##TITLE=31Pdec_PR159_oil
 D2O, 24 sc
 30.4.2019
##JCAMPDX= 6.0         $$ Bruker NMR JCAMP-DX V2.0
##DATA TYPE= NMR SPECTRUM
##DATA CLASS= NTUPLES
##ORIGIN= UXNMR, Bruker Analytische Messtechnik GmbH
##OWNER= root
$$ XWIN-NMR		Version 3.5
$$ Tue Apr 30 14:20:30 2019 Russian Standard Time (UT+4h)  she@DPX200
##.OBSERVE FREQUENCY= 81.013821
##.OBSERVE NUCLEUS= ^31P
##.ACQUISITION MODE= SIMULTANEOUS
##.ACQUISITION SCHEME= undefined
##.AVERAGES= 24
##.DIGITISER RES= 17
##SPECTROMETER/DATA SYSTEM= spect
##.PULSE SEQUENCE= zgpg30
##.SOLVENT NAME= CDCl3
##.SHIFT REFERENCE= (INTERNAL, CDCl3, 0, 182.463)
##AUDIT TRAIL= $$ (NUMBER, WHEN, WHO, WHERE, WHAT)
$$ ##TITLE= Audit trail, XWIN-NMR		Version 3.5
$$ ##JCAMPDX= 5.01
$$ ##ORIGIN= Bruker BioSpin GmbH
$$ ##OWNER= she
$$ F:/spectra/data/she/nmr/P31/1/pdata/1/auditp.txt
$$ ##AUDIT TRAIL=  $$ (NUMBER, WHEN, WHO, WHERE, WHAT)
(   1,<2019-04-30 14:19:33.64 +0400>,<she>,<DPX200>,
      <created by zg, POWCHK disabled, PULCHK disabled
       configuration hash MD5:
       00 E9 B6 7A A2 85 ED C7 34 08 36 98 17 FE 4E 26
       data hash MD5: 32K
       3E 26 2C 5E 7D 94 6A FF B8 14 52 5E DD 44 11 10>)
(   2,<2019-04-30 14:19:37.09 +0400>,<she>,<DPX200>,
      <Start of raw data processing
       efp BC_mod = 2 LB = 1 FT_mod = 6 PKNL = 1 PHC0 = -1820.585 PHC1 = 61.19899 SI = 64K 
       data hash MD5: 64K
       21 20 B8 94 29 66 AA 70 A5 F5 CD 40 F2 77 A0 B0>)
(   3,<2019-04-30 14:19:53.04 +0400>,<she>,<DPX200>,
      <pk PHC0 = -9.79209 PHC1 = 0 
       data hash MD5: 64K
       55 80 FD BF 30 72 F8 45 84 E5 C7 E7 20 2A 53 D2>)
$$ ##END=
$$ 
$$ hash MD5
$$ 0B 93 58 95 BE 49 E5 EB 01 4B 81 16 C6 5B F1 17
##$RELAX= 
##$RELAX= 
##$RELAX= 
##$RELAX= 
##$RELAX= 
##$RELAX= 
##$RELAX= 
##$RELAX= 
$$ Bruker specific parameters
$$ --------------------------
##$DU= <F:/spectra>
##$EXPNO= 1
##$NAME= <P31>
##$PROCNO= 1
##$TYPE= <nmr>
##$USER= <she>
##$AMP= (0..31)
100 100 100 100 100 100 100 100 100 100 100 100 100 100 100 100 100 100 
100 100 100 100 100 100 100 100 100 100 100 100 100 100 
##$AQSEQ= 0
##$AQ_mod= 1
##$AUNM= <au_zg>
##$AUTOPOS= <>
##$BF1= 81.014009
##$BF2= 200.13
##$BF3= 200.13
##$BF4= 200.13
##$BF5= 200.13
##$BF6= 200.13
##$BF7= 200.13
##$BF8= 200.13
##$BYTORDA= 1
##$CFDGTYP= 0
##$CFRGTYP= 5
##$CHEMSTR= <none>
##$CNST= (0..31)
1 1 145 1 1 1 1 1 1 1 1 1 1 1 1 1 1 1 1 1 1 1 1 1 1 1 1 1 1 1 1 1 
##$CPDPRG= <waltz16>
##$CPDPRG1= <>
##$CPDPRG2= <waltz16>
##$CPDPRG3= <>
##$CPDPRG4= <mlev>
##$CPDPRG5= <mlev>
##$CPDPRG6= <mlev>
##$CPDPRG7= <mlev>
##$CPDPRG8= <mlev>
##$CPDPRGB= <>
##$CPDPRGT= <>
##$D= (0..31)
0 1 0 0 0 0 0 0 0 0 0 0.03 2e-05 3e-06 0 0 0 0 0 0 0 0 0 0 0 0 0 0 0 0 
0 0 
##$DATE= 1556619573
##$DBL= (0..7)
120 120 120 11 120 120 24 19 
##$DBP= (0..7)
150 150 150 150 150 150 150 150 
##$DBP07= 0
##$DBPNAM0= <>
##$DBPNAM1= <>
##$DBPNAM2= <>
##$DBPNAM3= <>
##$DBPNAM4= <>
##$DBPNAM5= <>
##$DBPNAM6= <>
##$DBPNAM7= <>
##$DBPOAL= (0..7)
0.5 0.5 0.5 0.5 0.5 0.5 0.5 0.5 
##$DBPOFFS= (0..7)
0 0 0 0 0 0 0 0 
$$ [...]
##$SUBNAM2= <"">
##$SUBNAM3= <"">
##$SUBNAM4= <"">
##$SUBNAM5= <"">
##$SUBNAM6= <"">
##$SUBNAM7= <"">
##$SUBNAM8= <"">
##$SUBNAM9= <"">
##$SW= 369.568048894756
##$SWIBOX= (0..15)
0 1 3 0 0 0 0 0 0 0 0 0 0 0 0 0 
##$SW_h= 29940.119760479
##$TD= 32768
##$TD0= 1
##$TE= 0
##$TE2= 300
##$TE3= 300
##$TEG= 300
##$TL= (0..7)
0 120 53 12 22 120 120 120 
##$TP= (0..7)
150 150 150 150 150 150 150 150 
##$TP07= 0
##$TPNAME0= <>
##$TPNAME1= <>
##$TPNAME2= <>
##$TPNAME3= <>
##$TPNAME4= <>
##$TPNAME5= <>
##$TPNAME6= <>
##$TPNAME7= <>
##$TPOAL= (0..7)
0.5 0.5 0.5 0.5 0.5 0.5 0.5 0.5 
##$TPOFFS= (0..7)
0 0 0 0 0 0 0 0 
##$TUNHIN= 0
##$TUNHOUT= 0
##$TUNXOUT= 0
##$USERA1= <user>
##$USERA2= <user>
##$USERA3= <user>
##$USERA4= <user>
##$USERA5= <user>
##$V9= 5
##$VALIST= <valist>
##$VCLIST= <CCCCCCCCCCCCCCC>
##$VD= 0
##$VDLIST= <DDDDDDDDDDDDDDD>
##$VPLIST= <PPPPPPPPPPPPPPP>
##$VTLIST= <TTTTTTTTTTTTTTT>
##$WBST= 1024
##$WBSW= 4
##$XGAIN= (0..3)
0 0 0 0 
##$XL= 0
##$YL= 0
##$YMAX_a= 27324
##$YMIN_a= -25250
##$ZGOPTNS= <>
##$ZL1= 120
##$ZL2= 120
##$ZL3= 120
##$ZL4= 120
##$ABSF1= 0
##$ABSF2= 0
##$ABSG= 0
##$ABSL= 0
##$ALPHA= 0
##$AQORDER= 0
##$ASSFAC= 0
##$ASSFACI= 0
##$ASSFACX= 0
##$ASSWID= 0
##$AUNMP= <proc_1d>
##$AZFE= 0.1
##$AZFW= 0.5
##$BCFW= 0
##$BC_mod= 2
##$BYTORDP= 0
##$COROFFS= 0
##$CY= -3
##$DATMOD= 1
##$DC= 0
##$DFILT= <>
##$DTYPP= 0
##$F1P= 0
##$F2P= 0
##$FCOR= 1
##$FTSIZE= 65536
##$FT_mod= 6
##$GAMMA= 0
##$GB= 0
##$INTBC= 1
##$INTSCL= 5.30512e-09
##$ISEN= 30
##$LB= 1
##$LEV0= 0
##$LPBIN= 0
##$MAXI= 10000
##$MC2= 0
##$MEAN= 0
##$ME_mod= 0
##$MI= 50
##$NCOEF= 0
##$NC_proc= -3
##$NLEV= 6
##$NOISF1= 182.463
##$NOISF2= 159.3651
##$NSP= 0
##$NTH_PI= 0
##$NZP= 0
##$OFFSET= 182.463
##$PC= 4
##$PHC0= -1830.377
##$PHC1= 61.19899
##$PH_mod= 1
##$PKNL= yes
##$PPARMOD= 0
##$PSCAL= 0
##$PSIGN= 0
##$REVERSE= no
##$SF= 81.0140089999434
##$SI= 65536
##$SIGF1= 159.3651
##$SIGF2= -187.1042
##$SINO= 113.3802
##$SIOLD= 16384
##$SREGLST= <1H.CDCl3>
##$SSB= 0
##$STSI= 65536
##$STSR= 0
##$SW_p= 29940.119760479
##$SYMM= 0
##$S_DEV= 0
##$TDeff= 32768
##$TDoff= 0
##$TI= <>
##$TILT= no
##$TM1= 0
##$TM2= 0
##$TOPLEV= 0
##$USERP1= <user>
##$USERP2= <user>
##$USERP3= <user>
##$USERP4= <user>
##$USERP5= <user>
##$WDW= 1
##$XDIM= 65536
##$YMAX_p= 339722090
##$YMIN_p= -2293949
$$ End of Bruker specific parameters
$$ ---------------------------------
##NTUPLES= NMR SPECTRUM
##VAR_NAME=  FREQUENCY,     SPECTRUM/REAL,   SPECTRUM/IMAG
##SYMBOL=    X,             R,               I
##VAR_TYPE=  INDEPENDENT,   DEPENDENT,       DEPENDENT
##VAR_FORM=  AFFN,          ASDF,            ASDF
##VAR_DIM=   65536,         65536,           65536
##UNITS=     HZ,            ARBITRARY UNITS, ARBITRARY UNITS
##FACTOR=    0.456856943014862, 1,           1
##FIRST=     14782.0589164792, 0,            0
##LAST=      -15158.0608439998, 0,           0
##MIN=       -15158.0608439998, -2293949,    0
##MAX=       14782.0589164792, 339722090,    0
$$ Real data points
##PAGE= N=1
##DATA TABLE= (X++(R..R)), XYDATA
$$ [...]
37027E6970j98699j55653J8629J43983K08155K57630J89574n8445k60082j66477
37017C5585P9162J28764l3875r9741L5304J18659j2426j72209j51017k4621K9425
37006f6990K0532P1735J82936K20389R1506j45052l09134k42210P497J81806J05040
36995A18055p6045r5337N1733J33771N5451l7155m0217l5238q2150r3894j6953
36984a17979N1608L3052q924j0364j8673o2794o1128K9317J03344O3395k5264
36973b4410m7253j0563L86l1400n8435n7987l4963K0029J09677J97232K32274
36962B94587J85404N9578q9803j70662j53180j14048j09225p6206K7203Q8169
36952e8183J5843m5012Q3755K65116J98310q9509k35830q9248P8835M0104n1135
$$ y = [56970, -141729, -297382, -278753, -134770, 73385, 331015, 520589, 462144, 202062, 35585, 114747, 243511, 209636, 109895, 145199, 263858, 251432, 79223, -71794, -96415, -66990, -46458, 25277, 208213, 428602, 520108, 375056, 65922, -176288, -168791, 13015, 118055, 42010, -53327, -1594, 132177, 187628, 150473, 110256, 75018, -7132, -101026, -117979, -66371, -33319, -42243, -52607, -71280, -134074, -195202, -165885, -62541, 854, -24410, -71663, -82226, -81840, -113240, -171675, -229662, -264625, -244596, -134919, 62313, 294587, 479991, 539569, 449766, 279104, 125924, 11876, -97349, -173555, -146352, -58183, -42340, -87352, -3597, 261519, 459829, 370320, 134490, 45242, 124077, 164181, 113046]
36941A13046P859R9506K8671j05145q8468K8262N0728O877O0532J44179L3332
36930C79379k23496l01361r4610J00174L0256j51629j59431l104Q6125M0031J3716
36919b83950Q6644J34755O4079j1165M5779J45973Q6219j24063k32834r2073J26206
36908e4430J68056K8467r9199j17470r8988j08177j20093j12204q7958j4685J16757
36897d99924J92157J06950k0797J7414J71037J63752p0776k56437j91128l0406
36887d18158J1945n807N1726R4216j5434j38108l6803K03627K61238P0066q6161
36876g653k7648O7459p575j44684j05128R3948J93387N9647j39431j69979k8081
36865b15738Q6291M5233o1561q3101j6753K5551O405m743K0615K3783r538o63
$$ y = [113046, 120905, 220411, 249082, 143937, 55469, 83731, 134459, 141336, 201868, 346047, 379379, 155883, -145478, -240088, -139914, -109658, -261287, -420718, -423822, -337697, -297666, -283950, -197306, -62551, 1528, -9637, 36142, 182115, 268334, 144271, -88563, -180636, -54430, 113626, 142093, 42894, -74576, -173564, -281741, -401834, -514038, -601996, -616681, -499924, -307767, -200817, -221614, -204200, -33163, 130589, 59813, -196624, -387752, -418158, -406213, -412020, -360294, -266078, -281512, -419620, -456423, -252796, 8442, 78508, -7653, -35301, 32158, 24583, -120101, -225229, -131281, 62106, 121753, -17678, -187657, -215738, -129447, -84214, -145775, -228876, -245629, -220078, -213673, -218416, -197801, -174018, -183556, -184219]
36853a84219P9699J34765Q2185k5482r5004j16596j21371j05106o7039l6003K882
36842d51289R8238J88159J14454j16023k44136q9397J67890K26989Q3779j2449
36832c3785M4109J02652M1246n7973p6664k8536J6351M2837M9032L68r2220j27826
36820a20409l8287Q9530J02400j4135r9620k8247J03050Q9963q0965j84154q0464
36809b61338N1060k4721k09927j94426N9855K37432J33383p1385j21755l2924
36799d34746L7144M6484J9419p2197j87235j52638P6587K67007K28743J09550
36789f1882J26289J85311O8959j45467j94005o9931j4269r2828j16924k490R9298
36778b17939P8992J1410k6372m1040L721J59591L10969K65911O2959o0747l9330
$$ y = [-184219, -104520, 30245, 112430, 86948, -8056, -124652, -246023, -351129, -418168, -454171, -451289, -353051, -164892, -50438, -166461, -410597, -499994, -332104, -105115, -21336, -33785, 10324, 112976, 154222, 96249, 19585, -8951, 7400, 50237, 99269, 99637, 7417, -120409, -158696, -69166, 33234, 19099, -80521, -108768, -5718, 84245, 3280, -180874, -261338, -210278, -234999, -444926, -639352, -579497, -342065, -208682, -280067, -401822, -434746, -397602, -351118, -331699, -403896, -591131, -743769, -667182, -400175, -171432, -61882, 64407, 249718, 318677, 173210, -20795, -90726, -104995, -197823, -314747, -317237, -217939, -138947, -127537, -153909, -194949, -191228, -31637, 279332, 545243, 608202, 547455, 508125]
36767E08125m7287j50125j77034l9337R9613J00219M3515K0447l0496j24783j15280
36756H7577L9342J12874n9800k78038k47958k2576R5199J2384n9368L2391J59866
36745a28107J31084l4605j50933j05214L8059J49948J75179J33394M3684p3492
36735A78997j39625p9384L3352K6360j01033j15198J08272L30812K47885o6912
36725D23526k57397j70311L392O0260J6268j7843J2274J07486K05906J87325N3593
36714F24479L1426K67558N06284L72032p3892l96722l93612k68270j87867q2450
36704C98966L3496k2711k06447j87524J03998K83958J25195m4487J04184L18394
36694I07022J62616k63388m68349k86201k3461M3955m5587j37788j44487l4763
$$ y = [508125, 460838, 310713, 133679, 94342, 193955, 294174, 337689, 358136, 327640, 202857, 87577, 126919, 239793, 179993, -98045, -346003, -368579, -273380, -260996, -320364, -287973, -128107, 2977, -31628, -182561, -287775, -249716, -99768, 75411, 208805, 252489, 178997, 39372, -40012, -6660, 19700, -81333, -196531, -88259, 242553, 490438, 423526, 166129, -4182, -790, 59470, 75738, 57895, 70169, 177655, 383561, 570886, 624479, 655905, 923463, 1429747, 1801779, 1727887, 1331165, 937553, 669283, 481416, 398966, 432462, 409751, 203304, 15780, 119778, 403736, 528931, 484444, 588628, 907022, 1069638, 806250, 337901, 51700, 28239, 72194, 26607, -111181, -255668, -290431]
36684b90431J26103J66636L0420p9524K4419K14527K48069J40229Q1432R8862
36674G60742Q0179M1662P7923J07431l0314k47853k72235n4488J36443P4435j66802
36663E07123l54114l38223j42196P2891J41917P3027J9820K3821m3999j87188
36653b27121j79109N2662K04808M7104j53973k6048K92927L56398J04413r4683
36643C77378n3828K4390k7426j14155j42316j60058j63257p2437M8319M6520k2993
36632b59863L3983J81542J89320M8144j5542L0186k8455k05168k22069J7267K42091
36621A1436K41759J29121M7204l4721j01389l2879R2756J4842k38485k93876l0431
36610a94663J86137R3782p1212n0958r437j50006k82364j72645J4384M4077P0279
$$ y = [-290431, -164328, 2308, 32728, -46796, -22377, 192150, 440219, 580448, 661880, 760742, 840921, 882583, 960506, 1067937, 1037623, 789770, 517535, 463047, 599490, 673925, 507123, 153009, -185214, -327410, -254519, -112602, -39575, -19755, 4066, -39933, -227121, -406230, -353568, -148760, -101656, -255629, -281677, 11250, 367648, 472061, 377378, 323550, 347940, 320514, 206359, 64043, -96015, -259272, -331709, -283390, -236870, -259863, -225880, -44338, 144982, 193126, 177584, 207770, 179315, -25853, -247922, -230655, 11436, 253195, 382316, 429520, 394799, 293410, 260531, 353287, 368129, 129644, -164232, -194663, -8526, 85256, 14044, -36914, -46351, -196357, -478721, -651366, -636982, -592905, -522626]
36599e22626L07870N19713L35152j06447l27079k02552k2496M1498P5622J00982
36589A99637M6429J631R4671J71068R52k56229k32467M3913J87637R1361L0190
36578C78793R3350K9911k17448l28956j52567K7308Q4k3271J46246K84518J49370
36567C87338o6710n6780Q5736N8544j35408k45134k04982j43745o0042J41360
36557b39823L34074K56027o2170k73842j89113J39N3697k544j5126L9664P7101
36546b1916N3113k3187j27463j85238j01992Q5526J90455J08861k0170p186J07853
36535E8656J15448n0264k11289j88591j9559J28356J62963J04320n746j18988
36525b4694j41420l939K09543L05569J95423p384j42416j78219j77811j64159
$$ y = [-522626, -214756, 304957, 640109, 533662, 206583, 4031, -18465, 23033, 98655, 199637, 246066, 247697, 342368, 513436, 514388, 258159, 25692, 69605, 257242, 348603, 378793, 472143, 502054, 284606, -44350, -196917, -169609, -169525, -192796, -46550, 237968, 387338, 320628, 263848, 349584, 408128, 272720, 27586, -177396, -321141, -381183, -239823, 94251, 350278, 288108, 14266, -174847, -174708, -121011, -123555, -138681, -99017, -21916, 31197, 8010, -119453, -304691, -406683, -321157, -130702, -21841, -42011, -49197, 58656, 174104, 123840, -87449, -276040, -295599, -167243, -4280, 100040, 94294, -24694, -166114, -170053, 39490, 345059, 540482, 533098, 390682, 212463, 34652, -129507]
36515a29507j08755j7283N8716Q7488P6291M0312N389J9182R6322J63229J20220
36504D11604l4562j84117k02558p2622R0058J26408p210j62123j49743J4429J23110
36493d7326P1110l999L4715R6653M2648m3320J1585J41517J13625q0934j80426
36482A55848n7941Q3231M2401p0867l6507J28732K21372J56451L6362m1314p6447
36471E41321o8060L5015K37503M23663M30122J95288j55437l85781l58184j70184
36461G25266l1793k5040o7568q7967j00897j02004n1772p369r4398k69032k95093
36450d07667q1735J38171J35767K6762O8689K46649L15412J86062J2601q7999
36440E52712j57171k20293k16311j43306q0752l2338O5746J59431J16031j2411
$$ y = [-129507, -238262, -255545, -196829, -109341, -33050, 7262, 12651, 31833, 128155, 291384, 411604, 377042, 192925, -9633, -82255, 7803, 134211, 127001, -35122, -184865, -170436, -47326, 23784, 19785, 54500, 151153, 193801, 150481, 162066, 303583, 417208, 336274, 155848, 97907, 181138, 223539, 152672, 116165, 244897, 466269, 622720, 659082, 617768, 541321, 473261, 508276, 745779, 1169442, 1599564, 1794852, 1639415, 1253634, 895450, 725266, 693473, 668433, 600865, 512898, 412001, 309997, 258225, 250856, 156458, -112574, -407667, -489402, -351231, -215464, -188702, -120013, 126636, 442048, 628110, 640711, 552712, 395541, 175248, -41063, -184369, -265121, -297459, -231713, -72282, 43749, 31338]
36430C1338o063J64593K46633R3065j00191j12600k7103l0144q3984m8049L1715
36419A59210K6711m254O1894J13219n0953l14731l29268l4308K28620K07573M3304
36408A07017l5236k7155r652N8967J79603J87611K1661q4863N6205K31508J14675
36397H00341k12903l66390k26287n5849l4833j8134J39691L10495L02999J43083
36387G82213l850l3963Q5177L43621O09266O73745M99604K74654J12800j10412
36377C232855m68894p35534o59489l53418j37568q7934k6115Q4023N2630j65635
36367G34921l11502j78475P9331J67280L5716j25106j79932j62530j31114p1442
36357a42853K7730J11585J31669J32757K03298L30757L56067J40420k16839m16642
$$ y = [31338, 25275, 189868, 436501, 529566, 429375, 316775, 289672, 259528, 175544, 127495, 159210, 185921, 181667, 243561, 356780, 305827, -8904, -338172, -372480, -143860, 63713, 107017, 71781, 44626, 34974, 93941, 273544, 461155, 482816, 397953, 454158, 685666, 800341, 587438, 221048, -5239, -61088, -95921, -114055, 25636, 336131, 639130, 782213, 778363, 744400, 829577, 1173198, 1782464, 2456209, 2955813, 3230467, 3343267, 3232855, 2763961, 2028427, 1368938, 1015520, 877952, 790018, 763903, 847926, 900556, 734921, 423419, 244944, 324275, 491555, 527271, 402165, 222233, 59703, -71411, -142853, -115123, -3538, 128131, 260888, 464186, 794943, 1151010, 1291430, 1074591, 657949]
36347F57949k87046n044J12508k917j23753n9886J07125J71764O8570q8566j60002
36336C90702j07947j2884J135j05292k26476k30178j21209q226O6411J42366J96411
36325a5187J38247j5298j18255j06831q1203j04436q1740N7180K11712K72739
36315A56928K84717L00723K22507k9311k98672l52235j88018o527O4516M8048
36305B02676o455m6290J0650J40821J44153q0231k90354j97529P9160J67474O50
36294A24725j34230j03419q5469j53529j14135P9755J52776k6291j66440k8862
36284d55119J51696O5289j36874j07852J01231J48793j4483j01631R982J26410
36274b12558R6647j4121j24618k00774j25837J62001M01687K46196j84336l66362
$$ y = [657949, 370903, 365859, 478367, 475450, 351697, 291811, 398936, 570700, 639270, 550704, 390702, 282755, 269871, 271006, 165714, -60762, -290940, -412149, -420375, -353964, -211598, -15187, 123060, 107762, -10493, -117324, -198527, -302963, -384703, -327523, -115811, 156928, 441645, 742368, 964875, 935564, 636892, 284657, 96639, 90112, 154628, 202676, 196221, 149931, 160581, 301402, 445555, 365324, 74970, -122559, -43399, 124075, 124725, -9505, -112924, -198393, -351922, -466057, -386302, -233526, -259817, -426257, -455119, -303423, -238134, -375008, -482860, -381629, -232836, -247319, -348950, -338968, -212558, -115911, -130032, -254650, -455424, -581261, -419260, -17573, 228623, 44287, -322075]
36264c22075r6773K17945J64032j30740k78668j79297j7940Q2388J42577J76398
36254b42153J67383J26759N0387q5394k07539j77773k2819N1210k6547p0504M2725
36243c94265J56043R5853n2149j13309q1325k4431P4494J96296K02148P1225J2009
36232A42589J18602J50993p1369k95964j99676P6201J52000K5841K0289J80520
36222C00026J97315k8980j96147j08990N627r6634k56744j56912J90351M48121
36212B97033L90098J46898N738O5101J46574N0660j61644k46912j25585J9481
36202E87442M1413K5400P5430J12450M5763m5783p8586j19287k00610j96063o0546
36191A87023M8373P2209J65902L04728J82256k03835l36940L4186L98487K90118
$$ y = [-322075, -418848, -200903, -36871, -167611, -446279, -625576, -643516, -561128, -418551, -242153, -74770, 51989, 102376, 16982, -190557, -368330, -391149, -339939, -366486, -436990, -394265, -238222, -142369, -194518, -307827, -389152, -413583, -339089, -142793, 59355, 130580, 142589, 261191, 412184, 340815, 44851, -154825, -78624, 73376, 99217, 119506, 300026, 497341, 468361, 272214, 163224, 168851, 72217, -184527, -341439, -151088, 297033, 687131, 834029, 839767, 904868, 1051442, 1102102, 940458, 693546, 567961, 587442, 628855, 654255, 729685, 842135, 887898, 842115, 763529, 644242, 443632, 247569, 187023, 235396, 307605, 473507, 778235, 960491, 756656, 419716, 453902, 852389, 1142507]
36181A142507N0697J34988K52009M4197J979O01204J136193Q60942P89485K391355
36171G405556M520089L991746N1284l893323m443638k376957q63231r57100j123451
36162B310975m59818R3140j66815n25430l22273j6905j19088k75616q0517J74441
36152F12094J48814M4676N1903n5931l26829l45448K1770K73319R0253j46393
36142C68228p9221L7155o8681j34005P7564K36870K0111k78862k57902q5359j18514
36131b82616k38238j25128J25834K06669J42455J38285J32017j9406j37893J6179
36121d1842K72813K85773P1752q8993j21986j39010j17399J6811J33663P9358
36111C50940m2162q3898j46008l12307l38529j3136L80097M09828J51038L3767
$$ y = [1142507, 1193204, 1328192, 1580201, 1624398, 1626377, 2227581, 3363774, 4224716, 5014201, 7405556, 11925645, 15917391, 15968675, 12075352, 7631714, 5254757, 4391526, 3434426, 2310975, 1851157, 1944297, 1777482, 1252052, 929779, 912874, 793786, 518170, 437653, 612094, 760908, 805584, 857487, 801556, 474727, 129279, 151049, 424368, 514621, 368228, 289007, 326162, 257481, 123476, 201040, 437910, 458021, 179159, -78743, -164102, -282616, -520854, -645982, -520148, -313479, -171024, -32739, 99278, 79872, -58021, -41842, 230971, 516744, 588496, 499503, 377517, 238507, 121108, 137919, 271582, 350940, 308778, 224880, 78872, -233435, -571964, -585100, -205003, 204825, 355863, 389630]
36101C89630J50816J83635k1670k38020k37691m3683K06263L60792K62046o8975
36091I43143l23791k60380o2798n0883j65907j05727J32640K46201J21062m7093
36081D26467j21011j55661j57503m7998J05986J28550K2817n1338p7503j72044
36071i9238k83832k11441N2120K66829K76003J62847O9080O1141J48265K39815
36061F81589J58794j03064k74978j85798o6888j68421k86573r1999K42502K50756
36051A55920o9379k42359o7312J40007J30989M7298L1376j9566j39957j50997
36041a83980j0925N7667m2410j11298j8294J00762J44374J93280K32759R9767
36031D61702j54634k34451p9920J7113o5248p5094J01176J82669J0892j25689
$$ y = [389630, 540446, 724081, 702411, 464391, 226700, 183017, 389280, 750072, 1012118, 943143, 619352, 358972, 296174, 245291, 79384, -26343, 106297, 352498, 473560, 426467, 305456, 149795, -7708, -55706, 50280, 178830, 201647, 150309, 72806, -99238, -383070, -594511, -542391, -275562, 441, 163288, 232368, 293509, 441774, 681589, 840383, 737319, 462341, 276543, 209655, 41234, -245339, -337338, -94836, 155920, 86541, -155818, -223130, -83123, 47866, 95164, 126540, 106974, -32983, -183980, -194905, -137238, -179648, -290946, -309240, -208478, -64104, 129176, 361935, 461702, 307068, 72617, -7303, 9810, -55438, -130532, -29356, 153313, 164205, 38516]
36021C8516L427J66026J13864K0505Q4049R7816j27589k86411n0185K85247K07341
36010E52606j69698k78533p300J76889J8543j85135j45430N907M7578K6106P2994
35999A14527J40628J12687j242j10331j51430r8555Q382M1227o7064j81391j35551
35988c28113J3638R7200J21929K02964K74271J63569n9382j25758L140O2218p6727
35977C48949j92118q2499J10230J30911k8248j79720k10538j33903J5426J78522
35967d2988K42199J47878j7771j35861j98885k52906k63179j50363N9880K15659
35957c96337J86652K573j59278j26071J05561L55268M33495L16764J22511m7837
35947G93301j74483k56736k70925k01341o5707Q4885J65839J10206k6891q0179
$$ y = [38516, 41943, 207969, 321833, 342338, 426387, 524203, 396614, 110203, 60018, 345265, 552606, 382908, 104375, 97075, 273964, 292507, 107372, -38058, -32151, 15427, 41533, 114527, 255155, 367842, 366600, 256269, 104839, 6284, 14666, 55893, -11171, -192562, -328113, -314475, -217275, -95346, 107618, 381889, 545458, 486076, 360318, 363458, 425676, 348949, 156831, 74332, 184562, 315473, 287225, 107505, -103033, -236936, -221510, -42988, 199211, 347089, 329318, 193457, -5428, -258334, -521513, -671876, -611996, -396337, -209685, -207112, -366390, -492461, -386900, -31632, 401863, 718627, 841138, 793301, 618818, 362082, 91157, -110184, -175891, -91006, 74833, 185039, 158148, 77969]
35937G7969K8500J67914J71021O5984P172K7157J3230q1159j55978j19144K086
35926B04752J28642K03258J84503P4568l5434n3103k1791n6161j40936j32909
35916C55389R470J37947J09075m9870k20227l23661l22174k05279m7917K4490
35906e32757L284K7416J67465K85996K22531L1601r1161o6369J3118N2431N1068
35895A64623K9218k1700q2994r4736l8551L3423Q3360J27548J49660O3700j44522
35884B69029l02249k14032N8487K24774J31993l0489q690J45439J66131p088j29820
35873C03485k9721J27076R1433r6238j84107q6951K2894N997n5069k8112N2453
35862A23140N6080l7182j20898j28236j04448r5137n6891N2492J50466J03377
$$ y = [77969, 106469, 274383, 445404, 511388, 518560, 545717, 558947, 477788, 321810, 202666, 204752, 333394, 536652, 721155, 795723, 760289, 707186, 685395, 629234, 488298, 355389, 364859, 502806, 611881, 562011, 341784, 18123, -304051, -509330, -557247, -532757, -529473, -502057, -334592, -48596, 173935, 205536, 114375, 48006, 61124, 113555, 164623, 193841, 172141, 89147, -5589, -44140, -10717, 72643, 200191, 349851, 413551, 269029, -33220, -247252, -188765, 36009, 168002, 137513, 128823, 274262, 440393, 433305, 303485, 273764, 400840, 492273, 396035, 211928, 124977, 147871, 153868, 98799, 70687, 123140, 179220, 142038, 21140, -107096, -211544, -306681, -363572, -311080, -160614, -57237]
35852e7237o6518j54697k3696K01244K89295K02818J04644Q7073N8456n8175j70855
35841D12352j60445o3399k379j3692m7137o9118o3403N428J18467J52397K8973
35830B98044j29958j35977j197P4443j0218j31225j41822o5505p295K2977Q9430
35819a38303J85467K19724J42467O121j11122j76533j76599q6599P7364K15152
35809A57139K25534J27705L4320J509j7912n8550p6386m3555j2944k1505k3638
35798B91717k08k5124j16083j39976j6741J02096N4190m3886K2976J79419J58397
35787D66777l2697r0945P8773J91920N5491j18638q3725L9125m865j75053k28460
35776I7703j17361l2540j13527l14714n01728n29225l06946P0091L50091M02282
$$ y = [-57237, -123755, -278452, -302148, -100904, 188391, 391209, 495853, 582926, 641382, 583207, 412352, 251907, 188508, 186129, 172437, 125300, 56182, -7221, -1793, 116674, 269071, 298044, 168086, 32109, 30912, 105355, 95137, -36088, -177910, -243415, -250710, -227733, -138303, 47164, 266888, 409355, 415476, 304354, 127821, -48778, -135377, -58013, 157139, 382673, 510378, 544698, 546207, 528295, 469745, 393359, 349804, 336860, 315355, 291717, 291509, 266385, 150302, 10326, -6415, 95681, 149871, 105985, 128961, 308380, 466777, 434080, 343135, 421908, 613828, 669319, 550681, 466956, 506081, 501216, 326163, 97703, -19658, -52198, -165725, -480439, -982167, -1511392, -1818338, -1748247, -1398156, -995874]
35766i95874L45719K99142J90019l1840j95170j38677K5790J02946J07713J43310
35756a46922J54990O0279l2178k567L4917n1786j15872K9104K30712K20265P8103
35745D59045P6289J64789O1183k00933k87999j41635o1109j48753j55290j327
35735b35740L0577j71633k76253m5542K38144K08525k9638j23643j8102O2912
35725c60393K1097l8064l7050Q472P5110R9955j9984k27378k59043k464K61157
35714d78585K14015k9560q9096J26674L25148K83849J20158L8373L3759k1450
35704E23285j35925j89849j21578q817M8568N0279N4924O8070N1572K2588K7043
35693C90160N751j50629l51444l15297K2279L14848K45966j9816j19057n5409
$$ y = [-995874, -650155, -351013, -160994, -192834, -388004, -526681, -500891, -397945, -290232, -146922, 8068, 68347, 36169, 33602, 68519, 16733, -99139, -70035, 160677, 380942, 459045, 535334, 700123, 761306, 560373, 272374, 130739, 69630, -79123, -234413, -235740, -205163, -376796, -653049, -698591, -460447, -251922, -281560, -405203, -423305, -360393, -339296, -377360, -414410, -405938, -330828, -230873, -250857, -478235, -737278, -739742, -478585, -264570, -294130, -383226, -256552, 68596, 352445, 472603, 510976, 544735, 523285, 387360, 197511, 75933, 67116, 115684, 165963, 220887, 288957, 340529, 363117, 390160, 395911, 245282, -106162, -421459, -399180, -84332, 161634, 141818, 22761, -32648]
35683c2648j00777k36204j56406J54375L26317J96847M9794Q3676P8804j42365
35673B21413l19664j65737J35309K14611P8229L291L7732j2214j72803k36391
35663b16224j07848O0097J12297P0571L4917M5325O4308K5929p3419j11327K9343
35652f6031K38075K51565J4227k25150k60141j58244m7764P5960J87986J44744
35642A55227m6186j23845K9657J42790k7231k71450k42176J2100J69306J34517
35632f7291O4885J5644p5899j30458r087J78895J83694J9701m9172O8844J85613
35621C85369J69217J04696P1903J7480q1841j34643q4457M111M4525K770j09044
35610C90086k08387j76940l3018L8673m0077r5489l073O2136p2168k14164p6486
$$ y = [-32648, -133425, -369629, -526035, -371660, -45343, 151504, 201298, 284974, 363778, 221413, -98251, -263988, -128679, 85932, 164161, 167452, 205184, 192970, 20167, -216224, -324072, -263975, -151678, -81107, -46190, -865, 63443, 89372, 15953, -95374, -66031, 172044, 423609, 437836, 212686, -47455, -205699, -253463, -177503, 10483, 155227, 109041, -14804, 14853, 157643, 130412, -141038, -383214, -371114, -201808, -67291, -2406, 13238, -62661, -193119, -202206, -23311, 160383, 180084, 130912, 199756, 385369, 554586, 659282, 731185, 748665, 666824, 532181, 447724, 451835, 496360, 499130, 390086, 181699, 4759, -28259, 10414, -29663, -125152, -128225, -66089, -138257, -352421, -428907]
35599d28907K32205L46223J90669K6289m037n152k2701K2569P1542m2982k49188
35588A36530k60194k4393J64472J04531n6169j07976o5438m2188n0351l6625K8538
35577b09263J44101K34968J56604r0826k48472j24552Q8429J09140L5621J38951
35567B34701L11371J95605j72451l61250k24143p0262o6030M678K26352L25459
35557D04030J82685P2904J32899Q3997k01122l48235r5001J93144Q6133k10928
35547C00506k32474k0645L0008j19204j58283k8762J7156p2494o2121J16176K34261
35536D124J57620K1437l8893m0123j411Q2808J03715n4611k54387k26498K2312
35525b23907J98649J54956N7270N9722Q1373J0909r4887j36470j17161o4008L7463
$$ y = [-428907, -196702, 149521, 340190, 366479, 362442, 357290, 334589, 357158, 428700, 385718, 136530, -123664, -148057, 16415, 120946, 64777, -43199, -108637, -150825, -201176, -237801, -209263, -65162, 169806, 326410, 235584, -12888, -137440, -49011, 60129, 95750, 234701, 546072, 741677, 569226, 207976, -16167, -86429, -152459, -147781, 78571, 404030, 586715, 659619, 792518, 876515, 675393, 327158, 232157, 425301, 511434, 300506, 68032, 47387, 77395, -41809, -200092, -228854, -211698, -284192, -346313, -230137, 4124, 161744, 183181, 144288, 104165, 102754, 185562, 289277, 234666, -19721, -246219, -223907, -25258, 129698, 186968, 246690, 328063, 338972, 244085, 107615, -9546, -73554, -36091]
35514c6091J42252J32479m227j16320r1382N431P2027J20294J89680K19099J24281
35503G57523n6409j94465k18962j56999n5797N5257J28808J08137J4162l3121
35493C48134L9508J15063J1820k16362k68340j1714K49366J56534j58158k32483
35483C3368L2818K20132M8495k00122j54689O6216R9533n7389r3714N7496J17784
35472A69928n2293k20578j52540M9540J32394M7441l7057K890J02472J19700K7123
35461A89020n0649j3864M5784l2732j99430k13683p890J73165J31837J3977M1654
35450G7189J29929M7868j49423j65150P6098K91798K19153p9803l39278l52643
35440b44262r5561K54723M11786K40444p2710k35047j88037p9960J7903J44004
$$ y = [-36091, 106161, 238640, 234413, 118093, 26711, 32142, 104169, 224463, 414143, 633242, 757523, 701114, 506649, 287687, 130688, 74891, 130148, 258956, 367093, 381255, 348134, 387642, 502705, 514525, 298163, 29823, 18109, 267475, 424009, 265851, 33368, 66186, 286318, 334813, 134691, -19998, 46218, 145751, 88362, -5352, 52144, 169928, 117635, -102943, -255483, -205943, -73549, -26108, -63165, -60275, 42197, 161897, 189020, 138371, 124507, 170291, 137559, -61871, -275554, -283444, -110279, 21558, 35535, 77189, 207118, 254986, 105563, -59587, 16511, 308309, 527462, 447659, 108381, -244262, -339823, -85100, 326686, 567130, 494420, 259373, 71336, -8624, 9279, 153283]
35430A53283K46816K10891P9505M799k3865j38645k78234k25191p245P8706m5163
35419E5657q0726J25049K56662K6939k95617k47933J19371L21881J61814o1822
35409C81275j02208j04052k27585k90832p4355K42294K82876K5129j67108p2089
35399a06655J16867J39634M3267L1832J11955J10172l1023j83618k41388k14498
35389b23455j18462N0733K07658K18816R6980n056k7769m9440o2170N8918K66640
35378D13393K81682r62k79609k53473o0961k9127j50791j51174J5924J06559J9382
35367h9157n7612L248Q3633Q6067J05379J92561J92833j187k21142k36543o9642
35356a1562O9753O8035j9954j03630j26520o0380N5192J10352N2894k7947k4704
$$ y = [153283, 400099, 610990, 690495, 695294, 671429, 532784, 254550, 29359, 22114, 100820, 55657, -25069, 99980, 356642, 383581, 87964, -159969, -40598, 281283, 443097, 381275, 279067, 175015, -52570, -343402, -417757, -175463, 107413, 132542, -34566, -106655, 10212, 149846, 193113, 224945, 336900, 447072, 416049, 232431, -8957, -223455, -341917, -291184, -83526, 135290, 232270, 227214, 199445, 150005, 87835, 146753, 413393, 695075, 694113, 414504, 161031, 100070, 70943, -79848, -231022, -215098, -108539, -89157, -146769, -143521, -59888, 26179, 131558, 324119, 516952, 515765, 294623, 58080, -11562, 58191, 126226, 106272, 2642, -123878, -184258, -129066, -18714, 34180, 6233, -18471]
35345a8471L4603M1197k6568p4983k1490J06544J94970J48063l436j02573k9303
35334B48553J41141K20934J49901M9274J8814R083m4625q5244l5025M9852M2381
35323G65039p3493j77715j57477j6374J39339J81994O7047j01664j57394o3562
35313D05740M1627M9408M1798J38435K52562J73435r9483k87277j89417L2941
35303E59769Q2560n7107j29313r036J23630Q7911k7021m7430n929l7192r5006
35292D45836k8949J00927O4425j53995k82235j63530J6543M4114m299N8461K03021
35281C00319K41375J07411r1266k21468j99935k7702J36841P6447j86551l46933
35271b11462k12398L8274J55867J62372J71570J02055j22942k82185j28076J76835
$$ y = [-18471, 16132, 57329, 30761, -44222, -65712, 40832, 235802, 383865, 380429, 277856, 248553, 389694, 610628, 760529, 809803, 828617, 837700, 793075, 707831, 672806, 722658, 765039, 691546, 513831, 356354, 339980, 479319, 661313, 728360, 626696, 469302, 405740, 447367, 496775, 538573, 677008, 929570, 1103005, 1003522, 716245, 526828, 559769, 642329, 585222, 455909, 446873, 570503, 658414, 631393, 583963, 578034, 540842, 445836, 416887, 517814, 582239, 428244, 146009, -17521, -978, 43136, 38837, 97298, 300319, 541694, 649105, 557839, 336371, 136436, 108734, 245575, 322022, 135471, -211462, -423860, -385586, -229719, -67347, 104223, 206278, 83336, -198849, -326925, -150090]
35261a50090K68374J26546K3005J0577q8226k16409j01860J99125K74676J5727
35251C61445j76351m9922R2119n6312k65354j65583J36434K59752J45616L7587
35241C19431J5994m0125j10862m8155Q9418P5526q1214j03656J05607K72506J40880
35230F35350j63055l08182j64867R4161K14756R3067j49804k66153j17654J46133
35220A3752K19669k80k67166k69735o472K23568J89811j6614j42468r7903j5526
35209a69364q712q803Q9952K25011K27855O1059j21335j63010p1429K7652L8288
35198A27164l3113j16825j60762j65248j34529l4798J29292K27561J26769q5910
35188a20399j64987m8321M8123k3703j09231k5814J24681J36801L2172l3963n3912
$$ y = [-150090, 118284, 244830, 267835, 278412, 190186, -26223, -128083, 71042, 345718, 361445, 185094, 135172, 227291, 170979, -94375, -259958, -123524, 136228, 281844, 319431, 335425, 295300, 184438, 136283, 225701, 301227, 220013, 116357, 221964, 494470, 635350, 472295, 164113, -754, 93407, 308163, 401230, 251426, -14727, -132381, 13752, 233421, 233141, -34025, -303760, -310232, -86664, 103147, 86533, -55935, -153838, -169364, -178076, -186879, -96927, 128084, 355939, 416998, 295663, 132653, 61224, 88876, 127164, 94051, -22774, -183536, -348784, -483313, -518111, -388819, -161258, -34489, -120399, -285386, -333707, -285584, -309287, -418518, -444332, -319651, -182850, -150678, -184641, -238553]
35177b38553r3026o9506R7278K36204J44951l6026j6967J55125J84369M2163k3404
35166C82608K6254k1498j56459j12536R7027J05537j80431l62285j83121Q1164
35156c23740J37221J28001K31401K34910n8745l51084k57244N0549R7407j55636
35146b66960l02279j42190R8158J91762J81333J77290J78359J54270J09271M3989
35136D23003j1493J5094Q9890M1099j58672k47604l9686K32231K23438k718q5691
35125D78891O9963J76171J8129k53835l54487j92631P9341K18626R6195j53101
35115A83262k35511m4379J99859K56949J63185P7983P645j19669k49834k82973
35105d3483k34994j41052M1241K45310K23708q6305l35141k03401J13611K02745
$$ y = [-238553, -331579, -401085, -303807, -67603, 77348, 41322, 24355, 179480, 363849, 406012, 382608, 408862, 387364, 230905, 118369, 215396, 320933, 140502, -221783, -404904, -323740, -186519, -58518, 172883, 407793, 349048, -2036, -259280, -208731, -111324, -266960, -569239, -711429, -613271, -421509, -240176, -62886, 115473, 269743, 379014, 423003, 411510, 426604, 516494, 557593, 398921, 151317, 111631, 343862, 567300, 564582, 478891, 548854, 725025, 743154, 489319, 134832, -57799, 21542, 240168, 336363, 183262, -52249, -96628, 103231, 360180, 523365, 601348, 608993, 489324, 239490, -43483, -278477, -419529, -378288, -132978, 90730, 4425, -330716, -534117, -420506, -217761]
35095b17761M9176k5618P9092J56926J07124L8626j9517j40374k36602j36827
35085c45755O8285J09343k2295p7895p321k0636j43091j21947J04850K46670J43288
35074f6504M0247J49609K63828J05282j83173k32765m381J70487Q2028r0909p5452
35063A58297J09319J92121K5374k06369k17136J3205K27231K29170P7916q1607
35053E27521j86379j86967l6291J30165M5896k72117m09560j06080L10187L52049
35043A68424M9277j59472p8525P4551Q4523k7329j64302k49154j77874O2719K76620
35032a40542K85707J75037Q6663m8171k78545l63219j23542J40787N4219j92429
35022d04035j30968J89019K91228R5134K843J33678J30756j35944l02776j57820
$$ y = [-217761, -168585, -194203, -115111, 41815, 148939, 187565, 168048, 27674, -208928, -345755, -277470, -168127, -190422, -268317, -275638, -296274, -439365, -561312, -456462, -209792, -66504, -26257, 123352, 387180, 492462, 309289, 76524, 72143, 242630, 324658, 233749, 158297, 267616, 459737, 485111, 278742, 61606, 74811, 302042, 531212, 609128, 527521, 341142, 154175, 117884, 248049, 293945, 21828, -387732, -493812, -183625, 168424, 217701, 58229, -20296, 54255, 138778, 111449, -52853, -302007, -479881, -417162, -140542, 145165, 320202, 406865, 358694, 80149, -283070, -406612, -265825, -211606, -404035, -535003, -345984, -54756, 40378, 43221, 176899, 307655, 171711, -131065, -288885]
35012b88885K0395J2482J0884J55004K22810Q4152j4019P2117P8194j54039l03672
35001a04577r9996J76961J50846l8699k8185J37391J27759r0798k24306j19690
34991a13294P0883J47873N3311j33010k31014j06265J17117J64568J4353n3895
34981f9373Q7759K16496J54016L6145N271l8994j67571k18252r8473Q791k6148
34970a10333m5558O9888J52603O7497l3551k0128j8945r1456l1405K30715L81101
34959E50428J99368o3832j12514n6371r3502j11380J2812P8411n7171j24342Q2682
34948C04589K39101N069l29778k80958L4124J29123m4182j30280m7994k6409o6880
34937b14475M2621K27712J90111n3202j88543j29918o0598j4583J09843J92222
$$ y = [-288885, -268490, -256008, -245124, -90120, 132690, 216842, 202823, 274940, 353134, 199095, -104577, -204573, -27612, 123234, 84535, 56350, 193741, 321500, 230702, 6396, -113294, -42411, 105462, 158773, 25763, -205251, -311516, -194399, -29831, -15478, -69373, 18386, 234882, 388898, 425043, 430314, 391320, 223749, 5497, -92976, -84185, -110333, -155891, -86003, 66600, 134097, 100546, 80418, 61473, -29983, -61388, 169327, 550428, 749796, 685964, 573450, 517079, 423577, 312197, 325009, 403420, 346249, 221907, 304589, 543690, 548759, 218981, -61977, -27853, 101270, 57088, -73192, -121186, -147595, -214475, -171854, 55858, 245969, 192767, 4224, -125694, -186292, -200875, -91032, 101190]
34927A01190L6201j91714j60506O1214J39132P3995J19569J97146J5053k73483
34917A17797k11208J31583J74086k00221l97538p8065L04987K65455o910r6985
34907B981k9579m8957j15684n1347Q8677J51019J69799K18871J96320K5396j34615
34896D72881j24388m2078m8914j03565q8349k2210K9023Q3884J38863J08463l969
34885C99641o5189m4827p3141j67600j48652M7878K20027J98700O7036m3308j34577
34874B55988j97271j36365J5486N8543n5789j11831K3589J92862K31657J99154
34864D76023J67611N6804j34477j99095l8634J29218R5172l6769q2069q0422j30997
34853B22365j44447k5773Q0657N880j29804r0907R3037J79632P4445q6827j65087
$$ y = [101190, 137391, -54323, -214829, -153615, -14483, 59512, 179081, 376227, 391280, 117797, -93411, 38172, 212258, 12037, -385501, -463566, -158579, 106876, 99966, 2981, -26598, -75555, -191239, -242586, -153909, -2890, 166909, 385780, 582100, 607496, 472881, 348493, 306415, 257501, 153936, 65587, 43377, 72400, 156284, 295147, 403610, 399641, 334452, 289625, 216484, 48884, -99768, -51890, 168137, 366837, 433873, 390565, 255988, 58717, -77648, -62162, -3619, -59408, -171239, -147650, 45212, 276869, 476023, 643634, 700438, 565961, 366866, 328232, 457450, 552622, 515853, 433784, 353362, 222365, 77918, 52145, 132802, 138682, 8878, -82029, 11008, 190640, 265085, 178258, 13171]
34842A3171j33726j5439J27156J78257Q8527l0627m3826K7597N5415k0972j44457
34831A01076k07341j27806O2769J95367J33660l6822j27432j20933j29935j20144
34821c77541M4875K71882K81783O4445n6279N2686J07150q4199k42833o8288K27023
34810B20704K13991j03131l20116k29824k8997N7100M3498K9683J8697j6216l1475
34799a46086L4491J64903K54104J91669p728j70888j51239l2018p740p8303o1609
34788a0444P1271J25534K6664l2329P0189J54402M3680j25305j30461k0593R599
34777A82207l6384l430J04860J18826j0856j29252j03333J2432P1441J9375m0520
34766A85366L4446K15190K63667K6143k91832l43538j16262O1378J1691q3352
$$ y = [13171, -120555, -135994, -8838, 169419, 257946, 227319, 183493, 211090, 266505, 245533, 101076, -106265, -234071, -171302, 24065, 157725, 120903, -6529, -127462, -257397, -377541, -332666, -60784, 220999, 285444, 229165, 281851, 389001, 304802, 61969, -6319, 220704, 434695, 331564, 11448, -218376, -247373, -190273, -146775, -117092, -98395, -114611, -146086, -111595, 53308, 307412, 499081, 491353, 320465, 169226, 137208, 129468, 51165, -10444, 60827, 186361, 213025, 180696, 250885, 405287, 448967, 323662, 193201, 172608, 182207, 145823, 142393, 247253, 366079, 355223, 225971, 122638, 135070, 206511, 225886, 185366, 219812, 435002, 698669, 724812, 432980, 89442, -26820, 34558, 46249, -37103]
34756c7103n0299R043k1164k9030R0476J94123J14531o1849j55151j58344j41919
34745b46686o7744R1494K08585J85743J30749J53890J53476J2718j52645j69979
34735B99601q8219n4291m5667M1876J54581J56906N8597l0123p7955r7001m3399
34724B74906P8916J43311Q9900L8460N2002j8299k49649m15505k92760k4922R5322
34713b28318M9635J2058j0099j27160k53309j78176P1039K30698J75238N4971
34703b03423M4118J37573K07216J32795q9521k82867k38049p443J25655P1119
34693a02827O7015K26151K73365K2075k09586o6488K18019J55103k07334l63420
34683A2073j58915K9613k3918o2916J35653L57147L03132K9733k00326k70190
$$ y = [-37103, -87402, -78359, -99523, -128553, -38077, 156046, 270577, 208728, 53577, -104767, -246686, -314430, -222936, -14351, 171392, 302141, 456031, 609507, 622225, 469580, 299601, 211382, 157091, 111424, 153300, 307881, 464787, 523384, 493261, 415306, 318305, 274906, 353822, 497133, 587033, 625493, 677495, 659196, 409547, -5958, -298718, -323640, -228318, -178683, -166625, -176724, -303884, -557193, -735369, -664330, -433632, -258394, -203423, -159305, -21732, 185484, 318279, 228758, -54109, -292158, -299601, -173946, -102827, -35812, 190339, 463704, 485779, 276193, 209705, 427724, 582827, 375493, 12073, -146842, -117229, -141147, -204063, -68410, 288737, 591869, 621602, 421276, 151086]
34673A51086k20419r9971K9067Q9322J06993J86086K91455K41999N309j97851
34663E83076j95460q7330m1906m7788k1679p154p2308j13196K4919K60821L19429
34652F01424J03093j53830k02899j14283j21373k16372j52604J13745K63997P4597
34642A95495k00480j80663P2764J77526K5499j21796j08165n2845r684J28549
34632g3800K89195K03963j09684k60667p7595J09473J8107j51676j18738J7106
34622a54316M2318K0482P0068O2422j05024k26520j30980j4345p3134j17424N9564
34611e66889K39449J41221o4067n8676P2587O9170L894O8997J15044o3558k27807
34600b70635m9111K54020K34948j8849p5493N7634K0905j46179o7620J95518J78718
$$ y = [151086, -69333, -169304, -140237, -50915, 56078, 242164, 533619, 775618, 780927, 583076, 387616, 300286, 258380, 210592, 188913, 181759, 109451, -3745, 21174, 281995, 601424, 704517, 550687, 347788, 233505, 112132, -104240, -256844, -143099, 120898, 195495, -4985, -185648, -112884, 64642, 90141, -31655, -139820, -192665, -202349, -73800, 215395, 419358, 309674, 49007, -28588, 80885, 98992, -52684, -171422, -154316, -111998, -91516, -21448, 40974, -64050, -290570, -421550, -435895, -509029, -626453, -566889, -327440, -186219, -250286, -308962, -236375, -167205, -163311, -94314, 20730, -42828, -270635, -319746, -65726, 169222, 150373, 74880, 132514, 153419, 7240, -60380, 135138, 313856]
34589C13856j33384k23793O0081K35175J6767k29574j45570P8100J20912J7125
34579A09695o6145j27506j59169m7906J40899J36999r4831k41985j33480J7484
34569d65945K1786L840R9655J91657J34729j2925j26029j62372j13998j9587o629
34558d55818r1656n3343J96298L10912P501l43645j88364L02952M47242J00755
34548B32834j95112j27929L6600R1040J58589K08825J1628k70594j59534K87179
34538B73526M31829Q2942j90577m6829J02770q6172k97708k15528p8134j11199
34528a35080o4562K00015K93603j4928k97405j74926M4331k9047j78590o2106
34518d18695J38821J16347R186M3009O7966m2718l7726J73106J88938j41181k67159
$$ y = [313856, 180472, -43321, 16760, 251935, 268702, 39128, -106442, -28342, 92570, 109695, 43550, -83956, -243125, -291031, -150132, -13133, -107964, -349949, -483429, -465945, -444159, -440319, -340664, -149007, -14278, -27203, -153232, -315604, -429602, -449189, -455818, -547474, -600817, -404519, -93607, -86106, -429751, -618115, -315163, 132079, 232834, 37722, -90207, -53607, 37433, 196022, 404847, 416475, 145881, -13653, 273526, 705355, 788297, 597720, 550891, 653661, 567489, 269781, 54253, -23881, -135080, -199642, 373, 293976, 279048, -18357, -193283, -148952, -177999, -356589, -418695, -279874, -163527, -154341, -111332, -43366, -86084, -123810, 49296, 238234, 97053, -170106]
34507a70106J66419O20820N46987K99166L84172N17092L93586O79775J936878
34498E374789L036173K180000m94319k735247k902606j695725p42469n47660n22282
34489I50654k62929L1491R8995n4252k86839m50190m33670k47631j4053J52293
34479e16131J80940N4647q8638k5247K04283K45036l1269k26237J930L51903L13597
34468D64814o2019l12662k80116j70608o6459J05091K34714J56487J0563L1177
34458A10982J11987L4190o1581O0877J96118k709l50249l68700q2603N6229m3289
34447c38748m5410J25885J83545P6294O6226J66609J03607j10553j57976k4437
34437D5042l5953k19028k23809K1625J75315J08939P7005J36531J4041k75953
$$ y = [-170106, -3687, 617133, 1164120, 1463286, 1847458, 2364550, 2758136, 3437911, 5374789, 8410962, 10590962, 10096643, 7361396, 4458790, 2763065, 2020596, 1472936, 950654, 687725, 719216, 818211, 763959, 477120, 26930, -406740, -654371, -668424, -516131, -335191, -280544, -369182, -394429, -190146, 54890, 23621, -202616, -200686, 151217, 464814, 402795, 90133, -189983, -360591, -427050, -321959, -87245, 69242, 79805, 110982, 222969, 257159, 195578, 256455, 452573, 449864, 99615, -269085, -351688, -295459, -338748, -384158, -258273, -74728, 1566, 67792, 234401, 338008, 227455, 69479, 45042, 9089, -209939, -433748, -412123, -236808, -127869, -50864, 85667, 99708, -176245]
34427a76245k99683O3491L32995J67871j14730q5441J69642K96765K00253K7248
34417E82166r4218q1578Q6665K38473J52886q2798j58743k5600O0112P349M678
34406F89392J03320J09259j8143p5991k0803m4445j55674j21376O7557J20914
34396F54010k7006o8929J33041K89598J67349n8694j37277q4797k0826L1991M6493
34385I24953k2737p3852K1440J15852l5303k97970k88626r83J63131M8817m9364
34374E05358N7141J65248R1033n7058j47348j90450j60180j9661O7308m3316j04237
34363A63838J84544N53851M81832P4317o1090J77541K66939L4557n0052K41478
34353B067755N05852M78671M63773O91585R46420J128715J492702K053364K507304
$$ y = [-176245, -475928, -412437, -79442, 88429, -26301, -111742, 57900, 354665, 554918, 582166, 487948, 406370, 493035, 731508, 884394, 801596, 642853, 617253, 677365, 684714, 689392, 792712, 901971, 883828, 807837, 787034, 742589, 586915, 465539, 533096, 654010, 627004, 558075, 691116, 980714, 1148063, 1089369, 952092, 867295, 846469, 878460, 924953, 902216, 828364, 849804, 965656, 930353, 632383, 343757, 342774, 505905, 554722, 505358, 562499, 727747, 818780, 761722, 614374, 423924, 263744, 244083, 311391, 268075, 163838, 348382, 902233, 1384065, 1458382, 1397292, 1574833, 1841772, 1876329, 1826277, 2067755, 2573607, 3052278, 3516051, 4207636, 5154056, 6282771, 7775473, 9828837, 12336141]
34344A2336141K997098M028315N187624M937419K447326j090023l714650m676134
34336B2453116m508368l831134k955969k218255j811287j483827j001700o18050
34328D024526n73220n58919k70830m2662k66763o08735n18439j51338l3058j29025
34318H71537k7302K04559J41765j74560k91114j32023m7653j40350j79331j28774
34308I6754j59376j96811l5582J75188J35845m681J40535M53534M18815j9034
34298A005187l29371k09330M2480R0962Q11m8612o4183r2526r6195r1466j49945
34287E7812k15246j57570q696Q4287R3058Q0881M2261j1070M1224J94697K03694
34276D05332k2216j59205M4396K89782J64574j80383k80888r9390J1767l9221
$$ y = [12336141, 15333239, 19361554, 24549178, 29486597, 31933923, 30843900, 27129250, 22453116, 17944748, 14113614, 11157645, 8939390, 7128103, 5644276, 4642576, 4024526, 3451306, 2892387, 2621557, 2578895, 2312132, 1703397, 1184958, 1033620, 1000562, 871537, 844235, 1048794, 1190559, 1015999, 724885, 592862, 545209, 404859, 225528, 96754, -62622, -259433, -295015, -119827, 16018, 11337, 151872, 605406, 1024221, 1005187, 675816, 466486, 508966, 599928, 600739, 552127, 487944, 395418, 299223, 207757, 57812, -157434, -315004, -323700, -239413, -146355, -65474, -23213, -34283, 6941, 201638, 405332, 383116, 223911, 268307, 558089, 722663, 542280, 261392, 162002, 173769, 134548]
34266A34548j8531R6956N6335j60294k55267j10247M1833L0865j9796K6470J01854
34255g5274R1878J505q7286q6821L3674J51033Q2556j09714j28280R1655K14863
34244A79789L1377j82220j29964J4617l4364j48450n5541J36641J55625P0335
34234C7845J09754J86336Q2068p9284l5563J04128M1112j68889k33125j42965
34224i8583j03131q3279P2394K20078J01205j51848j83661m73Q2342j2184q5017
34213b42157p7031p6698j9808J76849L08614J56863p8111p7334M3796j5940j40309
34202d1266j4790K16962J46094j52144k07852M4221J95108J01144N9830J77862
34192E25169J70526p2431k56363j79615j2321N9536P0627N1704o0830k01147j88531
$$ y = [134548, 116017, 212973, 269308, 109014, -146253, -256500, -214667, -183802, -203598, -177128, -75274, 16604, 18109, -69177, -155998, -122324, 28709, 111265, 1551, -126729, -35074, 179789, 211166, 28946, -101018, -86401, -120765, -269215, -324756, -188115, -32490, 37845, 147599, 333935, 416003, 336719, 301156, 405284, 446396, 277507, 44382, -98583, -201714, -284993, -212599, 7479, 108684, -43164, -226825, -227298, -144956, -157140, -242157, -319188, -395886, -415694, -238845, 69769, 226632, 148521, 71187, 114983, 99043, -41266, -56056, 160906, 307000, 154856, -52996, -8775, 186333, 287477, 347307, 525169, 695695, 623264, 366901, 187286, 174965, 234501, 305128, 356832, 296002, 94855, -93676]
34181i3676k5357J03265J27177J19484Q6690O305k7360L0891K0405j36814k17339
34170f329q2289J0290j37850k32186J9008L17855K42643j4474L061K03946J57420
34159D81095j04653j86723o7413n2858j23588p700J96138J36122j28429k13133
34149g1142p9403j2809l2148P7914K52733K47868J21814P3830O041k02001k78848
34138A03849k7396J64667l5282j94174J47894N01274J68083m58689m53571R4588
34128A1243K87184l4779j82377L2043Q1436j31653j26703R7642L0818k56983j61682
34117c53811K46790K66640j06006j44528K00103J83018k60325l04165K15555M35822
34107C79093M2090j81959J37860K87789j19539l89112p7730J83184o9757k71238
$$ y = [-93676, -119033, -15768, 111409, 230893, 317583, 323888, 296528, 327419, 347824, 211010, -6329, -88618, -78328, -216178, -448364, -429356, -111501, 131142, 116668, 119729, 323675, 481095, 376442, 189719, 122306, 69448, -54140, -61840, 134298, 270420, 141991, -71142, -150545, -163354, -195502, -117588, 135145, 383013, 504827, 578657, 584698, 382697, 103849, 76453, 241120, 205838, 11664, 159558, 660832, 828915, 370226, -83345, 11243, 298427, 263648, 81271, 113314, 194750, 63097, -63606, 34036, 64854, -192129, -353811, -107021, 159619, 53613, -90915, 109188, 292206, 31881, -272284, -56729, 379093, 421183, 239224, 377084, 664873, 545334, 156222, 78492, 261676, 191919, -79319]
34097g9319J9548K54947m972k25117M5246K86825L0936k28273q05K69889J02834
34086D71739j15676K3326J19987j51108k53519J94300N39961K29558r5189K59530
34076A222909O85477L83383J13444J255296L341430M053417K020806j386957l539427
34067H149778l261719j675139o07097o13364q08091m46872L1158n6954l91230
34058C20470k49025J54163P3015l31757k55546K17946K43485j68075j49654L27761
34048A82783L36475k27601l80423J07880K77930j78870l47916J09479L11332p1254
34038A19815j48475L76138N10132j16491m44507L3682L07642j83102m66941K9507
34028A7400L42442j03843l23858K56816N70401l8278m59238P1206M61317j19094
$$ y = [-79319, -59771, 195176, 190204, -34913, 10333, 297158, 328094, 99821, 99016, 368905, 471739, 356063, 379389, 499376, 348268, 94749, 289049, 829010, 1058568, 963379, 1222909, 1908386, 2291769, 2405213, 3660509, 7001939, 11055356, 13076162, 11689205, 8149778, 4888059, 3212920, 2605823, 1992459, 1184368, 737496, 768654, 711700, 320470, 71445, 225608, 298623, -33134, -288680, -70734, 172751, 4676, -144978, 182783, 519258, 291657, -88766, 19114, 297044, 118174, -229742, -120263, 191069, 119815, -28660, 347478, 857610, 741119, 296612, 330294, 637936, 454834, -12107, 17400, 359842, 255999, -67859, 188957, 759358, 721080, 261842, 333048, 794365, 675271]
34018F75271n84494k9928M87753J1275m33876J25362O34027L7234o21871j87666
34008A13087L97168j2664n22479m1791M94254J0922m77320J37160P42130J24052
33998I64519n51771O3319Q07664K03376o54587k28438M62554o5023p15891Q467
33988B94189Q56433J39432q70361k94797O96177J83432p02741p3736Q41479J15988
33978A185495q62105l2358J063489J61485j074960j36976J239554L29706j020318
33969H53012J41317J765285N36810j305002L5851K207086R10933j365946K66350
33960D045696L198444J917620o92783J727576N957897M707224K218015P889407
33952C0969096J6835260J8004204K1503737M9246152Q9043722Q9528794K4591125
$$ y = [675271, 90777, 60849, 548602, 559877, 126001, 251363, 885390, 922624, 300753, 113087, 510255, 497591, -24888, -66679, 427575, 438497, -38823, 98337, 840467, 964519, 412748, 476067, 1283731, 1487107, 832520, 604082, 1066636, 1001613, 285722, 294189, 1150622, 1290054, 419693, 124896, 821073, 1004505, 301764, 228028, 1069507, 1185495, 323390, 291032, 1354521, 1516006, 441046, 304070, 1543624, 1873330, 853012, 994329, 2759614, 3296424, 1991422, 2027273, 4234359, 5145292, 3779346, 4045696, 7244140, 9161760, 8468977, 10196553, 16154450, 20861674, 23079689, 30969096, 47804356, 65808560, 87312297, 136558449, 225602171, 315130965, 339722090]
33945C39722090o0139569r5462297o9809327l1402427j7920960j9586955j4406676
33938C0993879m696540k982546o403953m845931j49915k15463l350826k729215
33930E619490M33057L79753j856122j333493R16079M64056j627889j164775R35558
33921B765714O92408j194154j009575P32406N95403j035507r60106N65254N88243
33912A740086p20631o50605O50126O55488m91194m14790O92502M71031r25644
33903A006369j067093J90420O23001j26307k42743M92289M38775m51323m99964
33894C63424L67319M98593k66069m14381K07009K17957m43388m24281K79571K94455
33884F80209l86256l83698L15446L02478m80374n69537K52545N79842Q095k95903
$$ y = [339722090, 279582521, 184120224, 114310897, 82908470, 64987510, 45400555, 30993879, 26297339, 23314793, 16910840, 12064909, 11914994, 11699531, 8348705, 5619490, 6052547, 6432300, 4576178, 3242685, 4158764, 4622820, 2994931, 1830156, 2765714, 3458122, 2263968, 1254393, 1986799, 2582202, 1546695, 586589, 1151843, 1740086, 1019455, 368850, 1018976, 1674464, 1183270, 768480, 1460982, 1932013, 1006369, -60724, 129696, 752697, 626390, 383647, 875936, 1314711, 863388, 363424, 730743, 1229336, 963267, 548886, 755895, 973852, 530464, 106183, 385754, 680209, 293953, -89745, 225701, 528179, 47805, -521732, -269187, 310655, 318750, 22847]
33874B2847P9872K09444j47212j33498L19829K92360k15005j94460L59749L64939
33864I58865k58566m12867P3610J58270l70528n13846m283K52624l2151j06961
33854b55833J92101J57987k06807q8376M38459L80970k73003m19267J46247L87370
33844D59848l31j16662K72618K46026m04687o27184k7822L83445K8577k95917
33834h2089k2976J97609j12697l31319N737L25272J66353p291J43964J47833k34864
33823A95532m11402o9242K01412K5332r3915J60323K68791o9713k88501k0321
33813a01704J92083o8681l05070m8180K92879K23431O262M5389J52765M9632o3926
33802C74880O863K4486j45093j88601M1857J92980O2029m0819Q0777J49711q657
$$ y = [22847, 102719, 312163, 164951, 31453, 351282, 643642, 428637, 234177, 593926, 958865, 700299, 287432, 361042, 519312, 148784, -365062, -369345, -116721, -148872, -255833, -63732, 94255, -112552, -200928, 237531, 618501, 345498, -73769, 72478, 459848, 459517, 342855, 615473, 861499, 456812, -170372, -198194, 185251, 213828, -82089, -105065, 92544, -20153, -351472, -345735, -20463, 145890, 138599, 282563, 430396, 195532, -215870, -285112, -83700, -58368, -152283, 8040, 276831, 207118, -81383, -101704, 90379, 21698, -283372, -331552, -38673, 184758, 191020, 236409, 389174, 438806, 374880, 381743, 406229, 261136, 72535, 114392, 307372, 369401, 328582, 409359, 559070, 550413]
33791E50413j47891j18546r6993j10564L0926K12565J11673j21594m0807K23708
33781D92890J29870k29938k21826J43079J83612j75633k43215J26832K49719p3306
33771C82084j69173J87209K91017j59609m47992j44319J29313r5212k70295P3894
33761b23083M04413J69688k06503j39412J20244R4826n8149l2831j6622j60396
33751d7825j19482K26077L35442n8137l49088p5004K60242J05622j83958j00550
33741f661P1883r0048k59103o248K97149J29444j95896r8170K18878J77623j41675
33730I7176k37904q5369K449M9631K17265K91164P3502j05382M8736J63707j41524
33719C73451m46552j91090K85170K49998k08291l77474r8560J34311J12684J21209
$$ y = [550413, 402522, 283976, 186983, 76419, 107345, 319910, 431583, 309989, 269182, 492890, 622760, 392822, 170996, 314075, 497687, 322054, 78839, 205671, 455390, 382084, 212911, 400120, 691137, 531528, 83536, -60783, 68530, -26682, -296977, -223083, 181330, 351018, 144515, 5103, 125347, 220173, 162024, 129193, 112571, -47825, -167307, 58770, 394212, 336075, -13013, -88017, 172225, 277847, 93889, -6661, 65222, -24826, -283929, -290177, 6972, 136416, -59480, -157650, 61228, 238851, 97176, -140728, -226097, -223648, -174017, 43248, 334412, 407914, 302532, 351268, 514975, 373451, -73101, -264191, 20979, 270977, 62686, -314788, -413348, -279037, -166353, -45144]
33709d5144K53792K59195P9679o0607r5147j42317j68925p7627L308n9400q5293
33698a38486J02941K87982K11824M4567N7944J31661L9747r2381p8322o7160j80936
33687C19381j59309J20269K17667j71971n43373l00519K46403L66957O7847m5818
33677A17534J64113K66589J08307j2263J4831j6863j25722j15776l2889r4295
33667B73566k13604j26513Q0590Q8197q7791j47659m2807K1829J9192P2693J20745
33656E8438N1514J3578J55680K62119J00703j13025q3459J7620r5557k30642p9962
33645E7007J27474L315k47078j69438Q5092K8865k28427j47130K42164L55069
33635A06913O3512j37468l7390J3779j32706j48330Q5797K03868R827j90077j45056
$$ y = [-45144, 208648, 467843, 547522, 486915, 391768, 249451, 80526, 2899, 6207, -53193, -138486, -35545, 252437, 464261, 508828, 566772, 698433, 738180, 645799, 567477, 500317, 319381, 160072, 280341, 498008, 326037, -217336, -517855, -271452, 95505, 163352, 117534, 281647, 548236, 656543, 644280, 659111, 642248, 516526, 400750, 367861, 273566, 59962, -66551, 14039, 102236, 14445, -133214, -176021, -154192, -135000, -62307, 58438, 109952, 123530, 279210, 541329, 642032, 529007, 445548, 463168, 367611, 136969, 57007, 184481, 187796, -59282, -228720, -143628, -114763, -343190, -490320, -248156, 106913, 170425, 32957, -4433, 9346, -123360, -271690, -185893, 17975, 27802, -162275, -307331]
33624c07331j9936J4019N6632J48243J14314p1759j70852p2766N2455Q8602J01947
33613f6432R3174j0970j07752l7133P7108L930j41442o5269J58213J97598N4497
33602A55522J9928R7828L1440j28746p3777J45167J49165q2804j65340k377P9870
33591B25876j7468p74K03331K72671Q9814m9982N79J6569j01992j46333o7998
33580D24293r3870k24682j71263O1242J06142q7456j26349Q3191J19485j62155
33570g1422k92235j091K72670J33198r7911K0534K74430J98852j12707j93854
33560A30464K9940J94345R0875j25772k56889k53093j39521R351P3417J9345n4678
33549b82216q2418r2184p2169J7889Q4332R988p3149N3749K61228J98840j02775
$$ y = [-307331, -327267, -313248, -256616, -108373, 5941, -65818, -236670, -309436, -256981, -168379, -66432, 26742, 15772, -91980, -129113, -52005, -48075, -189517, -254786, -96573, 101025, 155522, 175450, 273278, 304718, 175972, 102195, 247362, 396527, 313723, 148383, 146006, 225876, 208408, 207634, 410965, 683636, 773450, 723468, 724047, 740616, 638624, 492291, 424293, 330423, 105741, -65522, -4280, 101862, 14406, -111943, -28752, 90733, -71422, -363657, -364748, -92078, 41120, -56791, -36257, 238173, 437025, 324318, 130464, 160404, 354749, 445624, 319852, 62963, -190130, -329651, -320300, -246883, -227538, -282216, -364634, -456818, -528987, -511098, -426766, -416778, -489927, -436178, -174950, 23890, -78885]
33538g8885k12069J7679K16479J15722p0313r3838n3391p2024j8743J66687K52748
33527A70052J07795k8971O4916K60806L66951M07701L87247J49519k63674m82287
33517A140055l18861o5222j0891l1182N4734R8936n1298j85363o1513J71665K36614
33506I77674J55210R2127K5716j04596j67988p2109Q718p6001j74553j19530l2559
33495E12109o3390r6874j0709N2708k6471o9969P1729K02908J24353L926N3404
33484G53724J22470n92j55830r5508M1511k2671j86190j44109P3517J78139J15572
33473F80033O4839M6815n9167j85992j56547l4901l5873j34239j15977J9984N5282
33462A44257o6231j65357j38408o5385q195N4853J00104P5990K5533J2857j0786
$$ y = [-78885, -290954, -273275, -56796, 58926, -11387, -105225, -158616, -230640, -249383, -82696, 170052, 277847, 248876, 313792, 574598, 941549, 1349250, 1736497, 1886016, 1622342, 1140055, 821194, 755972, 745081, 713899, 768633, 867569, 816271, 630908, 569395, 741060, 977674, 1132884, 1225011, 1250727, 1146131, 978143, 906034, 914752, 838751, 664198, 544668, 512109, 448719, 351845, 341136, 393844, 367373, 297404, 369133, 572041, 696394, 700320, 753724, 876194, 875602, 719772, 624264, 665775, 643104, 456914, 312805, 386322, 564461, 680033, 744872, 791687, 732520, 546528, 389981, 355080, 319207, 184968, 68991, 88975, 144257, 78026, -87331, -225739, -291124, -299319, -244466, -144362, -68372, -42839, -29982, -40768]
33451d0768r7005j53817r0336O649K6931L5008J17826J82016J16111P652j7204
33440I3063j4907o8232q2523K9322J38761J17685O6136P7325J0347k08765l13996
33429a55784r1222J90572J57689o1983q1254O0569p378k76062l12408J2145K80163
33418b84953J77981o3482r6735M1682J12607P6798M9416L6178l8557j37996j42101
33407b69162l0941Q9947J29787R9077O3262N5707N2850L6132M4338J01119J17069
33396D89185j1527j96302k10354p257J76517J30354o6268j88595j43110q447P6899
33385D1095O839j78656k56057p6802J53396J20809q3539o7901J95132K64157m8242
33374G0231l30540k29500O016J1032q0457L8183K44156K18005L6703K5101J77312
$$ y = [-40768, -137773, -291590, -381926, -375277, -348346, -313338, -195512, -13496, 102615, 110267, 93063, 78156, 9924, -72599, -43277, 95484, 213169, 279305, 356630, 366977, 158212, -155784, -247006, -56434, 101255, 39272, -41982, 18587, 11209, -264853, -577261, -565116, -284953, -106972, -170454, -267189, -225507, -112900, -36102, 13314, 49492, 10935, -127061, -269162, -300103, -210156, -80369, 18708, 81970, 137677, 190527, 226659, 270997, 372116, 489185, 477658, 281356, 71002, 63745, 240262, 370616, 304348, 115753, -27357, -35804, 41095, 47934, -130722, -386779, -463581, -310185, -189376, -272915, -340816, -145684, 118473, 70231, -260309, -489809, -483793, -472761, -553218, -515035, -270879, -52874, -16171, 8930, 186242]
33363A86242K07055O4868l6991l2315l0731k0243Q1740J61285N3535j26250j39995
33352C68200k3710L302p7849j14318p6196j7532J02173K51587J92801j39217l67151
33341A02090j87515J02842O7628j44627r6986J39524J30209j17342j70898M1741
33331a33334J35102j2832q4551M4695J06709o186o0544J0859k3436j72756j25722
33320c21996J51834K65690N1692j36625l8761J11371O2970l6397N361P3086M0196
33309B28421L6921J38289J41164o4483k35630j65784k1131j4990m7259M8498J66860
33298B10876J24761k0978r6948o9136J3634J36923K25992J47137n8315j62671
33288D51275q6524k136j2699j0507M9909M7032l1975l4391L2672k7893j92668
$$ y = [186242, 393297, 458165, 421174, 388859, 358128, 337885, 419625, 580910, 634445, 508195, 368200, 344490, 347792, 269943, 155625, 79429, 61897, 164070, 415657, 608458, 469241, 102090, -85425, 17417, 85045, -59582, -156568, -17044, 113165, -4177, -175075, -133334, 1768, -11064, -95615, -50920, 55789, 49603, -10941, -82, -23518, -196274, -321996, -170162, 95528, 147220, 10595, -28166, 83205, 146175, 109778, 115139, 188225, 228421, 265342, 403631, 544795, 480312, 244682, 78898, 57767, 42777, -4482, 44016, 210876, 335637, 314659, 217711, 148575, 162209, 299132, 525124, 672261, 613946, 451275, 364751, 362615, 349916, 339409, 389318, 436350, 404375, 369984, 402656, 374763, 182095]
33277A82095j69679Q5256K18011M2929j56569j36740q2502j84784k28986J7340
33267d13629L26937L22603L5671k02715k41016j63464m3270O8489O4317n4385
33257c00462q9721N8229J93034J28363j2360k5925M5947N6337K8951O1521J15584
33246B59498J07242N9023N188q3319j58866r5969N9146Q7492m7948j30648p2908
33235a2069l5235n7512L1708J95585J31982j62215k57519R478K13688N7513j18383
33224b979K3847J84778j5312k95545j69926J99269K76587M1418o9750M8110R2946
33213C13443j3710m2325K0978n7884k54514k75675q9583K0379l0296k3534J05107
33202c27614J53102N9741J5716R1421J29309O6444J6470m754r1634j71816p1503
$$ y = [182095, 12416, 97672, 315683, 358612, 202043, 65303, -17199, -201983, -430969, -413629, -86692, 235911, 271582, 68867, -172149, -335613, -378883, -310394, -246077, -300462, -390183, -331954, -138920, -10557, -22917, -48842, -2895, 53442, 82393, 143914, 259498, 366740, 425763, 430951, 347632, 188766, 92797, 151943, 239435, 191487, 60839, -12069, -47304, -104816, -73108, 122477, 254459, 92244, -165275, -155797, 57891, 115404, -2979, 20868, 205646, 190334, -105211, -275137, -75868, 200719, 242137, 172387, 220497, 313443, 299733, 257408, 278386, 220502, -34012, -309687, -399270, -378891, -409187, -432721, -327614, -174512, -114771, -99055, -7634, 121675, 188119, 204589, 199835, 108201, -63615, -135118]
33191a35118J26386J47069l2032j52239j02364k5623N586N8168P9710m9829k01285
33180b81571j23084J07052J71059O0821P8569K42898K05662j07642k87489r2319
33170b6044J52420Q9031j38720k03243j10174o0423n5941K0334J13452Q7718j5480
33159a47070n4976k0214J1120L7688Q5616R9710L2244n8780j16154j71181k20771
33148e22768j56215N9612K64291K72524R6105j00402j79664j11811K7155R9044
33138b52129M6723m913P7632J91978J26570p7034j38192L6608J96132J15892r8880
33127B20387k11171j62300m9775M5533Q3206M5013n556L6404J47523J74420N2331
33116C76015j13597k16511k35885j42784P6328K67440K15615l0143j77023j11997
$$ y = [-135118, -8732, 138337, 106305, -45934, -148298, -173921, -168335, -110167, -30457, -80286, -281571, -404655, -297603, -126544, -65723, 12846, 255744, 461406, 353764, 66275, -26044, 126376, 215407, 76687, -126556, -236730, -297153, -353094, -332760, -219308, -131590, -147070, -202046, -222260, -211140, -173452, -87836, 11874, 44118, -14662, -130816, -301997, -522768, -678983, -619371, -355080, -82556, 13549, -86853, -266517, -378328, -351173, -252129, -205406, -210319, -132687, 59291, 185861, 108827, -29365, 7243, 203375, 319267, 220387, 9216, -153084, -202859, -157326, -74120, -29107, -34663, 1741, 149264, 323684, 376015, 262418, 45907, -189978, -332762, -256434, 11006, 226621, 196478, 19455, -92542]
33106i2542m5105j20229j67918k6017J53941J57632O0822O9466J52047J02468
33096B44565j03337k58347k19310o5874M4089M9985Q288J0581P7449J16099L9807
33085e6005p4677o6167O2354J32209O8871J1598O1631J08445L2246q6203j06103
33074H8199l9719K2360P3759J29109J14927j4730j49176j65104j13961j10621
33064a64957j20659l3079J16560J80459J31868R0503J08612Q9591l7725j84746
33054A76427k08803q7839O3464J23384P6326K453k8439l0413n1226p8591n1999
33043i5256L9084J28290J48718Q9356j5415j01995j07655m7945k7962r7010j43402
33032b31192m8216J02751J12001l9370j56012j00148N1977J56984J67386J08343
$$ y = [-92542, -137647, -257876, -425794, -451811, -297870, -140238, -79416, -9950, 142097, 244565, 141228, -117119, -336429, -402303, -358214, -308229, -299941, -289360, -211911, -95812, -56005, -130682, -196849, -134495, -2286, 66585, 78183, 139814, 248259, 280505, 194302, 88199, 48480, 70840, 144599, 273708, 388635, 373905, 224729, 59625, -54336, -164957, -285616, -318695, -202135, -21676, 110192, 200695, 309307, 398898, 361173, 176427, -32376, -120215, -56751, 66633, 142959, 145412, 116973, 86560, 35334, -43257, -95256, -56172, 72118, 220836, 310192, 294777, 192782, 85127, 37182, 9220, -87790, -231192, -279408, -176657, -64656, -104026, -260038, -360186, -308209, -151225, 16161, 124504]
33022A24504J9144m1232l8377k9619p6506j04059K530J72314K09612R7957L0983
33011C67251Q5288Q8060p9331k55625k41323j06631o6137j42383j50398O082J89825
33000c05322K23934J28999Q3211J58923J89710p232l15449l98618j49696J33090
32990b58450J52096l092p6098n8358r6712j36381j0729J87777J99540M0617k2225
32979h2015N0002J2263j83069k57872q2179J11564J40967J25350J50008O2552
32969D7571j68635k59136m7512J93687J76189K5742r212J4934n7503j13160J2191
32958a84844J57209O9208j42344j71502j7197N5933k4425p9109k7812L2142O5488
32947b67253J18122J33870L7912m6724L8845J63265O3390j96981k71956o6597
$$ y = [124504, 143648, 102416, 64039, 34420, -42086, -146145, -143615, 28699, 238311, 336268, 367251, 452539, 540599, 461268, 205643, -35680, -142311, -208448, -350831, -501229, -495147, -305322, -81388, 47611, 130822, 289745, 479455, 472223, 156774, -241844, -391540, -258450, -106354, -109446, -185544, -243902, -340614, -476995, -487724, -299947, -100407, -59790, -82015, -32013, -19750, -202819, -460691, -542870, -431306, -290339, -164989, -14981, 47571, -121064, -380200, -427712, -234025, -57836, -32094, -41306, -26372, -83875, -197035, -184844, -27635, 41573, -100771, -272273, -289470, -233537, -257962, -337071, -364883, -332741, -267253, -149131, -15261, 22651, -24073, 14772, 178037, 241427, 44446, -227510, -294107]
32937b94107J12249K9410j49590j43103N4374K17157J89878K7372r3822n3916
32927a04098P2117Q1802q3155k20405j40439N4231J35015Q5191N5994P2099L3735
32916D2087l4443k286J03252J08452j3795r7729o3849j8603l4026m5481k1198
32905g7619k6679o0511k4347P6764R5209k0020j20978q2236L2770J06711J19737
32894A8801Q7646k015j03572j03948j87M2313p4344j94593j00890J65895L20856
32883E5962J81226j01858k13191l7524K15895K73845J12353p4823j62880j93009
32873E5996j87437p9165R2198J28436l0557j48710l3685J34876P3984j31315j31365
32862b56744J55214M14745L78359J33781o8634j12797m2511M3556M7343n7919
$$ y = [-294107, -181858, -152448, -302038, -445141, -390767, -173610, 16268, 43640, -50182, -104098, -31981, 49821, -33334, -253739, -394178, -339947, -204932, -119741, -63747, 8352, 42087, 7644, 5358, 108610, 217062, 203267, 105538, 41689, 23086, -10940, -56421, -77619, -104298, -164809, -189156, -112392, -17183, -37203, -158181, -240417, -207647, -100936, 18801, 106447, 104432, 860, -103088, -103275, -60962, -135306, -329899, -430789, -264894, 55962, 237188, 135330, -77861, -115385, 100510, 374355, 486708, 411885, 249005, 55996, -131441, -210606, -118408, 10028, -20529, -169239, -202924, -68048, 5936, -125379, -256744, -101530, 313215, 691574, 825355, 756721, 643924, 601413, 644969, 692312, 634393]
32852F34393j70404j72690r9116p3414j03666q5979J833O5146N0422k356n5642
32841a1473q9985n5625M8869J00456J6824p0604q172Q9298n527k26786k64312
32830d77037m1754J56380J20821K899L0166J68496K28498J39080l0100j85796
32820A11653k33911j09744J09022K29341J68975N2832K0842N4321N3859k2200
32810D34990j45771k36355j74089O0643K50509J37200j97676l59674j46611J76727
32800b00107K48749P6262n4410n334Q4329N8863m1909o4255N6347K11994K25775
32789E96304L9084k16313l60828l47871k48907j16475L2692J40138J45042Q9040
32779b48094N7021L0135o6036j83702j84175n9608K9684k6733j57883k21144j40635
$$ y = [634393, 463989, 291299, 192183, 118769, 15103, -70876, -69043, -3897, 46525, 44169, -11473, -101458, -157083, -108214, -7758, 9066, -61538, -69710, 19588, 14061, -212725, -477037, -518791, -362411, -241590, -238691, -208525, -40029, 188469, 327549, 297449, 111653, -122258, -232002, -122980, 106361, 275336, 328168, 349010, 403331, 457190, 434990, 289219, 52864, -121225, -60582, 189927, 327127, 129451, -230223, -376834, -200107, 48642, 124904, 70494, 65160, 149489, 208352, 166443, 102188, 158535, 370529, 596304, 635388, 419075, 58247, -289624, -538531, -655006, -622314, -482176, -337134, -248094, -191073, -160938, -226974, -410676, -594851, -654459, -624775, -651508, -809391, -1030535, -1171170]
32768a171170N7590K44972K60779R9745l3583O113Q3451J8976p5171L0043K53555
32757b24700K83001O5926j15623r2979m03M0019Q1882J13812K996j90893j87614
32746b24576O0343K16492O3496j58683j55216k1734q650r1982q3666K0672R4480
32735b89024J27215J57754J11008m8008j48640n6871O9024K7812p7343l4467Q0124
32724h1416L9288r7688n1764J93716L29580J84424n3497j56264j33936q9771k4668
32713E8004P8587J36410O7431p3676j61533j45300p3973k1127j7635l3072j9607
32702b05491J5867K2883N648K9020Q5551O4356o8858j72294j18911J4609P8387
32691b49233P2067Q2299Q1345j9960j53853j34557N4947J89175R1274j23519j98850
$$ y = [-1171170, -1113580, -868608, -607829, -508084, -541667, -535554, -452103, -433127, -508298, -478255, -224700, 58301, 124227, 8604, -84375, -84778, -44759, 37123, 150935, 153931, -36962, -224576, -164233, 52259, 115755, -42928, -198144, -219878, -228528, -320510, -404176, -383504, -289024, -161809, -4055, 106953, 58945, -89695, -146566, -77542, -49730, -127073, -161540, -81416, -42128, -139816, -191580, 2136, 331716, 516140, 462643, 306379, 172443, 82672, 58004, 136591, 273001, 340432, 266756, 105223, -40077, -114050, -135177, -152812, -185884, -205491, -189624, -166741, -161093, -132073, -46522, 17834, -51024, -223318, -342229, -327620, -249233, -177166, -94867, -13522, -33482, -187335, -321892, -266945, -77770, 13504, -110015, -308865]
32680c08865p0438O7196M3075m3012L1739K43886K83183j3716l55217l38950j0480
32669d71599K00769R1202p9487l6146J26631J66775N9269n7039j16958j27058
32659b43641p0331K6648O5737M6281R9966K29325K15514l9734k86229k57455n1564
32648b65483N6108K3271Q818N9154Q8551Q3293Q6682N8409l7132r4740k9487L8362
32636G5806j9515q9102j5507P9949j3444j99396k04191l9596K2886p2602q5626
32625e60338P8262K02473J45832P0213J22179J64417K9027j70225k03992p4346
32615a96498J9136p027l8846N016L3520n0619j52453r0522J07935J78379j5799
32604b07778k33242j64966J05246K29114J43830J37251L05071L50651J15501q6752
$$ y = [-308865, -379303, -312107, -269032, -312044, -280305, -36419, 246764, 233048, -122169, -461119, -471599, -270830, -179628, -259115, -295261, -168630, -1855, 57414, 375, -116583, -243641, -313972, -287324, -221587, -175306, -75340, 153985, 369499, 329765, 43536, -213919, -265483, -209375, -186104, -177286, -118132, -29581, 53712, 140394, 198803, 161671, 66931, 37444, 75806, 56291, -32811, -48318, 31631, 18187, -181209, -385400, -424996, -402110, -474712, -560338, -482076, -279603, -133771, -63558, 58621, 223038, 252065, 81840, -122152, -196498, -177362, -184389, -223235, -218219, -184699, -235318, -387771, -478293, -370358, -191979, -207778, -441020, -605986, -500740, -271626, -127796, 9455, 314526, 665177, 780678, 693926]
32594F93926L1710K44357J94715j9227p7389k0908j14271k84417k27901q866n459
32583D06270k36173k76433L3429K95002J71534j24204k20878j23327o3875p2560
32573b11215l013J49540K18345J13824n8821j24604k0478J28271J29528k7076
32563B94301j25603l0876R4528O1486j2983Q2837K41561J83072n6204j65475p7801
32552D88843m5343j59348k05531r3374k8907j13691j47130j0648R7623K1549p2187
32541b68144J432J35617J55954J10850J11781J00769m134j20572j51246j39267
32531f6960j14662K803J82981K05277k83j61371m3518J82009J98936M976j43792
32520B46396j19319j3434O3681P0057q835j19661j33856j2802J07450J01430J3544
$$ y = [693926, 725636, 969993, 1164708, 1145481, 1068092, 1047184, 932913, 648496, 420595, 411729, 406270, 170097, -106336, -72907, 222095, 393629, 269425, 48547, -74780, -138655, -211215, -214228, -64688, 153657, 267481, 208660, 84056, 63578, 191849, 321377, 294301, 168698, 137822, 232350, 293836, 280853, 363690, 605251, 788323, 732119, 566644, 488843, 443500, 284152, 78621, -14753, -43660, -157351, -304481, -315129, -217506, -195957, -268144, -266712, -131095, 24859, 135709, 247490, 348259, 344125, 223553, 72307, -66960, -181622, -178819, 4162, 209439, 209156, 47785, 4267, 186276, 385212, 390188, 246396, 127077, 113643, 177324, 247381, 238546, 118885, -14971, -27773, 79677, 181107, 194651]
32509A94651n6228q7440p5679L432Q0314K5044j14955j18405O4845J98197J11420
32498B25196o2647j39028j26569p9056M0680J83257J67035r211q6319K9906P3371
32487B16615j20753k95302k08851n8740r8686j47199P3914L60893K96383n4942
32477c6668k31228q3159R3963J22814J53462K50129K19052j2204k08247j81569
32467H6345n4462k1970q2832j29637j17707m9458N0544R1546K830j14358q6299
32456d25458P6487J95924J91642J41431R1482J5356m2038J147P6348L1463j00438
32445B53346j27881k4170J7069q9608j71219p4672J01363J68875R4471k2430r4850
32434C0294q8972k1399K7564m572l9949N7444K45019K94155R4961j56292j83246
$$ y = [194651, 138423, 50983, -24696, -21264, 59050, 84094, -30861, -149266, -84421, 113776, 225196, 162549, 23521, -103048, -182104, -141424, 41833, 208868, 199657, 113338, 143244, 216615, 95862, -199440, -408291, -467031, -565717, -712916, -639002, -278109, 18274, -36668, -267896, -351055, -257092, -134278, 19184, 269313, 488365, 476161, 267914, 86345, 31883, 9913, -72919, -202556, -320263, -369721, -319177, -227631, -224801, -339159, -425458, -348971, -153047, 38595, 180026, 271508, 286864, 244826, 245973, 322321, 353784, 253346, 125465, 101295, 118364, 28756, -142463, -217135, -115772, 53103, 147574, 125144, 30294, -58678, -80077, -52513, -57085, -97034, -39590, 205429, 499584, 594545, 438253, 255007]
32423B55007K6827K14104J67805l1289j36345o1975J7279n3478j52513o7594J36281
32412C14109J83102K4792p2791L6697J65333J59711J66129K90892K99896j2477
32402A555393l94225m55511k47381j24472j54639r5712Q9859J39374m3723k14807
32392E4156j80452n0399J0120J3810L1536N7868Q2729J20192J24483M4854l9451
32381B69446k2383K5901k9386j25828j01566k057p039r1418o9505M3341M6840
32370f3654o3875q6576r159m2896j86916j51219J43643L57159K22545n3774j13053
32359d7775O8792K29463J83262l4970k51074k67729m3063J87278J39743j35198
32349B8729l11772k44140j02100k7690L3899R3535L6391j05931j13643O1235J92141
$$ y = [255007, 281834, 495938, 663743, 632454, 496109, 434134, 451413, 397935, 245422, 177828, 314109, 497211, 522003, 449212, 485909, 651242, 810953, 977082, 1267974, 1567870, 1555393, 1161168, 705657, 458276, 333804, 179165, 83453, 173312, 312686, 268963, 54156, -126296, -176695, -166575, -152765, -121229, -63361, 19368, 139560, 264043, 308897, 269446, 247063, 272964, 243578, 117750, 16184, 14127, 7088, -84330, -153835, -110494, -63654, -127529, -214105, -223264, -266160, -453076, -604295, -460652, -103493, 119052, 65278, -47775, 21017, 250480, 433742, 398772, 147698, -120031, -163094, 24184, 163927, 28729, -283043, -527183, -629283, -656973, -623074, -529539, -493148, -599079, -712722, -651487, -459346]
32338d59346J58873J15701J45672R0493j00040j93670o4394P0762L4086j6494
32328b18357P0917J23746l2591k18588j87479k4743N1715O1615J19100J43385
32318a11280M1189l0280P5671J66954R612k17949j61429J34701K83859J32682
32308C23730q5310j56390j21734q9025p6075o8272m1626N0460J67990J61420J4143
32297G9311n6311O0691J34217l4875k27006j38033R2112R9793q9037j25024M7247
32286a56915J15639l4546j43076n6610K9907m1922j30396q5117M766K5128L4131
32275d39011Q0690O5907n0673j20260l9797P1999Q3477N6968R4417J36659P9713
32264B0089l0460p2293l2443R663J6072Q517p8j6210l2443j9811N4349J77374
$$ y = [-459346, -300473, -184772, -39100, 51393, -48647, -242317, -306711, -235949, -201863, -218357, -147440, -23694, -56285, -274873, -462352, -487095, -435380, -373765, -254665, -111280, -70091, -100371, -24700, 142254, 151866, -66083, -227512, -92811, 191048, 323730, 238420, 82030, -39704, -128729, -204804, -273076, -314702, -264242, -96252, 65168, 79311, 23000, 83691, 217908, 183033, -43973, -182006, -89894, 9899, -79138, -204162, -156915, -41276, -75822, -218898, -275508, -245601, -287523, -417919, -503036, -498270, -473142, -439011, -358321, -292414, -343087, -463347, -503144, -431145, -347668, -290700, -196283, -59624, 20089, -10371, -82664, -115107, -105444, -89372, -80855, -80933, -97143, -129586, -149397, -95048, 82326]
32252H2326K41294J27825r3243j76064k7980J18571M0596j25950j23298j7082
32242D6995o8070k37763k15636M5791K23402J43822K6735N0725M4284j49622l11401
32231d00738j57920J84508L32429J65159p2291j31827j0806J39723J86951R5180
32221C30368o4931j91366k63606l12348k76417m6722K94592M63695L14694L1831
32211B79790j33676j55860j31153o2094O7390J40356M6703j06724j23205o74Q5861
32200i3286M5948m3037q8765q1488n3366l9667m9014j3080J39759K93653J95911
32189B13568j59193l84289j70654K42515L64298J18002j32547j79487j86401k39282
32179e13470j20178K38372M44669J60579l11432l76517J6547L21474J99149n6450
$$ y = [82326, 323620, 451445, 358202, 182138, 154158, 272729, 313325, 187375, 64077, 46995, -21075, -258838, -474474, -428683, -205281, -61459, -34724, 16001, 60285, -89337, -400738, -558658, -374150, -41721, 123438, 51147, -80680, -91486, 48237, 235188, 330368, 265437, 74071, -189535, -501883, -778300, -825022, -530430, -66735, 247959, 279790, 146114, -9746, -140899, -202993, -135603, 4753, 51456, -55268, -178473, -179147, -93286, -47338, -90375, -179140, -260628, -313994, -353661, -402675, -415755, -275996, 17657, 213568, 54375, -329914, -500568, -258053, 106245, 224247, 91700, -87787, -274188, -513470, -633648, -395276, 49393, 209972, -101460, -477977, -461430, -139956, 59193, 2743]
32169B743o2151O8286k658k28528k47635J7078K23078J39787k4515M784J35186
32158B5455R2685j21463k36740j23337N5467J20942R9855J00178J23099R1611
32148B27752k3818j73744k63816k01779M503J84013J50559n3442j81704j03077
32138d34553L5627M7193l1628m6361J0524J4888n9649j10175j00451j09579j47739
32127i31903j06544J3159L452k39926m32175j85503M22459Q33314O70091J91294
32117B37718r6561q7031n9265j33863j15198P7579J87129K1588j93700j42020
32107c03624Q8410J48256k4002j35020l1195O7684m5747k11129j41732J32136
32097d55963K94185J73555n5293j35824m0226O7890Q8449Q0057J11815J36255
$$ y = [2743, -59408, 8878, 6220, -222308, -469943, -452865, -229787, -90000, -114515, -109731, 25455, 118140, -3323, -240063, -363400, -307933, -186991, -87136, 13042, 136141, 227752, 203934, 30190, -233626, -435405, -430902, -246889, -96330, -149772, -331476, -434553, -398926, -351733, -383361, -429722, -419198, -404310, -463959, -574134, -674585, -784164, -931903, -1038447, -1025288, -1021836, -1261762, -1693937, -1879440, -1456981, -623667, 46424, 237718, 141157, 54126, -5139, -139002, -254200, -176621, 10508, 32096, -161604, -303624, -215214, -66958, -90960, -225980, -257175, -189491, -235238, -446367, -588099, -455963, -161778, 11777, -43516, -179340, -219566, -151676, -63227, 16830, 128645, 264900]
32087B64900P0454o4967j70335j94896j57782p2470M8049J31226J11805N4128
32077B0112P2712J29658P7108p6520j43075o2888j9938j33330k46142j81662j5675
32066e79640Q9550J33193J51296M4717k05409l31587j09729K35089K97354P5727
32056a99439p7404l4204r144q2151l7794J91897L13517J14556j78762k25882l9380
32045b64190J06329Q6051K4375N6968J57121J89454P0344j12842j71259o6747
32035G5604n65j09883k06141n6936J89773J96785j5623j13234k9159m2714j99679
32024c11772j55271K00452M38645K25464j45113k19573m6347L5545j0058K3473
32014C5445J25387J08531k063k1947K7081k6586j38511r5069R7599J99664J11256
$$ y = [264900, 335354, 270387, 100052, -94844, -252626, -325096, -277047, -145821, -34016, 20112, 92824, 222482, 299590, 223070, 79995, 17107, -2831, -136161, -382303, -563965, -579640, -490090, -356897, -205601, -160884, -366293, -697880, -807609, -572520, -275166, -199439, -276843, -311047, -320191, -402342, -440136, -248239, 65278, 179834, 1072, -224810, -264190, -157861, -71810, -47435, 9533, 166654, 356108, 426452, 313610, 142351, 75604, 75039, -34844, -240985, -297921, -108148, 88637, 73014, -40220, -69379, -112093, -311772, -467043, -266591, 172054, 397518, 252405, 32832, -13515, 22030, 11972, 35445, 160832, 269363, 267300, 245353, 272434, 245848, 107337, 12268, 109867, 309531, 420787]
32003D20787k9182j12954j55897j38947k2680Q5188L3533j06410j23936l323P1481
31992h2340K9671k3458m5294r6536j41350o7016Q0918J30372O1478J0665J080
31981a41810o0708j17027K828K28691K51400j5424k63658k20446K62J30185J12944
31970i2763O8805O3678P6443Q1081M7571l8337r9841m5476M9456J5727j19938
31959F406j38139J0445R0437m6162k08247j58616L7640J51544J20853M6308j6667
31948a04198o7405n6004M6663J43470J32756O8449N5765O6124J3923n2681j7475
31937B29387Q1061P3333q0935k08025j46704M2334J54450P8623r2000j78969j19628
31926a67073j8094J2315n704Q297L4654l73n7347k6344O2509N7989m3432n1746
$$ y = [420787, 391605, 278651, 122754, -16193, -38873, 46315, 79848, -26562, -150498, -153821, -82340, -52669, -76127, -121421, -217957, -359307, -426323, -345405, -215033, -153555, -142890, -141810, -202518, -319545, -316717, -88026, 163374, 147950, -115708, -336154, -335892, -205707, -92763, -23958, 39720, 116163, 197244, 244815, 206478, 106637, 61161, 110617, 126344, 6406, -131733, -121288, -30851, -77013, -285260, -443876, -406236, -254692, -133839, -87531, -104198, -171603, -227607, -180944, -37474, 95282, 163731, 219496, 285620, 299543, 246862, 229387, 310448, 383781, 302846, 94821, -51883, -9549, 144901, 223524, 131524, -47445, -167073, -185167, -172852, -178556, -170259, -135605, -135978, -193325, -219669, -157160, -99171, -142603, -194349]
31914a94349J02612K09168P7422j68801k69177j69753r546J22592K18115K18393
31904A36676P2408j04831j29987p976P7082K5419q6462j72795k17892j73664K3503
31893e58519K71426L28505J31982o9673m3307J03021J00213o7305j52610m3077
31883F56O9925Q542j03239m4683J31105J60541k0955j68446r4014O4573Q1688
31872H5693j1730j6318R9949J72296J13765R127p2259j51530j92682r3873R1454
31861C3892J32620m6815k00169r6312J25951J62341k060r9305r536Q1296R308
31850I1211j18773j29436n4213l1481n4033l060J14676J48923L9126q9928j14003
31839b00991o0723o582N5698J42683J73909Q1552l5352k6954O2716M2871j19113
$$ y = [-194349, -91737, 117431, 194853, 26052, -243125, -412878, -422424, -299832, -81717, 136676, 209084, 104253, -25734, -33710, 43372, 68791, -17671, -190466, -408358, -582022, -558519, -287093, 41412, 173394, 103721, 60414, 163435, 263648, 196343, 43733, 656, 70581, 79123, -24116, -68799, 62306, 222847, 201892, 33446, -60568, 4005, 85693, 73963, 57645, 157594, 329890, 443655, 452782, 380523, 228993, 36311, -57562, 33892, 166512, 119697, -80472, -176784, -50833, 111508, 109448, 10143, 607, 81903, 91211, -27562, -156998, -211211, -242692, -296725, -299785, -185109, -36186, 2940, -86988, -200991, -261714, -268296, -212598, -69915, 103994, 185546, 150194, 123240, 185956, 228827, 109714]
31828A09714k27127j52066j6117K4024J1108N7704J22205R3854L721l4898k6246
31817c4124m8420p1741j8015M7003l342j07598q5014M5640P1226m8720q9689N9431
31805b83363J85856R1611p4536m6466J46072K34721J09102o9311j33667r8777
31795F1242n6815l8199k8264k1719q412L4621R9121J32392R5659J3334n6459r0497
31783A36004j15704j42047j10332K6456J68969J32516q8119k32542q8760J97458
31773a16101L04809J66791M243m8755r5959k07538k54143j38201J2890L7927k6757
31762c60794n2374k1176J8779Q3424J88107K47428J80441M2509o3317j27583j81461
31751d6017j91763j22159k2737M0225O8890P7619N6760N4342J46686K47967J39432
$$ y = [109714, -117413, -269479, -285596, -261572, -250464, -192760, -70555, 23299, 27020, -7878, -34124, -82544, -154285, -172300, -125297, -128639, -236237, -321251, -275611, -204385, -253105, -342794, -283363, -97507, -5896, -80432, -126898, 19174, 253895, 362997, 293686, 160019, 61242, 4427, -33772, -62036, -83755, -92167, -57546, 41575, 173967, 269626, 282960, 226501, 136004, 20300, -121747, -232079, -205623, -36654, 95862, 7743, -224799, -313559, -116101, 188708, 355499, 359742, 310987, 215028, 7490, -246653, -384854, -371964, -334037, -360794, -413168, -434344, -415565, -332141, -144034, 103394, 283835, 326344, 263027, 135444, -46017, -237780, -359939, -382676, -342451, -273561, -195942, -139182, -84840, 61846, 309813, 449245]
31740D49245j80218l77624k11499J02998J91087L3672p7183M919J43447J86483
31730B65327J19064k3289j71696j94605o5138P891j42706l12782j74192J93075
31720d99051L64161J87759j9314R127J25113R1468l4198o6688j2895J3925K6618
31709A86025Q0637R3475k6147j67899j54864k0204N3302K0405R73M3758O0132
31698A69593J3878L165R3879J99797K03667J13803K7123j2107m1928q4336q8071
31687E98463j0071Q1750O7131m5540r2239J0602R2506n4140l26409l90204j49987
31676b18138P9393M653k21477k17476Q1137L34015K62714k279j28239n83J80970
31665A54690J78472r075j65860j20588N0019J15716j2619j59459j14523Q2524
$$ y = [449245, 269027, -108597, -320096, -217098, -26011, 7661, -69522, -64603, 78844, 265327, 384391, 361102, 189406, -5199, -70337, -62446, -205152, -517934, -692126, -499051, -134890, 52869, 33555, 42682, 167795, 259263, 225065, 158377, 145482, 159407, 186025, 266662, 360137, 333990, 166091, 11227, -8977, 44325, 64730, 65703, 109461, 169593, 183471, 186636, 280515, 480312, 683979, 797782, 824905, 812798, 770870, 686534, 598463, 588392, 670142, 737273, 691733, 599494, 610096, 702602, 648462, 322053, -68151, -218138, -138745, -134092, -355569, -573045, -491908, -157893, 104821, 102542, -25697, -26280, 154690, 333162, 324087, 158227, 37639, 87658, 203374, 190755, 31296, -83227, -703]
31655g03J99015J23900j1579n3037k4112k7146n5696l4540J4229r761j08464j64566
31643a52460j25222q1431j05813j24238m0842R5099J59982J37585J08404Q8970
31633c9966J6545r8076j32257j7745J44371J95214R3567o0013j35563q7610R884
31622a11649L7511l1834r6350p1528j1904K468K5510J39095K43990J67894k3055
31611B70148o8438P2490J16947r4622l02786k01528R2010K17191R8409n110N9558
31600B54269J38053N7778j13512j95969j36242k9299P166p3259k07831k55403
31590e54249j28325R6647K49666K33247P0781j50433l01854k48079J2260K67837
31580d52502K81420N5279j81552k36271j15513N0492J51640J66874J48522J30752
$$ y = [-703, 198312, 322212, 310633, 257596, 233484, 206338, 150642, 116102, 130331, 120570, 12106, -152460, -277682, -359113, -464926, -589164, -630006, -534907, -374925, -237340, -128936, -39966, -23421, -121497, -253754, -271499, -127128, 68086, 161653, 101640, -33923, -121533, -111649, -74138, -105972, -202322, -273850, -285754, -283286, -257776, -118681, 125309, 293203, 270148, 201710, 274200, 391147, 296525, -6261, -207789, -115779, 101412, 199821, 194711, 254269, 392322, 450100, 336588, 140619, 4377, -24922, -17756, -91015, -298846, -554249, -682574, -585927, -336261, -103014, -32233, -182666, -484520, -732599, -720339, -452502, -171082, -115803, -297355, -533626, -649139, -598647, -447007, -280133, -131611, -859]
31570h59N5680j22474k61439j37848J99588L94746K42071l3840j45719j56945
31560C2961k52300l15397j16665K07171K87436J00475j2090P6457J04591p5084
31550C7555k31954j66797k6348l71j4100M9489R1988Q811p2118p087J01626R8204
31538a31102M9182Q3983J21429J5341j51917j82540q1214j1450k46O6907J86956
31527c4671K11730R4887k8062m4746m255j1075q6570j66326j67653n6807R8430
31516a95118J63491P6070p4333j44901q7306K1542N3421n9012k14367j82624J21690
31505e21447M38795M16834O7231k39312k55599j00432L1864J25101J87393J22988
31495B73416o4132j79582j35459r7907j49200q4819J94830L79620J85649j44417
$$ y = [-859, 54821, -67653, -329092, -466940, -267352, 127394, 369465, 335625, 189906, 32961, -219339, -534736, -651401, -444230, -156794, -56319, -68409, 8048, 112639, 37555, -194399, -361196, -387544, -387915, -402015, -352526, -260538, -251727, -323845, -330932, -229306, -131102, -81920, 2063, 123492, 138833, -13084, -195624, -276838, -288288, -288534, -221627, -34671, 177059, 271946, 243884, 199138, 194883, 183808, 97238, -69088, -236741, -293548, -195118, -31627, 44443, -29890, -174791, -262097, -240555, -187134, -246146, -460513, -643137, -521447, -82652, 334182, 401413, 162101, -93498, -193930, -162066, -36965, 150428, 273416, 209284, 29702, -105757, -203664, -352864, -437683, -242853, 136767, 322416, 177999]
31485A77999j87338m279L610j99369k29612M9646K96794K43263N1510m5076q4024
31474G3124j47989j28849L0869J29160R923j32383l5176K03913K74711J30634
31464D07937J9099O6502J17307L0933j02884j46807j33355j67432k29195k15990
31454c53885j19719k8714K4006Q7496J61328J62143O2518n0605j17241j86099
31444c58772k64153k15400L4989K97167L19073J36839O026J7216L0563q691J5270
31433A0127R3952K5012k19847l48194j71117P8243R0159p4258j46423p6706p769
31422g46821L3831J16974J79425J18596L2698Q2090J75220R3939j09854j58867
31412a82769M946J25767L1000j46747k11615j38546k191J26414J61534O3628n1645
$$ y = [177999, -9339, -13618, -10008, -209377, -438989, -389343, -92549, 150714, 202224, 157148, 73124, -74865, -203714, -172845, -43685, -33762, -166145, -201321, 2592, 277303, 407937, 427036, 493538, 610845, 641778, 538894, 392087, 258732, 91300, -137895, -353885, -473604, -502318, -478312, -390816, -229488, -67345, -4827, -55432, -172673, -358772, -622925, -838325, -803336, -506169, -187096, -50257, -44231, -27015, 3548, -5143, 10127, 104079, 129091, -90756, -438950, -610067, -531824, -441665, -515923, -662346, -739052, -746821, -712990, -596016, -416591, -297995, -265297, -183207, -7987, 85952, -23902, -182769, -177823, -52056, -21056, -167803, -379418, -517964, -520155, -393741, -232207, -168579, -220224]
31401b20224l8823M6279L5291n4506m6491P4096J26864N4597J0480O6484Q8405
31390A42452j4535j46856k17845k53208k35780o8549J98273L25773J99497l001
31380g3779p2732k2654K2865J7893l0497j16249j68877q5805R7292K22413K37116
31369B6986K23812J80904J7904j82237j81640K6338J35885k0050k16121k11308
31359a99527j05922r9075j36526o1546Q0309J51647J75491K22733K00567J9590
31349B47741j57769j12678Q0177J62400P5001k6499p3667j30824j71787q3264
31339a91169R2380J59236N7942m9081l5358K6063K6015m111K7449J07376J22110
31328C38852M673j68748k46618j79679r7447j33972k09844j31491Q7235J99393
$$ y = [-220224, -259047, -212768, -177477, -231983, -278474, -204378, -77514, -22917, -12437, 54047, 142452, 127917, -18939, -236784, -489992, -725772, -794321, -596048, -270275, -70778, -73779, -146511, -169165, -146300, -128407, -158904, -275153, -444030, -529835, -432543, -210130, 26986, 250798, 431702, 449606, 267369, 85729, 112067, 247952, 227902, 11781, -199527, -305449, -404524, -541050, -602596, -522287, -370640, -195149, 27584, 228151, 247741, 89972, -22706, 57471, 219871, 294872, 268373, 194706, 63882, -107905, -191169, -98789, 60447, 118389, 69308, 33950, 60013, 86028, 81917, 109366, 216742, 338852, 343525, 174777, -71841, -251520, -348967, -482939, -692783, -824274, -737039, -537646]
31318e37646R1591l6270N368R6758L7104r1084m0966J98467L70520L02153Q3690
31307D79685j06930j90799j81932j27055p6390m0182J2520O8517N5834k8272p9649
31296b14653n2703l4485o2220k7905J05132J66670L8559j16325r4923K7764N7017
31285b08072J0775K2142L5544q4233k20522j26492J40043K45713Q4367o8353J4018
31274a55070K07241K76874J79167M127j74280k74054k09066k5737J09227J28153
31264F6582J18142J16466M3660r5593j53352p6907j0228m8368q5100l3255k670
31253a60623r5075j92232j38048K915O6280N8767R9516J67105J27197j3715r3244
31242a71157m5849J9738L4831P6881J78736K03257N2599j18595r0434P3076Q1595
$$ y = [-537646, -446055, -482325, -476957, -380199, -343095, -434179, -475145, -276678, 93842, 395995, 479685, 372755, 181956, 24, -127031, -203421, -243603, -231083, -162566, -106732, -135004, -214653, -267356, -301841, -364061, -391966, -286834, -120164, -81605, -197930, -292853, -265089, -208072, -197297, -175155, -139611, -223844, -444366, -570858, -430815, -185102, -100735, -169088, -155070, 52171, 329045, 508212, 512339, 338059, 64005, -145061, -170798, -61571, 66582, 184724, 301190, 344850, 249257, 95905, 18998, 8770, -39598, -124698, -157953, -160623, -255698, -447930, -585978, -583063, -516783, -458016, -358500, -191395, -64198, -77913, -171157, -217006, -197268, -162437, -85556, 93180, 296437, 349036, 230441, 140007, 213083, 294678]
31231B94678j39933k92218j23164J74513K15688k7852k08502j24275L3442L3359
31221a64264p2111j29028j41713j45203l4413K20356L62433J65650j46556j41502
31211b26351J95388M21875K73392J358n2643O5317P4133j03776k84756l14800
31201D9137k18820p8278Q1119K34097K81550J25545j66820l47563k32857M9324
31191b23566J83569O2355j03043j26291q9608j04114n8380J44811K89174J15062
31181H9969k16035k91731n5930J24931M0945q8482l7770P4008N0685l7635j6874
31170c63919P2723N9314o3257j22622j2025J85047K93447K05411k0308j94452
31160C9359j88952q0819k5169l6149k4342R789j387k8866j1678k9187j63164k47392
$$ y = [294678, 154745, -137473, -260637, -86124, 129564, 101712, -106790, -231065, -197623, -164264, -236375, -365403, -507116, -652319, -686732, -466376, -103943, 61707, -84849, -226351, -30963, 390912, 664304, 665662, 613019, 678336, 752469, 648693, 363937, 49137, -169683, -247961, -166842, 67255, 348805, 474350, 307530, -40033, -272890, -223566, -39997, 22358, -80685, -206976, -296584, -400698, -459078, -314267, -25093, 89969, -126066, -417797, -473727, -348796, -307851, -396333, -434103, -360095, -309410, -347045, -363919, -291196, -231882, -295139, -417761, -429786, -244739, 48708, 254119, 233811, 39359, -149593, -230412, -255581, -291730, -316072, -306283, -307670, -336536, -348214, -377401, -540565, -787957]
31148g87957o6014K26459K54244J7731p3588J29539K56877L7685k42823k11205
31138d59052K5310J35392R9219R5457P9695r9831l05410k50474J7534J53821L0717
31127d77622j20376j05560j467O8009J22016J92793K06206J03116m0369r5176
31117a48430k1584R6523J26031K0690r3155m8432J12940J57844l068j66127j34903
31106a01671L647N6290J2380k4506m5179p9584o5050L1389Q2624q777j15145p6798
31094c30380M2339R6476J04601J29945Q1267r6174j94379k3682K12895J70797
31084A93705j08828k79213k19308j11128m1044P0316J50364J5649k17346j87494
31074g34327J35732L39556J87627l6456j7024J20735J01408k9738m6938M2688
$$ y = [-787957, -853971, -627512, -373268, -355537, -429125, -299586, -42709, -5024, -247847, -459052, -433742, -298350, -199131, -103674, -23979, -123810, -429220, -679694, -662160, -508339, -477622, -597998, -703558, -705025, -637016, -515000, -322207, -116001, -12885, -53254, -148430, -170014, -73491, 52540, 73230, -19925, -68357, 44583, 202427, 199359, 33232, -101671, -98024, -41734, -29354, -53860, -99039, -178623, -243673, -212284, -129660, -138437, -253582, -330380, -288041, -191565, -86964, 42981, 124248, 28074, -166305, -189987, 22908, 193705, 84877, -194336, -413644, -524772, -565816, -495500, -345136, -329487, -546833, -734327, -598595, -259039, -71412, -107868, -124892, -4157, 97251, 67513, 20575, 63263]
31064F3263M4373p3151j47628r5593L845P2047J02627Q2585j2562j31778j57331
31053b49303l4867J37676J74655q033k48069k62897j66K43664J99167M377j5876
31042e9672J34461J36902j06926k90265j61853J17994K50209J96852J17189P5621
31032D10512J1244r8770j97742k17274j16843O1929J59168N3197j28704j37663
31022b00946K9467J14360R981o8217N5967K38457K65305J61083N2023p8151k69221
31011C10108l81247k56922M376J47033P7236p9198j69307j25828L2734J87249
31001b53766J87869N0269k0940Q7577K18697J66755m8874k57627l52769l05351
30991e28160j08560J45715K69078J97541Q1343M0858O241p2950p5434N7335J52306
$$ y = [63263, 107636, 34485, -113143, -208736, -204891, -132844, -30217, 52368, 39806, -91972, -249303, -284170, -146494, 28161, 20128, -227941, -490838, -491004, -247340, -48173, -43796, -59672, 74789, 211691, 104765, -185500, -347353, -229359, 20850, 217702, 334891, 410512, 421756, 322986, 125244, -92030, -208873, -146944, 12224, 65421, -63283, -200946, -171479, -57119, -47138, -115355, -59388, 179069, 444374, 605457, 657480, 579329, 310108, -71139, -328061, -323685, -176652, -99416, -178614, -347921, -473749, -441015, -253766, -65897, -15628, -36568, 51009, 269706, 436461, 387587, 129960, -222809, -528160, -636720, -491005, -221927, -24386, 56957, 97815, 104056, 31106, -44328, 13007, 165313]
30980A65313P8136k9923m2245q6178k50027k99644n0530K13905J30899j21862
30970b92156r4442J69048J99172p8337j95309N8715K70062R7277j70445j18531
30960a54946J21150J35086r3481k13697q5326P7477J07479P8590O0601k5514j98750
30949a91331k75889r7595J97912K82372L5531k64979k45921R4011L58255K55904
30939A48270k6029j13534K7737J13375K4080m8567J9605P7820o79r0825o7570
30928F3683m4213j35777j85489K756K88700L36908Q5713j76944k09033p4359K6811
30917b1244J6097l6961m2807R165M4190J79n5487J1056J73314K10176J3062k00796
30905A19944j58034Q0380K10962J22844N640J0785M3188k5825j34442j47747o6275
$$ y = [165313, 243449, 213526, 171281, 85103, -164924, -464568, -515098, -301193, -170294, -292156, -386598, -217550, -18378, -96715, -292024, -233309, 36753, 134030, -36415, -154946, -33796, 101290, 7809, -205888, -291214, -213737, -106258, -27668, 32933, 7419, -191331, -467220, -564815, -366903, -84531, -49000, -313979, -559900, -465889, -107634, 148270, 122241, 8707, 36444, 149819, 173899, 125332, 144937, 222757, 222078, 131253, 63683, 19470, -116307, -301796, -299040, -10340, 326568, 412281, 235337, 26304, -48055, -21244, -5147, -42108, -84915, -75750, -31560, -31381, -86868, -75812, 97502, 307678, 320740, 119944, -38090, 42290, 253252, 376096, 381736, 392521, 435709, 409884, 275442, 127695, 61420]
30894F1420J0851L9407K9727l4319j54316k36865j72013J1974J62317J77821J00205
30883c791K0111l4113p5001p8719j713J24205J76174O8431j24032k25530j52168
30872c06146N146J07453J16133P2041m475j02837j52042q2680L3272L0500j08670
30861c92305j78244j4267K49675L30907J63081m0342r3669m4383j1551J1803O1043
30850D1748M1806j27840k86013j79633J36472K99322J30065j02963p8446J19196
30840f286J73685L1959p1918l9936l5600j32661j44397M6285K34665J85110m44
30829B40462m5084Q0058J47198M1815j07052j78057k02369j94150o1550J82248
30819i6481L02658J29403j49499j92227L3314K04206R5439j22985j53006K2039
$$ y = [61420, 72271, 111678, 141405, 107086, -47230, -284095, -456108, -444134, -281817, -103996, -3791, 16320, -17793, -92794, -171513, -173226, -49021, 127153, 195584, 71552, -153978, -306146, -301000, -193547, -77414, -5373, -9848, -112685, -264727, -347407, -314135, -283635, -392305, -570549, -584816, -335141, -4234, 158847, 118505, 24836, -19547, -31098, -19295, 41748, 83554, -44286, -330299, -509932, -373460, -74138, 55927, -47036, -125482, -6286, 167399, 199358, 127440, 87504, 51904, -80757, -225154, -178869, 55796, 240906, 240462, 195378, 275436, 422634, 464449, 357397, 179340, -23029, -217179, -278729, -96481, 206177, 335580, 186081, -6146, 27168, 231374, 326813, 203828, 50822, 72861]
30809G2861J65194J39917L9635k9821j01437k11011k68102j83716k8032O4241
30799c40271P9065R0211R7311M0020n1947p4572k2412K054j6100M9075K45890
$$ y = [72861, 238055, 377972, 417607, 387786, 286349, 75338, -192764, -376480, -404512, -340271, -261206, -170995, -73684, -33664, -85611, -160183, -182595, -180541, -196641, -147566, 98324]
$$ [...]
##END NTUPLES=NMR SPECTRUM
##END=
