##TITLE=31Pdec_PR159R_rm2
 DMSO-d6, 24 sc
 29.4.2019
##JCAMPDX= 6.0         $$ Bruker NMR JCAMP-DX V2.0
##DATA TYPE= NMR SPECTRUM
##DATA CLASS= NTUPLES
##ORIGIN= UXNMR, Bruker Analytische Messtechnik GmbH
##OWNER= root
$$ XWIN-NMR		Version 3.5
$$ Mon Apr 29 14:13:11 2019 Russian Standard Time (UT+4h)  she@DPX200
##.OBSERVE FREQUENCY= 81.013821
##.OBSERVE NUCLEUS= ^31P
##.ACQUISITION MODE= SIMULTANEOUS
##.ACQUISITION SCHEME= undefined
##.AVERAGES= 24
##.DIGITISER RES= 17
##SPECTROMETER/DATA SYSTEM= spect
##.PULSE SEQUENCE= zgpg30
##.SOLVENT NAME= CDCl3
##.SHIFT REFERENCE= (INTERNAL, CDCl3, 0, 182.463)
##AUDIT TRAIL= $$ (NUMBER, WHEN, WHO, WHERE, WHAT)
$$ ##TITLE= Audit trail, XWIN-NMR		Version 3.5
$$ ##JCAMPDX= 5.01
$$ ##ORIGIN= Bruker BioSpin GmbH
$$ ##OWNER= she
$$ F:/spectra/data/she/nmr/P31/1/pdata/1/auditp.txt
$$ ##AUDIT TRAIL=  $$ (NUMBER, WHEN, WHO, WHERE, WHAT)
(   1,<2019-04-29 14:12:12.04 +0400>,<she>,<DPX200>,
      <created by zg, POWCHK disabled, PULCHK disabled
       configuration hash MD5:
       00 E9 B6 7A A2 85 ED C7 34 08 36 98 17 FE 4E 26
       data hash MD5: 32K
       F5 63 A8 DD 2D 00 A4 EE 77 E2 5E 89 68 2F 43 11>)
(   2,<2019-04-29 14:12:20.01 +0400>,<she>,<DPX200>,
      <Start of raw data processing
       efp BC_mod = 2 LB = 1 FT_mod = 6 PKNL = 1 PHC0 = -1806.668 PHC1 = 61.19899 SI = 64K 
       data hash MD5: 64K
       60 EB 66 F7 CC FF 27 5C F0 1D 6F 88 B0 F8 FA 3E>)
(   3,<2019-04-29 14:12:33.98 +0400>,<she>,<DPX200>,
      <pk PHC0 = -13.91662 PHC1 = 0 
       data hash MD5: 64K
       D0 A3 EE 49 83 E8 AC 8C CA 5B 41 31 E4 4E 2E FC>)
$$ ##END=
$$ 
$$ hash MD5
$$ B5 40 FD E7 59 60 57 A2 7C 73 05 87 59 B1 A9 03
##$RELAX= 
##$RELAX= 
##$RELAX= 
##$RELAX= 
##$RELAX= 
##$RELAX= 
##$RELAX= 
##$RELAX= 
$$ Bruker specific parameters
$$ --------------------------
##$DU= <F:/spectra>
##$EXPNO= 1
##$NAME= <P31>
##$PROCNO= 1
##$TYPE= <nmr>
##$USER= <she>
##$AMP= (0..31)
100 100 100 100 100 100 100 100 100 100 100 100 100 100 100 100 100 100 
100 100 100 100 100 100 100 100 100 100 100 100 100 100 
##$AQSEQ= 0
##$AQ_mod= 1
##$AUNM= <au_zg>
##$AUTOPOS= <>
##$BF1= 81.014009
##$BF2= 200.13
##$BF3= 200.13
##$BF4= 200.13
##$BF5= 200.13
##$BF6= 200.13
##$BF7= 200.13
##$BF8= 200.13
##$BYTORDA= 1
##$CFDGTYP= 0
##$CFRGTYP= 5
##$CHEMSTR= <none>
##$CNST= (0..31)
1 1 145 1 1 1 1 1 1 1 1 1 1 1 1 1 1 1 1 1 1 1 1 1 1 1 1 1 1 1 1 1 
##$CPDPRG= <waltz16>
##$CPDPRG1= <>
##$CPDPRG2= <waltz16>
##$CPDPRG3= <>
##$CPDPRG4= <mlev>
##$CPDPRG5= <mlev>
##$CPDPRG6= <mlev>
##$CPDPRG7= <mlev>
##$CPDPRG8= <mlev>
##$CPDPRGB= <>
##$CPDPRGT= <>
##$D= (0..31)
0 1 0 0 0 0 0 0 0 0 0 0.03 2e-05 3e-06 0 0 0 0 0 0 0 0 0 0 0 0 0 0 0 0 
0 0 
##$DATE= 1556532731
##$DBL= (0..7)
120 120 120 11 120 120 24 19 
##$DBP= (0..7)
150 150 150 150 150 150 150 150 
##$DBP07= 0
##$DBPNAM0= <>
##$DBPNAM1= <>
##$DBPNAM2= <>
##$DBPNAM3= <>
##$DBPNAM4= <>
##$DBPNAM5= <>
##$DBPNAM6= <>
##$DBPNAM7= <>
##$DBPOAL= (0..7)
0.5 0.5 0.5 0.5 0.5 0.5 0.5 0.5 
##$DBPOFFS= (0..7)
$$ [...]
##$SUBNAM2= <"">
##$SUBNAM3= <"">
##$SUBNAM4= <"">
##$SUBNAM5= <"">
##$SUBNAM6= <"">
##$SUBNAM7= <"">
##$SUBNAM8= <"">
##$SUBNAM9= <"">
##$SW= 369.568048894756
##$SWIBOX= (0..15)
0 1 3 0 0 0 0 0 0 0 0 0 0 0 0 0 
##$SW_h= 29940.119760479
##$TD= 32768
##$TD0= 1
##$TE= 0
##$TE2= 300
##$TE3= 300
##$TEG= 300
##$TL= (0..7)
0 120 53 12 22 120 120 120 
##$TP= (0..7)
150 150 150 150 150 150 150 150 
##$TP07= 0
##$TPNAME0= <>
##$TPNAME1= <>
##$TPNAME2= <>
##$TPNAME3= <>
##$TPNAME4= <>
##$TPNAME5= <>
##$TPNAME6= <>
##$TPNAME7= <>
##$TPOAL= (0..7)
0.5 0.5 0.5 0.5 0.5 0.5 0.5 0.5 
##$TPOFFS= (0..7)
0 0 0 0 0 0 0 0 
##$TUNHIN= 0
##$TUNHOUT= 0
##$TUNXOUT= 0
##$USERA1= <user>
##$USERA2= <user>
##$USERA3= <user>
##$USERA4= <user>
##$USERA5= <user>
##$V9= 5
##$VALIST= <valist>
##$VCLIST= <CCCCCCCCCCCCCCC>
##$VD= 0
##$VDLIST= <DDDDDDDDDDDDDDD>
##$VPLIST= <PPPPPPPPPPPPPPP>
##$VTLIST= <TTTTTTTTTTTTTTT>
##$WBST= 1024
##$WBSW= 4
##$XGAIN= (0..3)
0 0 0 0 
##$XL= 0
##$YL= 0
##$YMAX_a= 25279
##$YMIN_a= -20302
##$ZGOPTNS= <>
##$ZL1= 120
##$ZL2= 120
##$ZL3= 120
##$ZL4= 120
##$ABSF1= 0
##$ABSF2= 0
##$ABSG= 0
##$ABSL= 0
##$ALPHA= 0
##$AQORDER= 0
##$ASSFAC= 0
##$ASSFACI= 0
##$ASSFACX= 0
##$ASSWID= 0
##$AUNMP= <proc_1d>
##$AZFE= 0.1
##$AZFW= 0.5
##$BCFW= 0
##$BC_mod= 2
##$BYTORDP= 0
##$COROFFS= 0
##$CY= -3
##$DATMOD= 1
##$DC= 0
##$DFILT= <>
##$DTYPP= 0
##$F1P= 0
##$F2P= 0
##$FCOR= 1
##$FTSIZE= 65536
##$FT_mod= 6
##$GAMMA= 0
##$GB= 0
##$INTBC= 1
##$INTSCL= 5.30512e-09
##$ISEN= 30
##$LB= 1
##$LEV0= 0
##$LPBIN= 0
##$MAXI= 10000
##$MC2= 0
##$MEAN= 0
##$ME_mod= 0
##$MI= 50
##$NCOEF= 0
##$NC_proc= -5
##$NLEV= 6
##$NOISF1= 182.463
##$NOISF2= 159.3651
##$NSP= 0
##$NTH_PI= 0
##$NZP= 0
##$OFFSET= 182.463
##$PC= 4
##$PHC0= -1820.585
##$PHC1= 61.19899
##$PH_mod= 1
##$PKNL= yes
##$PPARMOD= 0
##$PSCAL= 0
##$PSIGN= 0
##$REVERSE= no
##$SF= 81.0140089999434
##$SI= 65536
##$SIGF1= 159.3651
##$SIGF2= -187.1042
##$SINO= 113.3802
##$SIOLD= 16384
##$SREGLST= <1H.CDCl3>
##$SSB= 0
##$STSI= 65536
##$STSR= 0
##$SW_p= 29940.119760479
##$SYMM= 0
##$S_DEV= 0
##$TDeff= 32768
##$TDoff= 0
##$TI= <>
##$TILT= no
##$TM1= 0
##$TM2= 0
##$TOPLEV= 0
##$USERP1= <user>
##$USERP2= <user>
##$USERP3= <user>
##$USERP4= <user>
##$USERP5= <user>
##$WDW= 1
##$XDIM= 65536
##$YMAX_p= 314359114
##$YMIN_p= -12040746
$$ End of Bruker specific parameters
$$ ---------------------------------
##NTUPLES= NMR SPECTRUM
##VAR_NAME=  FREQUENCY,     SPECTRUM/REAL,   SPECTRUM/IMAG
##SYMBOL=    X,             R,               I
##VAR_TYPE=  INDEPENDENT,   DEPENDENT,       DEPENDENT
##VAR_FORM=  AFFN,          ASDF,            ASDF
##VAR_DIM=   65536,         65536,           65536
##UNITS=     HZ,            ARBITRARY UNITS, ARBITRARY UNITS
##FACTOR=    0.456856943014862, 1,           1
##FIRST=     14782.0589164792, 0,            0
##LAST=      -15158.0608439998, 0,           0
##MIN=       -15158.0608439998, -12040746,   0
##MAX=       14782.0589164792, 314359114,    0
$$ Real data points
##PAGE= N=1
##DATA TABLE= (X++(R..R)), XYDATA
$$ [...]
36450A592410r46639l12093K56520K58483J7163p6329j5160P0770P4432j18992
$$ 1592410 645771 333678 590198 848681 865844 789515 774355 845125 919557 800565
36440H00565m14470m21376J0546M09754L04220m0730o7696J17136q8657p22354
$$ 800565 386095 -35281 -24735 385019 689239 648509 580813 697949 609292 -113062
36430a13062j041720n21326M22816Q97949M56165n02919j050783n44694O34510
$$ -113062 -1154782 -1676108 -1253292 -355343 100822 -402097 -1452880 -1997574 -1363064
36421a363064J333056R07742J3666k86388Q6790L04156q1711o14249p44548n38891
$$ -1363064 -30008 877734 891400 605012 691802 995958 914247 299998 -444550 -983441
36411i83441l72469l60090l01622O5888Q04308J509862J445187L69714q68280
$$ -983441 -1355910 -1716000 -2017622 -1951734 -1147426 362436 1807623 2177337 1309057
36402A309057j125962l48758M18514M38474L9887j79888j96712k50506l03980
$$ 1309057 183095 -165663 252851 691325 731212 551324 354612 104106 -199874
36393a99874k63835k63988k91318p34O09204Q26814J79125o46072o27688O0538
$$ -199874 -463709 -727697 -1019015 -1019749 -410545 416269 595394 -50678 -678366 -617828
36383f17828K54774m34474r98475n33245M19700O75755P5801l88054J2553Q49081
$$ -617828 -363054 -797528 -1796003 -2329248 -1909548 -1233793 -1157992 -1546046 -1533493 -684412
36373f84412J186559O96768r9129m85772k64681J35357J90024j10534l09461j71870
$$ -684412 502147 1198915 1099786 614014 349333 484690 674714 564180 254719 82849
36363H2849k5436j65394k57048J45350O82372N28491k85297p04401j70762M74074
$$ 82849 57413 -107981 -365029 -219679 462693 991184 705887 1486 -169276 304798
36353C04798K64463l61694k54461N93751R91430L57401m78441o00121k12783p887
$$ 304798 569261 207567 -46894 546857 1538287 1895688 1417247 817126 604343 596456
36343E96456p5294j19681k05783n16631o98686k47666N43970P63860J22116n75430
$$ 596456 521162 401481 195698 -320933 -1019619 -1267285 -723315 40545 162661 -412769
36333d12769m43217M14405J139565J139666N47777j69266o81861q32417n40450
$$ -412769 -855986 -441581 697984 1837650 2385427 2216161 1534300 701883 161433
36324A61433N3885M95859M08538R87j42896J32939L45894J34930k30709m12916
$$ 161433 215318 711177 1119715 1120702 977806 1110745 1456639 1591569 1360860 947944
36314I47944n44440p02065m10113N40868J253184P45908m48085q98674l95776
$$ 947944 403504 -298561 -708674 -167806 1085378 1831286 1383201 484527 88751
36305H8751r9786m59800n24495J73931O22565J09878m29884m4469N21643J69476
$$ 88751 -11035 -470835 -995330 -821399 -198834 -88956 -518840 -563309 -41666 127810
36295A27810n52567m21247L05735M85298K46267O12916J283220Q66779n62351
$$ 127810 -424757 -846004 -540269 -54971 191296 804212 2087432 2954211 2391860
36286B391860j214192l58392N72227M09494j7317L44515Q36878L33738p22101
$$ 2391860 1177668 819276 1391503 1800997 1783680 2128195 2965073 3298811 2576710
36277B576710j024055m38635N0205J5241m0264K08364M67903M48381J45278l97158
$$ 2576710 1552655 1114020 1164225 1179466 1139202 1347566 1815469 2263850 2409128 2011970
36267B011970r57933r80241k13927O75244Q23308L48404J25242M57807O87371
$$ 2011970 1054037 73796 -140131 535113 1358421 1706825 1832067 2289874 2977245
36258B977245K31344n72018r15778n03561J59336L72933K4185l37567k64863j3263
$$ 2977245 3208589 2636571 1720793 1217232 1376568 1749501 1773686 1436119 1171256 1157993
36248A157993o4439l13148l06238j07464j43042k57205J16230P61115P72397J02514
$$ 1157993 1093554 780406 474168 366704 223662 -33543 82687 843802 1616199 1718713
36238A718713k27033P8546k4708r49092j355195k28301J218407J269080L04606
$$ 1718713 1491680 1570226 1545518 596426 -758769 -987070 231337 1500417 1805023
36229A805023o2697L47500M08455m0356q8387K55375P73p94913r02800j28145
$$ 1805023 1742326 2089826 2498281 2457925 2369538 2624913 2625686 1830773 927973 799828
36219G99828K64943k04426m54111N1442K87435l38475p65862j92041M24816R7764
$$ 799828 1064771 860345 406234 457676 745111 406636 -359226 -551267 -126451 -28687
36209b8687m05432N014P70848P44466J89974P9239K37719j03236n69282k21500
$$ -28687 -434119 -429105 341743 1086209 1276183 1355422 1593141 1489905 920623 699123
36199F99123N63913N43402k84433o89748k67880J18658K5211J1940L22633L94070
$$ 699123 1263036 1806438 1522005 832257 564377 683035 708246 720186 1042819 1436889
36189A436889J5848k68529k41573l45325o65007p04108m08726k76978k58923K09942
$$ 1436889 1452737 1184208 942635 597310 -67697 -771805 -1180531 -1457509 -1716432 -1506490
36179a506490Q76492P80015L0734o3366P91455J148259J59137r34223q05676j01857
$$ -1506490 -629998 150017 180751 117385 908840 2057099 2216236 1282013 476337 374480
36169C74480p0771l74246L4934P51491M89712o30858j143476m83231L72660N90298
$$ 374480 303709 -70537 -35603 715888 1205600 574742 -568734 -1051965 -679305 -89007
36159h9007M33324L30409J79209j19353l65326n22238p12810p15576k49835L07352
$$ -89007 344317 674726 853935 734582 369256 -152982 -865792 -1581368 -1831203 -1523851
36149a523851L57792J24254K82732O65919M62404k83860n90568j26475L17047
$$ -1523851 -1166059 -1041805 -759073 -93154 369250 85390 -505178 -631653 -314606
36140c14606K23180L7164J00567Q3914o9997J72842P67897P97286K713n72567
$$ -314606 -91426 -54262 46305 130219 60222 233064 1000961 1798247 1800960 1228393
36130A228393k48635J67314j61907o90518o21089l27846l80220k07993P47332
$$ 1228393 979758 1147072 985165 294647 -326442 -654288 -1034508 -1242501 -495169
36121d95169J472591P45129o06218p45228K38329N24912l38480p53690O2284O93011
$$ -495169 977422 1722551 1116333 371105 609434 1134346 795866 42176 104460 797471
36111G97471j3548r78597p60393J02234K22868k37724o6827P36428R59601K66660
$$ 797471 783923 -194674 -955067 -852833 -629965 -867689 -934516 -198088 761513 1028173
36101A028173l22703k06894n1341m44554q68812o30735K8211M06559L35357J00984
$$ 1028173 705470 498576 447235 2681 -866131 -1496866 -1468655 -1062096 -726739 -625755
36091f25755j62329m25073m52476j10195K37175J50244k00964k56338J07991M32249
$$ -625755 -788084 -1213157 -1665633 -1775828 -1538653 -1388409 -1589373 -1845711 -1737720 -1305471
36081a305471L52038J2493k48270k71850o6406K53463M34832K93934J7011n4967
$$ -1305471 -953433 -940940 -1189210 -1461060 -1527466 -1274003 -839171 -545237 -528226 -583193
36071e83193L0907q5198l82785l46341K30188Q11818Q30284L97095m4673l35423
$$ -583193 -552286 -637484 -1020269 -1366610 -1136422 -324604 505680 902775 858102 522679
36061E22679m59406k80431P5178Q4308l18321l35709M42111J021492L69128p28530
$$ 522679 63273 -217158 -141980 -57672 -375993 -711702 -269591 751901 1121029 392499
36051C92499o43501M85753Q49368j46056r17467l06203O01984L84920m44749n10414
$$ 392499 -251002 234751 1084119 938063 20596 -285607 316377 701297 256548 -253866
36041b53866J61972M98412K80473J66056K39937k5142n66093p28853l55356J44067
$$ -253866 -91894 406518 686991 853047 1092984 1067842 501749 -227104 -582460 -438393
36031d38393N81444R07183P09662j57275q59205o22250m0707j08748m69765j26005
$$ -438393 143051 1050234 1759896 1602621 743416 121166 80459 -28289 -498054 -624059
36021f24059N69913M31625k82740j28274Q76394R83595l67309j434325q93303
$$ -624059 -54146 377479 94739 -33535 842859 1826454 1459145 24820 -868483
36012h68483J89512L12912j45491k0487N08117M65855p2658k08744J90713M25463
$$ -868483 -678971 -366059 -511550 -532037 -23920 441935 369277 160533 351246 776709
36002G76709K10500n8727j13522o6717j0132N1225N1951K5678R8779J32540j10104
$$ 776709 987209 928482 814960 748243 738111 789336 841287 866965 965744 1098284 988180
35991I88180l46356q7871L38978J07640o01674o55993J47691O80314M50774L56772
$$ 988180 641824 553953 892931 1000571 398897 -257096 -109405 570909 1021683 1378455
35981A378455P31858M57787q28700j490110m41954P45349K66200q68445n24230
$$ 1378455 2110313 2568100 1739400 249290 -192664 552685 818885 -49560 -573790
35972e73790R12247J176273j50964j153583p41976P5919L17199L00242L89712
$$ -573790 338457 1514730 1363766 210183 -531793 -455874 -138675 161567 551279
35963E51279L08020J49639M64793R55953O27616m35467r64013n15991q9551l54740
$$ 551279 859299 1008938 1473731 2429684 3057300 2621833 1657820 1141829 1052278 697538
35953F97538p37137o68019l55623N3765P09389J154884O38461l80056n44102K72561
$$ 697538 -39599 -707618 -1063241 -1009476 -300087 854797 1493258 1113202 569100 841661
35943H41661P55303L81933R0987K82201J08880n46245m50846O10447R04266m45446
$$ 841661 1596964 1978897 2069884 2352085 2460965 1914720 1463874 2074321 2978587 2533141
35933B533141j634512q73432P32040R52348j88139q78539m79844N1877J90629
$$ 2533141 898629 25197 757237 1709585 1521446 642907 163063 214940 405569
35924D05569L53348N77872L65682j68179l64716k10074k57920m66877k76087K39251
$$ 405569 758917 1336789 1702471 1534292 1169576 959502 701582 234705 -41382 197869
35914A97869L98163O9258k15791k70269m09087n98971l69307L29122R13285R05140
$$ 197869 596032 665290 449499 179230 -229857 -828828 -1198135 -869013 44272 949412
35904I49412L54753l87401q53095o56386p543L08787k3884k98099J28450P37189
$$ 949412 1304165 916764 63669 -592717 -600260 -291473 -315357 -613456 -485006 252183
35894B52183O22160j10129n68461l55929J74209O12192P00715K19759o04856r74426
$$ 252183 874343 764214 195753 -160176 14033 626225 1326940 1546699 941843 -32583
35884c2583n05152J25117K08648O0727K30744L98722R3795j89469J96415P37323
$$ -32583 -537735 -412618 -203970 -143243 87501 486223 580018 390549 586964 1324287
35874A324287N79333J14211K69154O58001J10833j143192j577341p70667k6652
$$ 1324287 1903620 2017831 2286985 2944986 3055819 1912627 335286 -435381 -462033
35865d62033k18633n69008j81088N31948P02740L07862r6315k25051j18181J07099
$$ -462033 -680666 -1249674 -1430762 -898814 -196074 111788 15473 -209578 -327759 -220660
35855b20660K34380J55556J58585M56574N96656J11230m79073l18559L11230L49628
$$ -220660 13720 169276 327861 784435 1381091 1492321 1013248 694689 1005919 1355547
35845A355547k86211n96591k17588J11738Q981j386K54640J54414m28209o75071
$$ 1355547 1069336 472745 255157 366895 375876 374490 629130 783544 355335 -319736
35835c19736k27125J82024O7858l9096K21821L12626o1057k81358l0631L5421
$$ -319736 -546861 -364837 -296979 -336075 -114254 198372 137315 -144043 -174674 -139253
35825a39253l70125m04502L68618R26591M16230l17897j46466M28286K62957l32200
$$ -139253 -509378 -913880 -545262 381329 797559 479662 333196 761482 1024439 692239
35815F92239j42418P65520J052950K28536o72868o98950j39030J86934k2476m43480
$$ 692239 549821 1315341 2368291 2596827 1923959 1225009 1085979 1272913 1250437 806957
35805H06957n45248p2751N40197M85025l22940r29958o38016j5664Q0915j45361
$$ 806957 261709 188958 729155 1214180 891240 -38718 -676734 -692398 -611483 -756844
35795g56844R815M00862L53236o661R1861P02794J052762P95496L81625J21702
$$ -756844 -747029 -346167 7069 408 92269 795063 1847825 2643321 3024946 3146648
35785C146648j63119m25367k49670L10302N40770N9259n90072o49742m7079O32534
$$ 3146648 2983529 2558162 2308492 2618794 3159564 3218823 2628751 1979009 1931930 2564464
35775B564464P78842K91341l02727l69128M351M6952n17378q91015l90009L87600
$$ 2564464 3343306 3634647 3331920 2962792 2967143 3014095 2496717 1605702 1215693 1603293
35765A603293M55918O34o7664K14190l2079p77619q78066K1700P09411K32104
$$ 1603293 2059211 2059845 1992181 2206371 2174292 1396673 518607 540307 1249718 1481822
35755A481822o11228n50722K07038M54623l2303k24333L74514P74399n8666j464708
$$ 1481822 870594 319872 526910 981533 949230 724897 1099411 1873810 1815144 350436
35745C50436j709690l05570J178673J119821k5365n13303J14714N58233L5189
$$ 350436 -1359254 -1664824 -486151 633670 608305 95002 209716 767949 803138
35736H03138m32826J46097Q97848M62024o48922p55339K84264Q47043J45602o42725
$$ 803138 370312 516409 1414257 1876281 1227359 472020 756284 1603327 1748929 1106204
35726A106204l95532K81536K90410j76689j65969M34545Q78507P98049N59022
$$ 1106204 710672 992208 1282618 1105929 939960 1374505 2253012 3051061 3610083
35717C610083M88695M29459J03484m84169j044529j235894r83868o27479n30437
$$ 3610083 4098778 4528237 4631721 4147552 3103023 1867129 883261 255782 -274655
35708b74655n46120k25700M25791Q79376Q62118O75680N66867L51916o0263l37777
$$ -274655 -820775 -1046475 -620684 258692 1120810 1796490 2363357 2715273 2655010 2317233
35698B317233k96210k90349n87022p88416m07896K92813N87765K46621k63324
$$ 2317233 2021023 1730674 1143652 355236 -52660 240153 827918 1074539 811215
35689H11215m65325l63484k24321j58691l3064K74499N86946N16931k8031n88602
$$ 811215 345890 -17594 -241915 -400606 -433670 -159171 427775 944706 916675 328073
35679C28073o73119l78846j19205Q7664M91777Q64720O20114j80925o86986m40851
$$ 328073 -345046 -723892 -843097 -755433 -263656 601064 1221178 1040253 353267 -87584
35669h7584l6017j47972n11240m47074K8184K81853M4544k73188k17798J61444
$$ -87584 -123601 -271573 -782813 -1229887 -1201703 -919850 -875306 -1148494 -1366292 -1204848
35659a204848M51214L57231L7696l1340L45977P12008N07394q4473l44847p7672
$$ -1204848 -753634 -396403 -358707 -390047 -44070 667938 1175332 1090859 746012 668340
35649F68340J57483k177k19320j66280n2857q6336p8565k40j97410n45677k13482
$$ 668340 825823 823646 604326 438046 385189 298853 220288 220048 22638 -523039 -736521
35638g36521R74768J734554R27463o15851j110259l21062L02761k6834m05484
$$ -736521 238247 1972801 2900264 2284413 1174154 853092 1155853 1129019 723535
35629G23535J5862N48789J24264r16061j254593m78189M51570O18825K38874L8425
$$ 723535 739397 1288186 1412450 496389 -758204 -1236393 -784823 -165998 72876 111301
35619A11301J34897O0135l24653n26575j77492L61037N22108L73968M06735N90691
$$ 111301 246198 306333 -18320 -544895 -722387 -361350 160758 534726 941461 1532152
35609A532152L18251n39516j169457q51589O910M17397J01995l16161k66531J55237
$$ 1532152 1850403 1310887 141430 -710159 -703249 -285852 -183857 -500018 -766549 -611312
35599f11312N13462N49339L26888J40774K61570N66448N52857l3148p60359j009099
$$ -611312 -97850 451489 778377 919151 1180721 1747169 2300026 2266878 1506519 497420
35589D97420p20670k98587M8375M13624P36206P14880K41586m07343q61012r16888
$$ 497420 -223250 -521837 -473462 -59838 676368 1391248 1632834 1225491 364479 -552409
35579e52409n81194q9702K14512K65046L69924O67746P61615L02173l29569m64013
$$ -552409 -1133603 -1223305 -1008793 -743747 -373823 293923 1055538 1357711 1028142 564129
35569E64129r4592K06910K08840J74385J21862k83474r09853j009567l02840M41140
$$ 564129 469537 676447 885287 1059672 1181534 898060 -11793 -1021360 -1324200 -883060
35559h83060M60481J02675J65194N21824L40336l58709m02344P70111J875163
$$ -883060 -422579 -319904 -154710 367114 707450 348741 -53603 716508 2591671
35550B591671J294579n41141j486432n84721O11123L79436o36357o19125L97952
$$ 2591671 3886250 3345109 1858677 1273956 1885079 2264515 1628158 1009033 1406985
35541A406985N89598n54619j219727j66951J171555R12929l57956o94665R8937
$$ 1406985 1996583 1441964 222237 55286 1226841 2139770 1781814 1087149 1186086
35532A186086M93051l1735l73889m6353k471o56151q82113N7506J060468Q27687
$$ 1186086 1679137 1647402 1273513 1227160 1224689 568538 -313575 -256069 804399 1632086
35522A632086j56727n38701j71377R606l25073n87220m34438j48970J14556N24780
$$ 1632086 1475359 936658 765281 774887 449814 -137406 -571844 -720814 -606258 -81478
35512h1478R26631P90012K5323p12775p72145k08548L91650N51305K95318M1901
$$ -81478 845153 1635165 1660488 947713 175568 -32980 358670 909975 1205293 1247194
35502A247194P9994J39361k67708j001973j232495n08751N13981Q54001M04827
$$ 1247194 1327188 1466549 1198841 196868 -1035627 -1544378 -1030397 -176396 228431
35493B28431j04645j22752K30171N47727N84909L61175J07489M0558L7637k31536
$$ 228431 123786 1034 231205 778932 1363841 1725016 1832505 1873063 1910700 1679164
35483A679164o99820q24637l78894J31393K05615L4285J0242O8948N4479J88184
$$ 1679164 979344 154707 -224187 -92794 112821 147106 157348 226296 280775 468959
35473D68959M95940L56428m96707j079581m04124P86085Q92986q8446n56059J01478
$$ 468959 964899 1321327 824620 -254961 -659085 127000 1019986 931540 375481 476959
35463D76959N86702J1208n22016J67133J179952Q98505l30088o65171L39226J090376
$$ 476959 1063661 1074869 552853 719986 1899938 2798443 2468355 1803184 2142410 3232786
35453C232786M54656o74318r70439n51272k72538r2552N75545J312780Q98841
$$ 3232786 3687442 3013124 2042685 1491413 1218875 1126323 1701868 3014648 3913489
35444C913489p36685j946829j402668J06939P93216K94762j32838K12348M11336
$$ 3913489 3176804 1229975 -172693 -65754 727462 1022224 889386 1101734 1513070
35435A513070l99695j392540j203365q4031M68429N0987j44094N56512J138760
$$ 1513070 1113375 -279165 -1482530 -1566561 -1098132 -1047145 -1191239 -634727 504033
35426E04033O01837l91260o48781l13399l10075n81796l23039L44778M31845j94078
$$ 504033 1105870 714610 65829 -247570 -557645 -1139441 -1462480 -1117702 -685857 -879935
35416h79935n90363m36753m85057r02984o91482M68908J222824N41083m67448
$$ -879935 -1470298 -1907051 -2392108 -3295092 -3986574 -3517666 -2294842 -1753759 -2221207
35407b221207j74035J001344J261651K09036p19032n23450K03234O16765P14834
$$ -2221207 -2395242 -1393898 -132247 76789 -642243 -1165693 -962459 -345694 369140
35398C69140O64427K59014l78787n70471j67484J7999n14638j062988p71398J35743
$$ 369140 1033567 1292581 913794 343323 175839 193838 -320800 -1383788 -2155186 -2019443
35388b019443Q45139J040184Q34284K61885m28418n61729Q0244O65116M04224
$$ -2019443 -1174304 -134120 700164 962049 533631 -28098 52146 717262 1121486
35379A121486k45310l45676K1583M8345l21664l37897J95280N73379L44522j04020
$$ 1121486 876176 530500 552083 600428 278764 -59133 136147 709526 1054048 950028
35369I50028l12508l17399k44109l0234K32742K88259J97085K50984L20992o2901
$$ 950028 637520 320121 76012 45778 278520 566779 763864 1014848 1335840 1272939
35359A272939q45197j284428q54181J74027J105981J335315O38146m26247o67540
$$ 1272939 427742 -856686 -1710867 -1536840 -430859 904456 1542602 1116355 448815
35350D48815L48772J344325Q38191o22589j139820l29453J96680m34534j005122
$$ 448815 797587 2141912 2980103 2357514 1217694 888241 1084921 650387 -354735
35341c54735m48752L29394J83331k39254J95757R66625Q43278Q4947j61039M330
$$ -354735 -803487 -474093 -290762 -530016 -334259 632366 1475644 1560591 1399552 1403882
35331A403882l73842j014837p37610K65463N42075j13561l16981L61448N70667
$$ 1403882 1030040 15203 -722407 -456944 85131 -28430 -345411 16037 586704
35322E86704l61736j102595n47626L33505K48254k68103k7074O11994M47524l72293
$$ 586704 224968 -877627 -1425253 -1091748 -843494 -1111597 -1138671 -526677 -79153 -451446
35312d51446n87974P4756O13174M59914J07715j0838l6145K2732L68717O57751
$$ -451446 -1039420 -964664 -351490 108424 216139 205301 169156 191888 560605 1218356
35302A218356K60219n27479o40283Q8540N38090M6919n45805l10959K82063K25299
$$ 1218356 1478575 951096 310813 399353 937443 984362 438557 127598 409661 634960
35292F34960l74503n54080k8307N37207O44977M60477J88998k33277o94439q29790
$$ 634960 260457 -293623 -321930 215277 860254 1320731 1509729 1276452 582013 -247777
35282b47777n72257k29904R8760N83913R95117O90888l53338j146751q42066J86757
$$ -247777 -820034 -1049938 -951178 -367265 627852 1318740 965402 -181349 -1023415 -836658
35272h36658R61122J124304R11781L61779n36410j130252o04342O59692J197822
$$ -836658 124464 1248768 2160549 2522328 1985918 855666 251324 911016 2108838
35263B108838L31622r05025j233449p72528m86600n91518m64352J14591O01846
$$ 2108838 2440460 1535435 301986 -470542 -957142 -1548660 -2013012 -1898421 -1296575
35254a296575O38035N33643N68398M93463J17851j51676J02986M84200J51677
$$ -1296575 -658540 -124897 443501 936964 1054815 903139 1006125 1490325 1642002
35245A642002r48936j743088j233948J91846J115602P88496M733o6035N06758
$$ 1642002 693066 -1050022 -2283970 -2092124 -976522 -188026 -183293 -249328 257430
35236B57430O56227R750n73474l78019J73843M44589O44251J120592J283642M00523
$$ 257430 913657 923407 349933 -28086 145757 590346 1234597 2355189 3638831 4039354
35226D039354q84391j100667m6094Q64756O02231k31364n99452m62090l51776
$$ 4039354 3154963 2054296 2008202 2872958 3475189 3243825 2644373 2182283 1830507
35217A830507l36282j96710q8799k60404m63336k93338J65442N61520Q04236Q54511
$$ 1830507 1494225 1297515 1208716 948312 484976 191638 357080 918600 1722836 2577347
35207B577347M05611n68147j295088j018771j47841J87318l19978q13947n65674
$$ 2577347 2982958 2414811 1119723 100952 -46889 140429 -179549 -993496 -1559170
35198a559170J25473N61131N67008M28121L24701K20643R7647J2427J9580J63769
$$ -1559170 -1433697 -872566 -305558 122563 447264 667907 765554 777981 797561 961330
35188I61330M18375N79342M18611K1924k24073q1481K65274M71644M24183K94233
$$ 961330 1379705 1959047 2377658 2399582 2175509 2094028 2359302 2830946 3255129 3549362
35178C549362L23350O07994R91949J166002J013693Q54228J148388J907486K579193
$$ 3549362 3872712 4480706 5472655 6638657 7652350 8506578 9654966 11562452 14141645
35169A4141645K625518K068409J334091O86575L0033p33073j383461j609295j462121
$$ 14141645 16767163 18835572 20169663 20856238 20886271 20153198 18769737 17160442 15698321
35160A5698321j342369j467254j582170j358790q66528m10314j13299l844k97148
$$ 15698321 14355952 12888698 11306528 9947738 9081210 8670896 8557597 8553753 8256605
35151H256605j047152j610619j173582J6842O72855J25553p00629o08961J08348
$$ 8256605 7209453 5598834 4425252 4442094 5114949 5240502 4539873 3930912 4039260
35142D039260J19378r41312j880685j568180l82723M19253L15608n0757R2575
$$ 4039260 4158638 3217326 1336641 -231539 -614262 -195009 120599 69842 162417
35133A62417O73763R95057O68887M5113l08738k77478j32264J720K25711M68251
$$ 162417 836180 1831237 2500124 2545237 2236499 1959021 1826757 1828477 2054188 2522439
35123B522439M51715J39480j99408m64073p85320r98905o61578J41348O48892
$$ 2522439 2974154 3113634 2914226 2450153 1664833 665928 4350 145698 794590
35114G94590M79586J74699J97046J38857l54109o34130n4114O84328M44778m35501
$$ 794590 1274176 1448875 1645921 1784778 1430669 796539 742425 1426753 1871531 1436030
35104A436030n50073L33688Q96741L78194l46262l25326R4109J96979J26712K97273
$$ 1436030 885957 1219645 2116386 2494580 2148318 1822992 1917101 2114080 2240792 2538065
35094B538065M45212K11926j3514K14924M37061J2272o25278n01651L15949P07751
$$ 2538065 2983277 3195203 3181689 3396613 3833674 3845946 3220668 2719017 3034966 3742717
35084C742717R6617q25626j128897p07159j03509J96284Q7313j76979k05592R8535
$$ 3742717 3839334 3013708 1884811 1177652 1074143 1270427 1357740 1180761 975169 1073704
35074A073704L71498K89629M7161p092M5865m7039j11215J72801N19889K90358
$$ 1073704 1445202 1734831 1781992 1774900 1820765 1773726 1662511 1835312 2355201 2645559
35064B645559m66130r11910n55561J25212M54064L91060K46828M7865l31080o85450
$$ 2645559 2179429 1267519 711958 837170 1291234 1682294 1929122 1976987 1645907 960457
35054I60457o24433j36326L29891L68411J1075l81031m92463l16357j02045m0994
$$ 960457 336024 199698 529589 898000 909075 528044 35581 -280776 -382821 -423815
35044d23815m0930J07092L93707N84133N37921L62611K18025J26263L5219m8724
$$ -423815 -464745 -357653 36054 620187 1158108 1520719 1738744 1865007 1900226 1851502
35034A851502o0351L9122J83408J93272o1125m28015n49526l02597j3119l7937
$$ 1851502 1791151 1830273 2013681 2206953 2145828 1717813 1168287 865690 852571 814634
35024H14634k67757k88143M9863M67189O21938M29051O4188j75796j08123P1828
$$ 814634 546877 258734 308597 775786 1397724 1826775 1890963 1715167 1607044 1678872
35014A678872o9386n74835q45079l77645M37516P36962L11759j90542k02598J34550
$$ 1678872 1609486 1034651 189572 -188073 249443 986405 1298164 1107622 905024 1039574
35004A039574L88621M03042K44467k7518k97770l81322k71136j86221k48809l26275
$$ 1039574 1428195 1831237 2075704 2048186 1750416 1369094 1097958 911737 662928 336653
34994C36653k64426m9783K72699N62158M92755j10915q34905j010090n47476Q222
$$ 336653 72227 22444 295143 857301 1350056 1239141 404236 -605854 -1153330 -1145108
34984a145108K96987M51993M97619J60998l95264l81901N00028J311789R56161
$$ -1145108 -848121 -396128 101491 262489 -132775 -514676 -14648 1297141 2253302
34975B253302l25354j222186r56188j0005O65967O42926K00925q2433R4670M04309
$$ 2253302 1927948 705762 -250426 -260431 405536 1048462 1249387 1166954 1261624 1665933
34965A665933K58492l27753o17797j64473N40347Q28616P15122M45245j58466
$$ 1665933 1924425 1596672 978875 814402 1354749 2183365 2898487 3343732 3185266
34956C185266j054619j313924k90871R16401O24343q50146j340347M5221J516449
$$ 3185266 2130647 816723 525852 1442253 2066596 1216450 -123897 -78676 1437773
34947A437773J178024l24850r71282k47176N44714M03433k63715n65483j16640
$$ 1437773 2615797 2290947 1319665 1072489 1617203 2020636 1756921 1191438 1074798
34938A074798Q86803J739134J470299j06444j677277j707532m50335L28405k32767
$$ 1074798 1961601 3700735 5171034 5064590 3387313 1679781 1229446 1557851 1325084
34929A325084j043904q32000J06387O44015M99921K66653K35447J11118k52170
$$ 1325084 281180 -550820 -444433 199582 699503 966156 1201603 1312721 1060551
34920A060551n73632o14004m00639n427M60438O76592L80328j84409m54534k03318
$$ 1060551 486919 -127085 -527724 -533151 -72713 603879 984207 799798 345264 141946
34910A41946K89104O74060Q09484O33490J40490m47988p72667o75940k90403J53695
$$ 141946 431050 1105110 1914594 2548084 2688574 2240586 1467919 791979 501576 655271
34900F55271M10898K57299k42400o26640n50817k73894k06653j50630L83767J151842
$$ 655271 1066169 1323468 1081068 454428 -96389 -370283 -576936 -727566 -343799 808043
34890H08043J263094N10112j78773o0804L51876J82003m31170o54821k96795Q9768
$$ 808043 2071137 2581249 2402476 2341672 2693548 2875551 2444381 1789560 1492765 1582533
34880A582533K75793N66824Q66251N09219n69550j324480q89288J77350O36337
$$ 1582533 1858326 2425150 3291401 3800620 3231070 1906590 1017302 1194652 1830989
34871A830989J98117l43713m38613m19450o79935r31275o88696m7731M89958O98442
$$ 1830989 2029106 1685393 1246780 827330 147395 -783880 -1472576 -1520307 -1030349 -331907
34861c31907O74652L90847k35042q13766o49787K67767R37964N25327m39095o72855
$$ -331907 342745 733592 498550 -315216 -965003 -697236 240728 766055 326960 -345895
34851c45895J32629R16929P43322j4507l97709j90473R9284J92534K30827J90759
$$ -345895 -213266 703663 1446985 1432478 1034769 844296 943580 1136114 1366941 1557700
34841A557700j29612n20771m67986J9587L41310K47139J66935L25888K70647k41697
$$ 1557700 1428088 907317 439331 458918 800228 1047367 1214302 1540190 1810837 1569140
34831A569140n75774j43364N20633M41087l38482q40525n82818q1814J19467J32108
$$ 1569140 993366 850002 1370635 1811722 1473240 632715 49897 -31917 87550 219658
34821B19658K23072L04996K13938n184l11834p01704q78509m48339L59760P69125
$$ 219658 442730 747726 961664 956480 644646 -57058 -935567 -1383906 -1024146 -255021
34811b55021N24527K53592M07554N45593K19192j25208Q1602L98660Mq46206r92232
$$ -255021 269506 523098 930652 1476245 1695437 1570229 1651831 2050491 2050495 1204289 212057
34800B12057j40879O31773L83927m59043q19903l45037M06383P79523O09096J82426
$$ 212057 71178 702951 1086878 627835 -192068 -537105 -130722 648801 1257897 1440323
34790A440323r9117j11201j12001k97186l91812r1344K33204p4605q26480j017869
$$ 1440323 1341206 1230005 1118004 820818 429006 337662 570866 496261 -330219 -1348088
34780a348088k41624O77227Q60047M57945L2572l99901r56562j160027n76594
$$ -1348088 -1589712 -912485 -52438 405507 438079 38178 -918384 -2078411 -2655005
34771b655005K30136L88061J02970K98082R75858J099059K80712n23794m51573
$$ -2655005 -2424869 -2036808 -1933838 -1635756 -659898 439161 719873 196079 -255494
34762b55494R0937K79604J20962J31553L27623K95394l0131k98806k96257r0837
$$ -255494 -164557 115047 236009 367562 695185 990579 960448 661642 365385 274548
34752B74548J98616M05306L12162J078p7949K37838M38079P3807m57851m44130
$$ 274548 473164 878470 1190632 1191710 1113761 1351599 1789678 1863485 1405634 961504
34742I61504P4529M08126K57018n582o9938q1187k09956l71744m91389n85560
$$ 961504 1036033 1444159 1701177 1695595 1625657 1544470 1334514 962770 471381 -114179
34732a14179n04967p6101M08905L66185k32751o65814l56814M24598R82882R49935
$$ -114179 -619146 -695247 -286342 79843 -152908 -818722 -1175536 -750938 231944 1181879
34722A181879M17815k83228o87152m54629J63830M50568R8318l53485k64326K57399
$$ 1181879 1599694 1316466 629314 174685 338515 789083 887401 533916 269590 526989
34712E26989O16118N37943J90257k62408p32805r66119o97680n9030N16472P69607
$$ 526989 1143107 1681050 1871307 1608899 876094 -90025 -787705 -846735 -330263 439344
34702D39344P17408L99601j10370n23203n61609l45645j88144p7585J91282M29625
$$ 439344 1156752 1556353 1445983 922780 361171 15526 -172618 -250203 -58921 370704
34692C70704J85931m26046o53259j63215L74100K25856l12944l53216L10189R73081
$$ 370704 556635 130589 -522670 -685885 -311785 -85929 -398873 -752089 -441900 531181
34682E31181J012247N34965j1042l56839l93130r2050L13455M22105J66154r0084
$$ 531181 1543428 2078393 2067351 1710512 1317382 1225332 1538787 1960892 2127046 2036962
34672B036962j46383k59535n42125n35682P9047P08122N20921k41100m73898J62322
$$ 2036962 1890579 1631044 1088919 553237 632284 1340406 1861327 1620227 1146329 1308651
34662A308651O99595L40235l27947k85948L39737N50418L8994m64429m17520j64440
$$ 1308651 2008246 2348481 2020534 1734586 2074323 2624741 2663735 2199306 1781786 1617346
34652A617346j81477l53314l58326k09241l8032J73859K88731o1846p92587j087045
$$ 1617346 1435869 1082555 724229 514988 476956 650815 939546 877700 85113 -1001932
34642a001932l99958O22698Q95183L21422k45908l22915k33736j87904J58523
$$ -1001932 -1401890 -779192 115991 437413 191505 -131410 -365146 -553050 -394527
34633c94527Q42303J097329L71015o96551j038063n68957p6439P5291K32148M33071
$$ -394527 447776 1545105 1916120 1219569 181506 -387451 -463890 -388599 -156451 276620
34623B76620J15633p56014j163658l74150Q24668J126455N29751J18585K28911
$$ 276620 392253 -363761 -1527419 -1901569 -1076901 49554 579305 697890 926801
34614I26801Q0409n91448q60452k02761M17152P0054m65509J20067J412642J725115
$$ 926801 1007210 415762 -444690 -647451 -230299 -160245 -625754 -505687 906955 2632070
34604B632070O29101n13542p21640n74515p23486o84692l427N82327K71547l96296
$$ 2632070 3261171 2747629 2025989 1451474 727988 43296 39869 622196 893743 497447
34594D97447m56807j37348k65676n71506l5554J204683J737039Q98301k95955
$$ 497447 40640 -96708 -362384 -933890 -969444 235239 1972278 2870579 2574624
34585B574624o63310k94217L7460P1259L9257K5264m1909q5395j7922N6824N9592
$$ 2574624 1911314 1617097 1654557 1725816 1765073 1790337 1748428 1663033 1645111 1701935 1761527
34574A761527P7327Q5635j30703n51665p51028m15675K09579O00312M87230K9527
$$ 1761527 1838854 1924489 1793786 1242121 491093 75418 284997 885309 1372539 1402066
34564A402066l28025j87103L24710N08673m9862p23888n54419L49971Q90356N37499
$$ 1402066 1074041 886938 1211648 1720321 1670459 946571 392152 742123 1632479 2169978
34554B169978l8518j63952j07583l45458o56239n88044k42020L0409K20850L95412
$$ 2169978 2131460 1967508 1859925 1514467 858228 270184 28164 58573 279423 674835
34544F74835L38920K7513q1283J74766J97180l55157p33055k15418M99353J86858
$$ 674835 1013755 1041268 959985 1134751 1331931 976774 243719 28301 527654 714512
34534G14512r21539j317153l89635P71067J015872N43518K22214L22852M68029
$$ 714512 -207027 -1524180 -1913815 -1142748 -126876 416642 638856 961708 1429737
34525A429737L13572j64308p20975r40369o08569q1609J10823J4691Q6573L32167
$$ 1429737 1743309 1579001 858026 -82343 -690912 -772521 -661698 -647007 -560434 -228267
34515b28267L12733N7281J29648N51640N40202k22510q67937n43128L16139O79139
$$ -228267 84466 141747 271395 823035 1363237 1140727 272790 -270338 45801 724940
34505G24940M03507J69775K11250L9004n09834p67409j54525Q73482J268322O49165
$$ 724940 1128447 1298222 1509472 1548476 1038642 271233 116708 990190 2258512 2907677
34495B907677k52219n21977k01468j49409p44721j204067o19552O31608J191578
$$ 2907677 2655458 2133481 1932013 1782604 1037883 -166184 -785736 -154128 1037450
34486A037450M48421o97247j014902l55342M34510N91558J00966m24192k88867
$$ 1037450 1485871 788624 -226278 -581620 -147110 444448 545414 121222 -167645
34477a67645N75664J309795R23911m33582j473696j279970l34658K96757L00994
$$ -167645 408019 1717814 2641725 2208143 734447 -545523 -880181 -583424 -282430
34468b82430J52950J97998K76139J47840j11599j57714K71778R06149R45762k1326
$$ -282430 -129480 68518 344657 492497 380898 223184 494962 1401111 2346873 2325547
34458B325547j159089j149708N3134J061964R26068K31265j36376k73964n13201
$$ 2325547 1166458 16750 69884 1131848 2057916 2289181 2152805 1878841 1365640
34449A365640l91898M82626J273434R05560k28463q09580n24971k02147k26516
$$ 1365640 973742 1456368 2729802 3635362 3406899 2597319 2072348 1870201 1643685
34440A643685j43651J84703K97110J10026K4288k7970m67212r20225m94967N81313
$$ 1643685 1500034 1684737 1981847 2091873 2116161 2088191 1620979 700754 205787 787100
34430G87100R62448K11036n29056m10706o0204j64323k34723K56829P05210M49385
$$ 787100 1749548 1960584 1431528 1020822 960618 796295 561572 818401 1523611 1972996
34420A972996K1053J49899L96919P594o32241o90596m04339n38255q29627m20883
$$ 1972996 1994049 2143948 2540867 2548461 1916220 1225624 821285 283030 -546597 -967480
34410i67480M45581O33230m2555n49854l18998R3889K25069L65906O61732O46976
$$ -967480 -521899 111331 68776 -481078 -800076 -706187 -481118 -115212 546520 1193496
34400A193496J43425k87316k44181n1769k6566N0225L05508L64188N1181j50707
$$ 1193496 1336921 1049605 805424 753655 727089 777314 1082822 1447010 1498191 1347484
34390A347484J49808O03440O98071M74214K03375j44967n99521p80649l71461
$$ 1347484 1497292 2100732 2798803 3273017 3476392 3331425 2731904 1951255 1579794
34381A579794K60856M16506q7024p58207j016309p13450k00043J2065j98427l70030
$$ 1579794 1840650 2257156 2170132 1411925 395616 -317834 -517877 -505812 -704239 -1074269
34371a074269q0367L79066M30652J83876K64966O52647N65477k13161q01566n32711
$$ -1074269 -1154636 -775570 -344918 -161042 103924 756571 1322048 1108887 307321 -225390
34361b25390J6131J9485k56374l588O82357Q84929K73061m23237m42958J12671
$$ -225390 -209259 -189774 -446148 -449736 232621 1117550 1390611 967374 524416 637087
34351F37087N73096M81374m3900m98459m93061j38403J71280L23367M94108N99495
$$ 637087 1210183 1691557 1647657 1149198 656137 517734 689014 1012381 1506489 2105984
34341B105984L07496k57709n02184l21243k92696n26761k88467N57743P95407
$$ 2105984 2413480 2155771 1653587 1332344 1039648 512887 224420 782163 1577570
34332A577570l32163j471350q31035J042823J862482Q04344o18493j047914q70275
$$ 1577570 1245407 -225943 -1056978 -14155 1848327 2652671 2034178 986264 115989
34323A15989p57873l25733P14860J399100Q13293l09155n82875J517K82888j65486
$$ 115989 -641884 -967617 -252757 1146343 1959636 1650481 1067606 1069123 1352011 1186525
34313A186525n54312k78174K68010N00198M62381M67601M48216P7124o53005j245063
$$ 1186525 632213 354039 622049 1122247 1584628 2052229 2500445 2577569 1924564 679501
34303F79501j142961l56843M47446O70370M97019N25690P51072N43465k11286
$$ 679501 -463460 -820303 -372857 297513 794532 1320222 2071294 2614759 2403473
34294B403473o98373l45938K47943J95905l74735o24873k71010J84080K92550
$$ 2403473 1705100 1359162 1607105 1803010 1428275 803402 532392 716472 1009022
34285A009022P4709k70188m92724l02986K02047L61663j90853p77009n14713L34737
$$ 1009022 1083731 813543 320819 17833 219880 581543 390690 -386319 -901032 -566295
34275e66295P33898M54512L07011O95888R39104L86194n74268j077431q15786
$$ -566295 167603 622115 929126 1625014 2564118 2950312 2376044 1298613 482827
34266D82827j75830K27011j4894o59580p82971J86668J413545J473315L14884
$$ 482827 306997 534008 519114 -140466 -923437 -736769 676776 2150091 2464975
34257B464975o09960m38506M6228j0274j42978L04170P36142K70392n99634p03340
$$ 2464975 1855015 1416509 1462737 1452463 1309485 1613655 2349797 2620189 2020555 1317215
34247A317215j15482L9842m90928p91033m37025p9547q7215R1442P17601J065963
$$ 1317215 1201733 1241575 750647 -40386 -477411 -556958 -644173 -552731 164870 1230833
34237A230833O02706q9550k84275j94277l16969m21092n9831M59079N25778K54812
$$ 1230833 1833539 1743989 1459714 1265437 948468 527376 467545 926624 1452402 1707214
34227A707214J67426J62167k45072q25265p91168r8266L72007J62953j19113O9062
$$ 1707214 1874640 2036807 1791735 966470 175302 77036 449043 611996 492883 561945
34217E61945K57897j96263q95972q51241O6079Q78405P73100J6102n94673o89825
$$ 561945 819842 623579 -272393 -1123634 -1057555 -179150 593950 610052 15379 -674446
34207f74446m02914J45109R02187J486312J275632J76067j006977j337440p78119
$$ -674446 -1077360 -932251 -30064 1456248 2731880 2907947 1900970 563530 -214589
34198b14589j11292R5159R499k4681m8150j79599j73695K25178P06309O90847
$$ -214589 -325881 -230722 -221223 -245904 -294054 -473653 -647348 -422170 284139 974986
34188I74986J56614l08133l21158j47049j89915m05691m26273m6537N75102J056699
$$ 974986 1131600 823467 502309 355260 165345 -240346 -666619 -713156 -138054 918645
34178I18645J062337N91233K6497k69295l68293n62795q21613q05523m05835J05619
$$ 918645 1980982 2572215 2598712 2329417 1961124 1398329 576716 -228807 -634642 -529023
34168e29023M68240N83248L18346k98194o70283j17272J024926J510180P69417
$$ -529023 -60783 522465 840811 542617 -127666 -244938 779988 2290168 3059585
34159C059585l02122o33226l40619j47368j32874M3085K01354l9429l48145j49765
$$ 3059585 2757463 2124237 1783618 1636250 1503376 1546461 1747815 1708386 1360241 1210476
34149A210476K21663l0069o88672p39209j01735J82492k32374l79568K70749P92424
$$ 1210476 1432139 1402070 713398 -25811 -127546 54946 -177428 -556996 -286247 506177
34139E06177L75703k81746k21404J55030m2283m98541k75521M19668M94453j92962
$$ 506177 881880 600134 378730 533760 491477 -7064 -282585 137083 631536 438574
34129D38574o07786j81528M97770P63942O12510K36124k26481l75967P7688N64021
$$ 438574 -169212 -350740 147030 910972 1523482 1759606 1533125 1157158 1234846 1798867
34119A798867K50811n65928p83373k93376j52367o49076o54659M24957J419815
$$ 1798867 2049678 1483750 700377 407001 254634 -394442 -1049101 -624144 795671
34110G95671J113242N9372m52979l21357k69706l11161O7879O36793O43943Q8704
$$ 795671 1908913 1968285 1515306 1193949 924243 613082 680961 1317754 1961697 2050401
34100B050401l56731m77085m91495j83538P30713J529895J095002l52565j354745
$$ 2050401 1693670 1216585 725090 541552 1272265 2802160 3897162 3544597 2189852
34091B189852j199413o00068k31911J01665M93793M61511K2474M748N84138P15275
$$ 2189852 990439 390371 158460 260125 753918 1215429 1237903 1242651 1826789 2542064
34081B542064j26100q17472l05926N97153M69220m88174r48474o39145m40649
$$ 2542064 2415964 1598492 1292566 1889719 2358939 1870765 922291 283146 -157503
34072a57503n78360l45995L07721M81189m8759l13545J99586O76302M42136J09219
$$ -157503 -735863 -1081858 -774137 -292948 -341707 -655252 -455666 220636 662772 771991
34062G71991L60042O27812J20345o14243m30928N27615R76962M17682k63338k49648
$$ 771991 1132033 1759845 1880190 1265947 835019 1362634 2339596 2757278 2493940 2244292
34052B244292J81689L97999L07668J10634j57878l99428l27455J2091R2922l06506
$$ 2244292 2425981 2823980 3131648 3242282 3084404 2684976 2357521 2369612 2462534 2156028
34042B156028o54721m56367r381J65349J87367M21783N90130J29571p05375j000701
$$ 2156028 1501307 1044940 1035559 1200908 1388275 1810058 2400188 2529759 1824384 823683
34032H23683n18905j6824M712J5465M73252R08135O88528J51211J32418O38209
$$ 823683 304778 287954 292666 308131 781383 1689518 2378046 2529257 2661675 3299884
34022C299884Q10186K06970n77219p16425p7209P83841J153756O50672m09233
$$ 3299884 4110070 4317040 3739821 3023396 2946187 3730028 4883784 5534456 5125223
34013E125223j100957p88140L6462L02067k04625n79371j68818M96646N93075
$$ 5125223 4024266 3236126 3272588 3574655 3370030 2790659 2621841 3118487 3711562
34004C711562K41894J93141N99312Q20006L97422l52359q01868o56733o3645N97076
$$ 3711562 3953456 4146597 4745909 5565915 5963337 5610978 4809110 4152377 4088732 4685808
33994D685808R49293R03302P58663Q56423J168771J425626J544450J655403J774800
$$ 4685808 5635101 6538403 7297066 8153489 9322260 10747886 12292336 13947739 15722539
33985A5722539J794024J814295K186686L132099M511266N963736P036784P189783
$$ 15722539 17516563 19330858 21517544 24649643 29160909 35124645 42161429 49351212
33977D9351212N993705L493471K72808k863198n208581o348491o347835n731672
$$ 49351212 55344917 58838388 59111196 56247998 51039417 44690926 38343091 32611419
33969C2611419n021754m301459l430951k539357j942456j657733j429676j228657
$$ 32611419 27589665 23288206 19857255 17317898 15375442 13717709 12288033 11059376
33961A1059376j273350j504486j510024j114037o06525k28045J29465M94999N37671
$$ 11059376 9786026 8281540 6771516 5657479 5050954 4822909 4952374 5447373 5985044
33952E985044K6119p53387j295912j315306p59174J65535P98086M42828o30953
$$ 5985044 6011163 5257776 3961864 2646558 1887384 2052919 2851005 3293833 2662880
33943B662880j163290m03810Q35440J223760N84208j58848l42476r3808K61866
$$ 2662880 1499590 1095780 1931220 3154980 3739188 3580340 3237864 3144056 3405922
33934C405922M93649K84871m19807r38627n54649L14032N34369q8684n61591l04900
$$ 3405922 3899571 4184442 3764635 2826008 2271359 2585391 3119760 3031076 2469485 2164585
33924B164585O7336K338m6342L44239N47685r7909r52524q77738J4552N34586
$$ 2164585 2231921 2234259 2187917 2532156 3079841 2981932 2029408 1151670 1166222 1700808
33914A700808J85833k88449j82473K80509N38625M18434K9116m56144p01093m33577
$$ 1700808 1886641 1598192 1415719 1696228 2234853 2653287 2682403 2226259 1525166 1091589
33904A091589N4814J64096j16585j44312L50567P85337N99712P5379j37045P9197
$$ 1091589 1146403 1310499 1193914 1049602 1400169 2185506 2785218 2860597 2723552 2802749
33894B802749K95038J79391j79563m50058l80409r8815q3017n36259q97547m93441
$$ 2802749 3097787 3277178 3097615 2647557 2267148 2168333 2085316 1549057 651510 158069
33884A58069L82980P59094M05673R6705K18506J55642m06469o46219L3791P44788
$$ 158069 541049 1300143 1705816 1802521 2021027 2176669 1770200 1123981 1157772 1902560
33874A902560L79624n60518p48207j60485O4750l07402l08284L13876M95126k52335
$$ 1902560 2282184 1721666 973459 812974 877724 570322 262038 575914 1071040 818705
33864H18705p83153n5370J164894J370211L54123p81332j151291p60285l6208
$$ 818705 35552 -19818 1145076 2515287 2869410 2088078 936787 176502 140294
33855A40294N31327N60101K03344J27953N77112Q77796M16034l94665p53707n89871
$$ 140294 671621 1231722 1435066 1563019 2140131 3017927 3433961 3039296 2285589 1695718
33845A695718l34331p2519K68298L37363j19160n18636j90543M31249L95154k17979
$$ 1695718 1361387 1288868 1557166 1894529 1775369 1256733 1066190 1497439 1892593 1674614
33835A674614m49977n4690K55037J72722J82871M04059K85836k05713l23561O0119
$$ 1674614 1224637 1169947 1424984 1597706 1780577 2184636 2470472 2264759 1941198 2001317
33825B001317O955q56565j410700o53509O98178J227681P17885L4729k91701l59069
$$ 2001317 2008272 1151707 -258993 -912502 -214324 1013357 1731242 1765971 1474270 1115201
33815A115201k29038L5468P731n12314q55288l26309O03036Q73237L62053j23475
$$ 1115201 886163 921631 929362 417048 -438240 -764549 -161513 711724 1073777 950302
33805I50302j84169j39996r2819K54324P42972P20715R1523m44482m40025k13005
$$ 950302 766133 626137 533318 787642 1530614 2251329 2342852 1898370 1458345 1245340
33795A245340r7602K2210J66641M0324k91614k49651L18037P08635L56133l16474
$$ 1245340 1147738 1169948 1336589 1376913 1085299 835648 1153685 1862320 2218453 1901979
33785A901979n26716j58890K84164L71762K1582n37423p74635k55440O62869R85914
$$ 1901979 1375263 1216373 1500537 1872299 1893881 1356458 581823 326383 989252 1975166
33775A975166K77150p28425j030628m47574M98134J243938J368114O84210l36233
$$ 1975166 2252316 1523891 493263 45689 543823 1787761 3155875 3840085 3503852
33766C503852p30144j69386N28552N33928J19489j1395K9683l49762r54338q92722
$$ 3503852 2773708 2604322 3132874 3666802 3786291 3774896 3804579 3454817 2500479 1607757
33756A607757J2679P79891N09911n08678j230412j030198k32231L46676K79136
$$ 1607757 1620436 2400327 2910238 2401560 1171148 140950 -91281 255395 534531
33747E34531k5668Q7342M86769L13118o74093j444339r92173K27534R37348P42942
$$ 534531 508863 596205 1082974 1396092 721999 -722340 -1714513 -1486979 -549631 193311
33737A93311L29919J93685J30711l9522j55680k04185l29407l00096K22315Q48962
$$ 193311 523230 716915 847626 808104 652424 448239 118832 -181264 41051 890013
33727H90013Q07876K15703o251L19589L05344l72161p47775k09121K90065k72259
$$ 890013 1697889 1913592 1907341 2226930 2532274 2160113 1412338 1203217 1493282 1221023
33717A221023j184083j007554J65505Q66598M66331j26515j11796J15022k6446
$$ 1221023 36940 -970614 -805109 61489 527820 401305 289509 404531 378085
33708C78085k34523L3906N47875P00302N30949N79479Q39835O20993l28828j147764
$$ 378085 143562 177468 725343 1425645 1956594 2536073 3375908 3996901 3668073 2520309
33698B520309q33578L44607J025155M46149o15305r52741m67898K3286J47876
$$ 2520309 1686731 2031338 3056493 3502642 2887337 1934596 1466698 1489984 1637860
33689A637860K48180L90261J43950l84347l31978N24074J061542L40813q73257
$$ 1637860 1886040 2276301 2420251 2035904 1703926 2228000 3289542 3630355 2757098
33680B757098j122355k99581M12763L78415J23203J32414J62953R03o4152J03700
$$ 2757098 1634743 1335162 1747925 2126340 2249543 2381957 2544910 2545813 2481661 2585361
33670B585361J57295k0828j7819K81261L08580j99922n27588r486P87532P73006
$$ 2585361 2742656 2721828 2704009 2985270 3293850 3093928 2566340 2556854 3344386 4117392
33660D117392o1529o36652l67291R3096m9192n66056o41276q1589M87538N63166
$$ 4117392 4055863 3419211 3051920 3145016 3095824 2529768 1888492 1806903 2294441 2857607
33650B857607L73766L70449N10394M17209N0899k33985k72027k70587l28766k53636
$$ 2857607 3231373 3601822 4112216 4529425 4580324 4346339 4074312 3803725 3474959 3221323
33640C221323l4841J8181j00435Q6451O54525Q55873K68755k44488K90571J277856
$$ 3221323 3186482 3204663 3104228 3190679 3845204 4701077 4969832 4725344 5015915 6293771
33630F293771J267326J85698n14744r1137M98602L10549j97161k30605O1258K91814
$$ 6293771 7561097 7746795 7232051 7140914 7639516 7950065 7752904 7522299 7583557 7875371
33620G875371P50774J507669J576022L58565q02277j39903J813387K707374J626104
$$ 7875371 8626145 10133814 11709836 12068401 11266124 11126221 12939608 15646982 17273086
33611A7273086K25140K15013J221574J932174K124385K451430K998258L249769
$$ 17273086 17498226 17713239 18934813 20866987 22991372 25442802 28441060 31690829
33603C1690829L214332L572283M661722O033028P207781Q439166J0447847J3525278
$$ 31690829 34905161 38477444 43139166 49172194 56379975 64819141 75266988 88792266
33595H8792266J7107946K0452639K3789903K8293647L4085083L8221466L5723877
$$ 88792266 105900212 126352851 150142754 178436401 212521484 250742950 286466827
33588B86466827K3644982M247305j6095023l1095006l7883343l7327475l2349839
$$ 286466827 310111809 314359114 298264091 267169085 229285742 191958267 159608428
33581A59608428k6069429k0592429j6597948j3715891j1343714r254948p623960
$$ 159608428 133538999 112946570 96348622 82632731 71289017 62034069 54410109
33574E4410109o624145o069764n519823m760414m000151l409890k715944j657683
$$ 54410109 47785964 41716200 36196377 31435963 27435812 24025922 21309978 19652295
33566A9652295o73898n09698j091954j475457j148832p05310p84766j029245p91223
$$ 19652295 18978397 18468699 17376745 15901288 14752456 14047146 13262380 12233135 11441912
33557A1441912l69690o15597j473828j847425j079805J53435P44468M37663j12929
$$ 11441912 11072222 10456625 8982797 7135372 6055567 6209002 6953470 7391133 7278204
33548G278204k18205K23823P62119Q04935J30808q49052j420181j226159n36112
$$ 7278204 7059999 7283822 8045941 8850876 8981684 8132632 6712451 5486292 4950180
33539D950180J00836L25262J63381n2497j3734J62758L0376m74465p20207k29370
$$ 4950180 5051016 5376278 5539659 5487162 5473428 5636186 5666562 5192097 4471890 4242520
33529D242520M32907L06776n10915q82165k55317N63298O66269K83887J25048
$$ 4242520 4675427 4982203 4471288 3589123 3333806 3897104 4563373 4847260 4972308
33520D972308J33318k31227q43650r82171m54618J68826M69016N47638M07219
$$ 4972308 5105626 4874399 4030749 3048578 2593960 2762786 3231802 3779440 4186659
33511D186659j93082r85269j114174l14491M94171L98614k61232n32528k73823
$$ 4186659 3993577 3008308 1894134 1579643 2073814 2472428 2211196 1678668 1404845
33502A404845p4083l9628K92676P96064N95474n05723j355215r16196K30826O75923
$$ 1404845 1330762 1291134 1583810 2379874 2975348 2469625 1114410 198214 429040 1104963
33492A104963Q2317n82820n68889j86272n556j9813M4997J88585L30311N99256
$$ 1104963 1187280 604460 35571 -150701 -156257 -176070 -131073 57512 387823 987079
33482I87079R87624J051364M35819m82824r12751n43972J66591N40489K86331
$$ 987079 1974703 3026067 3461886 2979062 2066311 1522339 1688930 2229419 2515750
33473B515750l24589o90548m27088J56710L58951L4205j29820L84193J059581
$$ 2515750 2191161 1500613 1073525 1230235 1589186 1623391 1493571 1877764 2937345
33464B937345J037096L62784j48627j52544j09472l37735n02329l05215m0585
$$ 2937345 3974441 4337225 4188598 4036054 3926582 3588847 3086518 2781303 2740718
33455B740718r0504l34528m07758j88864K16386O10674O50215J17692n59542o20608
$$ 2740718 2650214 2315686 1907928 1719064 1935450 2546124 3196339 3314031 2754489 2133881
33445B133881n4316K81280j0501j83756L80076R80884O07393m15737q90554n51967
$$ 2133881 2079565 2360845 2350344 2166588 2546664 3527548 4134941 3719204 2828650 2276683
33435B276683k40516l53321l40786P3552L43791J71316O0102K69599K23582l35541
$$ 2276683 2036167 1682846 1342060 1415612 1759403 1930719 1990821 2260420 2484002 2148461
33425B148461n64604J63280R59509O04292n11873r37404l91887l8227m29425o25402
$$ 2148461 1583857 1747137 2706646 3310938 2799065 1861661 1469774 1431547 1002122 376720
33415C76720Q9266Q57381N53496m35870q29322l29601K37543M06682N23608O72233
$$ 376720 465986 1323367 1876863 1440993 611671 282070 519613 926295 1449903 2122136
33405B122136L30630m93667q21395j07068P05647M37285n67511r80370m90248
$$ 2122136 2452766 1959099 1137704 1030636 1736283 2173568 1606057 625687 135439
33396A35439p7912k58924l08596K99844Q19181M35058k89269k40278M77144P49381
$$ 135439 57527 -201397 -509993 -210149 609032 1044090 754821 514543 991687 1741068
33386A741068K39406j96881J0837L28689J60183j82454j11676K61477L85777J07083
$$ 1741068 1980474 1783593 1794430 2123119 2283302 2100848 1989172 2250649 2636426 2743509
33376B743509k59230m28502l44459j08916L1151j06050k90026j28666K26712K04848
$$ 2743509 2484279 2055777 1711318 1602402 1633553 1527503 1237477 1108811 1335523 1540371
33366A540371j61251q8144O58737J133668N78668l00438l50031K90275N39194
$$ 1540371 1379120 1290976 1949713 3083381 3662049 3361611 3011580 3301855 3841049
33357C841049J30481j48590R2616K92582J2755l91155m52533j72112L12980R06808
$$ 3841049 3971530 3822940 3915556 4208138 4220893 3829738 3377205 3205093 3518073 4424881
33347D424881J217338Q12813L6972k21694J59993K97855k60584p26024k86279
$$ 4424881 5642219 6455032 6492004 6270310 6430303 6728158 6467574 5741550 5455271
33338E455271N93924Q42576L10262q7158L87209J378683J805171J081704N7194
$$ 5455271 6049195 6891771 7202033 7114875 7502084 8880767 10685938 11767642 11824836
33329A1824836L72387K407185M411250M661628L964970M515790O662339Q963721
$$ 11824836 12197223 14604408 19015658 23677286 27642256 32158046 38820385 47784106
33321D7784106J1416015J5463945J9466622J7559208O389996q808917j8596787
$$ 47784106 59200121 74664066 94130688 111689896 118079892 109270975 90674188
33314I0674188j9246471j5077086j1367894q938621o555953m660735m155851m005998
$$ 90674188 71427717 56350631 44982737 36044116 29488163 24827428 20671577 16665579
33306A6665579k786024j222259q93175j465196j403697o57005m73505r82102j039672
$$ 16665579 13879555 12657296 11764121 10298925 8895228 8238223 7764718 6782616 5742944
33297E742944l95257p3291m12043m79543J18555M19544k13302q74307m80054N48441
$$ 5742944 5347687 5274396 4862353 4382810 4501365 4920909 4707607 3833300 3353246 3901687
33287C901687R14330K42061o03193p78697l53750Q6010K23621J71240O5085j66498
$$ 3901687 4816017 5058078 4454885 3676188 3322438 3408448 3632069 3803309 3868394 3701896
33277C701896n16322o50483l10983J65955K37517K9225J81401P37499R72672N98640
$$ 3701896 3185574 2535091 2224108 2390063 2627580 2656805 2838206 3575705 4548377 5147017
33267E147017K78444M98899Q32269R10124J155458J752277J924660J320701J118878
$$ 5147017 5425461 5924360 6756629 7666753 8822211 10574488 12499148 13819849 14938727
33258A4938727K411720M398851N760113O868831Q491349Q932352N328469j764998
$$ 14938727 17350447 21749298 27509411 34378242 42869591 51801943 57130412 55365414
33250E5365414p723228r021316p051232n396063n116843m641672l113211j611399
$$ 55365414 47642186 38620870 31569638 26173575 21056732 16415060 13301849 11690450
33242A1690450j220673j576937j670909j136941m39235k22220n59513p62894k37002
$$ 11690450 10469777 8892840 7221931 6084990 5645755 5423535 4864022 4101128 3864126
33233C864126N12415M31455m44505r02777m02529J38484n5765m53064m20986l73234
$$ 3864126 4376541 4807996 4363491 3460714 3058185 3196669 3140904 2687840 2266854 1893620
33223A893620p07085p79225j47887K78014k70983q21645j62040R43168Q74427
$$ 1893620 1186535 407310 259423 537437 266454 -555191 -717231 225937 1100364
33214A100364j68812n96175j20897N5075l67645l30124M37448Q36398M28394J76617
$$ 1100364 931552 335377 214480 269555 -98090 -428214 9234 845632 1274026 1450643
33204A450643N69536P76551L77716K06152O07371N37362n40078j407908r85651
$$ 1450643 2020179 2796730 3174446 3380598 3987969 4525331 3985253 2577345 1591694
33195A591694r2659K2289l12395j26075L03363J03000m26629l26477K53564L61387
$$ 1591694 1499035 1521324 1208929 1082854 1386217 1489217 1062588 736111 989675 1351062
33185A351062k4683o7814L09855L16194k30250o22163n34587l84626l38777j11275
$$ 1351062 1326379 1258565 1568420 1884614 1654364 1032201 497614 112988 -225789 -337064
33175c37064J37892j19777n95184k70661R22914J645398R72624k64801p13279
$$ -337064 -199172 -318949 -914133 -1184794 -261880 1383518 2356142 2091341 1378062
33166A378062l31371j35752n48961q79515m19663N61363J127518P48904j02396
$$ 1378062 1046691 910939 361978 -517537 -937200 -375837 751681 1500585 1398189
33157A398189m77294m4466N61358O35997L15333J87676L00877J91235k12171m27553
$$ 1398189 920895 876429 1437787 2073784 2389117 2576793 2877670 3068905 2856734 2429181
33147B429181k44471l7985p6671j49661j47497l90242r62302j241333o40787M71333
$$ 2429181 2184710 2146725 2070054 1920393 1772896 1382654 420352 -820981 -1461768 -990435
33137i90435J120158Q78117K55498m2937Q6731K03747K325k55600r9643M16555
$$ -990435 129723 1007840 1263338 1220401 1307132 1510879 1513204 1257604 1157961 1574516
33127A574516O43303J87623m59374n27161J6361N26861O06862L94183J8749n21346
$$ 1574516 2217819 2405442 1946068 1418907 1435268 1962129 2568991 2963174 2981923 2460577
33117B460577q69841m83775L96312O71668k15517j375578j551484o77490K58233
$$ 2460577 1590736 1106961 1503273 2174941 1959424 583846 -967638 -1645128 -1386895
33108a386895N65269L74034J9601l32023m30494l5515N28843N21724j72327o47267
$$ -1386895 -821626 -447592 -427991 -760014 -1190508 -1226023 -697180 -175456 -347783 -995050
33098i95050j11859R04378J105924J43731q59247p36472K81156J016865R03151
$$ -995050 -1106909 -202531 903393 1047124 187877 -548595 -267439 749426 1652577
33089A652577M40982J91769N6903j93892l40638j57228K8140j94013n86878o18447
$$ 1652577 2093559 2285328 2342231 2148339 1807701 1650473 1678613 1484600 897722 279275
33079B79275l16986j32776j03141J23366M66426L89330j79229o32171o18509m80881
$$ 279275 -37711 -170487 -273628 -150262 316164 705494 526265 -105906 -724415 -1205296
33069a205296m51900j64094N21706Q80716K84539o23016n88358N04804J374426
$$ -1205296 -1657196 -1821290 -1299584 -418868 -134329 -757345 -1345703 -840899 533527
33060E33527J028749N2721k56181L37664P35076O6587j041001j250247l09489
$$ 533527 1562276 1614997 1358816 1696480 2431556 2498143 1457142 206895 -102594
33051a02594O39522O55415J30012j27669j93319n63383r19570n08734L99221O62254
$$ -102594 536928 1192343 1322355 1194686 1001367 437984 -481586 -990320 -591099 71155
33041G1155M8165l20990K64651R99364Q90981K36587q1012k4406j71086n48165
$$ 71155 119320 -201670 62981 1062345 1953326 2189913 2108901 2084495 1913409 1365244
33031A365244o47870l51577l6553Q5132R1990p695k00875k44385k8152J02499
$$ 1365244 717374 365797 329244 414376 506366 498671 297796 53411 25259 127758
33021A27758j05804k79162j25M08903L22462k33453o71072o43124k27851L52978
$$ 127758 21954 -257208 -257333 151570 474032 240579 -430493 -1073617 -1301468 -948490
33011i48490O77654K61670o16832q06399J86869J171577Q26558k74320n07734
$$ -948490 -270836 -9166 -625998 -1432397 -1245528 -73951 752607 478287 -29447
33002b9447L02839P70650K62374k89306j80986J0169k27786l32325J58068N66721
$$ -29447 273392 1044042 1306416 1017110 836124 846293 618507 286182 444250 1010971
32992A010971J95344m02194k76949M17703P57299M41813j8548k23231k18180r7667
$$ 1010971 1206315 804121 527172 944875 1702174 2143987 2125439 1902208 1684028 1586361
32982A586361R1764J72342M3974p9518j9727J9660j67454l37766j51302K32717
$$ 1586361 1678125 1850467 1894441 1814923 1795196 1814856 1647402 1309636 1158334 1391051
32972A391051L17008q8088o48602q29921l34387N51116J014771N10783m61162
$$ 1391051 1708059 1619971 971369 141448 -192939 358177 1372948 1883731 1422569
32963A422569q50639l86652J97106L62445L97303N54740M32028k19667p93707
$$ 1422569 571930 185278 382384 744829 1142132 1696872 2128900 1909233 1115526
32954A115526o39396m1179K80086J85501M362j53964l21123k94475J9182K38026
$$ 1115526 476130 434951 715037 900538 904900 750936 429813 135338 154520 392546
32944C92546P6639j02719R1033L40200J72117j70542j60075P8883M4171k38582
$$ 392546 469185 366466 457499 797699 969816 799274 639199 718082 762253 523671
32934E23671l78620m11845o06241p12895k85404M02997O41298M04455L22291N32362
$$ 523671 145051 -266794 -873035 -1585930 -1871334 -1468337 -827039 -422584 -100293 432069
32924D32069M50332j77886p81852p54463j43697N81455R42886O20570k24989q18078
$$ 432069 882401 704515 -77337 -831800 -975497 -394042 548844 1169414 944425 126347
32914A26347n59356R6245K22134j81139j89680N44267J160495Q03720k08582q64523
$$ 126347 -433009 -336764 -114630 -295769 -485449 58818 1219313 2023033 1814451 949928
32904I49928o59064M3587N43254M34436j03068n10464m43107p2717L07103O40824
$$ 949928 290864 334451 877705 1312141 1209073 698609 255502 182785 489888 1130712
32894A130712Q01396M02498n49671j249263r94363j42614M81292O80588O41219
$$ 1130712 1932108 2334606 1784935 535672 -458691 -601305 -120013 560575 1201794
32885A201794J70362p92071j405093r03220K6033J76096j96414J21728J007225
$$ 1201794 1372156 580085 -825008 -1728228 -1702195 -1526099 -1722513 -1600785 -593560
32876e93560J043445J5134n52092J16769Q31398N14912j85347l65423l94733p93614
$$ -593560 449885 465019 -87073 29696 861094 1376006 1190659 825236 430503 -363111
32866c63111r46603k64011M88850L57876k28289l03862P2450L04341M58422P60049
$$ -363111 -1309714 -1573725 -1084875 -726999 -955288 -1259150 -1186700 -882359 -423937 336112
32856C36112P22520L9156m57862k4293O01274L69733l15973m48886k15004l41978
$$ 336112 1058632 1097788 639926 615633 1216907 1586640 1270667 821781 606777 264799
32846B64799m25615K73579R87090M07702q77743j048115k0825M21305l54197q89910
$$ 264799 -160816 112763 1099853 1507555 629812 -418303 -439128 -17823 -372020 -1261930
32836a261930k40923N56176M57379M1767J47213L99798J88378j46233j26113o9457
$$ -1261930 -1502853 -946677 -489298 -447531 -300318 99480 287858 141625 15512 -53945
32826e3945k85988l35385O2372L47289J49926J9773L45403N79268L51976K56485
$$ -53945 -339933 -675318 -612946 -265657 -115731 -95958 249445 828713 1180689 1437174
32816A437174N97495N13983n25092j452289j155034l26501k69608o61593k11063
$$ 1437174 2034669 2548652 2023560 571271 -583763 -910264 -1179872 -1841465 -2052528
32807b052528R52756J338863M50689n54810p30892m28097k15151K175L34305M45923
$$ -2052528 -1099772 239091 689780 134970 -595922 -1024019 -1239170 -1236995 -902690 -456767
32797d56767K39621J54265L57137M01473O6468k09738j33174n9641k42418k80189
$$ -456767 -217146 -62881 294256 695729 762197 552459 419285 359644 117226 -162963
32787a62963J09343L80073n6995p43479o59134L21463J167992J009219J71085
$$ -162963 -53620 326453 269458 -474021 -1133155 -811692 356300 1365519 1536604
32778A536604l67063k06164J53721J13537k94089o03468n57533k63659J35786
$$ 1536604 1169541 963377 1117098 1230635 936546 333078 -224455 -488114 -352328
32769c52328N66596Q07893N86003J0242m37582n01346l89961k72822J7415N09045
$$ -352328 214268 1022161 1608164 1618406 1180824 679478 289517 16695 34110 543155
32759E43155P82034N47520J51822K6649k9471m65509j114911j329404q92468k55798
$$ 543155 1325189 1872709 2024531 2051180 2021709 1556200 441289 -888115 -1780583 -2036381
32749b036381J30831K63759L34998M24063M87262M04403R0381k50653j97238L05020
$$ -2036381 -1905550 -1641791 -1306793 -882730 -395468 8935 99316 -151337 -348575 -43555
32739d3555P26653O49401L10321N2405k68142p16638o80437K28048J072599N97125
$$ -43555 683098 1332499 1642820 1695225 1427083 710445 30008 258056 1330655 1927780
32729A927780p82091j309840m22040M27898M4777p19694m64011M98620P24815
$$ 1927780 1145689 -164151 -586191 -158293 -113516 -833210 -1297221 -798601 -73786
32720g3786k9762m94197J04208R56862R80574K69970l32577n00682n86967p98725
$$ -73786 -103548 -597745 -493537 463325 1443899 1713869 1381292 880610 293643 -505082
32710e05082q41588m46319J33205L41250n5559o47602p03838J01721J223374J639766
$$ -505082 -1346670 -1792989 -1659784 -1318534 -1374093 -2021695 -2725533 -2623812 -1400438 239328
32700B39328R13321k06562n17860K34788J008225P22782m16500j246719j105585
$$ 239328 1152649 946087 428227 663015 1671240 2394022 1977522 730803 -374782
32691c74782m33808P2814L15829N55004P92955P71907L27280m90900j371412j684102
$$ -374782 -808590 -735776 -419947 135057 928012 1699919 2027199 1536299 164887 -1519215
32681a519215r44625L90511J122790P16953r155q7499K87959L32979N925j37355
$$ -1519215 -2463840 -2073329 -950539 -233586 -242741 -330240 -42281 290698 296623 159268
32671A59268m4697j16049k58343k8531L72371L17884m2630M7498M81287K72660
$$ 159268 114571 -1478 -259821 -288352 84019 401903 359273 406771 888058 1160718
32661A160718o45713r62311p729J006796P41287l10547p67780m69197l09741m72195
$$ 1160718 515005 -447306 -455035 551761 1293048 982501 214721 -254476 -564217 -1036412
32651a036412k49657M61086Q17574M31065K3160K37403O22031L74158m31036r57961
$$ -1036412 -1286069 -824983 -7409 423656 446816 684219 1306250 1680408 1249372 291411
32641B91411p41189k04293j8057k49439l60335j341M79131N56883L33166L15019
$$ 291411 -449778 -654071 -672128 -921567 -1281902 -1283243 -804112 -247229 85937 400956
32631D00956M61849J55610o65051j102990n48341L23549N03998R7269k0657L44315
$$ 400956 862805 1018415 353364 -749626 -1297967 -974418 -470420 -373151 -393808 -49493
32621d9493N26595J87719k14628k58612j06895l1034j5736l8456j82869k75359
$$ -49493 477102 664821 450193 191581 84686 53652 37916 -540 -183409 -458768
32611d58768M5348O54757Q64044L40573l37112m37418n8262R4876k49268n62621
$$ -458768 -413420 241337 1105381 1445954 1108842 671424 613162 708038 458770 -103851
32601a03851k75493M06431P10843K92033k87130l09246Q5684J32144l59194o99557
$$ -103851 -379344 27087 737930 1029963 742833 433587 519271 651415 292221 -407336
32591d07336m43248q1078j17173j50254L56553R45127P79655O6145k10784J47585
$$ -407336 -850584 -931662 -1048835 -1199089 -842536 102591 882246 948391 737607 885192
32581H85192L45365J1892k75413j55420j06493m32712n78785j05735M17662K48414
$$ 885192 1230557 1242449 967036 811616 705123 272411 -306374 -412109 5553 253967
32571B53967l52101n21403l2720N34226O53961L54558p791r1749J65761L91820
$$ 253967 -98134 -619537 -652257 -118031 535930 890488 882697 790948 956709 1348529
32561A348529J41096m05160n25661J218M69263K59527k51297l62244j62500k51749
$$ 1348529 1489625 1084465 558804 560022 1029285 1288812 1037515 675271 512771 261022
32551B61022o31257o70401j48159L81829M19757J68229J02178K59367K71927l3617
$$ 261022 -370235 -1040636 -1188795 -806966 -387209 -218980 -116802 142565 414492 380875
32541C80875l45828k76608O1213J50254j57008l13723J06408O18584M98906J0018
$$ 380875 35047 -241561 -180348 -30094 -187102 -500825 -394417 224167 723073 733091
32531G33091M0606N29339L77111p04825j418329p07166O03991R85546K83760m55884
$$ 733091 773697 1303036 1680147 975322 -443007 -1150173 -546182 439364 723124 267240
32521B67240o76303o34641m10681J58572O68886M60898j96142l08576L11143P32655
$$ 267240 -409063 -1043704 -1454385 -1295813 -626927 -166029 -362171 -670747 -359604 373051
32511C73051L50340l18906n84002m37271j00176M44131R92723R33405Q6129p81924
$$ 373051 723391 404485 -179517 -616788 -716964 -272833 719890 1653295 1739424 957500
32501I57500q00018r631Q08924R96264M66917l35606p48585m90432j2392J23554
$$ 957500 157482 147851 956775 1953039 2419956 2084350 1335765 845333 832941 956495
32491I56495Q2657L44351O10977R1002j031917j499387p42545K65403M78818J61191
$$ 956495 1039152 1383503 1994480 2085482 1053565 -445822 -1188367 -922964 -444146 -282955
32481b82955J06993L46030M49014M04537L29710n4279p63808r85157j80346P46345
$$ -282955 -175962 170068 619082 1023619 1353329 1299050 535242 -449915 -630261 116084
32471A16084N19755n82408j050534k97069O38783O76182J4503m28256k01134L52727
$$ 116084 635839 53431 -997103 -1294172 -655389 20793 35296 -392960 -594094 -241367
32461b41367N39654l316p87889q51309k0507O69048M19515q6214J52074O48789
$$ -241367 298287 294971 -492918 -1344227 -1364734 -695686 -276171 -362385 -210311 438478
32451D38478J79788r78101j219497j56127P13480M13274p0112L15240Q04816J65397
$$ 438478 618266 -359835 -1579332 -1735459 -1021979 -608705 -678817 -363577 441239 606636
32441F06636j098600j384573l17962R12945J309953R73256L40268m09544j050539
$$ 606636 -491964 -1876537 -2194499 -1281554 28399 1001655 1341923 932379 -118160
32432a18160j214902q09220p9271O95713J197010J059480M05081J3419L01964
$$ -118160 -1333062 -2142282 -2221553 -1525840 -328830 730650 1135731 1149150 1451114
32423A451114N57172J2943p48000n93829K23216L03353o49183j260004o50271
$$ 1451114 2008286 2021229 1273229 679400 902616 1205969 556786 -703218 -1353489
32414a353489J95781R1280m51523j60409Q76706J343984P00300j49395k89582
$$ -1353489 -1157708 -1066428 -1517951 -1678360 -801654 542330 1242630 1093235 803653
32405H03653O4135J82594j02402l68644k85397K5304J81512n1488m74817o03054
$$ 803653 867788 1050382 947980 579336 293939 319243 500755 449267 -25550 -628604
32395f28604k26626K83635M40380K63145J40693K00452K14042R8735P0341J90610
$$ -628604 -855230 -571595 -131215 131930 272623 473075 687117 785852 856193 1046803
32385A046803J58533k27632o76389p25001l13135J65534L12159Q4686k46456m03427
$$ 1046803 1205336 977704 301315 -423686 -736821 -571287 -259128 -174442 -420898 -824325
32375h24325l42244j89010K3364L86744Q00589Q70371M05321j54623k07017J71796
$$ -824325 -1166569 -1355579 -1332215 -945471 -144882 725489 1130810 976187 769170 940966
32365I40966K91824j86948p90927q87838m22284J90064N42923M18892j15803n39172
$$ 940966 1232790 1045842 254915 -632923 -1055207 -865143 -322220 96672 -19131 -558303
32355e58303k19465P04237J197639N72509m91260p61569o9040N56796K96432n65911
$$ -558303 -777768 -73531 1124108 1696617 1205357 443788 374748 931544 1227976 662065
32345F62065j208898j134268l44771P59208J456324J189670K40307m74421m58300
$$ 662065 -546833 -1681101 -2025872 -1266664 189660 1379330 1619637 1145216 686916
32336F86916q7157J16806J18724M9265j63699m59889m57350m2783K97044J87734
$$ 686916 599759 716565 835289 884554 720855 260966 -196384 -239167 57877 245611
32326B45611k9487J07287M31956N38475M57269L31812q0488q19256j121213l84854
$$ 245611 216124 323411 755367 1293842 1751111 2082923 2002435 1183179 61966 -322888
32316c22888O19785O34903j78193m69811J49404N74075J38490l17525P075N25400
$$ -322888 296897 931800 753607 283796 433200 1007275 1145765 828240 835315 1360715
32306A360715M11120M9704J86571M24814j05462j044290j132220j40924P53377
$$ 1360715 1771835 1821539 2008110 2432924 2327462 1283172 150952 10028 763405
32297G63405O74570R6252j07709J61815L90494K18291k95988q16068r41564n47327
$$ 763405 1437975 1534227 1426518 1588333 1978827 2197118 1901130 1085062 143498 -403829
32287d03829O0694N60319R86862J323759J074252p9576j410172j761239j009295
$$ -403829 -343135 217184 1204046 2527805 3602057 3522481 2112309 351070 -658225
32278f58225j27005K19714K87430L79519K99742j1853j52078K4280R6595j10337
$$ -658225 -785230 -565516 -278086 101433 401175 389322 237244 261524 358119 247782
32268B47782j46693K01455M33430K17262k1300K1827j30983p65992j117937m47641
$$ 247782 101089 302544 735974 953236 931936 953763 822780 56788 -1061149 -1508790
32258a508790O19346R03749M07478J19610L41543L83937p0446m19403j86527K83751
$$ -1508790 -889444 14305 421783 541393 882936 1266873 1196427 777024 590497 874248
32248H74248M56365K29740k47592p19504o99251M1469P68338M38840p28297j263934
$$ 874248 1330613 1560353 1312761 593257 -105994 -64525 703813 1142653 414356 -849578
32238h49578m06000Q59087J241704P79964L30400J77886K2387j61497j43199j3855
$$ -849578 -1255578 -396491 845213 1625177 1955577 2133463 2155850 1994353 1851154 1837299
32228A837299K3758J70874O04272Q34134L28287m47426n52404m7630P0795m80508
$$ 1837299 1861057 2031931 2636203 3470337 3798624 3351198 2798794 2751164 2821959 2341451
32218B341451p64642j60328N78814M77572j85132l69789K04304Q30612Q63524
$$ 2341451 1576809 1416481 1995295 2472867 2287735 1917946 2122250 2952862 3816386
32209C816386K93698n54171j224260j147743j71054R17504J060591K27866n81659
$$ 3816386 4110084 3555913 2331653 1183910 1012856 1930360 2990951 3218817 2637158
32200B637158p19878n51380n32507m54854q4224J93957N7238k8267M11733Q30011
$$ 2637158 1917280 1365900 833393 378539 294315 488272 545510 517243 928976 1758987
32190A758987L84484n98636r76264n19034j31997k27156j38710M00784M84638
$$ 1758987 2143471 1544835 568571 49537 -82460 -309616 -448326 -47542 437096
32181D37096m16304j211711o78835N63613R12897J89983k43842K85826Q49527
$$ 437096 20792 -1190919 -1869754 -1306141 -393244 -203261 -447103 -161277 688250
32172F88250N53086j45486l76507j72650r6989k03585j20020K03777M41473L64004
$$ 688250 1241336 1095850 719343 546693 449704 246119 126099 329876 771349 1135353
32162A135353k9398n75131q41993l87569N05477Q39157J68974o06877m18677L82640
$$ 1135353 1105955 530824 -311169 -698738 -193261 645896 814870 207993 -210684 171956
32152A71956M84180m48178j243891q92390Q1456M46839m9481n12407k46226L88295
$$ 171956 656136 207958 -1035933 -1928323 -1846867 -1400028 -1449509 -1961916 -2208142 -1819847
32142a819847O50333M86621M83724Q86424J159279P36003j37310o93035o12806
$$ -1819847 -1169514 -682893 -199169 687255 1846534 2582537 2445227 1752192 1139386
32133A139386k66510k9872J17708J95417k5937n16878o57911O3251J190141J626896
$$ 1139386 872876 843004 960712 1156129 1130192 613314 -44597 18654 1208795 2835691
32123B835691Q78416l53971r27340m68218K56568K07376o69387j238619n25105
$$ 2835691 3714107 3360136 2432796 1964578 2221146 2428522 1759135 520516 -4589
32114d589Q94453J418268M14209r85628j412399r01538m04105k30945J10465P33316
$$ -4589 889864 2308132 2722341 1736713 324314 -577224 -981329 -1212274 -1101809 -368493
32104c68493R85066M58942k89728m22538J29369O07722L16385n69488j101178
$$ -368493 616573 1075515 785787 363249 492618 1100340 1416725 847237 -253941
32095b53941n61464O30820J324956J037068M58188K99734K76097j63911o92377
$$ -253941 -815405 -184585 1140371 2177439 2635627 2935361 3211458 3047547 2355170
32086B355170o05888j10005l9771m18489m09626J93480N60241K40564q3310J75243
$$ 2355170 1749282 1639277 1599506 1181017 771391 964871 1525112 1765676 1682366 1857609
32076A857609M74601J04036n61568o61171k40756j38744o53024j110855q28492
$$ 1857609 2332210 2436246 1874678 1213507 972751 834007 180983 -929872 -1758364
32067a758364L9772P44843P54453K54533o8301J90336O24391N31390j09790o36238
$$ -1758364 -1718592 -973749 -219296 35237 -33064 157272 781663 1313053 1203263 567025
32057E67025o83380n55903m80648j96478M03655R04828J017049R08431N45154
$$ 567025 -116355 -672258 -1152906 -1349384 -945729 -40901 976148 1884579 2429733
32048B429733m10401j498287j327807M64983K044503J485569n42398j651201r48654
$$ 2429733 2019332 521045 -806762 -341779 1702724 3188293 2645895 994694 46040
32039D6040J91737N34147M80184P10420Q01758J01211r46159j254558m53149P58816
$$ 46040 237777 771924 1252108 1962528 2764286 2865497 1919338 664780 211631 970447
32029I70447J291611N15669j049086j828555p39476J226420J889794O23249q54881
$$ 970447 2262058 2777727 1728641 -99914 -839390 387030 2276824 2900073 2045192
32020B045192r02897k1079L30692n2945k50869J07592N14504O14243M99186J52290
$$ 2045192 1142295 1121216 1451908 1398963 1148094 1255686 1770190 2384433 2883619 3035909
32010C035909m73405r40380p38879j28197J86536Q8310J7566Q9156O3196N2533
$$ 3035909 2562504 1622124 883245 755048 941584 1029894 1047460 1136616 1199812 1252345
32000A252345L56747O37680K03432p96262j358825r90145k52193K31461M75499
$$ 1252345 1609092 2246772 2450204 1653942 295117 -695028 -947221 -715760 -240261
31991b40261N89841L84878j01426m05749l44377k64442k88419k9345N90647R91372
$$ -240261 349580 734458 633032 227283 -117094 -381536 -669955 -699300 -108653 882719
31981H82719Q26247M87818K93135k8381n22691n88461p3001J11862o00044j224716
$$ 882719 1708966 2196784 2489919 2461538 1938847 1350386 1277385 1389247 789203 -435513
31971d35513n90685P36126J216343O14022P5103R4304n9704o82856q80846p5399
$$ -435513 -1026198 -290072 926271 1540293 1615396 1709700 1649996 967140 86294 10895
31961A0895R14866J071285N79022K57052K72812K29647N1655l351N2350l3345
$$ 10895 925761 1997046 2576068 2833120 3105932 3335579 3387234 3383883 3436233 3402888
31951C402888k69262m45368m88091m26765k14601Q4866J85835o237j40818O6313
$$ 3402888 3133626 2688258 2200167 1773402 1558801 1643667 1829502 1823265 1682447 1748760
31941A748760L57547L58338J83301J56780J72918j28618o55345q49310m25756
$$ 1748760 2106307 2464645 2647946 2804726 2977644 2849026 2193681 1344371 918615
31932I18615K44862N64040K92327k89215o51315n18651j86164j49104l60216k30397
$$ 918615 1163477 1727517 2019844 1730629 1079314 560663 374499 225395 -134821 -365218
31922c65218M47912J058186J012210N84480L83482M07460K79054R0293K26328
$$ -365218 82694 1140880 2153090 2737570 3121052 3528512 3807566 3897859 4124187
31913D124187N15841M07828n72J8821N93191Q78155L27240l80488k71809N45556
$$ 4124187 4640028 5047856 5047284 5066105 5659296 6537451 6864691 6484203 6212394 6757950
31903F757950J102076R22800N11916M63656O35833M80305r0748n58164n48232
$$ 6757950 7860026 8782826 9294742 9758398 10394231 10874536 10783788 10225624 9677392
31894I677392l94574o42976j169989j287256p72825k25261j31452j90125l3929
$$ 9677392 9282818 8639842 7469853 6182597 5409772 5184511 5053059 4862934 4829005
31885D829005m741m70198q87758n35179J49260J13351n15623m85460M96416J063705
$$ 4829005 4824264 4354066 3466308 2931129 3080389 3193740 2678117 2192657 2689073 3752778
31875C752778K05404j164179j540321q58578j87422l1706k0503Q1318R3982L2402
$$ 3752778 3958182 2794003 1253682 395104 207682 175976 155473 236791 330773 363175
31865C63175J17691K09281l3895m42968m68038k3831M11606N45894N17733L81782
$$ 363175 480866 690147 656252 213284 -254754 -278585 133021 678915 1196648 1578430
31855A578430k0577n61850p70428m70865n2981P0106o3904j45633L2839M19351
$$ 1578430 1557853 996003 225575 -245290 -298271 -228165 -292069 -437702 -404863 14488
31845A4488O71160L70626m25503j021342q69619l17560m4398J3556M41278J156166
$$ 14488 685648 1056274 630771 -390571 -1260190 -1577750 -1622148 -1608592 -1167314 -11148
31835a1148J353743Q12890L49510N48697Q38923M32724m39329r55030r27082q38720
$$ -11148 1342595 2155485 2504995 3053692 3892615 4325339 3886010 2930980 2003898 1165178
31825A165178q94222p93117m06721p961K50805N14847P49448O25948J22867k35237
$$ 1165178 270956 -522161 -928882 -936843 -686038 -171191 578257 1204205 1327072 1091835
31815A091835q9485J76147J1832m00224l74090K14539O79640N09463O6115o1836
$$ 1091835 1002350 1178497 1190329 790105 416015 630554 1310194 1819657 1885772 1823936
31805A823936L2076j40377n38668o41454l67310k23109l82216l43585J34263M56450
$$ 1823936 1856012 1715635 1176967 535513 168203 -54906 -437122 -780707 -646444 -189994
31795a89994J36105k52322J44421J053699J339961O18312k35272l56377M3461
$$ -189994 -53889 -306211 -161790 891909 2231870 2850182 2614910 2258533 2301994
31786B301994K13283p9486m40857m74046j41636L30734O53118O55230M06507J03881
$$ 2301994 2515277 2435791 1994934 1520888 1379252 1709986 2363104 3018334 3424841 3528722
31776C528722j41349k85025k34895p808R7258j79884o16934p53670n52897m05031
$$ 3528722 3387373 3102348 2867453 2859645 2956903 2777019 2160085 1406415 853518 448487
31766D48487m62623m41860j92064K1584K7321J05481M97980Q54229N70225l77590
$$ 448487 -14136 -455996 -648060 -626476 -599155 -493674 4306 858535 1428760 1051170
31756A051170j215775j095024j5583J019553R52114j32961r96844o50892N06383
$$ 1051170 -164605 -1259629 -1275212 -255659 696455 563494 -433350 -1084242 -577859
31747e77859J286561J137734M89590o1248k85369j80192N2237n0561o61849j155803
$$ -577859 708702 1846436 2336026 2274778 1989409 1809217 1861454 1810893 1149044 -6759
31737f759q41028p1464K28598M8907K23359Q00886P65825j86639q70928l72134
$$ -6759 -847787 -919251 -690653 -641746 -418387 382499 1148324 961685 90757 -281377
31727b81377N18228N98492O6858q6207K28285L48713K19910L20927M94348J20124
$$ -281377 236851 835343 902201 815994 1044279 1392992 1612902 1933829 2428177 2548301
31717B548301n78285o34518N8927L85536l19251j166623r39561J95745R26367
$$ 2548301 1970016 1335498 1394425 1779961 1460710 294087 -645474 -449729 476638
31708D76638M98542m34543p50082k43741K46360N4960m02140l14367K38778M21441
$$ 476638 975180 540637 -209445 -453186 -206826 -151866 -554006 -868373 -629595 -208154
31698b08154L3528j59710K08182M10477o1462m43394Q1541Q77081P52927j59131
$$ -208154 -174626 -334336 -126154 284323 222861 -220533 -138992 738089 1491016 1331885
31688A331885p08423n69226m24108m47297l8580Q02721J220571R42617O88219
$$ 1331885 623462 54236 -369872 -817169 -855749 -53028 1167543 2110160 2798379
31679B798379P12649K58598q78284j490497o35422P90455J230972N36582k16815
$$ 2798379 3511028 3769626 2891342 1400845 765423 1555878 2786850 3323432 3106617
31670C106617m57817n44620p13807o88066l84228j70461k52102l98831l99756
$$ 3106617 2648800 2104180 1390373 702307 318079 147618 -104484 -503315 -903071
31661i03071k97653j00973K61549O03195N48907J16214j44304J68519P24968Q32140
$$ -903071 -1200724 -1301697 -1040148 -436953 111954 228168 83864 252383 977351 1809491
31651A809491K88065l73050n31459j95729J06632O9045o5452j9674J5224k72026
$$ 1809491 2097556 1724506 1193047 997318 1103950 1172995 1107543 1087869 1103093 831067
31641H31067o82807o79750j41222M68002O96021N06700Q2391l72964n81555l36194
$$ 831067 148260 -531490 -672712 -204710 491311 998011 1080402 707438 125883 -210311
31631b10311J92121N83778O41990M71162J87870p0982n763M61185P78220L62272
$$ -210311 -18190 565588 1207578 1678740 1866610 1795628 1789865 2251050 3029270 3391542
31621C391542m63602q24638n45992k43840j60884R7253M80588K86423m87766p16388
$$ 3391542 2927940 2103302 1557310 1313470 1152586 1249839 1730427 2016850 1529084 812696
31611H12696J44699R30083M00412p73679r23526J59261R97643O06746l06821n91674
$$ 812696 957395 1887478 2287890 1514211 590685 749946 1747589 2354335 2047514 1455840
31601A455840j57219K36444J14875k67692m07459j80213L4107j19738l84963j78083
$$ 1455840 1298621 1535065 1649940 1382248 974789 794576 828683 708945 323982 145899
31591A45899M49832O73735N0816p40778q45552m04048j19857j10106o901J19422
$$ 145899 595731 1269466 1320282 579504 -266048 -670096 -789953 -900059 -906960 -787538
31581g87538j29072n65715n36451J0023M07701L49308K91289N80708Q91144Q11867
$$ -787538 -916610 -1482325 -2018776 -2008753 -1601052 -1251744 -960455 -379747 511397 1323264
31571A323264M23183K4834k33293k80932j50447j41894m35990n43398J46094J181943
$$ 1323264 1746447 1771281 1537988 1257056 1106609 964715 528725 -14673 131421 1313364
31561A313364J303156J96340q85347q24778j57272r1790o45517p68963n6447P03213
$$ 1313364 2616520 2812860 1927513 1102735 945463 853673 208156 -560807 -617254 85959
31551H5959P65807L57996O7975k6307j72652l06815j10522M20152Q61330Q55343
$$ 85959 851766 1209762 1277737 1251430 1078778 771963 661441 1081593 1942923 2798266
31541B798266M92512J46194O8812J99435K70717O5310l48513o09567m07640J09592
$$ 2798266 3290778 3436972 3505784 3705219 3975936 4041246 3692733 3083166 2675526 2785118
31531B785118M17533K16471j92929k99637L508M17431O80771O95630L61190k73963
$$ 2785118 3202651 3419122 3226193 2926556 2930064 3347495 4028266 4723896 5085086 4811123
31521D811123p58613o54441k24061j39212m32050m20750J04988L98444q7652p70454
$$ 4811123 4052510 3398069 3174008 3034796 2602746 2181996 2286984 2685428 2597776 1827322
31511A827322q03548k95752O9442J67269L70298O61444O21783J60282m03846q11167
$$ 1827322 1023774 728022 797464 964733 1335031 1996475 2618258 2778540 2374694 1563527
31501A563527q55065k66277P13834J093736L45896n61737l97586M57984O48681
$$ 1563527 708462 442185 1156019 2249755 2595651 2033914 1636328 2094312 2742993
31492B742993Q3963k2636N93476O97649k32357r26281l80928M54365K77892m43302
$$ 2742993 2826956 2804320 3397796 4095445 3863088 2936807 2555879 3010244 3288136 2844834
31482B844834l96371L36675N10334j98913q05882o67911k51583q4020j890K34397
$$ 2844834 2448463 2785138 3295472 3096559 2290677 1622766 1371183 1287163 1285273 1519670
31472A519670L94517K26867r6840k84022k82797j68098J613J08983M4894j00856
$$ 1519670 1914187 2141054 2044214 1760192 1477395 1309297 1310910 1419893 1464787 1363931
31462A363931j46923p7278K1259J31825J71578p2681n24651o21051k9244O62099
$$ 1363931 1217008 1139730 1160989 1292814 1464392 1391711 867060 246009 216765 878864
31452H78864N77895k01006o60738j90801O66204R86091N45069j02237l35177n5343
$$ 878864 1456759 1255753 595015 404214 1070418 2056509 2601578 2499341 2164164 2108821
31442B108821K79189J20684n57306j158892j125182n72787n5166J52953K17693
$$ 2108821 2388010 2508694 1951388 792496 -332686 -905473 -960639 -807686 -589993
31433e89993L17212M30524N28198O31751O61669M97987J98572o1902k23549l04238
$$ -589993 -272781 157743 685941 1317692 1979361 2477348 2675920 2614018 2390469 2086231
31423B086231k35571K2064L05956M24259L79991K40333J4688j32048Q8322N23710
$$ 2086231 1850660 1872724 2178680 2602939 2982930 3223263 3237951 3105903 3194225 3717935
31413C717935N15659j15137n41580j12117M51462O7931q38443q14564K81721R18219
$$ 3717935 4233594 4118457 3576877 3464760 3916222 3984153 3145710 2331146 2612867 3531086
31403C531086L19515k37747M74624J518904J206369j85260p96639l2962O90181
$$ 3531086 3850601 3612854 4087478 5606382 6812751 6627491 5830852 5797890 6488071
31394F488071L32080k14768K47713J246902J441435O84435L8049J3663K6031l16741
$$ 6488071 6820151 6605383 6853096 8099998 9541433 10225868 10263917 10277580 10303611 9986870
31384I986870n29850k89223j86033p40395j380929j286041p55906p21338j119149
$$ 9986870 9457020 9167797 8981764 8241369 6860440 5574399 4818493 4097155 2978006
31375B978006r18536J18657Q83103N99785K0L5218L25129l2660p45541p42828
$$ 2978006 2059470 2178127 3061230 3661015 3661035 3696253 4021382 3988722 3243181 2500353
31365B500353n3043J61021m04220n85074K70992R89430K80187j114573j315696
$$ 2500353 2447310 2608331 2204111 1619037 1890029 2879459 3159646 2045073 729377
31356G29377Q647J215440J060547K52729P8312M57113L19060n64268j187271p97662
$$ 729377 738024 1953464 3014011 3266740 3345052 3802165 4121225 3556957 2369686 1572024
31346A572024Q6216N02142K78039o8999k64582m71480o85809n80452p7910M11634
$$ 1572024 1658240 2160382 2438421 2369422 2104840 1633360 947551 367099 289189 700823
31336G00823N36556M05961K34341k6065l97188n69569k85267K09560M95172N63400
$$ 700823 1237379 1643340 1877681 1851616 1454428 884859 599592 809152 1304324 1867724
31326A867724O37602N83094N8677p40248j064390n56542K09532M47620J41652
$$ 1867724 2505326 3088420 3147097 2406849 1342459 785917 995449 1443069 1584721
31317A584721m9181K38285N69728L30543l70547p48676l82053J27728p2745q17381
$$ 1584721 1535540 1773825 2343553 2674096 2303549 1554873 1172820 1300548 1227803 410422
31307D10422j027441k22853P18184P28707n5596o70781o79355m14910j22541L03292
$$ 410422 -617019 -839872 -121688 607019 551423 -119358 -798713 -1213623 -1336164 -1032872
31297a032872P30496P36075L10692l4806m5557k259o5164N813K44858K76318M1835
$$ -1032872 -302376 433699 744391 709585 664028 661769 596605 602418 847276 1123594 1165429
31286A165429M2364M24969N33895k8471n55876k61789L57766J68944q28566j404161
$$ 1165429 1207793 1632762 2166657 2138186 1582310 1320521 1678287 1847231 1018665 -385496
31276c85496q19220K87313R59650J018967P21083J11183o77686j066669o92141
$$ -385496 -1204716 -917403 42247 1061214 1782297 1893480 1215794 149125 -543016
31267e43016p3783Q0767k8067L03169R05401P60502l43508j145489n55795P45004
$$ -543016 -616799 -536032 -564099 -260930 644471 1404973 1061465 -84024 -639819 105185
31257A05185J234327O29247R083K2705J23371j95462n09000l71118k07718n25872
$$ 105185 1339512 1968759 1977842 2000547 2123918 1928456 1419456 1048338 840620 314748
31247C14748r20650p53801l02634k56465m30617o4657P47978J065873O21897K23985
$$ 314748 -605902 -1359703 -1662337 -1918802 -2349419 -2414076 -1666098 -600225 21672 245657
31237B45657L36032L39721k37925p25528l46115M41049N80549K9637k07160M10860
$$ 245657 581689 921410 683485 -42043 -388158 52891 633440 663077 455917 866777
31227H66777J207549J231810M33319l65746m39985Q0157L90318n0684q27601j031277
$$ 866777 2074326 3306136 3739455 3373709 2933724 3013881 3404199 3353515 2525914 1494637
31217A494637m19302K56129K49208k42078m69954j71555K13054K31119n7032k63427
$$ 1494637 1075335 1331464 1580672 1338594 868640 697085 910139 1141258 1084226 820799
31207H20799j56868J04643K03761J38052K77855O87293O69484l38639j498901
$$ 820799 663931 768574 972335 1110387 1388242 2075535 2745019 2406380 907479
31198I07479j207703O05634J856289Q78763j164964j715829k69150J088136P37107
$$ 907479 -300224 305410 2161699 3040462 1875498 159669 -109481 978655 1715762
31189A715762l75063m70038L99843P06314o7395p24344l15085M03040J81236p91390
$$ 1715762 1340699 870661 1270504 1976818 1909423 1185079 869994 1273034 1454270 662880
31179F62880j160538l91669N14973N29061l1486j97305J68077L69896J02647j64627
$$ 662880 -497658 -889327 -374354 154707 123221 -74084 93993 463889 566536 401909
31169D01909n2725K01898K68811J80207M6884j61868l30115j82322K10485L96455
$$ 401909 349184 551082 819893 1000100 1046984 885116 555001 372679 583164 979619
31159I79619K29563O0635K6111k06011o46015o63083P645O11094M15891j65541
$$ 979619 1209182 1269817 1295928 1089917 443902 -219181 -211536 399558 815449 649908
31149F49908k97686o4250j44714m84852l58082L04920O78906L17780k09297k57347
$$ 649908 352222 287972 143258 -341594 -699676 -394756 284150 601930 392633 135286
31139A35286M7377K66446L46172M18358L60662L1837l20924l28521p5072m4957
$$ 135286 182663 449109 795281 1213639 1574301 1606138 1285214 956693 881621 836664
31129H36664m33244p51077l57851O14200J189320P12971j71445l09778K95928
$$ 836664 403420 -347657 -705508 -91308 1098012 1810983 1639538 1329760 1625688
31120A625688M77121k41172q13375l33623M85847N13308L8922Q4132M51428P3084
$$ 1625688 2102809 1861637 1048262 714639 1200486 1713794 1752716 1836848 2288276 2361360
31110B361360q88572j040305j10054M23137k67966r07088j74073J050614R60287
$$ 2361360 1472788 432483 322429 745566 477600 -429488 -603561 447053 1407340
31101A407340m12416j269158o75758L11494L87440k79668o40695l48610q631q2373
$$ 1407340 994924 -274234 -949992 -638498 -251058 -530726 -1171421 -1520031 -1528662 -1611035
31091a611035k08906J72467Q86350J144421N99789j66758m53468l16224k09225
$$ -1611035 -1819941 -1647474 -761124 383297 983086 816328 362860 46636 -162589
31082a62589j36835J58958M03620M3527o97403r00155k94427L15538K79286o8527
$$ -162589 -299424 -140466 263154 306681 -390722 -1290877 -1585304 -1269766 -990480 -1059007
31072a059007k20868l03950m72345k71862N91664J412204J287717M26157j69819
$$ -1059007 -1279875 -1583825 -2056170 -2328032 -1736368 -324164 963553 1389710 1219891
31063A219891j08581Q0999m4689k66899k27871J5483J36983m0578l48354m02400
$$ 1219891 1111310 1192309 1147620 880721 652850 668333 805316 764738 416384 13984
31053A3984n6280K68404O6616m05701l89914J01082J21164o30228j039997k59105
$$ 13984 -42296 226108 292724 -112977 -502891 -401809 -280645 -910873 -1950870 -2209975
31043b209975P41953N46222m10554m50436O73868J383482P68533j29722j62813
$$ -2209975 -1468022 -921800 -1332354 -1782790 -1108922 274560 1043093 913371 750558
31034G50558K18100Q3916k57589P0013P90219P55457k28295j029219q05382q8630
$$ 750558 968658 1052574 794985 864998 1655217 2410674 2182379 1153160 347778 259148
31024B59148J07688l53626p32085m71602J55925M70645K31820r0342N5746N34654
$$ 259148 366836 13210 -718875 -1190477 -1034552 -563907 -332087 -422429 -366683 167971
31014A67971O73172K16531k60519j76894J64964O863o87179j063862n28489M19164
$$ 167971 841143 1057674 797155 620261 785225 792088 104909 -958953 -1487442 -1068278
31004a068278Q16025M08369j88833l73965j92119k9938k9517l9880K7875P7050
$$ -1068278 -252253 156116 -32717 -406682 -598801 -628739 -658256 -698136 -670261 -593211
30994e93211L8997j0368k416J6127M286K9754J57758L31971M55336M99968M39748
$$ -593211 -554214 -564582 -566998 -550871 -546585 -516831 -359073 -27102 428234 928202 1367950
30983A367950J79633k79180o44300n16238J24322P27914O57523q9696p66551o39846
$$ 1367950 1547583 1268403 624103 107865 232187 960101 1617624 1527928 761377 121531
30973A21531J49329O93945L82189l64737o41362j84113L98831M98187K04394j8184
$$ 121531 270860 964805 1346994 982257 340895 156782 555613 1053800 1258194 1240010
30963A240010k4769n5524k63231m88649n20340l66086j74535R118K77010O21364
$$ 1240010 1215241 1159717 896486 407837 -112503 -478589 -653124 -644006 -366996 254368
30953B54368P85895N30573K1185l04675l40792m54884q18523r77632n10535K03579
$$ 254368 1040263 1570836 1592021 1287346 946554 491670 -326853 -1304485 -1815020 -1611441
30943a611441M58312K67391K45378N01425M48722j22333n67009l49258J75371
$$ -1611441 -1153129 -885738 -640360 -138935 309787 187454 -379555 -728813 -553442
30934e53442L89791K67621J01041j13011m25747m73875O9585P80520Q37835P6645
$$ -553442 -163651 103970 205011 92000 -333747 -807622 -738037 42483 880318 956963
30924I56963p55680q39463j28242O38142O62583o3908o74795m53272J85774K79343
$$ 956963 201283 -638180 -766422 -128280 534303 470395 -204400 -657672 -471898 -192555
30914a92555k20722m24626n4635P8245l79094m62369N30691J603816J397249K36382
$$ -192555 -413277 -837903 -892538 -814293 -1193387 -1655756 -1125065 478751 1876000 2112382
30904B112382m59406l08813j28583k65755k10672J65402L42580K33821K94509
$$ 2112382 1652976 1344163 1215580 949825 739153 904555 1247135 1480956 1775465
30895A775465M24020J1641p37528q44909k45543o9850p39799j155147n11885L64250
$$ 1775465 2199485 2211126 1473598 628689 383146 313296 -426503 -1581650 -2093535 -1729285
30885a729285M54789J61060L30291O36502K69592m27469m18814K62951N47381
$$ -1729285 -1274496 -1113436 -783145 -146643 122949 -304520 -723334 -460383 86998
30876H6998M3518m57019k95547K43457O27219P22414N27191J8626m72307m15023
$$ 86998 130516 -326503 -622050 -378593 248626 971040 1498231 1516857 1044550 629527
30866F29527R6498K95271j42854n31988k01739M05079L19717m87955r46748l19352
$$ 629527 726025 1021296 878442 346454 144715 549794 869511 381556 -565192 -884544
30856h84544P61520J087100M09251l35520l44426L4407o2707o91933r57428k26803
$$ -884544 -123024 964076 1373327 1037807 693381 727788 665081 -26852 -984280 -1211083
30846a211083R36692J323561M40434q68190j247179l05248Q84041J027990K48704
$$ -1211083 -274391 1049170 1489604 621414 -625765 -931013 -46972 981018 1229722
30837A229722j14564N41199J166994O77358l42775n75495l5888J30812l25870
$$ 1229722 1115158 1656357 2823351 3500709 3157934 2582439 2546551 2677363 2351493
30828B351493m45915R1187L35722k04381o38398k79369J40594j60498n87377l06696
$$ 2351493 1905578 1996765 2332487 2128106 1489708 1210339 1350933 1190435 603058 296362
30818B96362J80313j5488m53290j45322N03504K48665p45006j001791k09785J86245
$$ 296362 476675 461187 7897 -137425 366079 614744 -130262 -1132053 -1341838 -1155593
30808a155593o02599j349446p87697M05847Q02946L97670K13540L74349R2300
$$ -1155593 -1758192 -3107638 -3895335 -3489488 -2686542 -2288872 -2075332 -1700983 -1608683
30799a608683n67506m34350Q39398J825175J128629n93501j394195m96308R37848
$$ -1608683 -2176189 -2610539 -1771141 54034 1182663 589162 -805033 -1301341 -363493
30790c63493J472663R44746R1464n47767q08956n82096j8897K93420M4087k21715
$$ -363493 1109170 2053916 2145380 1597613 788657 206561 187664 481084 525171 303456
30780C03456M6067L31474j84510j017193q08104N03103J307133O60496l07606
$$ 303456 349523 680997 496487 -520706 -1328810 -825707 481426 1141922 834316
30771H34316k08382N21674N59607j05468l38423J67705M93757P7364n01557n56274
$$ 834316 625934 1147608 1707215 1601747 1263324 1431029 1924786 2002150 1500593 944319
30761I44319j98899R2501J42895M6432p2010j08076j06362k77805n72635m97550
$$ 944319 745420 837921 980816 1027248 955238 847162 740800 462995 -109640 -607190
30751f07190J72441Q13576O96608M7036l03673j04221J62114J10870k18265o40845
$$ -607190 -434749 378827 1075435 1122471 818798 714577 876691 987561 769296 128451
30741A28451q00232k33780Q02082J090619J6908j165480q92242L29534O47279
$$ 128451 -671781 -905561 -103479 987140 1004048 -161432 -1053674 -724140 -76861
30732g6861k55908q12396k40322L56571J27197j42372K58747N19993j61849r46400
$$ -76861 -332769 -1145165 -1385487 -1028916 -901719 -1044091 -785344 -265351 -427200 -1373600
$$ [...]
##END NTUPLES=NMR SPECTRUM
##END=
