##TITLE=31Pdec_PR159R_EtOH
 DMSO-d6, 124 sc
 7.5.2019
##JCAMPDX= 6.0         $$ Bruker NMR JCAMP-DX V2.0
##DATA TYPE= NMR SPECTRUM
##DATA CLASS= NTUPLES
##ORIGIN= UXNMR, Bruker Analytische Messtechnik GmbH
##OWNER= root
$$ XWIN-NMR		Version 3.5
$$ Tue May  7 12:54:49 2019 Russian Standard Time (UT+4h)  she@DPX200
##.OBSERVE FREQUENCY= 81.013821
##.OBSERVE NUCLEUS= ^31P
##.ACQUISITION MODE= SIMULTANEOUS
##.ACQUISITION SCHEME= undefined
##.AVERAGES= 124
##.DIGITISER RES= 17
##SPECTROMETER/DATA SYSTEM= spect
##.PULSE SEQUENCE= zgpg30
##.SOLVENT NAME= DMSO
##.SHIFT REFERENCE= (INTERNAL, DMSO, 0, 182.463)
##AUDIT TRAIL= $$ (NUMBER, WHEN, WHO, WHERE, WHAT)
$$ ##TITLE= Audit trail, XWIN-NMR		Version 3.5
$$ ##JCAMPDX= 5.01
$$ ##ORIGIN= Bruker BioSpin GmbH
$$ ##OWNER= she
$$ F:/spectra/data/she/nmr/P31/1/pdata/1/auditp.txt
$$ ##AUDIT TRAIL=  $$ (NUMBER, WHEN, WHO, WHERE, WHAT)
(   1,<2019-05-07 12:53:51.98 +0400>,<she>,<DPX200>,
      <continue with go, POWCHK disabled, PULCHK disabled
       configuration hash MD5:
       00 E9 B6 7A A2 85 ED C7 34 08 36 98 17 FE 4E 26
       data hash MD5: 32K
       76 FA 81 7C 16 C3 87 1D 28 F5 46 05 63 23 54 47>)
(   2,<2019-05-07 12:53:54.01 +0400>,<she>,<DPX200>,
      <Start of raw data processing
       efp BC_mod = 2 LB = 1 FT_mod = 6 PKNL = 1 PHC0 = -1799.554 PHC1 = 61.19899 SI = 64K 
       data hash MD5: 64K
       E1 7E 6A 54 BE A6 14 7E 83 1D D0 AB 2A 75 BA 44>)
(   3,<2019-05-07 12:54:17.60 +0400>,<she>,<DPX200>,
      <pk PHC0 = -26.02408 PHC1 = 13.2 
       data hash MD5: 64K
       4B E9 5D 0F 1A 82 45 D3 72 B1 C8 8A AA F2 66 21>)
(   4,<2019-05-07 12:54:20.68 +0400>,<she>,<DPX200>,
      <abs ABSG = 5 
       data hash MD5: 64K
       88 A7 55 4F E1 33 65 C2 54 ED FE 73 B2 58 ED 8E>)
$$ ##END=
$$ 
$$ hash MD5
$$ 6A 3F 8A 2B 7C B6 A1 3D 2E 39 4A 6E C9 C0 BE D0
##$RELAX= 
##$RELAX= 
##$RELAX= 
##$RELAX= 
##$RELAX= 
##$RELAX= 
##$RELAX= 
##$RELAX= 
$$ Bruker specific parameters
$$ --------------------------
##$DU= <F:/spectra>
##$EXPNO= 1
##$NAME= <P31>
##$PROCNO= 1
##$TYPE= <nmr>
##$USER= <she>
##$AMP= (0..31)
100 100 100 100 100 100 100 100 100 100 100 100 100 100 100 100 100 100 
100 100 100 100 100 100 100 100 100 100 100 100 100 100 
##$AQSEQ= 0
##$AQ_mod= 1
##$AUNM= <au_zg>
##$AUTOPOS= <>
##$BF1= 81.014009
##$BF2= 200.13
##$BF3= 200.13
##$BF4= 200.13
##$BF5= 200.13
##$BF6= 200.13
##$BF7= 200.13
##$BF8= 200.13
##$BYTORDA= 1
##$CFDGTYP= 0
##$CFRGTYP= 5
##$CHEMSTR= <none>
##$CNST= (0..31)
1 1 145 1 1 1 1 1 1 1 1 1 1 1 1 1 1 1 1 1 1 1 1 1 1 1 1 1 1 1 1 1 
##$CPDPRG= <waltz16>
##$CPDPRG1= <>
##$CPDPRG2= <waltz16>
##$CPDPRG3= <>
##$CPDPRG4= <mlev>
##$CPDPRG5= <mlev>
##$CPDPRG6= <mlev>
##$CPDPRG7= <mlev>
##$CPDPRG8= <mlev>
##$CPDPRGB= <>
##$CPDPRGT= <>
##$D= (0..31)
0 1 0 0 0 0 0 0 0 0 0 0.03 2e-05 3e-06 0 0 0 0 0 0 0 0 0 0 0 0 0 0 0 0 
0 0 
##$DATE= 1557219044
##$DBL= (0..7)
120 120 120 11 120 120 24 19 
##$DBP= (0..7)
150 150 150 150 150 150 150 150 
##$DBP07= 0
##$DBPNAM0= <>
##$DBPNAM1= <>
$$ [...]
##$SUBNAM3= <"">
##$SUBNAM4= <"">
##$SUBNAM5= <"">
##$SUBNAM6= <"">
##$SUBNAM7= <"">
##$SUBNAM8= <"">
##$SUBNAM9= <"">
##$SW= 369.568048894756
##$SWIBOX= (0..15)
0 1 3 0 0 0 0 0 0 0 0 0 0 0 0 0 
##$SW_h= 29940.119760479
##$TD= 32768
##$TD0= 1
##$TE= 0
##$TE2= 300
##$TE3= 300
##$TEG= 300
##$TL= (0..7)
0 120 53 12 22 120 120 120 
##$TP= (0..7)
150 150 150 150 150 150 150 150 
##$TP07= 0
##$TPNAME0= <>
##$TPNAME1= <>
##$TPNAME2= <>
##$TPNAME3= <>
##$TPNAME4= <>
##$TPNAME5= <>
##$TPNAME6= <>
##$TPNAME7= <>
##$TPOAL= (0..7)
0.5 0.5 0.5 0.5 0.5 0.5 0.5 0.5 
##$TPOFFS= (0..7)
0 0 0 0 0 0 0 0 
##$TUNHIN= 0
##$TUNHOUT= 0
##$TUNXOUT= 0
##$USERA1= <user>
##$USERA2= <user>
##$USERA3= <user>
##$USERA4= <user>
##$USERA5= <user>
##$V9= 5
##$VALIST= <valist>
##$VCLIST= <CCCCCCCCCCCCCCC>
##$VD= 0
##$VDLIST= <DDDDDDDDDDDDDDD>
##$VPLIST= <PPPPPPPPPPPPPPP>
##$VTLIST= <TTTTTTTTTTTTTTT>
##$WBST= 1024
##$WBSW= 4
##$XGAIN= (0..3)
0 0 0 0 
##$XL= 0
##$YL= 0
##$YMAX_a= 9837
##$YMIN_a= -12385
##$ZGOPTNS= <>
##$ZL1= 120
##$ZL2= 120
##$ZL3= 120
##$ZL4= 120
##$ABSF1= 182.463
##$ABSF2= -187.1042
##$ABSG= 5
##$ABSL= 3
##$ALPHA= 0
##$AQORDER= 0
##$ASSFAC= 0
##$ASSFACI= 0
##$ASSFACX= 0
##$ASSWID= 0
##$AUNMP= <proc_1d>
##$AZFE= 0.1
##$AZFW= 0.5
##$BCFW= 0
##$BC_mod= 2
##$BYTORDP= 0
##$COROFFS= 0
##$CY= -3
##$DATMOD= 1
##$DC= 0
##$DFILT= <>
##$DTYPP= 0
##$F1P= 0
##$F2P= 0
##$FCOR= 1
##$FTSIZE= 65536
##$FT_mod= 6
##$GAMMA= 0
##$GB= 0
##$INTBC= 1
##$INTSCL= 5.30512e-09
##$ISEN= 30
##$LB= 1
##$LEV0= 0
##$LPBIN= 0
##$MAXI= 10000
##$MC2= 0
##$MEAN= 0
##$ME_mod= 0
##$MI= 50
##$NCOEF= 0
##$NC_proc= -8
##$NLEV= 6
##$NOISF1= 182.463
##$NOISF2= 159.3651
##$NSP= 0
##$NTH_PI= 0
##$NZP= 0
##$OFFSET= 182.463
##$PC= 4
##$PHC0= -1825.578
##$PHC1= 74.39899
##$PH_mod= 1
##$PKNL= yes
##$PPARMOD= 0
##$PSCAL= 0
##$PSIGN= 0
##$REVERSE= no
##$SF= 81.0140089999434
##$SI= 65536
##$SIGF1= 159.3651
##$SIGF2= -187.1042
##$SINO= 113.3802
##$SIOLD= 16384
##$SREGLST= <1H.CDCl3>
##$SSB= 0
##$STSI= 65536
##$STSR= 0
##$SW_p= 29940.119760479
##$SYMM= 0
##$S_DEV= 0
##$TDeff= 32768
##$TDoff= 0
##$TI= <>
##$TILT= no
##$TM1= 0
##$TM2= 0
##$TOPLEV= 0
##$USERP1= <user>
##$USERP2= <user>
##$USERP3= <user>
##$USERP4= <user>
##$USERP5= <user>
##$WDW= 1
##$XDIM= 65536
##$YMAX_p= 374502770
##$YMIN_p= -109045533
$$ End of Bruker specific parameters
$$ ---------------------------------
##NTUPLES= NMR SPECTRUM
##VAR_NAME=  FREQUENCY,     SPECTRUM/REAL,   SPECTRUM/IMAG
##SYMBOL=    X,             R,               I
##VAR_TYPE=  INDEPENDENT,   DEPENDENT,       DEPENDENT
##VAR_FORM=  AFFN,          ASDF,            ASDF
##VAR_DIM=   65536,         65536,           65536
##UNITS=     HZ,            ARBITRARY UNITS, ARBITRARY UNITS
##FACTOR=    0.456856943014862, 1,           1
##FIRST=     14782.0589164792, 0,            0
##LAST=      -15158.0608439998, 0,           0
##MIN=       -15158.0608439998, -109045533,  0
##MAX=       14782.0589164792, 374502770,    0
$$ Real data points
##PAGE= N=1
##DATA TABLE= (X++(R..R)), XYDATA
$$ [...]
4069a8198279p302720m314030o008947j426787O657695N889146k202716m812254
$$ -18198279 -25500999 -29815029 -35823976 -37250763 -30593068 -24703922 -26906638 -31718892
4061c1718892r79843p58273k953161M017326J7523532J8943358K045754j5546847
$$ -31718892 -32698735 -33457008 -36410169 -32392843 -14869311 4074047 6119801 -9427046
4053i427046j6525865m448555O465590R052190N029546N12871L445309J4373913
$$ -9427046 -25952911 -30401466 -23935876 -14883686 -9854140 -9341269 -5895960 8477953
4045H477953J8822596L107697k1121386k5927357n054724J6040816J5895784L575074
$$ 8477953 27300549 30408246 9286860 -16640497 -21695221 -5654405 10241379 13816453
4037A3816453k213154j842592n225270q076453O05233J4488566J4848639r95417
$$ 13816453 11603299 9760707 4535437 -3541016 -2935783 11552783 26401422 25406005
4029B5406005j4352420j1427807m6088N578583M799208O418218J1530465J0717174
$$ 25406005 11053585 -374222 -420310 5158273 9957481 16375699 27906164 38623338
4021C8623338j594607j6880884k0722551r537636M976442R536532L998837j283738
$$ 38623338 37028731 20147847 -574704 -10112340 -5135898 4400634 8399471 7115733
4013G115733m60434J421063k247760r296901j0956448k181030J2055881K0012847
$$ 7115733 6655299 8076362 5828602 -3468299 -14424747 -16605777 -4549896 15462951
4005A5462951J3454285l260556j5752690j4320713m547920L60942l985244r068052
$$ 15462951 28917236 25656680 9903990 -4416723 -8964643 -8603701 -12588945 -21656997
3997b1656997n025826P760946J8398760J5137642j703193j5508966r598861Q838385
$$ -21656997 -26682823 -18921877 -523117 14614525 12911332 -2597634 -12196495 -3358110
3989c358110J2612233q670312k9074455k0234475O633734J6802592M407919j455500
$$ -3358110 9254123 583811 -28490644 -48725119 -42091385 -25288793 -20880874 -22336374
3981b2336374J3189554K3290620O602730j8048748j8880041J070826J2251496
$$ -22336374 -9146820 14143800 20746530 2697782 -16182259 -15111433 -2859937
3974b859937M510057l805267k17923N244764K438171k267080r75576R18729m019012
$$ -2859937 1650120 -2155147 -2373070 2871694 5309865 3042785 2067209 2985938 -1033074
3965a033074j0881749j0261876k840315L502822N851508O936135P441162N830489
$$ -1033074 -11914823 -22176699 -25017014 -21514192 -15662684 -8726549 -1285387 4545102
3957D545102L805535M167020L598101m639986j8330296k3388846r574438J3705088
$$ 4545102 8350637 12517657 16115758 11475772 -6854524 -30243370 -39817808 -26112720
3949b6112720K4985363J5836600J380116K72224R667509J0025567n913214k1000741
$$ -26112720 -1127357 14709243 16089359 16361583 26029092 36054659 30141445 9140704
3941I140704j6747219N18067P667265l905556j6867694j1392087Q746685K1386236
$$ 9140704 -7606515 -7088448 578817 -3326739 -20194433 -31586520 -22839835 -1453599
3933a453599J4029425k126263q463091k065869M428389K970889K63730M855749
$$ -1453599 12575826 10449563 1986472 -79397 4348992 7319881 7583611 12439360
3925A2439360J2566336J2260686J834579r598408j3917473j1198667n121763K047721
$$ 12439360 25005696 37266382 39100961 29502553 15585080 4386413 -735350 1312371
3917A312371Q765076J3285814J4331535J0329500N48623r696611j0579603j411321
$$ 1312371 10077447 23363261 37694796 48024296 48572919 38876308 28296705 26885384
3909B6885384L352218p557686k2664208k0497487j83723J6243533J3775482J232932
$$ 26885384 30237602 22679916 15708 -20481779 -20665502 -4421969 9353513 10586445
3901A0586445o022893n133749q82957M495342Q391327O335339J209347K548813
$$ 10586445 4563552 -570197 -1453154 3042188 11433515 17768854 18978201 21527014
3893B1527014R301109O381895j1935949k8355002k4576638n753971R985171J5761512
$$ 21527014 30828123 37210018 25274069 -3080933 -27657571 -33411542 -23426371 -7664859
3885g664859J5411176Q905544m500798j5077375j1868702r9548N261111M06982
$$ -7664859 7746317 16651861 12151063 -2926312 -14795014 -14894562 -9633451 -9226469
3877i226469o058771q783308q712682m456602M799769J1161739P628504K291321
$$ -9226469 -15285240 -24068548 -32781230 -37237832 -32438063 -21276324 -13647820 -11356499
3869a1356499P039013J5670601J1722419l406891j0458377k343670O138352L714924
$$ -11356499 -4317486 11353115 23075534 19668643 9210266 6866596 13004948 16719872
3861A6719872j703505r97321J86348n344206j1190795p928739J021569N413176
$$ 16719872 15016367 14019046 14205394 8861188 -2329607 -10258346 -9236777 -3823601
3853c823601L235484O50610K034911O595124J0338529P952794j416443r077227
$$ -3823601 -588117 62493 2097404 8692528 19031057 26983851 25567408 16490181
3845A6490181n973121K665569L327116m535889q386539o222741j1054437k4002681
$$ 16490181 10517060 13182629 16509745 11973856 3587317 -2635424 -13689861 -37692542
3837c7692542k4094117m87422K3257544J8866339m609935j3079396L242027J8057990
$$ -37692542 -61786659 -62274081 -39016537 -20150198 -24760133 -37839529 -34597502 -16539512
3829a6539512R494567j0002214j4434807K91276J4983359J4448916M213295l44570
$$ -16539512 -7044945 -17047159 -31481966 -31190690 -16207331 -1758415 2454880 2110310
3821B110310N789804J2670050J0213636J990079j587937o00647n130984j5526906
$$ 2110310 7900114 20570164 30783800 32773879 31185942 30585295 25454311 9927405
3813I927405j6484160O94671K1163863K4251256J0304727l646685q907377j0413437
$$ 9927405 -6556755 -5862084 15301779 39553035 49857762 46211077 37303700 26890263
3805B6890263j0772777o347406J4963j319312j0510504j5645825j0754964l219300
$$ 26890263 16117486 9770080 9785043 8465731 -2044773 -17690598 -28445562 -31664862
3797c1664862J355483P267781J4939749J4151673J754669p631962k717869M394406
$$ -31664862 -30309379 -23041598 -8101849 6049824 7804493 172531 -2545338 1849068
3789A849068l263568j7787069j6646480Q04204J0929384L322080l386579N741696
$$ 1849068 -1414500 -19201569 -35848049 -35043845 -24114461 -20792381 -24178960 -18437264
3781a8437264J5287400M703962j5231787j5751696O499059K4323782J9244969
$$ -18437264 -3149864 1554098 -13677689 -29429385 -22930326 1393456 20638425
3774B0638425L022336n904821o283037m082871K194405J1446878J0666170o531784
$$ 20638425 23660761 17755940 11472903 7390032 9584437 21031315 31697485 25165701
3766B5165701k3335534k0300230l815386N297918L998855N537971J0762861O858839
$$ 25165701 1830167 -18470063 -22285449 -16987531 -12988676 -7450705 3312156 10170995
3758A0170995m641387n652094O269456R799065m634154j6074164o573856Q270990
$$ 10170995 5529608 -122486 6146970 15946035 11311881 -4762283 -11336139 -3065149
3750c065149L950573j4282605k1422007j0713645K120216O353633N565538K879079
$$ -3065149 885424 -13397181 -34819188 -45532833 -43412617 -37058984 -31493446 -28614367
3742b8614367k343959m649430J630094Q100074K722555p202043l318646J2303500
$$ -28614367 -30958326 -35607756 -33977662 -25877588 -23155033 -30357076 -33675722 -21372222
3734b1372222J6915395K830427r455512l255555R554000Q937200m111287j3372461
$$ -21372222 -4456827 -1626400 -11081912 -14337467 -4783467 4153733 42446 -13330015
3726a3330015j1097562k432210N617595Q315170L182340m967870n898275J866225
$$ -13330015 -24427577 -26859787 -21242192 -12927022 -9744682 -14712552 -20610827 -18744602
3718a8744602P304015M262252J452481O046391R657757L299885n071899l628736
$$ -18744602 -11440587 -7178335 -5725854 320537 9978294 13278179 8206280 4577544
3710D577544J952706j789038j1246305j0416318J750007Q652673K572498m757585
$$ 4577544 6530250 4741212 -6505093 -16921411 -15171404 -6518731 -3946233 -8703818
3702h703818l007371K379658M086393N750572J0774348J1398605J592732q849604
$$ -8703818 -11711189 -9331531 -5245138 505434 11279782 22678387 24271119 15421515
3694A5421515p194798J414560R84281r813747j4603403m513921P583365N932152
$$ 15421515 8226717 9641277 10625558 811811 -13791592 -18305513 -10722148 -4789996
3686d789996n119738q403511O91169R094881P082059J788700L305663P478182
$$ -4789996 -9909734 -18313245 -17622076 -8527195 -1445136 343564 3649227 11127409
3678A1127409L883636m816555n809255J962732L977785o632832j5965403r410064
$$ 11127409 15011045 10194490 4385235 6347967 10325752 3692920 -12272483 -21682547
3670b1682547O105859J2934743Q026048K364183k03760o124940j3954601j1053370
$$ -21682547 -15576688 -2641945 5384103 7748286 7544526 1419586 -12535015 -23588385
3662b3588385N379628J8891719J4885895J95611q496770o967560l273141k201758
$$ -23588385 -18208757 682962 15568857 15764468 7267698 300138 -2973003 -5174761
3654e174761j952472k187102l451776p58932J0226822K0904028J6244232l429498
$$ -5174761 -7127233 -9314335 -12766111 -13525043 -3298221 17605807 33850039 30420541
3646C0420541j8800667j5747374l577032n82131q584445j3282040p299674r00
$$ 30420541 11619874 -4127500 -7704532 -8286663 -16871108 -30153148 -37452822 -37453722
3638c7453722m55386j441029R319345K6393230K8163077N243902k2542376k7079519
$$ -37453722 -37909108 -39350137 -30030792 -3637562 24525515 29769417 7227041 -19852478
3630a9852478n311316J8802249K4200577J2817240j669945j1206458j2512300
$$ -19852478 -25163794 -6361545 17839032 30656272 28986327 17779869 5267569
3623E267569k466051J2789900J4540898n552183k5412938j5909140J6543694L3023211
$$ 5267569 2801518 15591418 30132316 24580133 -832805 -16741945 -198251 32824960
3615C2824960J3398655j7174793k4723103r614481M204608O986185P233213P420643
$$ 32824960 46223615 29048822 4325719 -5288762 -1084154 5902031 13135244 20555887
3607B0555887Q57954r222271j0705183m635524m695588j0809197n598702J4663608
$$ 20555887 21413841 12191570 1486387 -3149137 -7844725 -18653922 -24252624 -9589016
3599i589016K7450797J5762223o033147j4509645r630629n980030m889925J902206
$$ -9589016 17861781 33624004 27590857 13081212 3450583 -2529447 -7419372 -5517166
3591e517166R176663L854403q545683p719019Q018128J5186549J94232j8805686
$$ -5517166 3659497 7513900 -1031783 -8750802 -732674 14453875 14648107 -4157579
3583d157579j7134298M057350K3440084K6618714J5388116j350920j3676617j3847955
$$ -4157579 -21291877 -17234527 6205557 32824271 48212387 46861467 33184850 19336895
3575A9336895m497127J064847m244442j0122829m358240P723668J2073605Q246330
$$ 19336895 14839768 15904615 11660173 1537344 -2820896 4902772 16976377 25222707
3567B5222707O881617P562506j779969j9798393k5209940o622869J5455762J2822738
$$ 25222707 32104324 39666830 37886861 18088468 -7121472 -13744341 1711421 14534159
3559A4534159j1253857k4755838q912116J8734901K9424519J8347650L468889
$$ 14534159 3280302 -21475536 -30387652 -11652751 17771768 36119418 39588307
3552C9588307k785010n415651j0626488j2737066n154143N119403N144923n080102
$$ 39588307 36803297 31387646 20761158 8024092 2869949 7989352 13134275 8054173
3544H054173j1658995n197510P760914J3754450P324232m851293j0749110l650696
$$ 8054173 -3604822 -8802332 -1041418 12713032 20037264 15185971 4436861 786165
3536G86165R989906J4569060K543465j4501016j9320848j1112501l762703l213719
$$ 786165 10776071 25345131 27888596 13387580 -5933268 -17045769 -20808472 -24022191
3528b4022191l83123J0473216K0773587K1457050J4657208M093487j1771989k6710268
$$ -24022191 -24405314 -13932098 6841489 28298539 42955747 47049234 35277245 8566977
3520H566977k2951600L000579K4200268J4433515j2842738k0644954m9532J9829263
$$ 8566977 -14384623 -11384044 12816224 27249739 14407001 -6237953 -6287485 13541778
3512A3541778J5825528n22820p086498k228675J870737Q22610j961659n803860
$$ 13541778 29367306 28844486 21757988 19529313 21400050 22222660 20261001 14457141
3504A4457141r746635p321684L700788J3343532J2041636M901547L339728Q609142
$$ 14457141 4710506 -2611178 1089610 14433142 26474778 31376325 34716053 43325195
3496D3325195J3248662J2746554O352548o722246k1384900k4333716j0439065
$$ 43325195 56573857 69320411 75672959 68950713 47565813 23232097 12793032
3489A2793032M672522K934038r631718j0992455L916545J6198065J1981985J072443
$$ 12793032 17465554 20399592 10767874 -224581 3691964 19890029 31872014 32944457
3481C2944457j421018K200079q944q176848j0816139l894521K555194n62030q420228
$$ 32944457 31523439 33723518 33714574 25537726 14721587 10827066 13382260 12820230 4400002
3472D400002r960289m116295q31471n337484q985119j568504J2201806J7893140
$$ 4400002 -5560287 -9676582 -10508053 -15845537 -24830656 -26399160 -14197354 3695786
3464C695786J1473379K962613j555859q072969j8467496k0221296m727363J4786029
$$ 3695786 15169165 18131778 16575919 8502950 -9964546 -30185842 -34913205 -20127176
3456b0127176J9067843R286902J081254j893367q541111j6841709j2835476K823106
$$ -20127176 -1059333 8227569 9308823 7415456 -1125655 -17967364 -30802840 -27979734
3448b7979734R886682j08780p886698L405100J9057521J3379649j1141995k6299040
$$ -27979734 -18093052 -18201832 -26088530 -22683430 -3625909 9753740 -1388255 -27687295
3440b7687295j6167593N919539J8726093J5594842K966093r912178j4835629q421395
$$ -27687295 -43854888 -37935349 -19209256 -3614414 -648321 -10560499 -25396128 -33817523
3432c3817523K684246P513501N007614N186961J2940019J9003335J2766758k549031
$$ -33817523 -31133277 -23619776 -18612162 -13425201 -485182 18518153 31284911 28735880
3424B8735880j4278011j5329942q240937J890771J0615265J2279023M075317o611288
$$ 28735880 14457869 -872073 -9113010 -7222239 3393026 15672049 19747366 13136078
3416A3136078p198379L692399J1775397N151926q950156j4153455p888465k866259
$$ 13136078 5937699 9630098 21405495 26557421 17607265 3453810 -4434655 -7300914
3408g300914n579068o687502J494416J0099690O912727l804849p355776P9722
$$ -7300914 -12879982 -19567484 -18073068 -7973378 -1060651 -4865500 -12221276 -12141554
3400a2141554Q836147J1868568J0421532M604888p601289k0129628k1358146j1020645
$$ -12141554 -3305407 8563161 18984693 23589581 15988292 -4141336 -25499482 -36520127
3392c6520127k321679k535901l830546Q73525N772653M054571K66428J269086
$$ -36520127 -38841806 -41377707 -45208253 -44334728 -38562075 -34507504 -34241076 -32971990
3384c2971990M738607N949530O233680N588434j777387j3564503j3715801M617682
$$ -32971990 -28233383 -22283853 -16050173 -10461739 -12239126 -25803629 -39519430 -34901748
3376c4901748K2180346J7941989O75432m993064L160069N507825l381198o895946
$$ -34901748 -12721402 5220587 5896019 902955 4063024 9570849 6189651 -706295
3368g06295J417716N285179l928989r226478L005204J6609191R763124r079138
$$ -706295 711421 5996600 2067611 -7158867 -4153663 12455528 22218652 13139514
3360A3139514j3642510n32662P806288M85101n998443K709355J3721329O873516
$$ 13139514 -502996 -1035658 6770630 7255731 1257288 3966643 17687972 24561488
3352B4561488j2104264j7607487j542501J3491144N667181j4899114k0320301
$$ 24561488 12457224 -5150263 -6692764 6798380 12465561 -2433553 -22753854
3345b2753854l787444J3047860J2813179M910978O519888J5810705J8222051R639048
$$ -22753854 -26541298 -13493438 -680259 4230719 10750607 26561312 44783363 54422411
3337E4422411k356112j3590118k3221224k3957291j0848781L353083K008841p250815
$$ 54422411 52066299 38476181 15254957 -8702334 -19551115 -16198032 -14189191 -21440006
3329b1440006j127385K0269239K8930815J2035519o920460n454796L675173k656813
$$ -21440006 -22567391 -2298152 26632663 38668182 31747722 26292926 29968099 27311286
3321B7311286j8388134k0197735o428305L865225M507220P477901J5613770J5969618
$$ 27311286 8923152 -11274583 -17702888 -13837663 -9330443 -1852542 13761228 29730846
3313B9730846M623491m385193k387199J79791p396944j8159457j8457847o805209
$$ 29730846 34354337 29969144 27581945 27761736 20364792 2205335 -16252512 -23057721
3305b3057721O775181J3270313J0657504L128324j988243j411663n49221m936371
$$ -23057721 -16282540 -3012227 7645277 10773601 8785358 7373695 6824474 1888103
3297A888103r160882l774890Q379794J4374700R559672J623559l807081q201665
$$ 1888103 -7272779 -11047669 -2667875 11706825 21266497 22890056 19082975 10881310
3289A0881310r928161m123750M600462N127375n79977K054861J4389468J8069584
$$ 10881310 953149 -3170601 1429861 6557236 5977259 8032120 22421588 40491172
3281D0491172L956352j1375248j1596769n377899q079286j4525710j0814707p51326
$$ 40491172 44447524 33072276 21475507 16097608 8018322 -6507388 -17322095 -18073421
3273a8073421K837282M084161J5710033K9589162K3548270j013766j5575098n849078
$$ -18073421 -15236139 -11151978 4558055 34147217 57695487 56681721 41106623 35257545
3265C5257545P941859L807765j0633999j5272488q685100l555893k773598M15736
$$ 35257545 43199404 47007169 36373170 21100682 12415582 8859689 6086091 6501827
3257F501827M794324J983427p013526j1205963n842008K538706P287966P706272
$$ 6501827 11296151 13279578 6266052 -4939911 -10781919 -8243213 -955247 6751025
3249F751025M700564L45624M46365O955984R616065k135749j9506758k1659144
$$ 6751025 11451589 11797213 12243578 19199562 28815627 26679878 7173120 -14486024
3241a4486024n248514R341571P467561k44106J571285P855179M256388o961662
$$ -14486024 -19734538 -10392967 -2925406 -3169512 -1598227 6256952 10513340 3551678
3233C551678j0605483l315908L330979L315487K751191M603053L184258k182878
$$ 3551678 -7053805 -10369713 -7038734 -3723247 -972056 3630997 6815255 4632377
3225D632377l226475J811962L018405l653725p531497j305525N053974L32265
$$ 4632377 1405902 3217864 6236269 2582544 -4948953 -6254478 -1200504 -868239
3217h68239r259463j1149896o604951m474271k736276N671017J3478159N983974
$$ -868239 -10127702 -21277598 -27882549 -32356820 -35093096 -29422079 -15943920 -9959946
3209i959946j2356004j8545889l766288J2464945J0129426m130808r941962k491612
$$ -9959946 -22315950 -40861839 -44628127 -32163182 -22033756 -26164564 -36106526 -38598138
3201c8598138N341460M730393R61892J721859N704926O294549J260925m668088
$$ -38598138 -33256678 -28526285 -27564393 -25842534 -20137608 -13843059 -12582134 -17250222
3193a7250222n679474j726523J634623R43381j61175K936765P319152O321216
$$ -17250222 -22929696 -24656219 -23021596 -22078215 -22239390 -19302625 -11983473 -5662257
3185e662257P09919j638973J849333M307640K81364o571752r945762q332050k716079
$$ -5662257 -4952338 -6591311 -4741978 -434338 -152974 -6724726 -16670488 -25002538 -27718617
3176b7718617N990953J3052737J0707472j554885j3438388j5845436j0771275
$$ -27718617 -21727664 -8674927 2032545 477660 -12960728 -28806164 -39577439
3169c9577439m473211K085781R299444J2422074Q018375K188683L030689P971223
$$ -39577439 -44050650 -41964869 -32665425 -20243351 -12224976 -10036293 -7005604 965619
3161I65619P792082J180201m411140n927692q485806j3478279j2457785L86899
$$ 965619 8757701 9937902 5526762 -400930 -8886736 -22365015 -34822800 -34435901
3153c4435901J5116635J4429625l968646k0606298j5632006O381413K1589204
$$ -34435901 -19319266 -4889641 -8858287 -29464585 -45096591 -38715178 -17125974
3146a7125974J7424143O802880N491418P730329r29740j5198111j5645955j424248
$$ -17125974 298169 7101049 12592467 20322796 19393056 4194945 -11451010 -12875258
3138a2875258N678579m701570j5731321j1928415k009940J609172N719388J8466402
$$ -12875258 -7196679 -11898249 -27629570 -39557985 -41567925 -39958753 -34239365 -15772963
3130a5772963K6070752J2764016q032902j0291134L632047P529836n024951j1573231
$$ -15772963 10297789 23061805 15028903 4737769 8369816 15899652 10874701 -698530
3122f98530J71371J2550265P872497n723447j1965153j0712232r803037q233049
$$ -698530 -527159 12023106 19895603 14172156 2207003 -8505229 -18308266 -26541315
3114b6541315k477333K580329K877242M662295J1686812J3504311J321820j3034976
$$ -26541315 -29018648 -26438319 -23561077 -18898782 -7211970 6292341 7614161 -5420815
3106e420815j0474291P264754J8386594R729509p869021j5285247p428541M018133
$$ -5420815 -15895106 -8630352 9756242 19485751 11616730 -3668517 -11097058 -7078925
3098g078925O342305P55822p62389N550706O490517q315628k3996887j6120279
$$ -7078925 -736620 19202 -743187 4807519 11298036 2982408 -21014479 -37134758
3090c7134758J0627737K2147060K638522k0016887j4164959R591366J6885762
$$ -37134758 -26507021 -4359961 -1721439 -21738326 -35903285 -26311919 -9426157
3083i426157J387438j0788448m240075P306533R506793Q112046J1275533J2397441
$$ -9426157 -8038719 -18827167 -23067242 -15760709 -6253916 1858130 13133663 25531104
3075B5531104M212684n441317o227525k703411n200419j1043843q867611J909448
$$ 25531104 29743788 24302471 18074946 15371535 10171116 -872727 -9740338 -7830890
3067g830890Q469628J982503j0943087j6215840p420328P880125J5440425R006681
$$ -7830890 638738 2621241 -8321846 -24537686 -31958014 -24077889 -8637464 369217
3059C69217k188141m053235M489677J0645878O119094k124059l969869l82665
$$ 369217 -1818924 -5872159 -1382482 9263396 15382490 13258431 9288562 8905897
3051H905897K256716M647878J0525175J4527152P015875q935058j7732060j2039937
$$ 8905897 11162613 15810491 26335666 40862818 47878693 38943635 21211575 9171638
3043I171638k673930j749172n369779k239811P103952J1400701O908717K539306
$$ 9171638 6497708 4748536 -621243 -2861054 4242898 15643599 22552316 25091622
3035B5091622M491139O285836j56017j1295682j7208896j4837902q282983K04756
$$ 25091622 29582761 35868597 35712580 24416898 7208002 -7629900 -15912883 -15708127
3027a5708127J0432992J7177891J2920949m45987j0806309r877782j779557M893101
$$ -15708127 -5275135 11902756 24823705 24377718 13571409 3693627 1914070 6807171
3019F807171O527712K682584p248309j9244147k2696853j1377280O530111J6369849
$$ 6807171 13334883 16017467 8769158 -10474989 -33171842 -44549122 -38019011 -21649162
3011b1649162J3379733N407313J295400K887543P549475J1971784J2435381O351531
$$ -21649162 -8269429 -2862116 -1566716 1320827 8870302 20842086 33277467 39628998
3003C9628998m431351j4143501j7404091j2104443l44075J1002753J3727748O469314
$$ 39628998 35197647 21054146 3650055 -8454388 -8798463 2204290 15932038 22401352
2995B2401352k743577o201551o042239q949637j4072370j3397751l999113O694571
$$ 22401352 19657775 13456224 7413985 -1535652 -15608022 -29005773 -33004886 -26310315
2987b6310315R585025L604418m345006o050424J175423J1130603J3328277M617130
$$ -26310315 -16725290 -13120872 -17465878 -23516302 -22340879 -11210276 2118001 6735131
2979F735131n669245o744245j72517L577099N60428k652744p85191K552339J928305
$$ 6735131 1065886 -5678359 -5850876 -2273777 -1713349 -4366093 -5151284 -2598945 -670640
2970f70640j727292l918576l328865k317834l059006n043739n103388p02295M744979
$$ -670640 -2397932 -6316508 -9645373 -11963207 -15022213 -20065952 -25169340 -25871635 -21126656
2961b1126656L378399n222393q253876M720805K2985898K4428744N774561j0900454
$$ -21126656 -17748257 -22970650 -31224526 -26503721 -3517823 20910921 26685482 15785028
2953A5785028q193793L300261K855333r308377j4188389l393789R503310R626816
$$ 15785028 7591235 10891496 13746829 4438452 -9749937 -13143726 -3640416 5986400
2945E986400J35688n628300k914044J942471L829552M850292P254868P421638
$$ 5986400 6122088 493788 -2420256 -477785 3351767 8202059 15456927 22878565
2937B2878565J309995p654621j1831294r814598p722419q689071p541047m5772
$$ 22878565 24188560 16533939 4702645 -5111953 -12834372 -21523443 -29064490 -29110262
2929b9110262Q546280J0897813Q975529R673567J2186911R816184L319612J242382
$$ -29110262 -20563982 -9666169 -690640 8982927 21169838 30986022 34305634 35548016
2921C5548016N252684O256557q23047q558117q966748n080724m042914o282090
$$ 35548016 40800700 47057257 46234210 37676093 28709345 23628621 19585707 13303617
2913A3303617q243061q964129p502059j091333P282740P490560l294175j2824730
$$ 13303617 5060556 -3903573 -11405632 -12496965 -5214225 2276335 -1017840 -13842570
2905a3842570j0162915j623937J377895K001844R773979J8662038J2803778o122587
$$ -13842570 -24005485 -25629422 -24251527 -22249683 -12475704 6186334 18990112 12867525
2897A2867525j6675071p562276P084276R706219J951890l917696l876870j745444
$$ 12867525 -3807546 -11369822 -4285546 5420673 7372563 3454867 -422003 -2167447
2889b167447M85337J560683j869948p549745n472764O334038J2928074K174851
$$ -2167447 -1682110 -121427 -1991375 -9541120 -15013884 -8679846 4248228 6423079
2881F423079j4802961j8533302j0208137o878458j0565161m659122J4705707K6122418
$$ 6423079 -8379882 -26913184 -37121321 -43999779 -54564940 -59224062 -44518355 -18395937
2873a8395937J3612508p805112j3038717p53869J0934262J3137797J1126154O038562
$$ -18395937 -4783429 -12588541 -25627258 -26381127 -15446865 -2309068 8817086 14855648
2865A4855648o650116j9717510j6422590L387311J7498709J1289290k193788m195919
$$ 14855648 8205532 -11511978 -27934568 -24547257 -7048548 4240742 2046954 -2148965
2857b148965J899227Q72072o716678o838513K684910R089097P269347O615772
$$ -2148965 -249738 622334 -6094344 -12932857 -10247947 -1158850 6110497 12726269
2849A2726269J1020154R921767k004631j1464727n259556Q547923J2005172K673322
$$ 12726269 23746423 33668190 31663559 20198832 14939276 23487199 35492371 38165693
2841C8165693o447516q089897p047602o167498r47045Q100413J0420327J78718
$$ 38165693 31718177 23628280 16580678 10413180 9466135 17566548 27986875 28165593
2833B8165593j2592492j3949527l865401N645785O605412J508287m065752o943242
$$ 28165593 15573101 1623574 -2241827 3403958 10009370 11517657 7451905 508663
2825E08663m679692L114553R798174O305014n228874j0599686k938627N073870
$$ 508663 -4171029 -1056476 8741698 15046712 9817838 -781848 -3720475 1353395
2817A353395q16025j2524242r698522P221152J3522026k757950j9077733r613052
$$ 1353395 537370 -11986872 -21685394 -14464242 -942216 -3700166 -22777899 -32390951
2809c2390951J5355786K3068473N342590j1970641q551312M501315P660492K352794
$$ -32390951 -17035165 6033308 11375898 -594743 -9146055 -4644740 3015752 5368546
2801E368546K036944O789336M594592p086301j6349925j3159128r9437J3117172
$$ 5368546 7405490 14194826 18789418 11703117 -4646808 -17805936 -17905373 -4788201
2793d788201J7917163J0576777m556301j5683581j3986858l705799L120838J267151
$$ -4788201 13128962 23705739 19149438 3465857 -10521001 -14226800 -11105962 -9838811
2785i838811l024812j163936Q216483J8059706J8500509N890091j1216720j8609110
$$ -9838811 -12863623 -14027559 -5811076 12248630 30749139 36639230 25422510 6813400
2777F813400j1959458j571112J387883k477069o056619o545530m656781K92210
$$ 6813400 -5146058 -6717170 -5329287 -7806356 -13862975 -20408505 -25065286 -24773076
2769b4773076O883509R019692M567649O02632K179067L146580k429590p922867
$$ -24773076 -17889567 -8869875 -4302226 -3699594 -1520527 1626053 -803537 -8726404
2761h726404n174843L21672j07551n04671Q732399J7947746Q805838j3208307
$$ -8726404 -13901247 -13579575 -13687126 -14191797 -5459398 12488348 21294186 8085879
2753H085879k1071727n753944R776483N479225p970129r776611J56950P052019
$$ 8085879 -12985848 -18739792 -8963309 -3484084 -11454213 -21230824 -21073874 -14021855
2745a4021855N062561l64331m264069k685477Q800913K3632700K2232327j941827
$$ -14021855 -8959294 -9323625 -13587694 -16273171 -7472258 16160442 38392769 36450942
2737C6450942k3964104j5462264J4167206K6774041O171547k1730822k5741194
$$ 36450942 12486838 -2975426 11191780 37965821 44137368 22406546 -3334648
2730c334648p630967P781652P375502r6913k678920p5197J410579l92021k607316
$$ -3334648 -10965615 -3183963 4191539 4094626 1415706 1340509 2751088 2359067 -248249
2721b48249l511607m650540o104218l578380N513163J4391860J1777237k996460
$$ -248249 -3759856 -8410396 -14514614 -18092994 -12579831 1812029 13589266 10592806
2713A0592806j5395387j1547733M500736J5109744R404301n716897j4946842j0809018
$$ 10592806 -4802581 -16350314 -11849578 3260166 12664467 6947570 -7999272 -18808290
2705a8808290P69355Q780807Q768803N059151K347441l98561m426763m919910
$$ -18808290 -18038935 -9258128 -489325 4569826 6917267 6518706 2091943 -2827967
2697b827967J838166Q214283L051106j0382985j6360864r077384k97495K60461
$$ -2827967 -989801 7224482 10275588 -107397 -16468261 -25545645 -25843140 -25582679
2689b5582679j235644L295859Q724008O956215K125705K774807O659694O121884
$$ -25582679 -26818323 -23522464 -14798456 -7842241 -5716536 -2941729 3717965 9839849
2681I839849K123684K76717j055425n493316p236351M98907R971756P465773m748386
$$ 9839849 11963533 12240250 11184825 5691509 -1544842 -1045935 8925821 16391594 11643208
2672A1643208j0382924k720491Q355978J3458629J3423530J0043979J105809j0991687
$$ 11643208 1260284 -1460207 6895771 20354400 33777930 43821909 44927718 33936031
2664C3936031j6892971j1462057N6003Q870257R250721n1877j2880217j7170092
$$ 33936031 17043060 5581003 5637006 14507263 23757984 23706107 10825890 -6344202
2656f344202q733896Q49456Q07020j375163N940116J4416214O578019j2650903
$$ -6344202 -15078098 -14228642 -13421622 -14796785 -8856669 5559545 12137564 -513339
2648e13339j8880464m303644J2219690J5404830J1386889R126659O172617J269175
$$ -513339 -19393803 -23697447 -11477757 3927073 15313962 24440621 30613238 31882413
2640C1882413K68986R26528p254354j9763777j6978770K668145J4887790P874408
$$ 31882413 32151399 33077927 25823573 6059796 -10918974 -8250829 6636961 14511369
2632A4511369R25503P534522R489513p570444k0982026n962854J8862197J8145936
$$ 14511369 15436872 22971394 32460907 24890463 3908437 -2054417 16807780 34953716
2624C4953716l752056j2522331p20945N681436m836160j4002382r906924l187697
$$ 34953716 31201660 18679329 17958384 23639820 18803660 4801278 -5105646 -8293343
2616h293343n76962N227118J1257782J468124k0892878k7973405q230167J4301016
$$ -8293343 -8870305 -3643187 7614595 9082719 -11810159 -39783564 -48013731 -33712715
2608c3712715J6763342Q198548O393032P740048J111623o954555l202499Q569468
$$ -33712715 -16949373 -8750825 -2357793 5382255 6493878 -460677 -3663176 4906292
2600D906292J3802320Q257017j875748j1738428j7619175j5176808p906750n336215
$$ 4906292 18708612 26965629 25089881 13351453 -4267722 -19444530 -27351280 -32687495
2592c2687495m760869P801066K7898082K6564207p119873l8748511l0451185N329072
$$ -32687495 -37448364 -29647298 -1749216 24814991 17695118 -21053393 -51504578 -46175506
2584d6175506K4091564J2120737j478368N637500J9484537J7912992K755557r423794
$$ -46175506 -22083942 -9963205 -11441573 -5804073 13680464 31593456 34349013 24925219
2576B4925219j1692550q751531n102918k016574n25021n18542l28001j3662j432514
$$ 24925219 13232669 4481138 -621780 -2638354 -3163375 -3681917 -4009918 -4023580 -5456094
2567e456094m622671p937712j0156120q522578Q94690J5116441K2535112J7315512
$$ -5456094 -10078765 -18016477 -28172597 -36695175 -35800485 -20684044 1851068 19166580
2559A9166580R039205Q242051R667169K543064r393634j3807196j0605583r224372
$$ 19166580 28205785 36447836 46115005 48658069 39264435 25457239 14851656 5627284
2551E627284q306160J713136J5303925J2853110q999530k7399071k3064445m125521
$$ 5627284 -2678876 -965740 14338185 27191295 18191765 -9207306 -32271751 -36397272
2543c6397272R918187J3506692J2363851Q207434O35093l893477P67818Q679669
$$ -36397272 -26479085 -12972393 -608542 7598892 8233985 4340508 5108326 13787995
2535A3787995R314780L556967O89378J701507j558299r249229q771129N501523
$$ 13787995 23102775 26659742 27349120 29050627 27492328 18243099 9471970 14973493
2527A4973493J7764109R440459j0810116j2910827J2110742L2795418J8915862
$$ 14973493 32737602 42178061 31367945 18457118 30567860 63363278 82279140
2520H2279140r908239p850788K4643714L0117017k4423497q8856604q9184792
$$ 82279140 72370901 64520113 89163827 119280844 94857347 6000743 -83184049
2513h3184049k5861484K9928909L1850915N624357n281351K268907P174142M562957
$$ -83184049 -109045533 -79116624 -47265709 -41641352 -46922703 -44653796 -37479654 -32916697
2505c2916697L018504K113380k388849m151185K949555J0625014R030110K775971
$$ -32916697 -29898193 -27784813 -30173662 -34324847 -31375292 -20750278 -11720168 -8944197
2497h944197K03142o62391k141923J999016J0592548P202451j3315293k7349428
$$ -8944197 -8741055 -9403446 -11545369 -9546353 1046195 8248646 -5066647 -32416075
2489c2416075j4164473R935889J4711920Q65925o819018k281290k276577j0478988
$$ -32416075 -46580548 -36644659 -21932739 -21066814 -27885832 -30167122 -32443699 -42922687
2481d2922687r888880M612946J5090928J0471802L017496M512800P227933P40344
$$ -42922687 -52811567 -48198621 -33107693 -22635891 -19618395 -15105595 -7877662 -7137318
2473g137318r246175j1132101m142011M444034Q468125L893093p623316j2511872
$$ -7137318 -16383493 -27515594 -31657605 -27213571 -18745446 -14852353 -22475669 -34987541
2465c4987541K595574K7306305L2196703N634811k8373938l8701117k1124306
$$ -34987541 -32391967 -5085662 27111041 32745852 4371914 -34329203 -55453509
2458e5453509N068403K1865885K3271392J2064479k395924r757553r969292j1940953
$$ -55453509 -50385106 -28519221 -5247829 6816650 4420726 -5336827 -15306119 -27247072
2450b7247072j6369839j1933605L797978J3477154K905752j5546038j7554333
$$ -27247072 -43616911 -55550516 -51752538 -38275384 -35369632 -50915670 -68470003
2443f8470003Q20093J9456255K0468259O501397o774497p517242L331814J4111460
$$ -68470003 -67649910 -48193655 -27725396 -21223999 -27998496 -35515738 -32183924 -18072464
2435a8072464J3586955K971411n417305l090629N504310J0320731O379082m098104
$$ -18072464 -4485509 -1514098 -6931403 -10022032 -4517722 5803009 12182091 8083987
2427H083987j3300379j1341010K731189J3822616P100554q591780j0237204M337819
$$ 8083987 -5216392 -16557402 -13826213 -3597 7096957 -1494823 -11732027 -7394208
2419g394208J2372091M136841m42869J1422608J8032374j400013k4974501j6609214
$$ -7394208 4977883 9114724 8671855 20094463 38126837 36726824 11752323 -4856891
2411d856891J4673808K2941562o377617l4176079k5139665M875546J8560847R682413
$$ -4856891 9816917 32758479 26380862 -7795217 -32934882 -28059336 -9498489 183924
2403A83924R44300L966950P818715L845392m33896L158045Q534854L801711j1432961
$$ 183924 1128224 5095174 12913889 16759281 16325385 19483430 28018284 31819995 20387034
2394B0387034k3525993j9572650k682667R994252O829127l427571k820512J0511586
$$ 20387034 -3138959 -22711609 -25394276 -15400024 -8570897 -11998468 -14818980 -4307394
2386d307394J8209889P365499r405950r735804P635915K0458795J2854531l888020
$$ -4307394 13902495 21267994 11862044 2126240 9762155 30220950 43075481 39187461
2378C9187461p685502M314396J3050193M131162j3814475k2110428j4981503j789278
$$ 39187461 31501959 35816355 48866548 52997710 39183235 17072807 2091304 302026
2370C02026P669634J0252488N624347l233403p112716k95352P138345M97350j5068161
$$ 302026 7971660 18224148 23848495 20615092 13502376 13207024 20345369 20842719 5774558
2361E774558j8118385l339429Q650009L260194o021348k539397N098145K55045
$$ 5774558 -12343827 -15683256 -7033247 -3773053 -9794401 -12333798 -7235653 -6980608
2353f980608j0983066j1109231k763752j745331n052252L986127J9900131J6622022
$$ -6980608 -17963674 -29072905 -31836657 -33581988 -38634240 -34648113 -14747982 1874040
2345A874040q888804k5260340j1717136J2280192J8934442J0088053L070876j331440
$$ 1874040 -7014764 -32275104 -43992240 -31712048 -12777606 -2689553 381323 -950117
2337i50117j1769523k0319939j0523908J2778269K5050264J4849079l070702j0437866
$$ -950117 -12719640 -33039579 -43563487 -30785218 -5734954 9114125 6043423 -4394443
2329d394443o417766j086465O09321J436712L949387N679288K352601m801930
$$ -4394443 -10812209 -11898674 -11289353 -9852641 -5903254 -223966 2128635 -2673295
2321b673295o950964K447381J5960734J8130659N375918q541142j0562423k631034
$$ -2673295 -9624259 -7176878 8783856 26914515 32290433 23749291 13186868 10555834
2313A0555834O516381J3013772J4649375P492442m981952j0223750m704113k583697
$$ 10555834 17072215 30085987 44735362 52227804 47245852 37022102 32317989 29734292
2305B9734292j3470962k3015214j2798104R380414J9361614J1825306L974232
$$ 29734292 16263330 -6751884 -19549988 -10169574 9192040 21017346 24991578
2298B4991578M875133L755679o070782j2379713l969525R488988J0291381l119754
$$ 24991578 29866711 33622390 27551608 15171895 11202370 20691358 30982739 27862985
2290B7862985j5633420j4745060k890793P005987M437835p830801j5151612p226227
$$ 27862985 12229565 -2515495 -5406288 1599699 6037534 -1793267 -16944879 -24171106
2282b4171106Q401832J5501719R862096J942972J10158K156221L960849M847852
$$ -24171106 -15769274 -267555 9594541 11537513 11647671 13803892 17764741 22612593
2274B2612593K391946o196212j4774308j2720809k046112L204892j285818m114390
$$ 22612593 25004539 18808327 4034019 -8686790 -10732902 -7528010 -8813828 -12928218
2266a2928218J17412P13929p100696q522327O137761J9334918J0528663r312342
$$ -12928218 -12810806 -12096877 -19197573 -27719900 -21582139 -2247221 8281442 -1030900
2258a030900j2845290N22212M815819q866185j7901941n736669J2362269J6093697
$$ -1030900 -13876190 -13353978 -8538159 -17404344 -35306285 -41042954 -28680685 -12586988
2250a2586988J0886807J2025472J4504851K867271j7691180k5087578j3822876
$$ -12586988 -1700181 10325291 24830142 27697413 10006233 -15081345 -28904221
2243b8904221j864586q07683m15864Q956740J7583750J3408357L502608J980609
$$ -28904221 -30768807 -31576490 -31992354 -23035614 -5451864 7956493 11459101 13439710
2235A3439710N892970J496027j0014531j2599556k245404N335263L50753n012487
$$ 13439710 19332680 20828707 10814176 -1785380 -4030784 1304479 1655232 -3357255
2227c357255K170140J2431719Q625853m957633p739465M885702J4057112O411485
$$ -3357255 -1187115 11244604 19870457 14912824 7173359 12059061 26116173 32527658
2219C2527658p101060j0502078o262895o292614r950167p218229J253455L992744
$$ 32527658 25426598 14924520 8661625 2369011 -7581156 -14799385 -13545930 -9553186
2211i553186j574893m758371k68026K994414j663305o178247j526289N606850
$$ -9553186 -11128079 -15886450 -16154476 -13160062 -14823367 -21001614 -22527903 -16921053
2203a6921053K478195q734822j2580288j805638J3875683K1186762J6172174K920589
$$ -16921053 -14442858 -23177680 -35757968 -37563606 -23687923 -2501161 13671013 16591602
2195A6591602j1117148j6618011q705723M637984Q977197K065123k862635K724694
$$ 16591602 5474454 -11143557 -19849280 -15211296 -6234099 -4168976 -7031611 -4306917
2187d306917R445100N342955m784289p187826k88914N192532M330232K543469
$$ -4306917 5138183 10481138 5696849 -1490977 -1779891 3412641 7742873 10286342
2179A0286342K025247k643008j1761844j5595092q568354Q62776J810409m306198
$$ 10286342 12311589 9668581 -2093263 -17688355 -26256709 -25393933 -23583524 -27889722
2171b7889722p697580l800148L846068J0537430J3785211J2246837O991678K439667
$$ -27889722 -35587302 -39387450 -35541382 -25003952 -11218741 1028096 8019774 10459441
2163A0459441J746845K730602J760490o33890j955035l218242p139043j1263203
$$ 10459441 12206286 14936888 16697378 16063488 14108453 10890211 3751168 -7512035
2155g512035q027767N421164J9325440J7818614k691383k3428993j9820620P858691
$$ -7512035 -15539802 -10118638 9206802 27025416 24334033 905040 -18915580 -11056889
2147a1056889K9425156J9960535p626353j9975295q400583L517792j202591r784544
$$ -11056889 18368267 38328802 30702449 10727154 2326571 5844363 4641772 -5142772
2139e142772n462716M981340O639475L044592O365786J2279874P425294m359958
$$ -5142772 -10605488 -5624148 1015327 4059919 10425705 22705579 30130873 25770915
2131B5770915o319238K886096P471676J903857k069277N35765j194519j1350839
$$ 25770915 19451677 22337773 29809449 31713306 29644029 30179794 28985275 17634436
2123A7634436j5527743l583130J2199467J4813228N643234k870674o575541q448774
$$ 17634436 2106693 -1476437 10723030 25536258 31179492 28308818 21733277 13284503
2115A3284503p569644l038762j628532p966578j3000997o012669O408201P922074
$$ 13284503 5714859 2676097 1047565 -6919013 -19920010 -25932679 -19524478 -11602404
2107a1602404l009669j0486141m057717Q505442J4458592J1463130N167902l94638
$$ -11602404 -14612073 -25098214 -29155931 -20650489 -6191897 5271233 10439135 10044497
2099A0044497m522812o814431o849816m730923n15135M459264O120218J681120
$$ 10044497 5521685 -1292746 -8142562 -12873485 -13388620 -8929356 -2809138 -1128018
2091a128018m824498n711494N94188P062985O810664R85728l713666k908294J619094
$$ -1128018 -5952516 -11664010 -11069822 -4006837 2803827 3789555 75889 -2832405 -1213311
2082a213311M493051K180421l641042q190502q814499o448703k191586L832073
$$ -1213311 3279740 5460161 1819119 -6371383 -15185882 -21634585 -23826171 -19994098
2074a9994098R183589R569970N280249K138342K440395Q94321m945502o973091
$$ -19994098 -10810509 -1240539 4039710 6178052 8618447 9512768 4567266 -2405825
2066b405825J670706J2247877J0017264l372318j0302473k321914P851923N409810
$$ -2405825 -735119 11512758 21530022 18157704 7855231 5533317 13385240 18795050
2058A8795050o260432j3084927j0262780m507658r59170J491139K947987J89522
$$ 18795050 12534618 -550309 -10813089 -15320747 -16279917 -14788778 -11840791 -11651269
2050a1651269o599857j1636887j0611133n310900O83072O720888J3116991J7555400
$$ -11651269 -18251126 -29888013 -40499146 -45810046 -45126974 -38406086 -25289095 -7733695
2042g733695J6335705Q610482j367283o200614j582117P420061R318837j92370
$$ -7733695 8602010 17212492 15845209 9644595 8062478 15482539 24801376 24609006
2034B4609006j0489044q716542J621236M505785n173436j3817923j0127142j901515
$$ 24609006 14119962 5403420 7024656 11530441 6357005 -7460918 -17588060 -19489575
2026a9489575j465872m426690J849087J4319651J6737573N537101m892071o310764
$$ -19489575 -20955447 -25382137 -23533050 -9213399 7524174 13061275 8169204 1858440
2018A858440p493932j2994883r755885J0133678K7977046J9925144p593827k4497694
$$ 1858440 -5635492 -18630375 -28386260 -18252582 9724464 29649608 22055781 -2441913
2010b441913j6984285j171930M974437M083763O487752J0734195Q475365m95971
$$ -2441913 -19426198 -20598128 -15623691 -11539928 -5052176 5682019 14157384 13661413
2002A3661413q764310j1748963r723908l469594N171448J1010768R335923J048719
$$ 13661413 4897103 -6851860 -16575768 -20045362 -14873914 -3863146 5472777 6521496
1994F521496q324582j2719699q425722K517323J1226746J0050426K739818J29734
$$ 6521496 -1803086 -14522785 -22948507 -20431184 -9204438 845988 3585806 3715540
1986C715540M864343Q613414O260140K949859K925182J620074m584772j0101565
$$ 3715540 8579883 17193297 23453437 26403296 29328478 30948552 26363780 16262215
1978A6262215r674062p739473r056702p822360K604190J4885429J5133742K566839
$$ 16262215 6588153 -1151320 -10208022 -18030382 -15426192 -540763 14592979 17159818
1970A7159818r651361j2061733p023297O2066O878382J0403674O919321j052227
$$ 17159818 7508457 -4553276 -11576573 -11514507 -4636125 5767549 12686870 11634643
1962A1634643n116431j156471O352303J1405693J2050982Q073178l28657r547312
$$ 11634643 6518212 5361741 11714044 23119737 35170719 43243897 42915240 33367928
1954C3367928j3895108j2139481q276207m859348p89754L347055M098572J800994
$$ 33367928 19472820 7333339 -942868 -5802216 -6591970 -3244915 853657 2654651
1946B654651K436621Q822701J4469001J1054849m27783j0495513j2435575r073753
$$ 2654651 5091272 13913973 28382974 39437823 39010040 28514527 16078952 7005199
1938G005199p195637p396695k865760R659355K0477397J5273479m948462j9866607
$$ 7005199 -190438 -7587133 -10452893 -793538 19683859 34957338 30008876 10142269
1930A0142269j3037797N946888J2716092q5379j4092087j1047537M240717J4091582
$$ 10142269 -2895528 3051360 15767452 15682073 1589986 -9457551 -5216834 8874748
1922H874748J2021581N724130Q95976m910246j1475916j1071322m76708J0347497
$$ 8874748 20896329 26620459 27516435 22606189 11130273 58951 -417757 9929740
1914I929740R800646L20202n869268m140679j405647k982366n467065n343015
$$ 9929740 19730386 20050588 14181320 10040641 8634994 5652628 185563 -5157452
1906e157452n165471o148167l352903M776654J0004489N989360p87645j759279
$$ -5157452 -10322923 -16471090 -19823993 -15047339 -5042850 946510 158865 -1600414
1898a600414q18273n500672r929287k940246R750932J0244095l201582j1511105
$$ -1600414 -2418687 -7919359 -17848646 -20788892 -11037960 -793865 -3995447 -15506552
1890a5506552m000455N990033L971637l576328k699611N402100R773459Q712486
$$ -15506552 -19507007 -13516974 -9545337 -13121665 -15821276 -10419176 -645717 8066769
1882H066769Q902485J1038689R346205K660840m275887q681266j1300879j2456313
$$ 8066769 16969254 28007943 37354148 40014988 35739101 27057835 15756956 3300643
1874C300643j2192723j1428743r427757m679177j08538l18075k555390j06984
$$ 3300643 -8892080 -20320823 -29748580 -34427757 -34536295 -34854370 -37409760 -37516744
1866c7516744M732527L992951Q73174N964170J4429167R091214p390468r380227
$$ -37516744 -32784217 -28791266 -27918092 -21953922 -7524755 1566459 -5824009 -15204236
1858a5204236J0338836K3474107R455390j1025910j0661614J126766K23984p937386
$$ -15204236 -4865400 18608707 28064097 17038187 6376573 7503339 7727323 -210063
1850b10063j713837J4586858J8958363J1313710Q119506O467439q215059k5423181
$$ -210063 -1923900 12662958 31621321 42935031 51054537 57521976 49306917 23883736
1842B3883736k1042817k006209K144763q823931o342177J2195122J5890748m072104
$$ 23883736 2840919 834710 2979473 -5844458 -12186635 8487 15899235 11827131
1834A1827131j7927460r775556j098686n118294l309148J1278337J2885573p881684
$$ 11827131 -6100329 -15875885 -16974571 -22092865 -25402013 -14123676 -1238103 -9119787
1826i119787j7808072L824063K5120371J3793598q433123n858754J0180099P313940
$$ -9119787 -26927859 -23103796 2016575 15810173 7377050 1518296 11698395 19012335
1818A9012335p727631m999922J1445145J1777205n907032j6222873j2702419j0280005
$$ 19012335 11284704 6284782 17729927 29507132 23600100 7377227 -5325192 -15605197
1810a5605197q507502N443972K2016377J8825607J506269n082480k209306j1236530
$$ -15605197 -24112699 -18668727 3347650 22173257 23679526 18597046 16387740 5151210
1802E151210k5086782j2845029K3058188M1119103K2733037l291366j1179206
$$ 5151210 -19935572 -32780601 -9722413 31396690 54129727 50838361 39659155
1795C9659155j1170872j5513060j2450965L334144J0319289m179446j8215807
$$ 39659155 28488283 12975223 524258 3858402 14177691 9998245 -8217562
1788h217562j0862044L444271K832895m167301K082487J4487619J1081479p294569
$$ -8217562 -19079606 -15635335 -12802440 -16969741 -14887254 -399635 10681844 3387275
1780C387275j8594817j2110313K465620J2799686J2801953J89428j8339194k5541240
$$ 3387275 -15207542 -27317855 -24852235 -12052549 749404 938832 -17400362 -42941602
1772d2941602j2260199P761264J4558556P434013J662040N515346J2206228J0971027
$$ -42941602 -55201801 -47440537 -32881981 -25447968 -23785928 -18270582 -6064354 4906673
1764D906673j870853j8764950k4130797r951326R641177J2352644n60034m248820
$$ 4906673 3035820 -15729130 -39859927 -49811253 -40170076 -27817432 -28377466 -32626286
1756c2626286J1234026K3379438J1479857j1477293j9973442j2868620p149606
$$ -32626286 -21392260 1987178 13467035 1989742 -17983700 -30852320 -38001926
1749c8001926o410378L79131J3849364K0429322J3955734L946638N58099L708924
$$ -38001926 -44412304 -44033173 -30183809 -9754487 4201247 8147885 8705984 12414908
1741A2414908P668863O874543j230845j0973662j0333707L093848J3966330P759403
$$ 12414908 20083771 26958314 25727469 14753807 4420100 7513948 21480278 29239681
1733B9239681q399021j5726659r536928j182337K383291N503536R628861P128438
$$ 29239681 20840660 5114001 -4422927 -5605264 -3221973 2281563 11910424 19038862
1725A9038862m971163j5348578j0632180O699675J9357422J4907175O26960n324223
$$ 19038862 14067699 -1280879 -11913059 -5213384 14144038 29051213 29678173 24353950
1717B4353950K707203J0069761K187261j4387794k1197288j3235522k279529K601063
$$ 24353950 27061153 37130914 39318175 24930381 3733093 -9502429 -11781958 -9180895
1709i180895L437441K654411r25745m079582j857330P43489m819740j2548015
$$ -9180895 -5743454 -3089043 -4014788 -8094370 -9951700 -9208211 -14027951 -26575966
1701b6575966q200385N923114J2917229Q971428O074289N700022k854938j4268219
$$ -26575966 -34776351 -28853237 -15936008 -6964580 -890291 4809731 1954793 -12313426
1693a2313426q900787R841865J4231146r10558p835889L363778O844236n678842
$$ -12313426 -21214213 -11372348 2858798 1948240 -5887649 -2523871 4320365 -1358477
1685a358477l161030K2638225K8630544O17143L792767Q1340024J49778535R2225039
$$ -1358477 -4519507 18118718 46749262 47366405 51159172 132499196 282277731 374502770
1677C74502770o2181354j55694683j09185487j4021879J4806476j4150546k4675165
$$ 374502770 312321416 156626733 47441246 33419367 48225843 34075297 9400132
1670I400132k211621Q733526n218488j3556041l638232M916865K962299K140519
$$ 9400132 7188511 15922037 10703549 -2852492 -6490724 -1573859 1388440 3528959
1662C528959M306249j083543j0291970q713618O29709J151090o902206p522611
$$ 3528959 7835208 6751665 -3540305 -12253923 -11624214 -10473124 -17375330 -24897941
1654b4897941J395003N500515K24243m458176m506749m252351j59807J4110070
$$ -24897941 -23502938 -18002423 -17778180 -22236356 -26743105 -30995456 -31155263 -17045193
1646a7045193K7235120J9657352m544170j9294525j3949855n242867n562890l984430
$$ -17045193 10189927 29847279 25303109 6008584 -7941271 -13184138 -18747028 -22731458
1638b2731458Q756746J8033543O740359j4510421j8898128o35219J6656510J1310925
$$ -22731458 -13974712 4058831 10799190 -3711231 -22609359 -23244578 -6588068 4722857
1630D722857r009301j8944449q778351M848022M911303l6349J0182769L1265098
$$ 4722857 -4286444 -23230893 -32009244 -27161222 -22249919 -22286268 -12103499 19161599
1622A9161599L3248406L623509k8005340k6110816L229701K3034084J6130439
$$ 19161599 52410005 56033514 28028174 1917358 5147059 28181143 44311582
1615D4311582L64288n903013p254486j2299250j3862019l114512J0972784J2755998
$$ 44311582 44675870 38772857 31518371 19219121 5357102 2242590 13215374 25971372
1607B5971372L015060l686449j569036p27561j0527733k5134296k9552231j6243034
$$ 25971372 28986432 25299983 23730947 23003386 12475653 -12658643 -42210874 -58453908
1599e8453908O967571K4230570K5597329J4059308K46995p743238q956567p383349
$$ -58453908 -51486337 -27255767 -1658438 12400870 12647865 4904627 -4051940 -11435289
1591a1435289p783695j1311234j2790985n628765P374983J3103503M388779p072802
$$ -11435289 -19218984 -30530218 -43321203 -48949968 -41574985 -28471482 -24082703 -31155505
1583c1155505l660731J3410359K3182959J1937259q611602j6812494q185807J832558
$$ -31155505 -34816236 -21405877 1777082 13714341 5102739 -11709755 -19895562 -18063004
1575a8063004n9030r346514j2587670n364762M550855R449951J0057303J0038809
$$ -18063004 -18122034 -27468548 -40056218 -45420980 -40870125 -31420174 -21362871 -11324062
1567a1324062Q511663L213758k853345m629153k779098j202635J503839Q870742
$$ -11324062 -2812399 401359 -2451986 -7081139 -9860237 -11062872 -9559033 -688291
1559f88291J4880157P255468j3040209k6597899j8184415L220042J5952338J1214140
$$ -688291 14191866 21447334 8407125 -18190774 -36375189 -33155147 -17202809 -5988669
1551e988669k014319j2063301j3674695n458317R395483J9382080J2987693n341398
$$ -5988669 -8002988 -20066289 -33740984 -39199301 -29803818 -10421738 2565955 -2775443
1543b775443j5888884n906926J3917973K1195191P968555j0778486j6198475q107737
$$ -2775443 -18664327 -24571253 -10653280 10541911 18510466 7731980 -8466495 -16574232
1535a6574232k356437p087940j1578394m278767P825367J0126534M308322M540765
$$ -16574232 -18930669 -26018609 -37597003 -41875770 -34050403 -23923869 -19615547 -15074782
1527a5074782J1413748R360870n746853j6485441j0644956M38159K902468K100912
$$ -15074782 -3661034 5699836 -47017 -16532458 -27177414 -26739255 -23836787 -21735875
1519b1735875P260440J0801749L156214n172618N90117J1659700Q662543m259155
$$ -21735875 -14475435 -3673686 -517472 -5690090 -5099973 6559727 15222270 10963115
1511A0963115n159160Q345539J4969551N190435n850046o776708o022247j0046880
$$ 10963115 5803955 14149494 29119045 34309480 28459434 21682726 15660479 5613599
1503E613599q819229L975591J5476583J2519065Q48974o932080q685391o782137
$$ 5613599 -3205630 769961 16246544 28765609 29614583 22682503 13997112 7214975
1495G214975O49222J0427129J0391894k159894j1352704n456088M426836K872286
$$ 7214975 7864197 18291326 28683220 26523326 15170622 9714534 14141370 17013656
1487A7013656n802310q526485o359719p594472q171343K25924R623025M964652
$$ 17013656 11211346 2684861 -3674858 -11269330 -19440673 -19214749 -9591724 -4627072
1479d627072r733289j5166468n170932Q141311J6365878K1256682J9179288K440218
$$ -4627072 -14360361 -29526829 -34697761 -26556450 -10190572 11066110 30245398 32685616
1471C2685616j8989385k0496596J917546J9791567R716843j4392758k3437894
$$ 32685616 13696231 -6800365 -4882819 14908748 24625591 10232833 -13205061
1464a3205061j3629873m355693l993188q98435J1351926K0228436J2894877n174805
$$ -13205061 -26834934 -31190627 -35183815 -36082250 -24730324 -4501888 8392989 3218184
1456C218184j8700248k0712812j4496665m651970N180327J0193009Q760099P021855
$$ 3218184 -15482064 -36194876 -50691541 -55343511 -50163184 -39970175 -31210076 -24188221
1448b4188221J1350243J7148413J3415641n37627j1531908r504049o71122K195656
$$ -24188221 -12837978 4310435 17726076 17188449 5656541 -3847508 -4518630 -2322974
1440b322974k988161p327573m312857L759426J0350497R113569l030855j9437032
$$ -2322974 -5311135 -12638708 -16951565 -13192139 -2841642 6271927 3241072 -16195960
1432a6195960k4018031q527602J2721970J7932228O670851j519824J451450J675241
$$ -16195960 -40213991 -48741593 -36019623 -18087395 -11416544 -12936368 -11484918 -9809677
1424i809677q280989j1489194N667180K4349660J5628833j5735383l4635213k2188370
$$ -9809677 -18090666 -29579860 -23912680 436980 16065813 330430 -34304783 -56493153
1416e6493153L736348J8212701J8033673J2556148M810271n165363j1387401r986697
$$ -56493153 -52756805 -34544104 -16510431 -3954283 855988 -4309375 -15696776 -25683473
1408b5683473p435497r195530q463145J829542J3560631J3879352N813307L508504
$$ -25683473 -33118970 -42314500 -50777645 -48948103 -35387472 -21508120 -15694813 -12186309
1400a2186309R446108J1931458N928812P88198K700029L737666l375003j1104356
$$ -12186309 -2740201 9191257 15120069 15908267 18608296 22345962 18970959 7866603
1392G866603q745293m52948P98744o449691j0436083m946988J917993J625068
$$ 7866603 -878690 -1331638 -532894 -6982585 -17418668 -22365656 -20447663 -18822595
1384a8822595j794343K04880N666368M299891o359951j5095146j0476654M437614
$$ -18822595 -20616938 -20412058 -14745690 -10445799 -16805750 -31900896 -42377550 -37939936
1376c7939936J5344550J3182978L291150k546545K96301O302017Q392778N335321
$$ -37939936 -22595386 -9412408 -6121258 -8667803 -8371502 -2069485 6323293 11658614
1368A1658614J11035n069739r414462j1549161j0137588n922134j177167K099725
$$ 11658614 11769649 6699910 -2714552 -14263713 -24401301 -30323435 -31500602 -29400877
1360b9400877K391465o60921m056408l143205J787170M690571L267222L534233
$$ -29400877 -27009412 -27670333 -31726741 -34869946 -33082776 -28392205 -25124983 -21590750
1352b1590750Q485514R085305k178200j4055983q753873R727367J7997349P676286
$$ -21590750 -13105236 -4019931 -6198131 -20254114 -29007987 -19280620 -1283271 6393015
1344F393015k569143J677923P703112l32695j2489813r622223L985286Q855639
$$ 6393015 3823872 5501795 13204907 12872212 382399 -9239824 -5254538 3601101
1336C601101L077186J067862L916690j383907j2576848j0770418N244307J1152964
$$ 3601101 6678287 7746149 11662839 10278932 -2297916 -13068334 -7824027 3328937
1328C328937m536074j9540882j1622948Q026508J4721707O604908m7946Q85370
$$ 3328937 -1207137 -20748019 -32370967 -24344459 -9622752 -3017844 -3065790 -2180420
1320b180420L300667O364626J3160050J6942962P966090q300614j6130501j1148999
$$ -2180420 1120247 7484873 20644923 37587885 45553975 37253361 21122860 9973861
1312I973861l133239K20916r51914n956628j2854574j3282160j635789J2656397
$$ 9973861 6840622 7061538 6109624 152996 -12701578 -25983738 -27619527 -14963130
1304a4963130J4980931N434337l455456n655708n209879m349785j854986j99483
$$ -14963130 17801 5452138 1996682 -3659026 -8868905 -13218690 -15073676 -15273159
1296a5273159q83456K781836J3547579J7581217K929471j5305256j1907626Q649196
$$ -15273159 -16156615 -13374779 172800 17754017 20683488 5378232 -6529394 2119802
1288B119802J6107682Q53025j1805995k868528J1680812Q691487p537650j6626289
$$ 2119802 18227484 19080509 7274514 4405986 16086798 24778285 17240635 614346
1280F14346j1982016j944917O343153Q811154J581307r788022r673705N390520
$$ 614346 -11367670 -13312587 -6969434 1841720 3423027 -6364995 -16038700 -10648180
1272a0648180J6182136P246827q851845j0977149j302722K544011j576331K19967
$$ -10648180 5533956 12780783 3928938 -7048211 -8350933 -5806922 -7383253 -7163286
1264g163286J1032641J7415916J1368797K80199p230812j0523437j0230751n906347
$$ -7163286 3869355 21285271 32654068 32934267 25703455 15180018 4949267 -957080
1256i57080k091655m438958q706457n627179K714546M279574l581711r283285
$$ -957080 -3048735 -7487693 -16194150 -21821329 -19106783 -14827209 -18408920 -27692205
1248b7692205m860376L294299O074923L706179J148007R2317M93251L202720O835574
$$ -27692205 -32552581 -29258282 -23183359 -19477180 -18329173 -18236856 -17743605 -14540885 -7705311
1239g705311P306335L231861k520716p103378q697463m937445K865447O199175
$$ -7705311 -398976 2832885 312169 -6791209 -15488672 -20426117 -17560670 -11361495
1231a1361495j000306j0849532j0212412k08915N136627J017547p72713Q628308
$$ -11361495 -12361801 -23211333 -33423745 -33632660 -28496033 -27478486 -28251199 -19622891
1223a9622891K0437838K0826479R345988l447352j0547707j2827041j2677560
$$ -19622891 814947 21641426 30987414 27540062 16992355 4165314 -8512246
1216h512246j0337981n729520k98598K979633J740694j738165j020840N829152
$$ -8512246 -18850227 -24579747 -24878345 -21898712 -20158018 -21896183 -22917023 -17087871
1208a7087871J1343253Q437046J093388k782008m232003p729673p743728L521830
$$ -17087871 -5744618 2692428 3785816 1003808 -3228195 -10957868 -18701596 -15179766
1200a5179766J7190338J5232526j275254j1075418m853278K293000j027618l984020
$$ -15179766 2010572 17243098 15967844 4892426 39148 2332148 1304530 -2679490
1192b679490K778992O163476o160455j8634235r058595J3932447K1401067P032020
$$ -2679490 99502 6262978 102523 -18531712 -27590307 -13657860 7743207 14775227
1184A4775227o954630o467792k293668n550226r968989p609869k815829j72477
$$ 14775227 7820597 1352805 -940863 -6491089 -16460078 -24069947 -26885776 -27058253
1176b7058253M882763J2688264J2038685j246985j1949286n854788Q431626J3119135
$$ -27058253 -22175490 -9487226 2551459 1304474 -10644812 -16499600 -8067974 5051161
1168E051161P443858L493187K638898m540924j6497060j8490962o423039L682609
$$ 5051161 12495019 15988206 18627104 14086180 -2410880 -20901842 -27324881 -23642272
1160b3642272j820756j4577852j6866038n308652Q040711J2954293J0100098N837967
$$ -23642272 -25463028 -40040880 -56906918 -62215570 -54174859 -41220566 -31120468 -25282501
1152b5282501N556896J0045947J2701755M125581j3906599k4348748j4598599
$$ -25282501 -19725605 -9679658 3022097 7147678 -6758921 -31107669 -45706268
1145d5706268M045661R638370J80971n141948L081454J1351659Q935770O885474
$$ -45706268 -41660607 -32022237 -31841266 -36983214 -33901760 -22550101 -13614331 -6728857
1137f728857J5606845K0262985J901915k6515774l2301857r950111J0822646Q872697
$$ -6728857 8877988 29140973 31042888 4527114 -27774743 -37724854 -26902208 -18029511
1129a8029511k138948k089012M694464M121867n22552K587027R614192P422544
$$ -18029511 -20168459 -22257471 -17563007 -13441140 -13963692 -11376665 -1762473 5660071
1121E660071k146547m686836K565909P235647K572359m255482o049953m103159
$$ 5660071 3513524 -1173312 1392597 8628244 11200603 6945121 895168 -3207991
1113c207991j304831J313101M91736n382381q920185k624633O069673L180759
$$ -3207991 -4512822 -3199721 -2707985 -8090366 -17010551 -19635184 -13565511 -10384752
1105a0384752q637184j1943777j691726P313900N289848J518840M833715P730419
$$ -10384752 -19021936 -30965713 -32657439 -25343539 -20053691 -18534851 -13701136 -5970717
1097e970717K571344j826586M202729J0908259K806646j4458179j9542876n486332
$$ -5970717 -3399373 -5225959 -1023230 9885029 12691675 -1766504 -21309380 -26795712
1089b6795712J2114550J7741381J2566800N683281Q15970l112703o278078q036896
$$ -26795712 -14681162 3060219 15627019 21310300 22126270 19013567 12735489 4698593
1081D698593q640430q163973o095153k109297M614385J4290950K2046933J9445055
$$ 4698593 -3941837 -12105810 -18200963 -20310260 -15695875 -1404925 20642008 40087063
1073D0087063N590927q638585j4186338j5445643j9077344j8179912k233299K0232090
$$ 40087063 45677990 37039405 22853067 7407424 -11669920 -29849832 -32083131 -11851041
1065a1851041K6471173J0038832r484011j3370237n554926R47365M537206Q459193
$$ -11851041 14620132 24658964 15174953 1804716 -3750210 -2802845 1734361 10193554
1057A0193554N947803r630351k5867177k2495013j587649J2314024O835187j592941
$$ 10193554 16141357 6511006 -19356171 -41851184 -43438833 -31124809 -24289622 -25882563
1049b5882563M523472J5578564J0663321q618178j9726621j2011421J005786N302487
$$ -25882563 -21359091 -5780527 4882794 -3735384 -23462005 -35473426 -34467640 -29165153
1041b9165153N020271R167153J3661126R107693j936844q302934o530504k669701
$$ -29165153 -24144882 -14977729 -1316603 7791090 5854246 -2448688 -8979192 -11648893
1033a1648893n86182R60328J399745r27396j832145M468004J3759387J4762263
$$ -11648893 -12235075 -11274747 -9875002 -10802398 -12634543 -8166539 5592848 20355111
1025B0355111M902228o871980j4378819j9935785k2816132j4893304M651978K0809420
$$ 20355111 25257339 18385359 4006540 -15929245 -38745377 -53638681 -48986703 -28177283
1017b8177283J9356970N947815j290072M829976J3130615R625299n612954j8641956
$$ -28177283 -8820313 -2872498 -4162570 667406 13798021 23423320 17810366 -831590
1009h31590j6863406l197766P101161N512586O04466K991854P300558K295978
$$ -831590 -17694996 -20892762 -13791601 -8279015 -7674549 -4682695 2617863 4913841
1001D913841o279622k119497J2615940J6975714N145328l271895K441946M863863
$$ 4913841 -1365781 -3485278 9130662 26106376 31251704 27979809 30421755 35285618
993C5285618q721069j8808326n157441J4236858Q675768j3449323j5742255P150848
$$ 35285618 26564549 7756223 2598782 16835640 25511408 12062085 -3680170 3470678
985C470678K0450168N246311j3036440p413361J0091653J2418064l48910p485093
$$ 3470678 23920846 29167157 16130717 8717356 18809009 31227073 30878163 23393070
977B3393070k964069l10783p151015j4483845j2078205j829933O399439N640074
$$ 23393070 20429001 20118218 12967203 -1516642 -13594847 -15424780 -9025341 -3385267
969c385267k123926q015205n893658J74739K414256J444322L878110R221462R880393
$$ -3385267 -5509193 -13524398 -19418056 -19243317 -16829061 -15384739 -11506629 -2285167 7595226
960G595226M664282J058149K787763N934365P507250O275787k662767j8909092
$$ 7595226 12259508 13317657 16105420 22039785 29547035 35822822 33160055 14250963
952A4250963k5606483q171770J6624626J6154616r501841k3496989o593128J5104832
$$ 14250963 -11355520 -19527290 -2902664 13251952 3750111 -19746878 -26340006 -11235174
944a1235174J3720190P48743R9002O448958J425748q570478m578357Q135964R066561
$$ -11235174 2485016 3233759 3332761 9781719 11207467 2636989 -1941368 6194596 15261157
935A5261157o19827k995382J165025m442411j6029328j2135743O491868J3790160
$$ 15261157 14641330 11645948 12810973 8368562 -7660766 -19796509 -13304641 485519
927D85519J546962p326059P24409P726817j706272j2409115n770469P581060O332178
$$ 485519 2032481 -5293578 -4569169 3157648 1451376 -10957739 -16728208 -9147148 -2814970
918b814970n307161m796159J2070864K3710932J2912876j0496771k1875710j0318540
$$ -2814970 -8122131 -12918290 -847426 22863506 35776382 25279611 3403901 -6914639
910f914639R017846J2339570l132549j3911798j558031J9637757K1192602P93048
$$ -6914639 2103207 14442777 11310228 -2601570 -4159601 15478156 36670758 37463806
902C7463806j5896734j2773635o54908O178046Q104535P354399r47976j3798216
$$ 37463806 21567072 8793437 8138529 14316575 22421110 29775509 28827533 15029317
894A5029317j6169952m656415L086518l759090j0358865j806871J0247889P071717
$$ 15029317 -1140635 -5797050 -2710532 -6469622 -16828487 -18635358 -8387469 -1315752
886a315752n366821p193862K288511N929444j503291p095106k803014M434879
$$ -1315752 -6682573 -13876435 -11587924 -5658480 -7161771 -14256877 -17059891 -12625012
878a2625012P281033O717638L788515l670743j2819799j5326833q445732J236830
$$ -12625012 -5343979 1373659 5162174 1491431 -11328368 -26655201 -35100933 -33864103
870c3864103O667976O574784L097839o32458j259085J430202L650080L636614
$$ -33864103 -27196127 -20621343 -17523504 -18155962 -19415047 -17984845 -14334765 -10698151
862a0698151M023339M491418n46860j0808305j5040154n858804P567699J1515241
$$ -10698151 -6674812 -2183394 -2730254 -13538559 -28578713 -34437517 -26869818 -15354577
854a5354577O180873K103408L720570O765313P329059L947308m581869j4556268
$$ -15354577 -9173704 -7070296 -3349726 3415587 10744646 14691954 10110085 -4446183
846d446183j6157905n884845N923190Q703816N266559K643410q52840p663779
$$ -4446183 -20604088 -26488933 -20565743 -11861927 -6595368 -3951958 -4804798 -12468577
838a2468577j0375533l627217K742593j254428o411936J298778J4476658J3752538
$$ -12468577 -22844110 -26471327 -23728734 -24983162 -31395098 -30096320 -15619662 -1867124
830a867124n98866q624387j732492P285459P222817K215595q67826j888324q86198
$$ -1867124 -2465990 -11090377 -12822869 -5537410 1685407 3901002 3033176 1144852 258654
821B58654L085836M734791j555719q666558n097225M734142N994302j845302n324777
$$ 258654 3344490 8079281 6523562 -2142996 -7240221 -2506079 3488223 1642921 -3681856
812c681856j809835k393892q354319p720880N69815K577497m339434m743511O837699
$$ -3681856 -5491691 -7885583 -16239902 -23960782 -23390967 -20813470 -25152904 -29896415 -23058716
803b3058716J4208301O432967n199238q162578n486565q70106J0216980K2361443
$$ -23058716 -8850415 -2417448 -7616686 -15779264 -21265829 -22135935 -11918955 10442488
795A0442488J7492193m540797j7284965p100850M265496k570479j1239278j342274
$$ 10442488 27934681 23393884 6108919 -991931 3273565 703086 -10536192 -11878466
787a1878466J1638052K626757j6297702j4285523N470958J1741782j348369p358444
$$ -11878466 -240414 2386343 -13911359 -28196882 -22725924 -10984142 -12332511 -19690955
779a9690955M474592J2535942K096938j1936926j2752667m516330L125759Q814893
$$ -19690955 -15216363 -2680421 -583483 -12520409 -25273076 -29789406 -26663647 -17848754
771a7848754Q782233k947134j5216569p079654J5664845K0405641j727942j6303039
$$ -17848754 -9066521 -12013655 -27230224 -34309878 -18645033 1760608 32666 -16270373
763a6270373J875643K6148778J8086471j2823037k5768901j1078043K524664j009826
$$ -16270373 -14394730 11754048 29840519 17017482 -8751419 -19829462 -17304798 -18314624
755a8314624m878394L778792J0837376L237517o314942j467007R490451P711745
$$ -18314624 -23193018 -19414226 -8576850 -5339333 -11654275 -13121282 -3630831 4080914
747D080914n392940j1471191l990553M577631M064819l29646J5256L663451L616142
$$ 4080914 -1312026 -12783217 -16773770 -12196139 -8131320 -8460966 -8445710 -4782259 -1166117
738a166117j689829p577458r443714n797670J965793R433095J1492491P943405
$$ -1166117 -2855946 -10433404 -19877118 -25674788 -23708995 -14275900 -2783409 5159996
730E159996M289353L962784L005718l098453j0281418j0031936j834537N455793
$$ 5159996 9449349 13412133 16417851 13319398 3037980 -6993956 -8828493 -3372700
722c372700N767382K579003Q68618r50649n857314j0078189p197629J473916P235877
$$ -3372700 2394682 4973685 5842303 4891654 -965660 -11043849 -18241478 -16767562 -9531685
713i531685N206353K13805k23849M417942P356609K924173o397954j2306310r983492
$$ -9531685 -4325332 -4111527 -4335376 82566 7439175 10363348 3965394 -8340916 -18324408
704a8324408l325049O66615M41135p09004j862469n225763r535315r003724j075421
$$ -18324408 -21649457 -20982842 -20541707 -21250711 -23113180 -28338943 -37874258 -46877982 -47953403
695d7953403R411148J5456818J3336620L419231q160486r866312L482819J8773115
$$ -47953403 -38542255 -23085437 -9748817 -6329586 -14490072 -24356384 -20873565 -2100450
687b100450J6527897k155473j4438586p456774M465202M784865N50360O166070
$$ -2100450 14427447 12271974 -2166612 -9623386 -5158184 -373319 177041 6343111
679F343111J4601848P545645j2124010k1990242j3952172l889514l635537m473648
$$ 6343111 20944959 28490604 16366594 -5623648 -19575820 -23465334 -27100871 -31574519
671c1574519L159854J1784295J0579770L682145K149136O484686Q684062N995885
$$ -31574519 -28414665 -16630370 -6050600 -2368455 -219319 6265367 14949429 20945314
663B0945314K877366K563839L752730L220188k273644j2741143k0746157j6396930
$$ 20945314 23822680 26386519 30139249 33359437 31085793 18344650 -2401507 -18798437
655a8798437p69018J1502551Q378436n103893j3451703q738143K316283P718531
$$ -18798437 -19567455 -8064904 313532 -4790361 -18242064 -26980207 -24663924 -16945393
647a6945393L746060j382158J615341R099832P892541l915296r626462K273879
$$ -16945393 -13199333 -14581491 -12966150 -3866318 4026223 110927 -9515535 -7241656
639g241656J6566875J0395154j1621938k2142614j0592595M335117O000272J019174
$$ -7241656 9325219 19720373 8098435 -14044179 -24636774 -20301657 -14301385 -13282211
631a3282211O9132q08421o029668o618568K676848Q250212j890027j5547777j3839236
$$ -13282211 -13213079 -14021500 -20051168 -26669736 -23992888 -15742676 -17632703 -33180480 -47019716
622d7019716n93973O483087N667084R640918J8439579J7244875K432353j0530085
$$ -47019716 -47613689 -41130602 -35463518 -25822600 -7383021 9861854 12294207 1764122
614A764122r806882j673030K876314K732676K407806L238415L605944J472694
$$ 1764122 -8042760 -9715790 -6839476 -4106800 -1698994 1539421 5145365 6618059
606F618059m451665j0532048q284389L483693J1693984N072779q071603j1471699
$$ 6618059 2166394 -8365654 -16650043 -13166350 -1472366 3600413 -4471190 -15942889
598a5942889n053633j248537j653950K615706Q779769L568373j0160160j1760039
$$ -15942889 -20996522 -22245059 -23899009 -21283303 -12503534 -8935161 -19095321 -30855360
590c0855360L932172J4599153M692704r284083n275622R930655J3988753M333286
$$ -30855360 -26923188 -12324035 -7631331 -16915414 -22191036 -12260381 1728372 6061658
582F061658k731447j247211p31248m147767l142758J969941j831246j6716354
$$ 6061658 3330211 2083000 1351752 -2796015 -5938773 -3968832 -5800078 -22516432
574b2516432k3793351q370210J6484057K5211828J2134301m584387q875330l786889
$$ -22516432 -46309783 -54679993 -38195936 -12984108 -849807 -5434194 -14309524 -18096413
566a8096413l35495o59004K31829K492449J217032l011768k945884L131675O320892
$$ -18096413 -18431908 -19090912 -18859083 -16366634 -15149602 -18161370 -21107254 -17975579 -11654687
557a1654687L6799q570058q353612p37306L747222L261519O437628J4313964J3778602
$$ -11654687 -11617888 -20187946 -28541558 -29278864 -25531642 -22270123 -15832495 -1518531 12260071
548A2260071k799426k1002626j9376540K357873K1418962J9610384L853413n636476
$$ 12260071 9460645 -11541981 -30918521 -28560648 -7141686 12468698 16322111 10685635
540A0685635j771323K873929l928445j5615426j5574346j316627J0483915O508047
$$ 10685635 8914312 11788241 7859796 -7755630 -23329976 -24646603 -14162688 -7654641
532g654641n288746q329748n88372O228875O234903M581902L907320k43914p446508
$$ -7654641 -12943387 -21273135 -21861507 -15632632 -9397729 -4815827 -908507 -1152421 -8598929
523h598929q930015j758485M564322K357823k895597k559804K365996N872621
$$ -8598929 -17528944 -19287429 -14723107 -12365284 -15260881 -17820685 -15454689 -9582068
515i582068O617989N537117J142375n162916o263978J42661N131199R88551o790682
$$ -9582068 -2964079 2573038 3715413 -1447503 -7711481 -7568820 -2437621 -1449070 -8239752
506h239752q687120n201156k029832J461811P529729J0372922M119468m552566
$$ -8239752 -16926872 -22128028 -24157860 -22696049 -15166320 -4793398 -673930 -5226496
498e226496n259112j000836j733070m597444J858128J4098413J3576270m443302
$$ -5226496 -10485608 -11486444 -13219514 -17816958 -15958830 -1860417 11715853 7272551
490G272551j9415498j2734401O432879J4224914K997238j2219325j4609253l638521
$$ 7272551 -12142947 -24877348 -18444469 -4219555 -1222317 -13441642 -28050895 -31689416
482c1689416P917554R812923N172719M896481J1311439J2853180O34521j5455204
$$ -31689416 -23771862 -13958939 -8786220 -3889739 7421700 20274880 20909401 5454197
474E454197j7822948n333099O404656Q323970P072029Q603394P869308R78743
$$ 5454197 -12368751 -17701850 -11297194 -2973224 4098805 12702199 20571507 21550250
466B1550250n907437p559038p518159p205157j038J3929653J9728376P844049
$$ 21550250 15642813 8083775 565616 -6639541 -6640579 7289074 27017450 34861499
458C4861499q619173j1302660k951563l54591p049002j0521886m308994L963739
$$ 34861499 26242326 14939666 11988103 11633512 4584510 -5937376 -10246370 -6282631
450f282631P397702P744896O230330L2365q283433r741044k371090L995977J461874
$$ -6282631 1115071 8859967 15090297 15122662 6839229 -2901815 -5272905 -1276928 184946
441A84946n147462n890694J930623J2491682J7418636J1253057l460037j5356214
$$ 184946 -4962516 -10853210 -8922587 3569095 20987731 32240788 28780751 13424537
433A3424537j4514880m572608J294267l251079j1735966j4923198r454264L023965
$$ 13424537 -1090343 -5662951 -4368684 -7619763 -19355729 -34278927 -43733191 -40709226
425d0709226J6821382K2331987J4511986J826184k632211J136474K122320k249046
$$ -40709226 -23887844 -1555857 12956129 14782313 12150102 13286576 15408896 13159850
417A3159850k952377K151928K730768n160053j0372819n620617j92875k629682
$$ 13159850 10207473 12359401 15090169 9930116 -442703 -6063320 -6256195 -8885877
409h885877m943567J966226R846748O639615j537699l39004P822295Q029131j570415
$$ -8885877 -13829444 -11863218 -2016470 4623145 3085446 2746442 10568737 18597868 17027453
400A7027453p753037n196337k881692n306614m644507L243812R699757O917472
$$ 17027453 9274416 4078079 1196387 -4110227 -8754734 -5510922 4188835 11106307
392A1106307n90452m505039l821206k329959k247621l963491o122500m921726
$$ 11106307 10515855 6010816 2189610 -140349 -2387970 -6351461 -12473961 -17395687
384a7395687M11329L264773p69696l670957L539769J2894969R265956l764618
$$ -17395687 -16984358 -13719585 -14489281 -18160238 -14620469 -1725500 7540456 3775838
376C775838p411874J457064N038681m009681r204239O05062J1140023P606317
$$ 3775838 -3636036 -2178972 2859709 -1149972 -10354211 -9749149 1390874 8997191
368H997191m95532J087347M893514k037682j0177843k621821J1414212P368339
$$ 8997191 8501659 9589006 14482520 12444838 2266995 -354826 11059386 18427725
360A8427725j3550077k2819051p223595J2862622J5206783L852334m373823l959990
$$ 18427725 4877648 -17941403 -25164998 -12302376 2904407 6756741 2382918 -1577072
352a577072n16582P61894k395121q683578j0388098j718229Q345318N693076m827878
$$ -1577072 -2093654 -1331760 -3726881 -12410459 -22798557 -24516786 -16171468 -10478392 -15306270
343a5306270l415733J1951193J8399274M069748j0792954n259901R072754Q300685
$$ -15306270 -18722003 -6770810 11628464 15698212 4905258 -354643 8718111 17018796
335A7018796m826901q045200K128340O349019l937101j4129578j2745722p986496
$$ 17018796 12191895 4146695 6275035 12624054 8686953 -5442625 -18188347 -26174843
327b6174843q881359q315119K253679J4342155J3325451N87672q441441n330598
$$ -26174843 -35056202 -43371321 -41117642 -26775487 -13450036 -12862364 -21303805 -26634403
319b6634403L240390P770244P171730N922863O353262O869271N022917M14291
$$ -26634403 -23394013 -15623769 -8452039 -2529176 3824086 10693357 15716274 16130565
311A6130565m358304n492686k082285K050622K607708M90092K83784K519864J536827
$$ 16130565 11772261 6279575 4197290 6247912 8855620 9345712 9629496 12149360 13686187
302A3686187n534609j1179809n869398O197853Q766888m341039j7317391j2220914
$$ 13686187 8151578 -3028231 -8897629 -2699776 6067112 1726073 -15591318 -27812232
294b7812232M947818J1437260p74j1251311n897210Q177914J3086303O699198
$$ -27812232 -22864414 -11427154 -11427928 -22679239 -28576449 -20398535 -7312232 -613034
286f13034P37191j83599k446700p838422q558486j305960M962902J687243o212066
$$ -613034 124157 -59442 -2506142 -10344564 -18903050 -20209010 -15246108 -13558865 -19770931
277a9770931p092208J149441Q478362O455162p78888k705144K508009M891467
$$ -19770931 -26863139 -25713698 -17235336 -10780174 -11559062 -14264206 -11756197 -6864730
269f864730k649535j2027300r909181K553136J0347034O146572m07000J26621
$$ -6864730 -9514265 -21541565 -31450746 -28897610 -18550576 -12404004 -12811004 -12684383
261a2684383K533017j127207n546975j149494P733545Q249518k96123n308938
$$ -12684383 -10151366 -11278573 -16825548 -17975042 -10241497 -1991979 -2288102 -7597040
253g597040n08096O069606N678674j26014m721858m292863J185292P693799Q070286
$$ -7597040 -8105136 -2035530 3643144 3517130 -1204728 -5497591 -4312299 3381500 11451786
244A1451786M88579n944181k810749L797001K507888l938657l482103L084254
$$ 11451786 11940365 5996184 3185435 6982436 9490324 5551667 2069564 5153818
236E153818K788272n433527p222158J426400N255090m022631j2076979n656302
$$ 5153818 7942090 2508563 -4713595 -3287195 1967895 -2054736 -14131715 -19788017
228a9788017N510765O276428L37027p69016L25547m413610q474203j240342R406825
$$ -19788017 -14277252 -8000824 -7663797 -8432813 -8107266 -12520876 -20995079 -22235421 -12828596
219a2828596P455133l378450n420689K027371K247061p467989r554060K765300
$$ -12828596 -5373463 -8751913 -14172602 -12145231 -9898170 -17366159 -26920219 -24154919
211b4154919J2633383Q031666Q72831L796111P587559n51579j1734180q762177
$$ -24154919 -11521536 -3489870 -2617039 1179072 8766631 8215052 -3519128 -12281305
203a2281305N213912J1798899N646460j584129l119282m195180o311152k303180
$$ -12281305 -7067393 4731506 10377966 8793837 5674555 1479375 -4831777 -7134957
195g134957P543864R810379k536850j5924302j2617038M515798J4874744O720737
$$ -7134957 408907 10219286 7682436 -8241866 -20858904 -16343106 -1468362 5252375
187E252375q691824j2703074k411297Q128615P891079K307552L016558J0096116
$$ 5252375 -3439449 -16142523 -18553820 -10425205 -2534126 -226574 2789984 12886100
179A2886100J2692969N811673l040600o287136o072574o251400l271546N974186
$$ 12886100 25579069 31390742 28350142 22063006 15990432 9739032 6467486 12441672
171A2441672J3250708P253890r101057k0217240j7177975o473224J753901M997461
$$ 12441672 25692380 32946270 23845213 3627973 -13550002 -20023226 -18269325 -13271864
163a3271864N187128K902121m38193j155031J081230J498930j718263l102544
$$ -13271864 -8084736 -5182615 -5620808 -6775839 -5694609 -4195679 -5913942 -9016486
155i016486J604288P893931Q988787N316589J583893j272588m414328n133931
$$ -9016486 -7412198 481733 9470520 14787109 16371002 15098414 10684086 5550155
147E550155n05155N226685N008356l86262m050885m444131o282815r671083q345792
$$ 5550155 5045000 10271685 15280041 14893779 10842894 6398763 115948 -9555135 -17900927
138a7900927j328593L602233K656869K724148Q634208J2439313M726316r451915
$$ -17900927 -19229520 -15627287 -12970418 -10246270 -1612062 10827251 15553567 6101652
130F101652j6202469j0934398j321679N472521Q900267R493695O699934K584553
$$ 6101652 -10100817 -21035215 -22356894 -16884373 -7984106 1509589 8209523 10794076
122A0794076j81361l455407q849797j0205227j721277Q173853N336625o735796
$$ 10794076 10612715 7157308 -1692489 -11897716 -13618993 -5445140 -108515 -6844311
114f844311q746273M285379J3008618M139630p213866k250096R718117O750781
$$ -6844311 -15590584 -11305205 1703413 5843043 -1370823 -3620919 6097198 12847979
106A2847979p882776j0018885M742217J2137782j885406j7722983j1709603Q864609
$$ 12847979 4965203 -5053682 -311465 11826317 9940911 -7782072 -19491675 -10627066
98a0627066J7973257O950127r361905j6723455j5046874r084589l52693Q252009
$$ -10627066 7346191 14296318 4934413 -11789042 -26835916 -35920505 -36273198 -28021189
90b8021189R948566J793758r269713j1902378j842425J2108760J4985235K490047
$$ -28021189 -18072623 -16278865 -25548578 -37450956 -39293381 -27184621 -12199386 -9709339
82i709339j0231824m662497J5078860K3718414Q241868j2512052j3246279K974784
$$ -9709339 -19941163 -24603660 -9524800 14193614 22435482 9923430 -3322849 -348065
74c48065J1610637K851763p942722o740418L67571J351115k984879m004422j1762
$$ -348065 11262572 14114335 6171613 -568805 -201234 1149881 -1834998 -5839420 -5851182
65e851182L341344K526317r27365l889536l797198m58261K201196L72443k962007
$$ -5851182 -2509838 16479 -910886 -4800422 -8597620 -9055881 -6854685 -6482242 -9444249
56i444249j747818K432474K091802k280205j212355O683279R095342m91065r577320
$$ -9444249 -11192067 -8759593 -6667791 -8947996 -10160351 -3477072 5618270 5127205 -4450115
47d450115m828039O071120N544987o784398j4289259q717812M30152L426086K700605
$$ -4450115 -9278154 -3207034 2337953 -4446445 -18735704 -27453516 -27023364 -23597278 -20896673
38b0896673L469381M404220L569906L601154M863065K392134m046172n720387
$$ -20896673 -17427292 -13023072 -9453166 -5852012 -988947 1403187 -2642985 -8363372
30h363372J405191O918616P1476j2149611j3028079o1493J1211280Q988065p188
$$ -8363372 -6958181 -39565 31911 -12117700 -25145779 -25207272 -13995992 -5007927 -5015115
21e015115k539215K664664O161597K991243k050463l886285l995700m836808l586507
$$ -5015115 -7554330 -4889666 1271931 4263174 2212711 -1673574 -5669274 -10506082 -14092589
12a4092589K776677R346960P509512k395713r451649o058387K296922N596520
$$ -14092589 -11315912 -1968952 5540560 3144847 -6306802 -12365189 -10068267 -4471747
4d471747K612793o05004j843997m092682
$$ -4471747 -1858954 -2463958 -4307955 -8400637
0h400637
$$ -8400637
$$ Imaginary data points
##PAGE= N=2
##DATA TABLE= (X++(I..I)), XYDATA
65535a6325345o23445O704809R140317N475914K081111K326247J960240k443304
$$ -16325345 -16948790 -10243981 -1103664 4372250 6453361 8779608 10739848 8296544
65527H296544p014888o828793l715587k652081l324303q90166N411496R316601
$$ 8296544 1281656 -5547137 -9262724 -11914805 -15239108 -16129274 -10717778 -1401177
65519a401177N078942m464168r986362o077551K211968N186949L55148m698458
$$ -1401177 3677765 -786403 -10772765 -16850316 -14638348 -9451399 -9096251 -13794709
65511a3794709k515290M750923R242677P815860L916400Q28793j554965l474361
$$ -13794709 -16309999 -11559076 -2316399 5499461 9415861 10244654 8689689 5215328
65503E215328l856551k780460j341245J020806M867653O957494L491354k714367
$$ 5215328 1358777 -1421683 -2762928 -1742122 3125531 10083025 13574379 10860012
65495A0860012m414189l87041K575283K677m316972n456479m172735l159735k303184
$$ 10860012 6445823 6058782 8634065 8636742 4319770 -1136709 -5309444 -8469179 -10772363
65486a0772363j409024k008293k704690J070819Q402822J0992700N456634L6005
$$ -10772363 -12181387 -14189680 -16894370 -15823551 -7420729 3571971 9028605 9064610
65478I064610J657496L889888k160654j1320029j1346745k884661J430243k615669
$$ 9064610 10722106 14611994 12451340 1131311 -10215434 -13100095 -11669852 -14285521
65470a4285521n152155M98896P793433R122511O690791M865581J581393m898988
$$ -14285521 -19437676 -18938780 -11145347 -2022836 4667955 9533536 11114929 6215941
65462F215941q913133n658364p144J470778J384605N061597Q479608L949150m980556
$$ 6215941 -2697192 -8355556 -8362700 -6891922 -5507317 -445720 8033888 11983038 7002482
65453G002482o470986J558710P944516N297062l71625j599839r98365l696689
$$ 7002482 531496 2090206 10034722 15331784 14960159 13360320 12361955 8665266
65445H665266o293695k386134N905326J1009953J1214463R831118N633746n056864
$$ 8665266 2371571 -14563 5890763 16900716 28115179 37946297 43580043 38523179
65437C8523179j6642075j6431383k807070Q947328N887673n455610r598757l603428
$$ 38523179 21881104 5449721 2642651 11589979 17477652 12022042 2423285 -1180143
65429a180143K170344J454285r59140L3420K045562J009139k608148o422934q976246
$$ -1180143 990201 2444486 1485346 1518766 3564328 4573467 1965319 -4457615 -13433861
65420a3433861p584043L25232J0706514J4006129O881671k498412n183755k578160
$$ -13433861 -21017904 -20692672 -9986158 4019971 10901642 8403230 3219475 641315
65412F41315k030496n491933p993272m991439K960759J0879750J2169276M177461
$$ 641315 -1389181 -6881114 -14874386 -19865825 -16905066 -6025316 6143960 10321421
65404A0321421o623802r550802k730766M158950L642990K17996J063135M123197
$$ 10321421 3697619 -5853183 -8583949 -4424999 -782009 -564013 499122 4622319
65396D622319L245675n76729k022403j119776j058146k36788L885294O534640
$$ 4622319 7867994 7291265 5268862 4149086 3090940 2854152 6739446 13274086
65388A3274086J822633n527922o110843j598233j974867p571724p734408O91374
$$ 13274086 15096719 9568797 3457954 1859721 -115146 -7686870 -15421278 -14729904
65380a4729904P595632O538079L883988M826360L497061m037650q692783k049725
$$ -14729904 -7134272 -596193 3287795 8114155 11611216 7573566 -1119217 -3168942
65372c168942P476320N310543p246041j4478190q278503K641018O605315K753389
$$ -3168942 4307378 9617921 2371880 -12106310 -20384813 -17743795 -11138480 -8385091
65364h385091j949708k803768m99715K378064M358463N050633L928856O16091
$$ -8385091 -10334799 -13138567 -13638282 -11260218 -6901755 -1851122 2077734 2693825
65356B693825k904154k270811M011895J0413622R681524K032379n538144q803899
$$ 2693825 -210329 -2481140 1530755 11944377 21625901 23658280 18120136 9316237
65348I316237r447874q496241l707695M432927J0684464J1806199R711138N958939
$$ 9316237 -131637 -8627878 -12335573 -7902646 2781818 14588017 24299155 30258094
65340C0258094l71374p199706r236757o244917m174263n164371m596459j230099
$$ 30258094 29886720 22687014 13450257 7205340 3031077 -2133294 -6729753 -7959852
65332g959852n28914l323327k032534N087096P283419j588508r917747m633794
$$ -7959852 -8488766 -11812093 -13844627 -8757531 -1474112 -3062620 -12980367 -17614161
65324a7614161P716054J0233429M92047q368050q473496m960711l153500r44886
$$ -17614161 -9898107 335322 827369 -7540681 -16014177 -20974888 -24128388 -25073274
65316b5073274L790729Q128236R078857O863400K677288q49335J325150R830144
$$ -25073274 -21282545 -13154309 -4075452 2787948 5465236 4615901 5941051 15771195
65308A5771195J5098326P119325r678366j9692124j4639291j758985O494696M707496
$$ 15771195 30869521 37988846 28310480 8618356 -6020935 -7779920 -1285224 3422272
65300C422272l147725q121368l956081N478388R194534L241204l553938k811405
$$ 3422272 274547 -7846821 -11802902 -6324514 2870020 6111224 2557286 -254119
65292b54119J902833L574095L080494L291501J237634l307982j910782P189346
$$ -254119 1648714 5222809 8303303 11594804 12832438 9524456 7613674 14803020
65284A4803020R942039r62250p833259N387908K0515293Q582179k1217446l0706170
$$ 14803020 24745059 23782809 15949550 21337458 41852751 50434930 29217484 -1488686
65276a488686j1289423L640526o232173j7454987n458055J4409795J4400794j147240
$$ -1488686 -12778109 -9137583 -15369756 -32824743 -38282798 -23873003 -9472209 -10619449
65268a0619449p505209M43320P823686Q859225R953062R644113k70753j5218855
$$ -10619449 -18124658 -17681338 -9857652 -998427 8954635 18598748 18327995 3109140
65260C109140j9593815q518849P180238J6603051J6512092O827105q003569j5981975
$$ 3109140 -16484675 -25003524 -17823286 -1220235 15291857 22118962 14115393 -1866582
65252a866582r051314M365767R323902L522685l735087o607062n544493o79890
$$ -1866582 -10917896 -6552129 2771773 6294458 2559371 -4047691 -9592184 -10272074
65244a0272074N687892N506784m175308j2627700r467801j03336N112149P701511
$$ -10272074 -4584182 922602 -3252706 -15880406 -25348207 -25451543 -20339394 -12637883
65236a2637883J2024100J0094081m965994j9016423j3171904N605267J3978318
$$ -12637883 -613783 9480298 4514304 -14502119 -27674023 -22068756 -8090438
65229h090438Q382648N739979R641760N168194q585806j1309094K434423Q459155
$$ -8090438 292210 6032189 15673949 20842143 12256337 947243 3381666 11840821
65221A1840821q654655k6640588j7190504J0802440K3999266J1053307o863081
$$ 11840821 3186166 -23454422 -40644926 -29842486 -5843220 5210087 -1652994
65214a652994r111159O84350O799814L227934k959692l872467j046487k499536
$$ -1652994 -10764153 -10079803 -3279989 -52055 -3011747 -6884214 -7930701 -10430237
65206a0430237r974295j3556904m722522R248769J3846925Q016583L478774L884711
$$ -10430237 -20404532 -33961436 -38683958 -29435189 -15588264 -7571681 -4092907 -208196
65198b08196M37426q492631j0444323M90223J1074678P621690m481759j0647589
$$ -208196 229230 -8263401 -18707724 -18217501 -7142823 478867 -4002892 -14650481
65190a4650481o688190J531955R153004J3236175J0404572K387038l044013l181716
$$ -14650481 -21338671 -19806716 -10653712 2582463 12987035 15374073 12330060 9148344
65182I148344l911266o931054n218614K064266M082590k978552o565801Q96408
$$ 9148344 5237078 -1693976 -6912590 -4848324 -765734 -3744286 -10310087 -9413679
65174i413679O585705j204959j0409078l464550J2822657J7303339P282917o55708
$$ -9413679 -2827974 -4032933 -14442011 -17906561 -5083904 12219435 19502352 18846644
65166A8846644R24268K418758k403452p320340p161373m424637m01492O300190
$$ 18846644 19770912 22189670 19786218 12465878 5304505 879868 478376 6778566
65158F778566J1184888P015807l608176j0654288j0787095p390781J65216J2736837
$$ 6778566 17963454 24979261 21371085 10716797 -70298 -7461079 -7295863 5440974
65150E440974K0044528J0359720q963063j7703426j0149361L23612M260203N532313
$$ 5440974 25485502 35845222 26882159 9178733 -970628 -647016 3613187 9145500
65142I145500O235498J618397n816930n810671R79660K054400l991886l232548
$$ 9145500 15380998 16999395 11182465 5371794 6351454 8405854 4413968 1181420
65134A181420P946831J3694750N206069l993545k182862O73103o620820j3681931
$$ 1181420 9128251 22823001 28029070 24035525 21852663 22525766 15904946 2223015
65126B223015n854723Q919968J1532653J575976m240107J041040P209557M740135
$$ 2223015 -3631708 5288260 16820913 18396889 14156782 15197822 22407379 27147514
65118B7147514m273212j2458503j3997564p051783K660051M980361j150025m500905
$$ 27147514 22874302 10415799 -3581765 -10633548 -7973497 -2993136 -4143161 -8644066
65110h644066Q16350M900327p34810p376754m270599J770101j031449o705679
$$ -8644066 -7827716 -2927389 -3662199 -11038953 -15309552 -13539451 -14570900 -21276579
65102b1276579j389689J0330401J0522452k492697j0553322l576367P450218R458618
$$ -21276579 -22666268 -12335867 -1813415 -4306112 -14859434 -18435801 -10985583 -1526965
65094a526965L569592k632628o249348p493988o535350m933390l170158J948218
$$ -1526965 2042627 -590001 -6839349 -14333337 -20868687 -25802077 -28972235 -27024017
65086b7024017R553317R639105k475650j2806166n770586J0210835J3166044J141896
$$ -27024017 -17470700 -7831595 -10307245 -23113411 -28883997 -18673162 -5507118 -4365222
65078d365222n946305J054207Q270724M127878l993433o305555n546364o565160
$$ -4365222 -10311527 -9257320 -986596 3141282 -852151 -7157706 -12704070 -19269230
65070a9269230o664726m133104k066232J606073J1851051K0347419J1534765r187386
$$ -19269230 -25933956 -30067060 -32133292 -30527219 -18676168 1671251 13206016 4018630
65062D018630j6100173j623122R879168L51580j4273792j3037159l515191l200528
$$ 4018630 -12081543 -13704665 -3825497 -3473917 -17747709 -30784868 -34300059 -37500587
65054c7500587o938594L49981J3174680J5222484Q798766P683193R496339K530158
$$ -37500587 -44439181 -44089200 -30914520 -15692036 -6893270 789923 10286262 12816420
65046A2816420o925197k808917R164276P568482p569022j2974390q99063Q673903
$$ 12816420 5891223 3082306 12246582 19815064 12246042 -728348 -1627411 7046492
65038G046492K158761p080946l385283P464523J1609209P407559J039122m572289
$$ 7046492 9205253 2124307 -1260976 6203547 17812756 25220315 26259437 21687148
65030B1687148p288840m200595Q18680j82262m817999k291399O941762R507740
$$ 21687148 14398308 10197713 11016393 10834131 6016132 3724733 10666495 20174235
65022B0174235J612702m340267k044036j945287j0531379j6437581q957845M191544
$$ 20174235 21786937 17446670 15402634 13457347 2925968 -13511613 -22469458 -18277914
65014a8277914R584695O454452J882032j115990j710163J396932L739744j283739
$$ -18277914 -8693219 -2238767 -356735 -1472725 -3182888 -1785956 1953788 670049
65006F70049p405086m61954J5635722J8410700J984358j0171159k378941P009659
$$ 670049 -6735037 -7196991 8438731 26849431 28833789 18662630 16283689 23293348
64998B3293348k463521j6940476j1267868P497796J0797051n510507j6747861
$$ 23293348 20829827 3889351 -7378517 119279 10916330 5405823 -11342038
64991a1342038r229936L449747O911215M918642N693030P808627O686469K594524
$$ -11342038 -20571974 -17122227 -10211012 -5292370 400660 8209287 14895756 17490280
64983A7490280j905732l615785J337997J0277838J1455604k68576j2049018j0624723
$$ 17490280 15584548 11968763 13306760 23584598 35040202 34771626 22722608 12097885
64975A2097885l050740l631585q808653n158507M427887N348005j902445l137157
$$ 12097885 9047145 5415560 -3393093 -8551600 -4123713 1224292 -678153 -3815310
64967c815310L013539L949234j525897j109217N770554N279302m249474p372217
$$ -3815310 -801771 3147463 1621566 512349 6282903 11562205 7312731 -59486
64959e9486J017751O782785J967445l616118l391325l667952m893509K395474
$$ -59486 958265 7741050 9708495 6092377 2701052 -966900 -5860409 -3464935
64951c464935J4030814J0665085q322760j6070492P87788J8185951J1364253p806152
$$ -3464935 10565879 21230964 12908204 -3162288 -2374500 15811451 27175704 19369552
64943A9369552j2784626j706942Q887880J2628659J1790710K399067j4933656
$$ 19369552 6584926 4877984 13765864 26394523 38185233 40584300 25650644
64936B5650644k2755416r747440O369900L596967q838602o720000P878867J1437974
$$ 25650644 2895228 -6852212 -482312 3114655 -5723947 -12443947 -4565080 6872894
64928F872894r45883j0596879q504870m616319k970339M668057J6529024J7892229
$$ 6872894 5927011 -4669868 -13174738 -17791057 -20761396 -16093339 435685 18327914
64920A8327914O181246l887814n658787q648926j5584969j4476601j958744P484873
$$ 18327914 24509160 20621346 14962559 6313633 -9271336 -23747937 -25706681 -18221808
64912a8221808N863989M573092J1301546J4120425L194844r380165q503468n92266
$$ -18221808 -12357819 -7784727 3516819 17637244 20832088 11451923 2948455 2356189
64904B356189r68086p461058n714742N425831J2235633P934406L91624k777948
$$ 2356189 1388103 -6072955 -11787697 -6361866 5873767 13808173 14199797 11421849
64896A1421849l538055n038692m773774j028565J347127k484710q952279r903321
$$ 11421849 7883794 2845102 -1928672 -2957237 -1610110 -4094820 -13047099 -22950420
64888b2950420l661306K958872M883011N814602J0524477J4356965Q846792l290138
$$ -22950420 -26611726 -23652854 -18769843 -12955241 -2430764 11926201 20772993 17482855
64880A7482855r314416m837034L31460n47863o42698N593610J0187692O068355
$$ 17482855 8168439 3331405 3662865 3115002 2472304 8065914 18253606 24321961
64872B4321961J241500L689683M170760p147862j7561340q695358J0353836J3113391
$$ 24321961 25563461 29253144 33423904 26276042 8714702 19344 10373180 23486571
64864B3486571l082740j3547024o336750K116064j086894m847889J866451R184398
$$ 23486571 20403831 6856807 520057 2636121 1549227 -3298662 -1432211 7752187
64856G752187N428984k143830k133512J380032j34683k901365l04200L411635
$$ 7752187 13181171 11037341 8903829 10283861 10149178 7247813 6943613 10355248
64848A0355248L097721M063989R862334J1645492L896878k681455O55917L619503
$$ 10355248 13452969 17516958 27379292 39024784 42921662 40240207 40896124 44515627
64840D4515627m544203j3220175p664226L800764K541002r631306j6221179j5341889
$$ 44515627 39971424 26751249 19087023 22887787 25428789 15797483 -423696 -15765585
64832a5765585j7757313k0194408q367845J2786049J9593330O199264m653534
$$ -15765585 -33522898 -53717306 -62085151 -49299102 -29705772 -23506508 -28160042
64825b8160042L077365J5335372J2666039j056477j0138683j2013239j3277364
$$ -28160042 -25082677 -9747305 2918734 1862257 -8276426 -20289665 -33567029
64818c3567029j1423432R51627J8214398K4659784J5839761M150117N69371R97111
$$ -33567029 -44990461 -44038834 -25824436 -1164652 14675109 18825226 19394597 20391708
$$ [...]
##END NTUPLES=NMR SPECTRUM
##END=
