##TITLE=31Pdec_PR152_rmH
 D2O, 24 sc
 15.3.2019
##JCAMPDX= 6.0         $$ Bruker NMR JCAMP-DX V2.0
##DATA TYPE= NMR SPECTRUM
##DATA CLASS= NTUPLES
##ORIGIN= UXNMR, Bruker Analytische Messtechnik GmbH
##OWNER= root
$$ XWIN-NMR		Version 3.5
$$ Fri Mar 15 15:54:54 2019 Russian Standard Time (UT+4h)  she@DPX200
##.OBSERVE FREQUENCY= 81.013821
##.OBSERVE NUCLEUS= ^31P
##.ACQUISITION MODE= SIMULTANEOUS
##.ACQUISITION SCHEME= undefined
##.AVERAGES= 24
##.DIGITISER RES= 17
##SPECTROMETER/DATA SYSTEM= spect
##.PULSE SEQUENCE= zgpg30
##.SOLVENT NAME= D2O
##.SHIFT REFERENCE= (INTERNAL, D2O, 0, 182.463)
##AUDIT TRAIL= $$ (NUMBER, WHEN, WHO, WHERE, WHAT)
$$ ##TITLE= Audit trail, XWIN-NMR		Version 3.5
$$ ##JCAMPDX= 5.01
$$ ##ORIGIN= Bruker BioSpin GmbH
$$ ##OWNER= she
$$ F:/spectra/data/she/nmr/P31/1/pdata/1/auditp.txt
$$ ##AUDIT TRAIL=  $$ (NUMBER, WHEN, WHO, WHERE, WHAT)
(   1,<2019-03-15 15:51:21.60 +0400>,<she>,<DPX200>,
      <created by zg, POWCHK disabled, PULCHK disabled
       configuration hash MD5:
       00 E9 B6 7A A2 85 ED C7 34 08 36 98 17 FE 4E 26
       data hash MD5: 32K
       9A C5 54 49 1B 0B 75 EA CF 2D 78 95 6D 66 01 E3>)
(   2,<2019-03-15 15:52:05.04 +0400>,<she>,<DPX200>,
      <Start of raw data processing
       efp BC_mod = 2 LB = 1 FT_mod = 6 PKNL = 1 PHC0 = -1820.73 PHC1 = 103.1989 SI = 64K 
       data hash MD5: 64K
       59 C9 2D 52 69 66 45 6E 0E 40 EF 6A B2 CA A5 6D>)
(   3,<2019-03-15 15:53:19.50 +0400>,<she>,<DPX200>,
      <pk PHC0 = -33.4931 PHC1 = 0 
       data hash MD5: 64K
       42 3D 2B 63 FF 0B 3A 9B 5C 26 3C 3A 36 C6 4B C4>)
(   4,<2019-03-15 15:53:24.45 +0400>,<she>,<DPX200>,
      <abs ABSG = 5 
       data hash MD5: 64K
       8D 09 8C 75 2C 82 9B 93 BD 40 2C 3C A4 CB FF 49>)
$$ ##END=
$$ 
$$ hash MD5
$$ C4 9C 07 22 E0 5C EA 29 12 DC D6 B1 F0 FE 4F 07
##$RELAX= 
##$RELAX= 
##$RELAX= 
##$RELAX= 
##$RELAX= 
##$RELAX= 
##$RELAX= 
##$RELAX= 
$$ Bruker specific parameters
$$ --------------------------
##$DU= <F:/spectra>
##$EXPNO= 1
##$NAME= <P31>
##$PROCNO= 1
##$TYPE= <nmr>
##$USER= <she>
##$AMP= (0..31)
100 100 100 100 100 100 100 100 100 100 100 100 100 100 100 100 100 100 
100 100 100 100 100 100 100 100 100 100 100 100 100 100 
##$AQSEQ= 0
##$AQ_mod= 1
##$AUNM= <au_zg>
##$AUTOPOS= <>
##$BF1= 81.014009
##$BF2= 200.13
##$BF3= 200.13
##$BF4= 200.13
##$BF5= 200.13
##$BF6= 200.13
##$BF7= 200.13
##$BF8= 200.13
##$BYTORDA= 1
##$CFDGTYP= 0
##$CFRGTYP= 5
##$CHEMSTR= <none>
##$CNST= (0..31)
1 1 145 1 1 1 1 1 1 1 1 1 1 1 1 1 1 1 1 1 1 1 1 1 1 1 1 1 1 1 1 1 
##$CPDPRG= <waltz16>
##$CPDPRG1= <>
##$CPDPRG2= <waltz16>
##$CPDPRG3= <>
##$CPDPRG4= <mlev>
##$CPDPRG5= <mlev>
##$CPDPRG6= <mlev>
##$CPDPRG7= <mlev>
##$CPDPRG8= <mlev>
##$CPDPRGB= <>
##$CPDPRGT= <>
##$D= (0..31)
0 1 0 0 0 0 0 0 0 0 0 0.03 2e-05 3e-06 0 0 0 0 0 0 0 0 0 0 0 0 0 0 0 0 
0 0 
##$DATE= 1552650680
##$DBL= (0..7)
120 120 120 11 120 120 24 19 
##$DBP= (0..7)
150 150 150 150 150 150 150 150 
##$DBP07= 0
##$DBPNAM0= <>
##$DBPNAM1= <>
##$DBPNAM2= <>
$$ [...]
##$SUBNAM3= <"">
##$SUBNAM4= <"">
##$SUBNAM5= <"">
##$SUBNAM6= <"">
##$SUBNAM7= <"">
##$SUBNAM8= <"">
##$SUBNAM9= <"">
##$SW= 369.568048894756
##$SWIBOX= (0..15)
0 1 3 0 0 0 0 0 0 0 0 0 0 0 0 0 
##$SW_h= 29940.119760479
##$TD= 32768
##$TD0= 1
##$TE= 0
##$TE2= 300
##$TE3= 300
##$TEG= 300
##$TL= (0..7)
0 120 53 12 22 120 120 120 
##$TP= (0..7)
150 150 150 150 150 150 150 150 
##$TP07= 0
##$TPNAME0= <>
##$TPNAME1= <>
##$TPNAME2= <>
##$TPNAME3= <>
##$TPNAME4= <>
##$TPNAME5= <>
##$TPNAME6= <>
##$TPNAME7= <>
##$TPOAL= (0..7)
0.5 0.5 0.5 0.5 0.5 0.5 0.5 0.5 
##$TPOFFS= (0..7)
0 0 0 0 0 0 0 0 
##$TUNHIN= 0
##$TUNHOUT= 0
##$TUNXOUT= 0
##$USERA1= <user>
##$USERA2= <user>
##$USERA3= <user>
##$USERA4= <user>
##$USERA5= <user>
##$V9= 5
##$VALIST= <valist>
##$VCLIST= <CCCCCCCCCCCCCCC>
##$VD= 0
##$VDLIST= <DDDDDDDDDDDDDDD>
##$VPLIST= <PPPPPPPPPPPPPPP>
##$VTLIST= <TTTTTTTTTTTTTTT>
##$WBST= 1024
##$WBSW= 4
##$XGAIN= (0..3)
0 0 0 0 
##$XL= 0
##$YL= 0
##$YMAX_a= 31073
##$YMIN_a= -32129
##$ZGOPTNS= <>
##$ZL1= 120
##$ZL2= 120
##$ZL3= 120
##$ZL4= 120
##$ABSF1= 182.463
##$ABSF2= -187.1042
##$ABSG= 5
##$ABSL= 3
##$ALPHA= 0
##$AQORDER= 0
##$ASSFAC= 0
##$ASSFACI= 0
##$ASSFACX= 0
##$ASSWID= 0
##$AUNMP= <proc_1d>
##$AZFE= 0.1
##$AZFW= 0.5
##$BCFW= 0
##$BC_mod= 2
##$BYTORDP= 0
##$COROFFS= 0
##$CY= -3
##$DATMOD= 1
##$DC= 0
##$DFILT= <>
##$DTYPP= 0
##$F1P= 0
##$F2P= 0
##$FCOR= 1
##$FTSIZE= 65536
##$FT_mod= 6
##$GAMMA= 0
##$GB= 0
##$INTBC= 1
##$INTSCL= 5.30512e-09
##$ISEN= 30
##$LB= 1
##$LEV0= 0
##$LPBIN= 0
##$MAXI= 10000
##$MC2= 0
##$MEAN= 0
##$ME_mod= 0
##$MI= 50
##$NCOEF= 0
##$NC_proc= -5
##$NLEV= 6
##$NOISF1= 182.463
##$NOISF2= 159.3651
##$NSP= 0
##$NTH_PI= 0
##$NZP= 0
##$OFFSET= 182.463
##$PC= 4
##$PHC0= -1854.223
##$PHC1= 103.1989
##$PH_mod= 1
##$PKNL= yes
##$PPARMOD= 0
##$PSCAL= 0
##$PSIGN= 0
##$REVERSE= no
##$SF= 81.0140089999434
##$SI= 65536
##$SIGF1= 159.3651
##$SIGF2= -187.1042
##$SINO= 113.3802
##$SIOLD= 16384
##$SREGLST= <1H.CDCl3>
##$SSB= 0
##$STSI= 65536
##$STSR= 0
##$SW_p= 29940.119760479
##$SYMM= 0
##$S_DEV= 0
##$TDeff= 32768
##$TDoff= 0
##$TI= <>
##$TILT= no
##$TM1= 0
##$TM2= 0
##$TOPLEV= 0
##$USERP1= <user>
##$USERP2= <user>
##$USERP3= <user>
##$USERP4= <user>
##$USERP5= <user>
##$WDW= 1
##$XDIM= 65536
##$YMAX_p= 474599517
##$YMIN_p= -7796846
$$ End of Bruker specific parameters
$$ ---------------------------------
##NTUPLES= NMR SPECTRUM
##VAR_NAME=  FREQUENCY,     SPECTRUM/REAL,   SPECTRUM/IMAG
##SYMBOL=    X,             R,               I
##VAR_TYPE=  INDEPENDENT,   DEPENDENT,       DEPENDENT
##VAR_FORM=  AFFN,          ASDF,            ASDF
##VAR_DIM=   65536,         65536,           65536
##UNITS=     HZ,            ARBITRARY UNITS, ARBITRARY UNITS
##FACTOR=    0.456856943014862, 1,           1
##FIRST=     14782.0589164792, 0,            0
##LAST=      -15158.0608439998, 0,           0
##MIN=       -15158.0608439998, -7796846,    0
##MAX=       14782.0589164792, 474599517,    0
$$ Real data points
##PAGE= N=1
##DATA TABLE= (X++(R..R)), XYDATA
$$ [...]
41749A240611l48519j238506o31432K64509l03494j499836j163122O02214J567759
$$ 1240611 892092 -346414 -977846 -713337 -1016831 -2516667 -3679789 -3077575 -1509816
41740a509816Q35350j71746k52611J40147L24706L75298K55945l65535r98696
$$ -1509816 -674466 -846212 -1098823 -958676 -633970 -258672 -2727 -368262 -1366958
41731a366958n95884O06823J056775K20597n68829k43396M92382N61634O8000
$$ -1366958 -1962842 -1356019 -299244 -78647 -647476 -890872 -398490 163144 231144
41722B31144m04951p97406r86366l95396Q35312J410336O49430l55124m30625
$$ 231144 -173807 -971213 -1957579 -2352975 -1517663 -107327 542103 186979 -243646
41713b43646q5865k90575n24785L03208J639130J783622M70161o92515n56081
$$ -243646 -329511 -620086 -1144871 -841663 797467 2581089 3051250 2358735 1802654
41704A802654J71292K76150l27469q78356r06443n32913r0812J46657J16772M2840
$$ 1802654 1973946 2250096 1922627 1044271 137828 -395085 -485897 -339240 -222468 -179628
41694a79628J73016M45560O27762O47920N12363J35173l70188n21973r2331L70192
$$ -179628 -6612 438948 1066710 1714630 2226993 2362166 1991978 1470005 1377674 1747866
41684A747866K14201l58936o48513n41730n09204o45462n27819o3423K93548L03465
$$ 1747866 1962067 1603131 954618 412888 -96316 -741778 -1269597 -1333020 -1039472 -736007
41674g36007K37068K61263J72668q9704k72516l08840m01213m77124k04701K94351
$$ -736007 -498939 -237676 -65008 -154712 -427228 -736068 -1137281 -1614405 -1819106 -1524755
41664a524755M43899J41451m0053J46796K16816m3274n948P03302J269825P24224
$$ -1524755 -1080856 -939405 -979458 -832662 -615846 -659120 -665068 38234 1308059 2032283
41654B032283n40809j208292p98237j37701n4356l37513k38667M42963J067231
$$ 2032283 1491474 283182 -515055 -652756 -707112 -1044625 -1283292 -840329 226902
41645B26902Q61838j27098q81715n02647N67144R71668K68730m32146j48866M78155
$$ 226902 1088740 961642 79927 -422720 144424 1116092 1384822 952676 803810 1281965
41635A281965K69716n55497p52221p3600M21502J75899p5121K45472N01850k2350
$$ 1281965 1551681 996184 243963 170363 591865 767764 692643 938115 1439965 1417615
41625A417615q42266r93934m32589J26404L29148L52849K79044P1472k8829J98385
$$ 1417615 575349 -418585 -851174 -724770 -395622 -42773 236271 307743 278914 477299
41615D77299M12574J44205l79257n40223l45378l49735n83897m26682K62893P38440
$$ 477299 889873 1034078 654821 114598 -230780 -580515 -1164412 -1591094 -1328201 -589761
41605e89761M92297N7111J34015N10590N14549J28356j00166n4772j85455o12591
$$ -589761 -97464 -40353 93662 604252 1118801 1247157 1146991 1092219 906764 294173
41595B94173p98992l76089K27217L64027N2805j38565N7032K94061J87665j57901
$$ 294173 -504819 -880908 -653691 -289664 -236859 -375424 -318392 -24331 163334 5433
41585E433l81988l86020l26029j98425J78167O71397P20299O0688o64174n18244
$$ 5433 -376555 -762575 -1088604 -1287029 -1108862 -437465 282834 343522 -320652 -838896
41575h38896M72399J161683O37135o10424j261520p64166Q7712K66919j69905
$$ -838896 -366497 795186 1432321 821897 -439623 -1203789 -1116077 -849158 -1019063
41566a019063k47548N14675J311417J027651k06127j033495o20836K21237K11080
$$ -1019063 -1266611 -751936 559481 1587132 1381005 347510 -273326 -52089 158991
41557A58991n52311p76168O1322Q97165N85221n62810j300028r69497P1843J112632
$$ 158991 -393320 -1169488 -1108166 -211001 374220 -188590 -1488618 -2458115 -2386272 -1273640
41547a273640J547850J046733m4180o99373k95754M84807N17287k00234o69161
$$ -1273640 274210 1320943 1276763 577390 281636 766443 1283730 1083496 414335
41538D14335m80572k84303m93785n50873K319N65468L36952m20573p55280l74298
$$ 414335 -66237 -350540 -844325 -1395198 -1392879 -827411 -490459 -911032 -1666312 -2040610
41528b040610J08416J70924K257N4010M11788P46158O74563J36182m83021o81555
$$ -2040610 -1932194 -1761270 -1759013 -1705003 -1293215 -547057 127506 263688 -219333 -900888
41518i00888l92224l9153M1752j4205O5449K70408M19634M18320K34576n9410
$$ -900888 -1293112 -1332265 -1290513 -1304718 -1239269 -968861 -549227 -130907 103669 44259
41508D4259j00208M24292J036232P31738n62686j484237r08195M43502R86073
$$ 44259 -55949 368343 1404575 2136313 1573627 89390 -818805 -375303 610770
41499F10770M42833o4359R3643K91415o4483o18808q47148q13614o55159j36697
$$ 610770 1053603 989244 1082887 1374302 1309819 691011 -156137 -969751 -1624910 -1761607
41489a761607O97282J138339P29399l998l50514l84975m80457m16733J62133P85842
$$ -1761607 -1064325 74014 803413 799415 448901 63926 -416531 -833264 -671131 114711
41479A14711O22800k11237p10627l93862J53025K93771J28469k2421k12680m91420
$$ 114711 737511 526274 -184353 -578215 -425190 -131419 -2950 -25371 -238051 -729471
41469g29471m81667P2069O54758N02953k97859p90551l47345N21441Q22718L02479
$$ -729471 -1211138 -1139069 -484311 18642 -279217 -1069768 -1417113 -895672 -72954 229525
41459B29525l19520k83135L64556R56923R81222M48012l24249r72193j181798
$$ 229525 -89995 -373130 -8574 948349 1929571 2377583 2053334 1081141 -100657
41450a00657q45109k01908L74508P27838Q32310M80215m65979j460931j509966
$$ -100657 -945766 -1147674 -773166 -45328 786982 1267197 801218 -659713 -2169679
41441b169679l55476J006399J411295Q04925K5915l55973m41065m43807l54484
$$ -2169679 -2525155 -1518756 -107461 697464 723379 367406 -73659 -517466 -871950
41432h71950j87383r0349r5746o8585N1963J95848L07403L24953J44541j34781
$$ -871950 -1059333 -1149682 -1245428 -1314013 -1262050 -1066202 -758799 -433846 -289305 -424086
41422d24086j37469K63960N99157M45811J63022L32118O51751K39401r06908j643415
$$ -424086 -561555 -297595 301562 747373 910395 1242513 1894264 2133665 1226757 -416658
41412d16658j196947j63396M55070M92617L22669j0060n50467p79294j53491Q29295
$$ -416658 -1613605 -1777001 -1321931 -829314 -506645 -516705 -1067172 -1846466 -1999957 -1170662
41402a170662J016727J69118o54117n52476P8088L27391J11354L9470K36991J21924
$$ -1170662 -153935 15183 -638934 -1191410 -1113322 -785931 -674577 -635107 -398116 -276192
41392b76192n22076r59562m45680O60388J293111J023497M22928R6397j1457j42763
$$ -276192 -798268 -1757830 -2203510 -1543122 -250011 773486 1196414 1292811 1281354 1138591
41382A138591j89288o7034j12931n13028p29138k25469M95325M62579k04542k98377
$$ 1138591 949303 882269 769338 256310 -472828 -698297 -202972 259607 55065 -243312
41372b43312O47806J480586R81482m13514j242486r37665k64790M539P552J89606
$$ -243312 404494 1885080 2866562 2453048 1210562 272897 8107 12646 20198 209804
41362B09804M44558L05920k64343p05604n43846k8887J32150l07517p38509m57418
$$ 209804 654362 960282 695939 -9665 -553511 -582398 -450248 -757765 -1496274 -1953692
41352a953692L61832Q78344P21047L77411K94362J85861l12592p45436k93598
$$ -1953692 -1591860 -713516 7531 384942 679304 865165 552573 -192863 -486461
41343d86461R28022J674497R65874o47049j589797j014787K66482Q00108K15935
$$ -486461 441561 2116058 3081932 2434883 845086 -169701 96781 896889 1112824
41334A112824n17148n59127k39046k06413k19963L29586J061894R15340j51871
$$ 1112824 595676 36549 -202497 -408910 -628873 -299287 762607 1677947 1526076
41325A526076r04757o00237L8176J23253j14445o7480Q7157j46360n91840p57670
$$ 1526076 621319 21082 59258 182511 68066 586 87743 -58617 -650457 -1408127
41315a408127o75877n57978j37016P37361J326166Q54325j79750n78044j22254
$$ -1408127 -2084004 -2641982 -2778998 -2041637 -715471 138854 -40896 -618940 -741194
41306g41194L22025K33341n3340k19896l57274m19928j76549K14654L66041L71076
$$ -741194 -419169 -185828 -239168 -459064 -816338 -1236266 -1412815 -1198161 -832120 -461044
41296d61044N44007N74316p9959j017041j202912n14849J46791L90007P27604
$$ -461044 82963 657279 577320 -439721 -1642633 -2157482 -2010691 -1620684 -893080
41287h93080J196941R64425j14876q25168l13234N61759N25865l09049q92239
$$ -893080 303861 1268286 1153410 328242 15008 576767 1102632 793583 -98656
41278i8656q03122m26060o7060K18618K91635J81738L30316R10471J286429Q33319
$$ -98656 -901778 -1327838 -1394898 -1176280 -884645 -702907 -372591 537880 1824309 2657628
41268B657628n9668n02602l31263j32625k42738l68224j58151L08962O03220L12946
$$ 2657628 2597960 2095358 1764095 1631470 1388732 1020508 862357 1171319 1774539 2087485
41258B087485m90562j094548q38030j8040M42809K82155J10941K37637K30647
$$ 2087485 1596923 502375 -335655 -353695 89114 371269 482210 719847 950494
41249I50494p2306j78521J0941r3432m72699j94822Q36110J235217L01970o12864
$$ 950494 878188 699667 710608 617176 144477 -50345 785765 2020982 2322952 1710088
41239A710088k87956K62792l46140j226924o94462O01719O47535l64435l18459
$$ 1710088 1422132 1684924 1338784 111860 -582602 19117 666652 302217 -16242
41230a6242R50158J110051o11092j773611n81666J151141R03126o51723j013220
$$ -16242 933916 2043967 1432875 -340736 -922402 228739 1131865 480142 -533078
41221e33078J39756Q13886O1042q39456o84614M6795L99257L62444M12892N46867
$$ -533078 -393322 420564 481606 -357850 -1042464 -995669 -596412 -233968 178924 725791
41211G25791M45436J15320j45027j98088j79670k35779k91410j35445K03154K84653
$$ 725791 1171227 1286547 1141520 943432 763762 527983 236573 101128 304282 588935
41201E88935k23911q99339r10711j35826N85364N45656K3565k55732n4301L12130
$$ 588935 365024 -534315 -1445026 -1580852 -995488 -449832 -426267 -681999 -736300 -424170
41191d24170M48164J48028m17437o19479o540Q29618P47075l09144j027185n75497
$$ -424170 23994 172022 -245415 -864894 -871434 -41816 705259 396115 -631070 -1206567
41181a206567J95918J66623l15355j80908N05443P06898J54298l28217k47239
$$ -1206567 -1010649 -844026 -1159381 -1340289 -834846 -127948 26350 -301867 -549106
41172e49106m6024p5034K1131M79202P95644M55533k63951o93732n90377j70957
$$ -549106 -595130 -670164 -649033 -169831 625813 1081346 817395 123663 -466714 -637671
41162f37671L14429O39792N13297r6745o37025m16144N08526J202358Q66019j62626
$$ -637671 -323242 316550 829847 733102 96077 -320067 188459 1390817 2256836 2094210
41152B094210p52596l66031K85426K37698m31456q25582n56207j63850j54201
$$ 2094210 1341614 975583 1261009 1498707 1067251 241669 -314538 -478388 -632589
41143f32589l09123k37610j7738J07832K00852L62714L91953J41436j08631o0058
$$ -632589 -941712 -1179322 -1197060 -1089228 -888376 -525662 -133709 7727 -100904 -160962
41133a60962R6720j1181l59129o13098n90559l36802L4598L34468L93487L50648
$$ -160962 -64242 -75423 -434552 -1047650 -1638209 -1975011 -1940413 -1605945 -1212458 -861810
41123h61810N02856P21579N19113p9887l44472J06332O59414O10572J49493j20523
$$ -861810 -358954 362625 881738 801851 457379 563711 1223125 1833697 1983190 1862667
41113A862667j38210k41834m80793o45669o33461l43175L20046R34241P19974
$$ 1862667 1724457 1482623 1001830 356161 -277300 -620475 -300429 633812 1353786
41104A353786k71069r06721n71453j20536l66613n95021J69008J255427J261615
$$ 1353786 1082717 175996 -395457 -515993 -882606 -1477627 -1308619 -53192 1208423
41095A208423L29644j54954J25346J30068n04221q40334l60549K25953L63581
$$ 1208423 1538067 1383113 1508459 1638527 1134306 293972 -66577 159376 522957
41086E22957M63641P85702P60296P9135o07746p22521n57804m97909l62093o1566
$$ 522957 986598 1772300 2532596 2611731 2003985 1281464 723660 225751 -136342 -197908
41076a97908o675l05431m09584p5899J74275L4642o0622J15994J05655j97106
$$ -197908 -204583 -510014 -919598 -995497 -821222 -786580 -847202 -731208 -625553 -822659
41066h22659q1874O82406J140930O12845j30649j44834J51610j26094o74165n54461
$$ -822659 -904533 -222127 918803 1531648 1400999 1256165 1407775 1281681 607516 53055
41056E3055J12128L34878j13245m63982k70312J15938L71362N29049M28193k37830
$$ 53055 165183 500061 386816 -77166 -347478 -231540 139822 668871 1097064 859234
41046H59234j135183j342821n06371O03257R79825M99410n9157N3872P06535R88385
$$ 859234 -275949 -1618770 -2125141 -1521884 -542059 -42649 -101806 -47934 658601 1646986
41036A646986L04668p35227r62822j82104N91129N79950J50907r0886k51059n72631
$$ 1646986 1951654 1216427 253605 71501 662630 1242580 1393487 1302601 1051542 478911
41026D78911o93828k80567K07437K05921k1749L7419J51991j65952o16686n18823
$$ 478911 -214917 -495484 -288047 -82126 -103875 -66456 85535 -80417 -697103 -1215926
41016a215926M4935M01752L60529K53009J53531r9330l42626l49533l48726m92301
$$ -1215926 -1170991 -769239 -408710 -155701 -2170 -101500 -444126 -793659 -1142385 -1634686
41006a634686k54190O71330J349339P03635o71919j143563l72929L49658J81996
$$ -1634686 -1888876 -1217546 131793 835428 163509 -980054 -1352983 -1003325 -821329
40997h21329k32020r7658L99818P29967P42607L77703l79336r37640n17485N22862
$$ -821329 -1053349 -1151007 -751189 -21222 721385 1099088 719752 -217888 -735373 -212511
40987b12511Q38013J0756p54097m08948M95250Q35272M57561p9565n08242p77472
$$ -212511 625502 636258 -117839 -526787 -31537 803735 1261296 1181731 673489 -103983
40977a03983o35655j06380J42514l23943q98038p18605R8447P00479O73976L49125
$$ -103983 -739638 -846018 -703504 -1027447 -1925485 -2644090 -2545643 -1845164 -1171188 -822063
40967h22063J37802J08174J01520p5970m25752n70318j46058M99058N49375j17503
$$ -822063 -684261 -576087 -474567 -550537 -976289 -1546607 -1692665 -1193607 -644232 -761735
40957g61735o50420m26267J49390M56380N44615O44128N01674o6543n38157l90700
$$ -761735 -1412155 -1838422 -1689032 -1232652 -688037 -43909 457765 391222 -146935 -537635
40947e37635N654j4630l09172k40746J95716M02037J90359j4487M7224J70791
$$ -537635 -531981 -546611 -855783 -1096529 -900813 -498776 -308417 -322904 -275680 -104889
40937a04889J87539J83739J70050J0920k60370m10333k87463J05869O71169J090659
$$ -104889 82650 266389 436439 447359 186989 -223344 -510807 -404938 266231 1356890
40927A356890R23223J85331m39951l91393K7895J30629j91922m74378m31269j95689
$$ 1356890 2280113 2465444 2025493 1634100 1661995 1792624 1600702 1126324 695055 499366
40917D99366O3166K94932M15996L65190K20901J9217l26550o98947p20183l22052
$$ 499366 562532 857464 1273460 1638650 1859551 1878768 1552218 853271 133088 -188964
40907a88964K5691r746j76920k20707l29290n40355l90077J99232M16031j84770
$$ -188964 -163273 -173019 -349939 -570646 -899936 -1440291 -1830368 -1631136 -1215105 -1399875
40897a399875o35846R2881J261956J254169J0401q97751o16919N2711K97557L72213
$$ -1399875 -2035721 -1942840 -680884 573285 583686 -314065 -930984 -878273 -580716 -208503
40887b08503N21905K41428n55573q30547N6576J045570P83219l28861p71406k14391
$$ -208503 313402 554830 -743 -831290 -774714 270856 1054075 725214 -46192 -260583
40877b60583J74943k63035o96171k76507M78260N81619J61356J53920O88082Q26131
$$ -260583 -85640 -348675 -1044846 -1321353 -843093 -261474 -100118 53802 741884 1568015
40867A568015R8516o42963m64741K56293M83757J21480j2911L43435N14870J14064
$$ 1568015 1666531 1023568 558827 815120 1298877 1420357 1407446 1750881 2265751 2379815
40857B379815l55496m58189m50265n16823l27831J06457J16681m11115n28570
$$ 2379815 2024319 1566130 1115865 599042 271211 377668 494349 83234 -445336
40848d45336K09344P51422K45306l50266J86348J111959Q38030l67068q21338
$$ -445336 -235992 515430 760736 410470 596818 1708777 2546807 2179739 1358401
40839A358401k73902j44682q38632j025072j09138O48406L18653k38097j22047
$$ 1358401 1084499 939817 101185 -923887 -1033025 -384619 -65966 -304063 -426110
40830d26110Q0412k89029n28830P6778P40764M41462l08021l81603J11166K86373
$$ -426110 -345698 -634727 -1163557 -1086779 -346015 95447 -212574 -594177 -483011 -196638
40820a96638P6729K355k6472l41665n05361j961N46703K26129n09133m29960M66946
$$ -196638 -119909 -117554 -144026 -485691 -991052 -993013 -446310 -220181 -729314 -1159274 -692328
40809f92328R69682N77572O3327M3142K22582K45567K13773J45554j60438n48226
$$ -692328 277354 854926 918253 961395 1183977 1429544 1643317 1788871 1628433 1080207
40799A080207n91863l28205j49229l0513L01013N56028K07523m32521m96548L8023
$$ 1080207 488344 160139 10910 -19603 281410 837438 1044961 612440 115892 153915
40789A53915K77883j25193m76797k36373K53269N18549N52056L69712j73192p98000
$$ 153915 431798 306605 -170192 -406565 -153296 365253 917309 1287021 1113829 315829
40779C15829q26709j44020N33724O18734K51917k09000n95363o74121k34573L87325
$$ 315829 -510880 -654900 -121176 497558 749475 540475 -54888 -729009 -963582 -576257
40769e76257N64247K69618K2555l4988j71132k51073P5961L99121l1134p98915
$$ -576257 -12010 257608 280163 245175 74043 -177030 -101069 298052 266918 -531997
40759e31997o09839O10374J349253P79505m4272k3545L31951P6902n61177q54346
$$ -531997 -1141836 -531462 817791 1597296 1553024 1529479 1861430 1938332 1377155 522809
40749E22809q29495p60396l71282L46177M93003l46262j007326l85687O89039
$$ 522809 -306686 -1067082 -1438364 -1092187 -599184 -945446 -1952772 -2338459 -1649420
40740a649420P16979o9793k38342M14781P30574K86961q5105N5449J66902j8655
$$ -1649420 -932441 -1002234 -1240576 -825795 -95221 191740 106635 162084 328986 310331
40730C10331n4553J37415L6771l38487l02112J85372K95191k07673m94870j34572
$$ 310331 255778 393193 429964 91477 -210635 -25263 269928 62255 -432615 -567187
40720e67187J61213j53947n01026k49565J95034J81371o7646O4319N33088P70592
$$ -567187 -405974 -559921 -1060947 -1310512 -1115478 -934107 -1001753 -937434 -404346 366246
40710C66246M90286j29547o60406n27989M91006J569537J404963m5066j217609
$$ 366246 856532 726985 66579 -461410 29596 1599133 3004096 2959030 1741421
40701A741421r42425L3699L03743j86351m08437j3489L27172J79102q4378n7599
$$ 1741421 798996 832695 1136438 950087 541650 528161 855333 1034435 950057 892458
40691H92458J30705J91055P0114j36296k82527k02069K8661Q72m68927r00510
$$ 892458 1023163 1214218 1284332 1148036 865509 663440 692101 692973 224046 -676464
40681f76464p41643k01173N8240p9092r9825K38380N28225L62188j11433m49133
$$ -676464 -1418107 -1619280 -1561040 -1640132 -1739957 -1501577 -973352 -611164 -722597 -1171730
40671a171730l98130j5366M29511O18200M76524K81740K72129K90191J09637p3863
$$ -1171730 -1569860 -1585226 -1155715 -537515 -60991 220749 492878 783069 892706 818843
40661H18843Q6112M47946N20133K13230n8801p5212r0591k93565m79393m76884
$$ 818843 904955 1352901 1873034 2086264 2027463 1952251 1861660 1568095 1088702 611818
40651F11818m63843n77857n73900j96654L53983O38299N03194J58932j29387k23422
$$ 611818 147975 -429882 -1003782 -1200436 -846453 -208154 295040 453972 324585 101163
40641A01163j11998Q2847J87414J77190J77639K06068J34075J3351J38615N47428
$$ 101163 -10835 72012 259426 436616 614255 820323 954398 967749 1106364 1653792
40631A653792P37925K58877n74146r59317n64202J70037O63533P28397M24230
$$ 1653792 2391717 2650594 2076448 1117131 552929 722966 1386499 2114896 2539126
40622B539126j31421o04818n61402q3375J32233k58702n68939j5464R39449J052677
$$ 2539126 2407705 1802887 1241485 1158110 1290343 1031641 462702 447238 1386687 2439364
40612B439364J07413p11030n61413j05433k76008p44965o10934l6359K8493m42562
$$ 2439364 2546777 1835747 1274334 1168901 892893 147928 -463006 -499365 -470872 -913434
40602i13434m12707M44914J044518N16670m28844n58995J19171N35741J78780
$$ -913434 -1326141 -881227 163291 679961 251117 -307878 -188707 347034 525814
40593E25814l06352j59620M56713O95009Q0923q34140r96074j27258P73521O36273
$$ 525814 219462 59842 516555 1211564 1292487 458347 -537727 -664985 108536 744809
40583G44809k15058n44984n8571K74475k9101j24283N63967J076962L90312p48366
$$ 744809 529751 -15233 -73804 200671 171570 47287 611254 1688216 2078528 1330162
40573A330162q49125Q102M11699p3641m27321j03243J24585k95837p04146m94512
$$ 1330162 481037 489139 900838 827197 399876 296633 421218 125381 -578765 -1073277
40563a073277j95053m04606o27247j88860M25883K82274m14243n78955P1729O70973
$$ -1073277 -1268330 -1672936 -2300183 -2489043 -2063160 -1780886 -2195129 -2774084 -2702355 -2031382
40553b031382O05281L10804L63484N46888L29536k14594n26895m06324k24127
$$ -2031382 -1426101 -1115297 -751813 -204925 124611 -89983 -616878 -1023202 -1247329
40544a247329k75577l28828l9736M29895N63162K38881l2086J99264O72612P62103
$$ -1247329 -1522906 -1851734 -1891470 -1461575 -898413 -659532 -691618 -492354 180258 942361
40534I42361K95804k97442n62519m10203R7M21124N67604L18966j13674m49813
$$ 942361 1238165 940723 378204 -31999 -31902 389222 956826 1275792 1162118 712305
40524G12305o49884o77344k16179Q14343J620628J180279l29068j453205j142174
$$ 712305 62421 -614923 -831102 -16759 1603869 2784148 2455080 1001875 -140299
40515a40299N1136Q17000O31230K576m31188n23064m75412m74408m76438k51075
$$ -140299 -89163 727837 1359067 1361643 930455 407391 -68021 -542429 -1018867 -1269942
40505a269942K57751O57094N08670l424k53451q3703n055l30676o82085o39535
$$ -1269942 -1012191 -355097 153573 150149 -103302 -187005 -192060 -522736 -1204821 -1844356
40495a844356l42654q7039J79044N46781P72287O32134K94949k528k54139l66937
$$ -1844356 -2187010 -2274049 -2095005 -1548224 -775937 -143803 151146 148618 -105521 -472458
40485d72458o4985N13605O99316K59941q7546K75518Q61518Q17028J94542k85786
$$ -472458 -537443 -23838 675478 935419 847873 1123391 1984909 2801937 2996479 2710693
40475B710693l52634k58501o9833K71787M25291L9285n14009o20407m43588n69727
$$ 2710693 2358059 2099558 2029725 2301512 2726803 2766088 2252079 1631672 1188084 618357
40465F18357q20316m76616L32312O11742Q7261l10510J4707L42170j17368q25330
$$ 618357 -201959 -678575 -346263 265479 352740 42230 56937 399107 281739 -543591
40455e43591o73093L27095J020750O83997j23893m40572j27710J33479j05477
$$ -543591 -1216684 -889589 131161 815158 691265 250693 122983 256462 150985
40446A50985m41049k74008K11686K78298j79756m18795j02712N4966m58969q77505
$$ 150985 -290064 -564072 -352386 -74088 -253844 -672639 -775351 -720385 -1179354 -2056859
40436b056859l20604N98908O12708j49784m04488J11763L07872k09566m02438
$$ -2056859 -2377463 -1778555 -1165847 -1315631 -1720119 -1608356 -1300484 -1510050 -1912488
40427a912488K91005Q60952M40122k35614j80488J92714M3524k57178J01546O83096
$$ -1912488 -1621483 -760531 -320409 -556023 -736511 -543797 -500273 -757451 -655905 27191
40417B7191M33162m25504o71502r1474K83802p847k50993r255J68253m1631n3214
$$ 27191 460353 34849 -636653 -728127 -444325 -452172 -703165 -712420 -544167 -585798 -639012
40406f39012M51849P42120K38395l83497k17562M13561N23012K2639l30060l04979
$$ -639012 -187163 554957 793352 409855 192293 605854 1128866 1151505 821445 516466
40396E16466m16836p35066n67245L00583R80745P32033J32210K01883Q11929R00672
$$ 516466 99630 -635436 -1202681 -902098 78647 810680 942890 1144773 1956702 2857374
40386B857374J21266o97619q61495o56654n34652l22785J47151L66808p0765n69341
$$ 2857374 2978640 2281021 1419526 762872 228220 -94565 52586 419394 348629 -220712
40376b20712l53496J82585K9342o92981p32507L76711J507454J492749N83577
$$ -220712 -574208 -391623 -362281 -1055262 -1787769 -1411058 96396 1589145 2172722
40367B172722j85270l52699j84944n4562j92632n91976p88148k94142M42023K88822
$$ 2172722 1987452 1634753 1449809 1395247 1202615 610639 -177509 -471651 -29628 259194
40357B59194q81165j624182p99276P60806J398532Q38386J57446l8881k01319
$$ 259194 -621971 -2246153 -3045429 -2284623 -886091 -47705 109741 70860 -130459
40348a30459o58003r62698o81042o4997L51222L70964K05162K14346N40127Q04692
$$ -130459 -788462 -1751160 -2432202 -2497199 -2145977 -1775013 -1569851 -1355505 -815378 -10686
40338a0686M82582k06488l67368J85495M13783l14550r49544k99437Q63905Q00706
$$ -10686 471896 265408 -101960 83535 497318 182768 -766776 -1066213 -202308 598398
40328E98398m45666j050185k43860O17805L37577l82049l55001K27147M28391
$$ 598398 152732 -897453 -1141313 -523508 -185931 -567980 -922981 -695834 -267443
40319b67443J48016k1440O6227P2211q0559j75179j59473r5005P9170L42558M91056
$$ -267443 -119427 -140867 -74640 -2429 -82988 -258167 -417640 -512645 -433475 -90917 400139
40308D00139N12242O14695O84486L30251l04293n34795k41867r9148l09979j75045
$$ 400139 912381 1527076 2211562 2541813 2237520 1702725 1460858 1361710 1051731 876686
40298H76686M64754N25696n98479j672807j252424J39218Q78676O66873N22301
$$ 876686 1341440 1867136 1268657 -404150 -1656574 -1517356 -638680 28193 550494
40289E50494P31327N11707k71289o99210m34085k80833o06202n62117L62487J186700
$$ 550494 1281821 1793528 1522239 823029 388944 108111 -498091 -1060208 -697721 488979
40279D88979Q10714k90860p76444l14314K27899K01177j14414k10837o1894N2892
$$ 488979 1299693 1008833 232389 -81925 145974 347151 232737 21900 -39994 12898
40269A2898K5615M168J27169K88805K41670L508j5776M03200P24415J98869r76376
$$ 12898 38513 42681 169850 458655 700325 703833 688057 1091257 1815672 2014541 1038165
40258A038165j626535r98212K86989J040429Q89745M18931J66960j2126n24338
$$ 1038165 -588370 -1586582 -1299593 -259164 630581 1049512 1216472 1204346 680008
40249F80008j252171j441799n45259Q43213J322525L42925q63235p16162N80748
$$ 680008 -572163 -2013962 -2559221 -1716008 -393483 -50558 -913793 -1629955 -1049207
40240a049207J317333P18867n7122J68233Q25314O49228l24996r55059p35740
$$ -1049207 268126 986993 929871 1098104 1923418 2572646 2247650 1292591 556851
40231E56851k38627P824O6578N5875l7428Q708L80213N93712J1810r60949j153327
$$ 556851 318224 326048 392626 448501 411073 419781 799994 1393706 1405516 444567 -708760
40220g08760k86234O07618P25418M60328L58644J31477n39274j061126p43387
$$ -708760 -994994 -387376 338042 798370 1157014 1288491 749217 -311909 -1055296
40211a055296L3358L99714L07689L19209M44383K00884l59206o67735n91987m25274
$$ -1055296 -1021938 -622224 -314535 4674 449057 649941 290735 -377000 -968987 -1394261
40201a394261n0157P89843J402105O60412j046819j735107m38399J255049J304017
$$ -1394261 -1444418 -654575 747530 1407942 361123 -1373984 -1812383 -557334 746683
40192G46683p0587j008438p05174o4894R8439N6738J63594J19516k42344l93845
$$ 746683 676096 -332342 -1037516 -1102410 -1003971 -947233 -783639 -664123 -906467 -1300312
40182a300312L0351N05108L84380j18515l46561j97213p0096r4175m7167R7475
$$ -1300312 -1269961 -764853 -380473 -498988 -845549 -1042762 -1112858 -1207033 -1254200 -1156725
40172a156725J48210J67459L78906N69683J95178p11845j282559q42709J76623
$$ -1156725 -1008515 -841056 -462150 107533 302711 -409134 -1691693 -2534402 -2357779
40163b357779P98728P13269M26449L36760K63245L575k06744j35535m5500k84109
$$ -2357779 -1559051 -845782 -419333 -82573 180672 184247 -22497 -158032 -203532 -487641
40153d87641o24230n25335L1279M71344M31370J73281P5158J28195J38906Q9516
$$ -487641 -1111871 -1637206 -1605927 -1134583 -703213 -529932 -454774 -326579 -187673 -98157
40143i8157P2528J16179K33399M12019M89278L35440J57452J77739M6072p31181
$$ -98157 -25629 90550 323949 735968 1225246 1560686 1718138 1895877 1941949 1210768
40133A210768j665264j520135j23271J018752O92772l05243m83923O4814J00292
$$ 1210768 -454496 -1974631 -2097902 -1079150 -386378 -691621 -1175544 -1110730 -1010438
40124a010438m89445n01296M08756R77597L14757o89067p31439J05378P76314
$$ -1010438 -1499883 -2001179 -1592423 -614826 -300069 -989136 -1720575 -1615197 -838883
40115h38883P74203L95477K5706j12957J19886N23185N43958j2157o29797q24309
$$ -838883 -64680 330797 356503 243546 363432 886617 1430575 1418418 788621 -35688
40105c5688p67731p81683p44880m75542j68398M6959M24517R46069R71238K13302
$$ -35688 -803419 -1585102 -2329982 -2805524 -2973922 -2926963 -2502446 -1556377 -585139 -371837
40095c71837n22526l61526L68913P07979M60714J62487M8166J0989K64816R86631
$$ -371837 -894363 -1255889 -886976 -178997 281717 444204 492370 503359 768175 1754806
40085A754806J467384P45794q36137j743251j159457O0127O28442K85730k84170
$$ 1754806 3222190 3967984 3131847 1388596 229139 289266 917708 1203438 919268
40076I19268l90587J08515P49573Q14646J28526n48549m38355J07974J23907m15951
$$ 919268 528681 637196 1386769 2201415 2329941 1781392 1343037 1451011 1574918 1158967
40066A158967n26822J54838P14022L85010k81386l58209M0803Q7922m14053p97936
$$ 1158967 632145 786983 1501005 1886015 1604629 1246420 1287223 1375145 961092 163156
40056A63156n33389J32873N75362M61652j8237l93406l72765j24790j8033j08986
$$ 163156 -370233 -237360 338002 799654 781417 388011 15246 -109544 -127577 -236563
40046b36563j03476J62702M69469N01622J76667l35589p17065o76711k59864J22734
$$ -236563 -340039 -177337 292132 793754 970421 634832 -82233 -758944 -1018808 -896074
40036h96074K42178M20644R61111J456967J248147M20527k96605n65801o91550
$$ -896074 -653896 -233252 727859 2184826 3432973 3853500 3556895 2991094 2299544
40027B299544q48744q06018n17211k67045q7733K53939N58002K96804l49168m42943
$$ 2299544 1450800 644782 127571 -139474 -227207 26732 584734 881538 532370 89427
40017H9427L09763R48227O04911k58907o23688l30482j7811n7525k50243l54647
$$ 89427 399190 1347417 1952328 1693421 1069733 739251 721440 663915 413672 59025
40007E9025l55953l14110k84064k48642k575N70927J049323Q37891J18655k36368
$$ 59025 -296928 -611038 -895102 -1143744 -1146319 -575392 473931 1311822 1430477 1194109
39997A194109Q0317M10583K97497J68227L51278L40226k29400p14758m70899N925
$$ 1194109 1274426 1685009 1982506 2150733 2502011 2842237 2612837 1898079 1427180 1433105
39987A433105o9865m12169k55469K02909J64369k92337l52258M6245J18877l07241
$$ 1433105 1363240 951071 695602 898511 1062880 770543 418285 464530 583407 276166
39977B76166m67938o5594J34684l88330r33359n65560N19138J255477J010322
$$ 276166 -191772 -257366 -122682 -511012 -1444371 -2009931 -1490793 -235316 775006
39968G75006J51207m91057m03439K41325P97834P84440L27723j07958k92078l18598
$$ 775006 926213 435156 31717 273042 1070876 1855316 2183039 2075081 1783003 1464405
39958A464405k97034k54954k24095j50860J10988M56256M46217q4040o36807o84434
$$ 1464405 1167371 912417 688322 537462 648450 1104706 1550923 1466883 830076 145642
39948A45642l69566j01429J63254O03296Q43609L92876l86166n80768k0855M96639
$$ 145642 -223924 -325353 -162099 441197 1284806 1677682 1291516 710748 689893 1186532
39938A186532L91968J7178l0830K47792L79849N2076n52561q89014n79097N0043
$$ 1186532 1578500 1595678 1564848 1812640 2192489 2244565 1692004 802990 223893 273936
39928B73936K43395j38566l47218O8417M39782N4283n56072l85960M11974P74398
$$ 273936 517331 378765 31547 99964 539746 594029 37957 -348003 63971 838369
39918H38369L59628j78342l82581l34094M8305Q20691J223470M53514p33951p02968
$$ 838369 1197997 1019655 637074 302980 351285 1171976 2395446 2848960 2115009 1412041
39908A412041N43153J129527J23747j037380q02247K76645P10129K58886l05995
$$ 1412041 1955194 3084721 3208468 2171088 1368841 1645486 2355615 2614501 2308506
39899B308506o83859r82269q80217j32491N81601M70950j12061k82224m7909k1523
$$ 2308506 1624647 642378 -237839 -370330 211271 682221 570160 287936 240027 218504
39889B18504j16584K19266O96005M23106m91514q32867p8616P61783O07464k25667
$$ 218504 101920 321186 1017191 1440297 948783 115916 37300 799083 1406547 1180880
39879A180880o38386k83772J71524J11863k49854k48676L47056J027983J133100
$$ 1180880 542494 258722 430246 542109 292255 43579 390635 1418618 2551718
39870B551718N88328j20055n89623p87362p28895l43064J89221L89274K6959n83434
$$ 2551718 3140046 3019991 2430368 1643006 914111 571047 760268 1149542 1176501 593067
39860E93067r87386r79635n38306J86518P46515P71365N43702O09853P91201L80856
$$ 593067 -394319 -1373954 -1912260 -1725742 -979227 -207862 335840 945693 1736894 2117750
39850B117750n43961r75365m85913J04903P5296j78484r4053P6461n40J2174K84983
$$ 2117750 1573789 598424 112511 217414 292710 114226 20173 96634 96094 108268 393251
39839C93251J98016m68526p10773J60991J099458Q04662j89091m42268N2953J51294
$$ 393251 591267 122741 -588032 -427041 672417 1477079 1287988 845720 898673 1049967
39829A049967l14588m80105k77277m80435r41145n98280N42780J168475P37285
$$ 1049967 735379 255274 -22003 -502438 -1443583 -2041863 -1499083 -330608 406677
39820D06677J66698M2424k00390p55458p58851R5245P46186M57026l7026L3852
$$ 406677 573375 615799 415409 -340049 -1098900 -1003655 -257469 199557 162531 196383
39810A96383K13899j4055j08902L32131M67338l74874j213530p97794L49319P74481
$$ 196383 410282 396227 287325 619456 1086794 711920 -501610 -1299404 -950085 -175604
39800a75604L59598J99674O13800Q25165M96959J61396O0328j77362n57535n64443
$$ -175604 183994 383668 997468 1822633 2319592 2480988 2541316 2363954 1806419 1241976
39790A241976j87095n9164l34991m16827r3776K8708l44844n73232j68870K78442
$$ 1241976 1054881 995717 660726 243899 150123 178831 -166013 -739245 -908115 -629673
39780f29673K6053n42667m39728L88457R21947N33182j64238k79966R2845J70138
$$ -629673 -603620 -1146287 -1586015 -1197558 -275611 257571 93333 -186633 -93788 76350
39770G6350k16278l44871J90489O82101K73908o87556j019643l19608N41462O57540
$$ 76350 -139928 -484799 -294310 387791 661699 -25857 -1045500 -1365108 -823646 -166106
39760a66106J28619l85566n26162l02854J63462N85632O49186N24703P39466J217506
$$ -166106 -37487 -423053 -949215 -1252069 -1088607 -502975 146211 670914 1410380 2627886
39750B627886J077670j05378j430170j707059r06816Q1163O86171R02053O91272
$$ 2627886 3705556 3600178 2170008 462949 -443867 -362704 323467 1225520 1916792
39741A916792L9873n61512n37408q9358R5446o9432n4927K25013K08978k72063
$$ 1916792 1956665 1395153 857745 768387 863833 794401 739474 964487 1173465 901402
39731I01402n69509k06509L63426M48606Q0373k06288k07732j57199j65523m0214
$$ 901402 331893 125384 488810 937416 1017789 811501 603769 446570 281047 240833
39721B40833L00374N72018M41822n0587n44594p76809p73204o05796k12051L56403
$$ 240833 541207 1113225 1555047 1504460 959866 183057 -590147 -1195943 -1407994 -1051591
39711a051591P51390P19466M61254J94835l32928j226399j626482n96956J141781
$$ -1051591 -300201 419265 880519 1075354 742426 -483973 -2110455 -2707411 -1565630
39702a565630J665111M80559o13503j19475J012211J052329J56333k88801j69916
$$ -1565630 99481 580040 -33463 -152938 859273 1911602 2067935 1779134 1609218
39693A609218n37147j304088j131696J51665R27818K35515p71480o70160K56307
$$ 1609218 1072071 -232017 -1363713 -1212048 -284230 -48715 -820195 -1490355 -1234048
39684a234048Q41804P48601L72344q2257m73331l93556J51277L94029o0065m58124
$$ -1234048 -392244 356357 728701 646444 173113 -220443 -69166 324863 264798 -193326
39674a93326j05423M10905K22239k87986j57125M53277N48710K9470k33122k0695
$$ -193326 -298749 112156 334395 46409 -110716 342561 891271 920741 687619 666924
39664F66924j07592p33039j018188m38025K20139J14510k88597j7792P89509J072961
$$ 666924 559332 -173707 -1191895 -1629920 -1409781 -1295271 -1583868 -1601660 -812151 260810
39654B60810M64661k15783k23240J27345J39586j49509j51956K06846L24673n5186
$$ 260810 725471 509688 286448 413793 553379 403870 251914 458760 783433 728247
39644G28247l36635j8084M10545K22436k65992j25226N52010N73095m59237j285699
$$ 728247 391612 373528 784073 1006509 740517 615291 1167301 1740396 1281159 -4540
39634d540p70441L71833O67142N4336k83364N8171K34838j72753l48704L37744
$$ -4540 -774981 -403148 263994 318330 34966 93137 327975 155222 -193482 144262
39624A44262J142432R94594P5987n09867l01951R0008K1965m15908p65202q05614
$$ 144262 1286694 2281288 2357275 1847408 1545457 1635465 1657430 1241522 476320 -329294
39614c29294n80443j65678L11471N79274M08742o5608l44445k0315P19675J141303
$$ -329294 -909737 -1075415 -763944 -184670 224072 158464 -185981 -206296 513379 1654682
39604A654682O64888m54105j273377j084069j30066O66705O69363J25051k31082
$$ 1654682 2319570 1865465 592088 -491981 -622047 44658 714021 839072 607990
39595F07990p8984J59308k9087m83347n68010r4685L64879K71700j24837j68468
$$ 607990 529006 688314 659227 175880 -392130 -486815 -121936 149764 24927 -143541
39585a43541K79387P04840O67545K68724j59141m85140p35357q37457o30222r8875
$$ -143541 135846 840686 1508231 1776955 1617814 1132674 397317 -440140 -1070362 -1169237
39575a169237M97457P65231M93073j15772n77513n74137k40065L3913J1943k14155
$$ -1169237 -671780 93451 586524 470752 -106761 -680898 -920963 -887050 -875107 -1089262
39565a089262l68049k50552N9683K62891K10251J47651L51712O09640M64136k6489
$$ -1089262 -1457311 -1707863 -1648180 -1385289 -1175038 -1027387 -675675 -66035 398101 371612
39555C71612l00818j85819j46485l61390k65081M43383J015225O81321m7731q9979
$$ 371612 70794 -115025 -261510 -622900 -887981 -444598 570627 1251948 1204217 1114238
39545A114238N10606O89980R7642m16925k63965K858k83555q60415j087365q68974
$$ 1114238 1624844 2314824 2412466 1995541 1731576 1734434 1450879 590464 -496901 -1365875
39535a365875m60417Q5376P00199R88287P06613K24978K1793L5436m5283j86771
$$ -1365875 -1826292 -1740916 -1040717 -52430 654183 879161 900954 936390 891107 704336
39525G04336j74784n8666M5237K95273P56929R57979L98604o11125j168319q38234
$$ 704336 529552 470886 516123 811396 1568325 2526304 2924908 2313783 1145464 307230
39515C07230q6456L63774K68005q1945k85396k41729j87298k88395l04580M7898
$$ 307230 220774 584548 852553 770608 485212 243483 56185 -232210 -536790 -488892
39505d88892M84472M27640n7631k63660L0071K02356n0646p3953N55812J039184
$$ -488892 -4420 423220 365589 101929 132000 334356 283710 209757 765569 1804753
39495A804753N29601l60872m25767J80634J86873p06998j352907r89172k91558
$$ 1804753 2334354 1973482 1547715 1728349 1915222 1208224 -144683 -1133855 -1425413
39486a425413r4107j18502L07504J000915J157551M68414n53723j167578j022832
$$ -1425413 -1519520 -1638022 -1330518 -329603 827948 1296362 742639 -424939 -1447771
39477a447771l85125J27351K34673L13483O70812Q28312K52532m96086m05667
$$ -1447771 -1832896 -1705545 -1470872 -1157389 -486577 341735 594267 98181 -307486
39468c07486K87232L33227m22021o45581K18112Q39499J72586o89221k70978P87003
$$ -307486 -20254 312973 -109048 -754629 -536517 302982 475568 -213653 -484631 302372
39458C02372P65799k84319o88008N0481N51410j2337n94484j74123M77044P5182
$$ 302372 1068171 783852 95844 146325 697735 685398 90914 -83209 393835 469017
39448D69017j038456j283102m7740J467799J681067L36620j327187j866255j017879
$$ 469017 -569439 -1852541 -1900281 -432482 1248585 1585205 258018 -1608237 -2626116
39439b626116J73687O30590M03952K63331M33735M19338L4801j88516J19235N52763
$$ -2626116 -2452429 -1821839 -1417887 -1154556 -720821 -301483 -266682 -455198 -335963 216800
39429B16800N74081K47059n1663k12274l03497k83642j57127r9835j46857r9088
$$ 216800 790881 1037940 986277 774003 470506 186864 29737 -70098 -216955 -316043
39419c16043K6711j06530n20244o62186j76516N07147P87908O86035N57747M25469
$$ -316043 -289332 -395862 -916106 -1578292 -1754808 -1247661 -459753 226282 784029 1209498
39409A209498J37834j36775j56949j01434k68649n08187m82238k59628j07438
$$ 1209498 1347332 1210557 1053608 952174 683525 175338 -306900 -566528 -673966
39400f73966M0490K98735L17021j79855n70094J594J158034J502025N30287o27570
$$ -673966 -633476 -334741 -17720 -197575 -767669 -766075 391959 1893984 2424271 1796701
39390A796701q23662l60952j90012l72922k47373K76122N36938K16704j77154
$$ 1796701 973039 612087 422075 49153 -198220 77902 614840 831544 654390
39381F54390j09989K59411M25025K31409m7869j14791R1600M07037N41290K59722
$$ 654390 544401 803812 1228837 1460246 1412377 1297586 1389186 1796223 2337513 2597235
39371B597235l64048r03775r24794l94601L21029Q45250J037669Q54308K28636
$$ 2597235 2233187 1329412 404618 10017 331046 1176296 2213965 3068273 3296909
39362C296909o69729j250163j012773k75272Q0709k14299l87653K32378J110470
$$ 3296909 2627180 1377017 364244 88972 169681 -44618 -432271 -199893 910577
39353I10577J201865M81363n5312Q6479K63718j31250o91987p61844n20557n32175
$$ 910577 2112442 2593805 2538493 2624972 2888690 2757440 2065453 1303609 783052 250877
39343B50877o30967j88410O15449P71602k6516o87219j94231P89805P01205o56843
$$ 250877 -380090 -568500 46949 818551 792035 104816 -89415 700390 1401595 744752
39333G44752j611078q14630Q28610J309108K21310p97496m87464L70178M35919
$$ 744752 -866326 -1680956 -852346 456762 678072 -119424 -606888 -236710 199209
39324A99209o1318N0252O98083N99976m68865j048303k22713R05132R11270J02423
$$ 199209 137891 188143 886226 1486202 1017337 -30966 -253679 651453 1562723 1665146
39314A665146l01098j66156k61965o28473n83785j28181N7947l2501K47739P57005
$$ 1665146 1364048 1197892 935927 307454 -276331 -404512 -346565 -379066 -131327 625678
39304F25678N68389l11908o81523r2890L75105J8824k61889L22075Q59540K73214
$$ 625678 1194067 882159 200636 107746 482851 501675 239786 561861 1421401 1694615
39294A694615o45734m32113N50543O72797k11439n34666L01760Q91112J18288
$$ 1694615 1048881 616768 1167311 1840108 1628669 1094003 1395763 2286875 2405163
39285B405163j077950j221933m32281O3647j92329n50256m01221J89068Q05350
$$ 2405163 1327213 105280 -327001 -263354 -455683 -1005939 -1407160 -1218092 -412742
39276d12742J047269P43787K07291K6147L12650N28807L24766L2747k5294j17137
$$ -412742 634527 1378314 1585605 1611752 1924402 2453209 2777975 2810722 2785428 2668291
39266B668291m81307p06996l67942J88041L31915L9260l20716o33163q22023m99309
$$ 2668291 2186984 1479988 1112046 1300087 1632002 1671262 1350546 717383 -104640 -603949
39256f03949L62008Q84049L76751m12798k52827O19756P63554k36413j111388
$$ -603949 -241941 642108 1018859 606061 353234 972990 1736544 1500131 388743
39247C88743q08087J39541O76552O51944M93767K75146j11681l95157k67477M7276
$$ 388743 -419344 -279803 396749 1048693 1542460 1817606 1705925 1310768 1043291 1090567
39237A090567J22766n6934k26788k52337o0799M34114R61325Q87127L5223q69953
$$ 1090567 1213333 1156399 929611 677274 616475 1050589 2011914 2899041 2934264 2064311
39227B064311j043094n85803j56146l7789k9953J1458K9700J3952L719l0656p1496
$$ 2064311 1021217 435414 279268 241479 211526 222984 252684 266636 270355 239699 168203
39216A68203k3381M9369p988j8192L59131Q48560O46675l25075j008507o45966
$$ 168203 144822 194191 186203 168011 527142 1375702 2022377 1697302 688795 42829
39206D2829Q9402J72509k24278k34526J53967K00344j67220k03304L13019O29383
$$ 42829 132231 304740 80462 -154064 -97 200247 33027 -170277 142742 772125
39196G72125J95489n09913o69375j00964O94696J056980O49801j99272o74509
$$ 772125 967614 457701 -211674 -312638 382058 1439038 2088839 1889567 1215058
39187A215058l61157K00581K77121m4791k01290j65264l12487n16368l05377J65746
$$ 1215058 853901 1054482 1331603 1286812 1085522 920258 607771 91403 -213974 -48228
39177d8228K47520q9911j99104J31664M29544M65022M56980K75285m54650j246900
$$ -48228 199292 109381 -89723 41941 471485 936507 1393487 1668772 1214122 -32778
39167c2778r71484L69706J243503O18944o05958r51642k50759N91474R50036P60465
$$ -32778 -1004262 -634556 608947 1227891 621933 -329709 -580468 11006 961042 1721507
39157A721507J05848o30456p21217J2815P07782N31212k09889o62272n93307k88094
$$ 1721507 1827355 1196899 475682 488497 1196279 1727491 1517602 855330 262023 -26071
39147b6071J55404O40151O61410p0755r30038j039667l52259N27926J161708J298585
$$ -26071 129333 769484 1430894 1360139 430101 -609566 -961825 -433899 727809 2026394
39137B026394O80162l71868p54297O2352R76583O29383n89999j128772n77764
$$ 2026394 2706556 2334688 1580391 1642743 2619326 3248709 2658710 1529938 952174
39128I52174k7502j30524k20746K80416Q21364P15312K61236J48452L29479J71104
$$ 952174 924672 794148 573402 853818 1675182 2390494 2651730 2800182 3129661 3300765
39118C300765n42990j256254j233299l31533P73728J197280P96576K78642J57602
$$ 3300765 2757775 1501521 268222 -63311 710417 1907697 2704273 2982915 3140517
39109C140517P4658l85851p62521m01519L20553M39330j11148m68328k65744n6596
$$ 3140517 3215175 2829324 2066803 1665284 1985837 2425167 2314019 1845691 1579947 1523351
39099A523351j88294k53627M9302L77179L96172K37397J3159m06804q58931q27532
$$ 1523351 1335057 1081430 1130732 1507911 1904083 2141480 2154639 1747835 888904 61372
39089F1372k28427L64292N05156K97622p3850n13349o28447l3925P85286Q33207
$$ 61372 -167055 197237 702393 1000015 926165 412816 -215631 -249556 535730 1368937
39079A368937P7228l94251n081N33546M92852J13622j92067n25661p48256k00327
$$ 1368937 1446165 1051914 1046833 1580379 2073231 2186853 1994786 1469125 720869 520542
39069E20542R77686J385589L00803r58081q59193P9604L22520j50038o5166P77742
$$ 520542 1498228 2883817 3184620 2226539 1367346 1446950 1769470 1619432 1554266 2332008
39059B332008J179893O13441n7007k26790m02347q84555r70405k15625N94694
$$ 2332008 3511901 4125342 4068335 3841545 3439198 2554643 1584238 1368613 1963307
39050A963307N61365o5520m94591n46740m50290j36079M33873P39299L64094j64551
$$ 1963307 2524672 2459152 1964561 1417821 967531 831452 1265325 2004624 2368718 2204167
39040B204167m8268N09543N83320K27l69221L7401O41689O28992O6731l97847
$$ 2204167 2155899 2665442 3248762 3248989 2879768 2917169 3558858 4187850 4254581 3856734
39030C856734n44429o79005q79488p38446q768Q65072J126935N27990l73286p29358
$$ 3856734 3312305 2633300 1753812 1015366 1006598 1871670 2998605 3526595 3153309 2423951
39020B423951k24474N82361Q00043J83223n46892n47802J03128N45521K82146
$$ 2423951 2199477 2781838 3581881 3765104 3218212 2670410 2773538 3319059 3601205
39011C601205k51070m01180j42463J00210J17026N257j59606l33459l52733j51986
$$ 3601205 3350135 2948955 2806492 2906702 3023728 3028985 2869379 2535920 2183187 2031201
39001B031201L4904N4557J74524N83421Q25743L84303l45487m59858O3606K55903
$$ 2031201 2066105 2120662 2295186 2878607 3704350 4088653 3743166 3283308 3346914 3602817
38991C602817l20499q20046m16318L85185N22524R474j34967M80631R46160L57147
$$ 3602817 3282318 2462272 2045954 2431139 2953663 2963137 2828170 3308801 4254961 4612108
38981D612108p97673j158171k45705Q96030J021011K05058m16798k14768K84454
$$ 4612108 3814435 2656264 2410559 3306589 4327600 4532658 4115860 3901092 4185546
38972D185546L70206O5966k55309n23703p15605n07170J51316N76840K21209l81104
$$ 4185546 4555752 4621718 4366409 3842706 3127101 2619931 2771247 3348087 3569296 3188192
38962C188192l41793K38129N46068L97103K98702L59364K07917m8930J19394N95990
$$ 3188192 2846399 3084528 3630596 4027699 4326401 4685765 4893682 4844752 4964146 5560136
38952E560136O50667J43607l14323m39552m37008j23565Q10713J623114J117593
$$ 5560136 6210803 6354410 6040087 5600535 5163527 5039962 5850675 7473789 8591382
38943H591382l14538q67302q72P40730K88500l44011n6574M32328Q7146m67528
$$ 8591382 8276844 7409542 7408670 8149400 8437900 8093889 8037315 8469643 8556789 8089261
38933H089261j10089P02424O88173j65604p90282p65726n14617k63780p756P676
$$ 8089261 7979172 8681596 9369769 9204165 8413883 7648157 7133540 6869760 6862004 6869680
38923F869680j64518K15730J353375K095085J515837N10922M78148J178599J343744
$$ 6869680 6705162 6920892 8274267 10369352 11885189 12396111 12874259 14052858 15396602
38914A5396602P56463K60097K26454M07478Q18371J476496J810376J549590J533898
$$ 15396602 16153065 16413162 16639616 17047094 17865465 19341961 21152337 22701927 24235825
38905B4235825K433076L483577L738089L596943L838535M365247N269501P490637
$$ 24235825 26668901 30152478 33890567 37487510 41326045 45691292 50960793 58451430
38897E8451430J0626573J1957620R938992O853299N562379N880279P132885J1423523
$$ 58451430 69078003 81035623 90974615 97827914 103390293 109270572 116403457 127826980
38889A27826980K0120939L0133617L9260957N1623772O8634118P6086301N3171596
$$ 127826980 147947919 178081536 217342493 268966265 337600383 413686684 466858280
38882D66858280j64392n4766487p9728126p2549456n4403048m1725758l3617926
$$ 466858280 466693888 411927401 332199275 259649819 205246771 163521013 129903087
38875A29903087k4549990j6129655j2107347j0716982q121963m713268l005514
$$ 129903087 105353097 89223442 77116095 66399113 58277150 53563882 50558368
38868E0558368k494474r84349J146516J910514J544451J898830K781023K095528
$$ 50558368 48063894 47079545 48226061 50136575 51681026 53579856 56360879 58456407
38860E8456407m59501k536801k377728p35150J085374L198422O063255R040111
$$ 58456407 57996906 55460105 53082377 52347227 53432601 56631023 62694278 71734389
38852G1734389J1783757J6036773K3240697K9713990K7183187J1238638j1505613
$$ 71734389 83518146 99554919 122795616 152509606 179692793 190931431 179425818
38845A79425818k7959759l1025983k5135806j8825587j5255880j2317151q836135
$$ 179425818 151466059 120440076 95304270 76478683 61222803 48905652 40069517
38838D0069517o282062n221146m186418k606167j775614k134739k189243j099610
$$ 40069517 33787455 28566309 24379891 21773724 19998110 17863371 15674128 14574518
38830A4574518q8817k15588p36719p91817q77828j418245j539481o60220J27633
$$ 14574518 14485701 14270113 13533394 12741577 11863749 10445504 8906023 8245803 8373436
38821H373436k59885j018384p78436J40719L90693j49275l87789K772J50822l89945
$$ 8373436 8113551 7095167 6316731 6457450 6848143 6698868 6311079 6313851 6464673 6074728
38811F074728q65731n67752O0553J15256m64746q30800l47649N99995J069757
$$ 6074728 5208997 4641245 4701798 4817054 4352308 3521508 3173859 3773854 4843611
38802D843611O70779n2272l66519j56750J96995M01225L78734J07230k80370m59459
$$ 4843611 5514390 5462118 5095599 4938849 5135844 5537069 5915803 6023033 5742663 5283204
38792E283204l20997j46490p5325J81447P02243R54154N83673R6402J00069L57551
$$ 5283204 4962207 4815717 4740392 4921839 5624082 6578236 7161909 7258311 7358380 7715931
38782G715931K95876k6263k10790k99350m84060n33221k85060j54722l50300k78249
$$ 7715931 8011807 7985544 7774754 7475404 6991344 6458123 6173063 6018341 5668041 5389792
38772E389792L64076P43956K67361j12158O23831J613510J347573J84092k54934
$$ 5389792 5753868 6497824 6765185 6653027 7276858 8890368 10237941 10422033 10167099
38763A0167099K28840L31446k84178m44634M21414J391985J582416J115734M16227
$$ 10167099 10395939 10727385 10443207 9998573 10419987 11811972 13394388 14510122 14926349
38754A4926349j21899J89350J584270K899756K782401J600746P85735P77360J144512
$$ 14926349 14804450 14993800 16578070 19477826 22260227 23860973 24646708 25424068 26568580
38745B6568580J989039L441854M642578N180129O413953R194828J1923008J3627251
$$ 26568580 28557619 31999473 36642051 41822180 48236133 57430961 69353969 82981220
38737H2981220J6830701K3755387L2479656M1886549N6375757P6192483Q4723373
$$ 82981220 99811921 123567308 156046964 197933513 254309270 330501753 415225126
38730D15225126N9196870J77521n9934604q7117345p8511264n7305808m2070849
$$ 415225126 474421996 474599517 414664913 327547568 249036304 191730496 149659647
38723A49659647l2929536k4387445j7173518j3594025j1336005p793525m787877
$$ 149659647 116730111 92342666 75169148 61575123 50239118 42445593 37657716
38716C7657716m464297m906978l664139j931515j715841j976796r35690L66421
$$ 37657716 33193419 28286441 24622302 22690787 20974946 18998150 18062460 18428881
38708A8428881j4210j475005k138669j891719j691695j364941l90302M19197J02747
$$ 18428881 18414671 16939666 14800997 12909278 11217583 9852642 9462340 9881537 9984284
38699I984284o70392p61999m01058l12177k21484K26275K86838n53767j214049
$$ 9984284 9313892 8551893 8150835 7838658 7617174 7843449 8130287 7576520 6362471
38690F362471o02152M47538M24131n47528j184585j073701p36186l12769L72637
$$ 6362471 5760319 6207857 6631988 6084460 4899875 3826174 3089988 2777219 3149856
38681C149856Q82379N81404k83663q73376q06994k47645N28896J034373P25030
$$ 3149856 4032235 4613639 4329976 3456600 2649606 2401961 2930857 3965230 4690260
38672D690260j19351m40579Q4882M80771M3103n67079n65866k89523k79795j90744
$$ 4690260 4570909 4130330 4215212 4695983 4739086 4172007 3606141 3316618 3036823 2846079
38662B846079L33101O48509J27062o34041p33296l70250k52908l07709q8661J52989
$$ 2846079 3179180 3827689 3954751 3320710 2587414 2217164 1964256 1656547 1567886 1720875
38652A720875p3695m66619l81004J01519M28888M61392L34724k8157n37432o65785
$$ 1720875 1647180 1180561 799557 901076 1329964 1791356 2126080 2097923 1560491 894706
38642H94706k56083Q1756M0696K05243P88952Q26708k82026j385660j064718K26139
$$ 894706 638623 720379 761075 966318 1755270 2581978 2299952 914292 -150426 75713
38632G5713Q81049M56481j24461k76844k61593j81292K16768P21624P33149K28804
$$ 75713 956762 1413243 1288782 1011938 750345 569053 785821 1507445 2240594 2469398
38622B469398j96961k48439j54153p6002M0625J64057K69182M77331O57334L62793
$$ 2469398 2272437 2023998 1869845 1793843 1834468 1998525 2267707 2745038 3402372 3765165
38612C765165l39962o42128k19500P9834m24145j029090p80292n4425J65300l6248
$$ 3765165 3425203 2783075 2563575 2643409 2219264 1190174 409882 355457 520757 484509
38602D84509J43786O50950O85285J57132j98679n7888K04148L38133L81848J73195
$$ 484509 628295 1279245 1964530 2121662 1922983 1865095 2069243 2407376 2789224 2962419
38592B962419l93588q53729p66148m87618m97843m34329K03864R21005R52708
$$ 2962419 2568831 1715102 948954 461336 -36507 -470836 -266972 654033 1606741
38583A606741O34951P62003J025623N45626l52625m83366J44449K34127o30159
$$ 1606741 2241692 3003695 4029318 4574944 4222319 3738953 3883402 4117529 3487370
38574C487370j239725o52367M34379P88059J83217o76613j084048q13523k05568
$$ 3487370 2247645 1595278 2029657 2817716 3000933 2324320 1240272 426749 221181
38565B21181Q5796j50117l24802O2724N81885N89728K76270J32668l1150m80781
$$ 221181 306977 156860 -167942 -105218 476667 1066395 1342665 1475333 1444183 963402
38555I63402o01727J56280R48825O33411k81801m23463J17900J01815m57434k89220
$$ 963402 361675 517955 1466780 2100191 1818390 1394927 1512827 1614642 1157208 867988
38545H67988O35668P81132k93969j025219l96159M68292K98526l30312j99606
$$ 867988 1503656 2284788 1990819 965600 569441 1037733 1336259 1005947 806341
38536H06341N86426R90825N52367l47673j014916p52509N09051J625073J363372
$$ 806341 1392767 2383592 2935959 2588286 1573370 820861 1329912 2954985 4318357
38527D318357K96012J89360J274786J822830R27078j75916m07712n30064j282238
$$ 4318357 4614369 4803729 6078515 7901345 8828423 8652507 8244795 7714731 6432493
38518F432493j650241o41505O51970N65519o04693j296112j073242o75395l63417
$$ 6432493 4782252 4140747 4792717 5358236 4753543 3457431 2384189 1708794 1345377
38509A345377J38774N32134L02416j45390p3241K12058j11363p92039q07770r6020
$$ 1345377 1484151 2016285 2318701 2173311 2100070 2312128 2200765 1408726 600956 504936
38499E04936L17652o9310o26371o81922k79708K63597P68659J038321Q82089L86283
$$ 504936 822588 753278 126907 -555015 -834723 -571126 197533 1235854 2117943 2504226
38489B504226j71944n69727o13307k43010J51348P7541k25723p6387L46729O9768
$$ 2504226 2332282 1762555 1149248 906238 1057586 1135127 909404 833017 1179746 1249514
38479A249514r27030j330226n36441L07633K42178L3612N36096R36050K48378
$$ 1249514 322484 -1007742 -1544183 -1236550 -994372 -960760 -424664 511386 759764
38470G59764o51187l73159N31974M85997l88683n42506L16101Q47225L65759l45487
$$ 759764 108577 -264582 267392 753389 364706 -177800 138301 985526 1351285 1005798
38460A005798o19292o40996m72270J09816O57548L95506l70666n77300j39205
$$ 1005798 386506 -254490 -726760 -616944 40604 436110 65444 -511856 -651061
38451f51061Q3602j0563K86627Q29416O57218j24102l02203K74175L34364m96903
$$ -651061 -567459 -578022 -291395 538021 1195239 1071137 768934 1043109 1377473 880570
38441H80570q93350j16364O50977K67276o06287q09763m17615n4041L28922Q45348
$$ 880570 -12780 -129144 521833 789109 182822 -626941 -1044556 -1098597 -769675 75673
38431G5673Q95257J38959o26843o19999k68087k51628k20713M05759J099587R07092
$$ 75673 970930 1109889 483046 -136953 -405040 -656668 -877381 -471622 627965 1535057
38421A535057P690n33115l07543O6723k4217m90225p64917l52964N92810J105848
$$ 1535057 1542747 1009632 702089 768812 744595 254370 -510547 -863511 -270701 835147
38411H35147M15213p53621q14709M30655J311225O29538p03817j226684r48541
$$ 835147 1250360 496739 -317970 112685 1423910 2053448 1349631 122947 -825594
38402h25594o99201m95589O8163N62513L20713j79871N6615Q32484J011890L28338
$$ -825594 -1524795 -2020384 -1952221 -1389708 -1068995 -1248866 -1192251 -359767 652123 980461
38392I80461l37429m36048k95745j47711K24606O75536N97125n8684n28012l30999
$$ 980461 643032 206984 -88761 -236472 -11866 663670 1260795 1202111 674099 343100
38382C43100R7838J64761j17975l88630m40963k58765K9259J13836j76121m93151
$$ 343100 440938 605699 487724 99094 -341869 -600634 -571375 -457539 -633660 -1126811
38372a126811l39837J90599N01610L15161n3522k32404j42531J78623O33694R17485
$$ -1126811 -1466648 -1276049 -774439 -459278 -512800 -745204 -887735 -709112 -75418 842067
38362H42067P34528K01048k98310n82796o57743l96759K64924R03788R02436K22197
$$ 842067 1576595 1777643 1479333 896537 238794 -157965 106959 1010747 1913183 2135380
38352B135380n14453p45064m59081p917K73919K99393K92862N01315P32312N25056
$$ 2135380 1620927 875863 416782 408865 682784 982177 1275039 1776354 2508666 3033722
38342C033722n0016l09897k0006J23659l64036q31911n27788O8479N291n05534
$$ 3033722 2983706 2673809 2653803 2777462 2413426 1581515 1053727 1122206 1127497 621963
38332F21963m51743J90550L51507l59340j019290q43168j80799L43447P07519
$$ 621963 170220 360770 712277 352937 -666353 -1509521 -1690320 -1346873 -639354
38323f39354R98101Q83596J81416o44187j038244r31399m64147K84562R87559
$$ -639354 358747 1242343 1423759 779572 -258672 -1190071 -1654218 -1369656 -382097
38314c82097J095012N26088j72302n80680p43662o33957q8339M83494K73278o01900
$$ -382097 712915 1239003 1066701 486021 -257641 -891598 -979937 -496443 -223165 -825065
38304h25065r16314r4147Q08770O98584J02718J64242P24969P22392P9681j92690
$$ -825065 -1741379 -1835526 -1026756 -328172 -225454 -61212 663757 1386149 1465830 1273140
38294A273140K65586O10953K09704m74122p78540p40637o42852l95979J01686
$$ 1273140 1538726 2149679 2359383 1885261 1106721 366084 -276768 -672747 -571061
38285e71061N22811N33003K87808J10527R304j17296j19260J44344M16380L27579
$$ -571061 -48250 484753 772561 883088 892392 775096 655836 800180 1216560 1544139
38275A544139n7230l30874k89996p4144J59185L62041M17141J71761k72095n83401
$$ 1544139 1486909 1156035 866039 791895 951080 1313121 1730262 1902023 1629928 1046527
38265A046527o36493o63429p98158p22227r0477P98904J154407O13696k80558
$$ 1046527 410034 -253395 -1051553 -1773780 -1864257 -1065353 89054 702750 422192
38256D22192p12092m82556n2464J29877M4256q6889j00114L3558K23627L02511
$$ 422192 -289900 -772456 -824920 -695043 -650787 -737676 -837790 -804232 -580605 -278094
38246b78094K00774Q1766J60054M22557O79313P97646O88886K23240n06478r65101
$$ -278094 -77320 4446 164500 587057 1266370 2064016 2752902 2976142 2469664 1504563
38236A504563o83007K9941L82653J76668J2986K55113M34263Q3717m22659m56459
$$ 1504563 821556 851497 1234150 1410818 1423804 1678917 2113180 2196897 1774238 1317779
38226A317779j37390p8150l89694o30620o07048n25189l81851Q7875P57462J063494
$$ 1317779 1180389 1102239 712545 81925 -525123 -1050312 -1432163 -1344288 -586826 476668
38216D76668P95690L40400l5971m80254q68574o09074L33720R21706L41950o77062
$$ 476668 1272358 1612758 1576787 1096533 227959 -381115 -47395 874311 1216261 539199
38206E39199p86744K9451M86311l1522o50736n02241N23M7227k00152j6555N67571
$$ 539199 -247545 -218094 268217 236695 -414041 -916282 -915759 -868532 -1068684 -1085239 -517668
38195e17668P89033L40946k64436n04060l27665J61969Q11773J133335O37437
$$ -517668 271365 612311 347875 -156185 -483850 -321881 489892 1623227 2260664
38186B260664l49226q68679n85742j96544k63332l54894J22932Q56398J075485
$$ 2260664 1911438 1042759 457017 260473 -2859 -357753 -234821 621577 1697062
38177A697062O61700J07184l27637o98099q26799m37971J89960M00121N8296l16548
$$ 1697062 2358762 2465946 2138309 1440210 613411 175440 365400 765521 823817 507269
38167E07269m01619m47406o33178o18808p4727P10856J095321P91986J27653l18531
$$ 507269 105650 -341756 -974934 -1593742 -1668469 -957613 137708 929694 1057347 738816
38157G38816k80569p4923k04907o15969o63546r2165L90110P7709n52393m25940
$$ 738816 458247 383324 178417 -437552 -1101098 -1193263 -803153 -725444 -1277837 -1703777
38147a703777N15683J185657R00580J73796k57152l35095k60150J8284L83039
$$ -1703777 -1188094 -2437 898143 1071939 814787 479692 219542 237826 620865
38138F20865L32046k33634n99985k38320L05926J99834m08914o27168q8156O45775
$$ 620865 952911 719277 119292 -119028 186898 386732 -22182 -649350 -737506 -91731
38128i1731Q42715L07118n31377r10297l92841M66072N53161l17716r44090l66859
$$ -91731 750984 1058102 526725 -383572 -776413 -310341 242820 -74896 -1018986 -1385845
38118a385845O58705P25616j60040p10710l74300K1586j66930l66161J16036Q34852
$$ -1385845 -727140 -1524 -161564 -872274 -1246574 -1224988 -1391918 -1758079 -1642043 -807191
38108h07191Q32169M9801o13561n06844P4768M33655L35294J43015K01540L19024
$$ -807191 24978 74779 -538782 -1045626 -970858 -537203 -201909 -58894 142646 461670
38098D61670P6830m15964n04670P0144O62663N81155P4881j24003M8040J9419
$$ 461670 538500 122536 -382134 -311990 350673 931828 1006709 882706 930746 950165
38088I50165l68265o32619n03326k51368m9373K59114N69379M58254J5853k1668
$$ 950165 581900 -50719 -554045 -805413 -854786 -595672 -26293 431961 447814 426146
38078D26146N86458J003874M61475n75166j054818p60236l71495l32681l57891
$$ 426146 1012604 2016478 2477953 1902787 847969 87733 -283762 -616443 -974334
38069i74334p1731M07567O66720M82468L2270k31996J7294N73458Q20215M22977
$$ -974334 -1046065 -638498 28222 510690 542960 310964 328258 901716 1721931 2144908
38059B144908k68258o65483n96450l34444j78918k00186k31493P420N52556R02812
$$ 2144908 1876650 1211167 614717 280273 101355 -98831 -330324 -322904 229652 1132464
38049A132464M82119m56054r03608m09588K13939K7471o49738p18735P2425P94553
$$ 1132464 1614583 1158529 254921 -154667 59272 86743 -562995 -1281730 -1209305 -414752
38039d14752O75362N4441k52516k3111K85040K30955j33384l97166k55445J46862
$$ -414752 260610 315051 62535 39424 324464 555419 422035 24869 -230576 -83714
38029h3714L65984K06106m2176o3078P433j33991l78420l22418R0598M61071M99231
$$ -83714 282270 488376 446200 383122 390555 256564 -121856 -444274 -353676 107395 606626
38018F06626L22446J05891j96901o04652q54414o46970o1807M28314L80663j72797
$$ 606626 929072 1034963 838062 233410 -621004 -1267974 -1329781 -901467 -520804 -693601
38008f93601p02830p00121k41521J29858J31840N6308K07860M04741L62834K43750
$$ -693601 -1396431 -2096552 -2338073 -2208215 -2076375 -2020067 -1812207 -1407466 -1044632 -800882
37998h00882L75169O59654P32986N33795K56467o6381m33535n54522k57473N16
$$ -800882 -425713 233941 966927 1500722 1757189 1690808 1257273 702751 445278 445794
37988D45794k59242o16505l16098L52163L19439m78255p79932N6786R33405O24893
$$ 445794 186552 -429953 -746051 -393888 -74449 -552704 -1332636 -1275850 -342445 282448
37978B82448m33471r68790p46620m81473l55204J22829R06293J230183P88511
$$ 282448 -151023 -1119813 -1866433 -2347906 -2703110 -2580281 -1673988 -443805 344706
37969C44706J62893j31312k21965k78398r9365L66238P15676O47711L07530j58972
$$ 344706 507599 376287 154322 -124076 -223441 142797 858473 1506184 1813714 1654742
37959A654742p96461j296643r61769K53415J234345R41582j89452q00680l83471
$$ 1654742 858281 -438362 -1400131 -1146716 87629 1029211 839759 39079 -344392
37950c44392K40001K20490k59675n00779k96564P776J45799J46451M4711j84359
$$ -344392 -104391 116099 -143576 -644355 -940919 -933143 -787344 -640893 -596182 -780541
37940g80541l81085k77575O2163K27203P9990L3664L78984O82474L91031k03069
$$ -780541 -1161626 -1439201 -1377038 -1149835 -1069845 -1036181 -657197 25277 416308 213239
37930B13239l30760k8225j50385q61337j101934k03378Q60557Q31068J11786Q1069
$$ 213239 -117521 -145746 -296131 -1157468 -2259402 -2462780 -1602223 -771155 -659369 -578300
37920e78300Q01648R17966m4400q20913m67653R0416l72578j283346j107519K10743
$$ -578300 223348 1141314 1096914 276001 -191652 -101236 -473814 -1757160 -2864679 -2653936
37910b653936J076279N41745m44488m96161L89236J069165Q25030Q4029l05657
$$ -2653936 -1577657 -1035912 -1480400 -1976561 -1587325 -518160 306870 390899 85242
37901H5242r5789J89308p757n16505o19482m1722N73548M93526o2248k17982K94758
$$ 85242 -10547 178761 171004 -345501 -964983 -1006705 -433157 60369 -1879 -219861 74897
37890G4897P59193N29818n7956k25799J27975L55819M8448l88132l39845J48744
$$ 74897 834090 1363908 1305952 1080153 1208128 1563947 1612395 1224263 884418 1033162
37880A033162M59267K48410j59636l04096j69451k8883L729m0899k17458n05031
$$ 1033162 1492429 1740839 1581203 1277107 1107656 1078773 1082502 1041603 824145 319114
37870C19114o02812l21865k0814j39792m36361l00771K57311O65905P94677J003431
$$ 319114 -283698 -605563 -626377 -766169 -1202530 -1503301 -1245990 -580085 214592 1218023
37860A218023J104131L91160q99256j349042l40866P81214N48095n41514r69595
$$ 1218023 2322154 2713314 1814058 465016 124150 905364 1453459 911945 -57650
37851e7650m88373m8237M4139L15909O70506L53914m85466p06615k847N42778
$$ -57650 -546023 -594260 -550121 -234212 436294 790208 304742 -401873 -404720 138058
37841A38058K14303k91491j95357J49373J30280l6161O6558J60394j24169m03846
$$ 138058 352361 60870 -134487 14886 145166 109005 175563 335957 211788 -192058
37831a92058j46405L82003N36963K59635l8111j81162k44800k13627j19993j68804
$$ -192058 -338463 43540 580503 840138 802027 620865 376065 162438 42445 -126359
37821a26359l48707l56277j87482j89859k48353K30928J085142J161344N2897
$$ -126359 -475066 -831343 -1018825 -1208684 -1457037 -1226109 -140967 1020377 1073274
37812A073274r36398n67858M71442O81682J0614l58713o727L63322L56850L09274
$$ 1073274 136876 -430982 40460 722142 732756 374043 367316 730638 1087488 1396762
37802A396762K86105q0766o47941p91162n34997n70525r40019p79069K63503J286151
$$ 1396762 1682867 1602101 954160 162998 -371999 -942524 -1882543 -2661612 -2398109 -1111958
37792a111958J293344M11987m43398n88953P9P89968J047658N16639k48797o09555
$$ -1111958 181386 593373 149975 -438978 -438899 351069 1398727 1915366 1666569 1057014
37782A057014o56641p36154n83929J45333Q18136M82768n01397p75015l4468N35231
$$ 1057014 400373 -335781 -919710 -774377 43759 526527 25130 -749885 -784353 -249122
37772b49122J86923l53829l14271q8824k77469n65497m23467r0030j3469l810
$$ -249122 -62199 -416028 -730299 -819123 -1096592 -1662089 -2085556 -2175586 -2189055 -2192865
37762b192865K67360N35514M66314L47896N26774O73500L52005j29550j71682
$$ -2192865 -1925505 -1389991 -923677 -575781 -49007 624493 976498 846948 675266
37753F75266J68523L55554K09838l1131k28454l96653m60304l59374j79367O0554
$$ 675266 843789 1199343 1409181 1378050 1149596 752943 292639 -66735 -246102 -185548
37743a85548M05547O11547L30389j87690k64128J05548J36629m25120q00340m83472
$$ -185548 219999 831546 1161935 974245 710117 815665 952294 527174 -273166 -756638
37733g56638o3772p2610j6357N62032R89812M99766m01174p20447m90763l37897
$$ -756638 -820410 -893020 -909377 -347345 642467 1142233 741059 20612 -470151 -808048
37723h08048j42766N52645J211657P79357n85860j494010j140326j57733M38404
$$ -808048 -950814 -398169 813488 1592845 1006985 -487025 -1627351 -1785084 -1346680
37714a346680L32980j17891l30704M5553O05614M43794n18587j063828l45149
$$ -1346680 -1013700 -1131591 -1462295 -1416742 -811128 -367334 -885921 -1949749 -2294898
37705b294898O82444O24392j99820l70256L12900P20127M32566K24566L93189
$$ -2294898 -1612454 -988062 -1187882 -1558138 -1245238 -525111 -92545 132021 525210
37696E25210K35373m28283o98883j36632M27896K60417j82759j63275K44935N23362
$$ 525210 760583 332300 -366583 -503215 -75319 185098 2339 -160936 83999 607361
37686F07361L91426k45765j203147j627476p11224Q95935J490279N55806n06541
$$ 607361 998787 753022 -450125 -2077601 -2788825 -1892890 -402611 153195 -353346
37677c53346l97846M66105R89446R19696N52224o9574p67970q98532k91146K06007
$$ -353346 -751192 -285087 704359 1624055 2176279 2106705 1338735 440203 149057 355064
37667C55064o3024n27823l79839J26203K46290j006o9601J07778J85821R8684
$$ 355064 292040 -235783 -615622 -489419 -243129 -244135 -313736 -205958 -20137 78547
37657G8547k640j19942j76146Q4279M91766M14675j69263l84433J36476M88313
$$ 78547 75907 -44035 -220181 -135902 355864 770539 601276 216843 353319 841632
37647H41632n0096p41042n82600Q9018L38975J98436K37672K65519j76368n79570
$$ 841632 791536 50494 -532106 -443088 -104113 94323 331995 597514 421146 -158424
37637a58424j78701N14228L66435m65285p83657l41459l9214j64798k3928N03046
$$ -158424 -337125 177103 543538 78253 -705404 -1046863 -1086077 -1250875 -1274803 -771757
37627g71757N97771O7097j82732K64133O08208K87827q9807N5111K92775J34306
$$ -771757 -173986 -106889 -289621 -25488 582720 870547 780740 835851 1128626 1262932
37617A262932q6637n8732k21812p99303j038547l79256M44892N17238K30219N13268
$$ 1262932 1176295 1117563 895751 96448 -942099 -1321355 -876463 -359225 -129006 384262
37607C84262J146373J134451M44493L4847J92469J40276m63799q45644m56492
$$ 384262 1530635 2665086 3109579 3144426 3336895 3477171 3013372 2167728 1711236
37598A711236P062l20711j080416j220724n14600K99092O80596P45633N73941
$$ 1711236 1718298 1397587 317171 -903553 -1418153 -1119061 -438465 307168 881109
37589H81109m0833q59653j020750j69430Q03811Q44258J51405k60527j36542j63545
$$ 881109 840276 -19377 -1040127 -1209557 -405746 438512 589917 329390 192848 29303
37579B9303o03694p76889k31813M45128M96948l143n12898p62519o39983J1101
$$ 29303 -574391 -1351280 -1583093 -1137965 -641017 -644160 -1157058 -1919577 -2559560 -2548459
37569b548459Q81363J104089L53550n27134o80680l90944k90840j35726N35427
$$ -2548459 -1667096 -563007 -209457 -736591 -1417271 -1808215 -2099055 -2234781 -1699354
37560a699354J112521O60628l43247m87351L62229P95291Q2662p38983n75980
$$ -1699354 -586833 73795 -269452 -756803 -394574 400717 483379 -255604 -831584
37551h31584J51095M34277K28283J80276M41359N96319M29646J06498j86612l30719
$$ -831584 -680489 -246212 -17929 162347 603706 1200025 1629671 1736169 1549557 1218838
37541A218838k21728O1030K61326K81633K07585k9653n26447r17782o76702k4132
$$ 1218838 997110 1058140 1319466 1601099 1808684 1779031 1252584 334802 -341900 -366032
37531c66032K18489r0969j38810M49460Q51632L45844m40894m64726J33051L53705
$$ -366032 -147543 -238512 -377322 72138 923770 1269614 828720 363994 497045 850750
37521H50750m6269l07771k7088K02252j66362o56592m11043M97260J009719M41998
$$ 850750 804481 496710 469622 671874 505512 -151080 -562123 -64863 944856 1386854
37511A386854n71287q97455m01447L8442l714P4892O14218Q17313O7107p24413
$$ 1386854 815567 -81888 -483335 -444893 -448607 -373715 240503 1057816 1124923 400510
37501D00510l77034N17540L86166p43417j213873m21627L11717P2851k40234K55972
$$ 400510 23476 541016 927182 183765 -1030108 -1451735 -1140018 -1067167 -1307401 -1051429
37491a051429Q36461N76749k6963j37180o3504l20931l45887L55408Q46825K37064
$$ -1051429 -214968 361781 334818 197638 134134 -186797 -532684 -177276 669549 906613
37481I06613m44075K09765J300689P39440j255045k151368q63807P41956Q28695
$$ 906613 462538 672303 1972992 2712432 1457387 -693981 -1557788 -815832 12863
37472A2863O1932k4704N03574N93605J73398L315J55511P993m65086n55432l0248
$$ 12863 74795 50091 553665 1147270 1320668 1323983 1479494 1487487 1022401 466969 436721
37461D36721M25435K28514k71217l54241K9542K45775k6198k43836J89590Q56989
$$ 436721 862156 1090670 819453 465212 494754 740529 714331 470495 660085 1517074
37451A517074P57892j53402p20197k90841K20357k06172r49618o61538N18325
$$ 1517074 2274966 2121564 1401367 1110526 1330883 1124711 175093 -486445 31880
37442C1880J050201K70887p53571r16887m18919K1536K42493L30195J00534m39314
$$ 31880 1082081 1352968 599397 -317490 -736409 -714873 -472380 -142185 -41651 -480965
37432d80965p51310m94013p2446M3330L5700K73821O06414O37998L38306n7281
$$ -480965 -1232275 -1726288 -1798734 -1755404 -1719704 -1445883 -839469 -201471 136835 79554
37422G9554l94075m84622q2940O27216R64284O23138J87230K54903M74068J10929
$$ 79554 -314521 -799143 -882083 -254867 709417 1332555 1519785 1774688 2248756 2359685
37412B359685o82382r33911k22120O76248P87057J62494l04356j24898K04625
$$ 2359685 1677303 743392 521272 1197520 1984577 2147071 1842715 1717817 1922442
37403A922442M2587l90928l77184Q2234J67011m33550q99800n27234J50304K83354
$$ 1922442 1965029 1574101 1196917 1279151 1446162 1012612 112812 -414422 -264118 19236
37393A9236J03306L38230P19420L72868m98573p35591j20547K48189j84135n57350
$$ 19236 122542 460772 1180192 1553060 1054487 318896 198349 446538 262403 -294947
37383b94947j53201M27530L96642P757j70968k55866m51964l41950K87518O97007
$$ -294947 -448148 -20618 376024 383781 212813 -43053 -495017 -836967 -549449 147558
37373A47558K74856l16800j20589N79957P93231M09107J26959J42273M4759j78721
$$ 147558 422414 105614 -14975 564982 1358213 1767320 1894279 2036552 2081311 1902590
37363A902590j47876j777k41673o66865n20926J78015M74629o5899o47665m34802
$$ 1902590 1754714 1752937 1511264 844399 323473 501488 976117 910218 262553 -172249
37353a72249K71125N75738K14965l00560m77444k96964J7870K99115M16115K14918
$$ -172249 98876 674614 889579 589019 111575 -185389 -167519 131596 547711 762629
37343G62629k77861o33381l47315M12331P59789K41891l33892L5925R20011R40458
$$ 762629 484768 -148613 -495928 -83597 676192 918083 584191 620116 1540127 2480585
37333B480585j05191q67853n36721K4330q2179l14972J00480O35820M24130j37056
$$ 2480585 2375394 1507541 970820 995150 912971 597999 698479 1334299 1758429 1621373
37323A621373j46493J58935j0025l78520j60137K48144j59706j008057r38703
$$ 1621373 1474880 1633815 1623790 1245270 1085133 1333277 1173571 165514 -773189
37314g73189M8243N14754K0160k64442J97677L76185k51541n37803K99664J083303
$$ -773189 -724946 -210192 -190032 -454474 -256797 119388 -132153 -669956 -370292 713011
37304G13011N15009o59084q64898j54582J60093k41318l83722K37467R55992J080401
$$ 713011 1228020 568936 -295962 -450544 -290451 -531769 -915491 -678024 277968 1358369
37294A358369O72213M2567o51751j129365j015540l87414J87280K98694M8627
$$ 1358369 2030582 2073149 1421398 292033 -723507 -1110921 -923641 -624947 -576320
37285e76320k40612l31214j19248K91063N75154M96021J86306k9996K0567K98532
$$ -576320 -816932 -1148146 -1267394 -976331 -401177 94844 281150 251154 271721 570253
37275E70253O18989O87290L49253j03864k20811m4850m0370l03940m40443l65029
$$ 570253 1189242 1876532 2225785 2121921 1901110 1856260 1815890 1511950 1071507 706478
37265G06478m90545q07656o01705L57344J111931P77491r6773l20838J97289M62383
$$ 706478 215933 -591723 -1193428 -836084 275847 1053338 956565 635727 833016 1295399
37255A295399m5194p40489r11927n70800j47779J20232K97286N39770Q65970J007837
$$ 1295399 1250205 509716 -402211 -973011 -1120790 -1000558 -703272 -163502 702468 1710305
37245A710305O39139j09348o63659p29115n92602m74771j59121L40797M26058
$$ 1710305 2349444 2240096 1576437 847322 254720 -220051 -379172 -38375 387683
37236C87683j39599n67149j56487M76543K89544m71564o00457J80445Q39140O40555
$$ 387683 248084 -319065 -475552 991 290535 -181029 -781486 -601041 238099 878654
37226H78654M2160k93398m10273n58591n74231k74905P2131J38827L0875P0151
$$ 878654 920814 627416 217143 -341448 -915679 -1190584 -1118453 -979626 -948751 -878600
37216h78600L43035O28633N63714o8798r11022j105884l02792O61835P62203K12816
$$ -878600 -535565 93068 656782 587984 -323038 -1428922 -1731714 -1069879 -307676 -94860
37206i4860K9752L52985L38987k08187l68867L06049R20459O29344q1041l21963
$$ -94860 -65108 287877 626864 418677 49810 355859 1276318 1905662 1824621 1502658
37196A502658j78749k45583m46460l10344J9329J7445k39463k01763J79588L81681
$$ 1502658 1323909 1078326 631866 321522 340851 358296 118833 -82930 96658 478339
37186D78339J47702k49037n04115m88272j08920M58382O00371q510o81714m82184
$$ 478339 626041 377004 -127111 -615383 -724303 -265921 334450 325940 -355774 -837958
37176h37958L62861O55253m6311p43035m16352N57105R72084L72764n16800q15235
$$ -837958 -475097 180156 133845 -609190 -1025542 -468437 503647 876411 359611 -455624
37166d55624m67490j08747j89704m39172k54487M62220J091460J034285M28398
$$ -455624 -923114 -1031861 -1221565 -1660737 -1915224 -1453004 -361544 672741 1101139
37157A101139j15718k97011l03291l33492l44344k75546j68345m333K68084M90928
$$ 1101139 985421 688410 385119 51627 -292717 -568263 -736608 -740941 -472857 18071
37147A8071L85351k0516l21220k15823J52002M43084N08519L90398J05245l69505
$$ 18071 403422 382906 61686 -154137 -2135 440949 949468 1339866 1445111 1075606
37137A075606q98073j108741o63346K89111J017709Q38292q6925q44039q02483
$$ 1075606 177533 -931208 -1594554 -1305443 -287734 550558 463633 -380406 -1182889
37128a182889k75818L7999n8651k43999k32722M0900N42678J022348J014900M14871
$$ -1182889 -1458707 -1420708 -1479359 -1723358 -1956080 -1915180 -1372502 -350154 664746 1079617
37118A079617j78239j77568J82442L13846K35803L09088K71852m58687j537073
$$ 1079617 901378 723810 906252 1220098 1455901 1764989 2036841 1578154 41081
37109D1081j826161j025540j28516J36917K72576Q15451J206195P51653p7253
$$ 41081 -1785080 -2810620 -2939136 -2802219 -2529643 -1714192 -507997 243656 166403
37100A66403l43035p7605K1246j04903K3655L01511J76235j84996l3698N73008
$$ 166403 -176632 -254237 -232991 -337894 -314239 -12728 163507 -21489 -55187 517821
37090E17821O82084R217n33277l38566o0364l60954o57446j05630Q25809R24056
$$ 517821 1199905 1209122 675845 337279 276915 -84039 -741485 -847115 -21306 902750
37080I02750J00399m62673j07476M04336J84801m46448n86337j59480J16707j7690
$$ 902750 1003149 540476 433000 837336 1022137 575689 -10648 -170128 -53421 -71111
37070g1111j3838M16137O61109J55815o03017p23622k72690o1131j73347J85980
$$ -71111 -84949 331188 992297 1148112 545095 -178527 -451217 -512348 -685695 -499715
37060d99715J075941J232203o8206j492250j223718M63184J545127J005803j13345
$$ -499715 576226 1808429 1740223 247973 -975745 -512561 1032566 2038369 1925024
37051A925024n68052m58989m06562l55102j4578L21191K31212j07933l42021n67596
$$ 1925024 1356972 897983 491421 136319 121741 442932 674144 566211 224190 -343406
37041c43406q89407q78446k02865O28322Q81626O02202L13616J01858k32452m40652
$$ -343406 -1232813 -2111259 -2314124 -1685802 -804176 -201974 111642 213500 -18952 -459604
37031d59604j05696N13620P23011L90430j2020k46452m55826n75268l70390l7302
$$ -459604 -565300 -51680 671331 1061761 1049741 803289 347463 -227805 -598195 -635497
37021f35497k1313k33617j62174K42059N07255M42203K41605j48623q83929j429676
$$ -635497 -656810 -890427 -1052601 -810542 -303287 138916 380521 231898 -652031 -2081707
37011b081707r42436L36077J063641N51114l66029o21067j97839L58729Q17795
$$ -2081707 -3024143 -2688066 -1624425 -1073311 -1439340 -2060407 -2258246 -1899517 -1081722
37002a081722J017861N61164m74249j135469o79622L93651J037964R30252M51390
$$ -1081722 -63861 497303 23054 -1112415 -1792037 -1398386 -360422 569830 1021220
36993A021220p7946m62957m09052O1675L69241J93347N8480M08906O56954N5428
$$ 1021220 943274 480317 71265 132940 502181 695528 754008 1162914 1819868 1875296
36983A875296r37897j214542o61436j73609j46594o8546L12766M96673J91067
$$ 1875296 937399 -277143 -938579 -1112188 -1258782 -1327328 -1014562 -517889 -326822
36974c26822j44461j01325O6514J3732j42199k04245k67518l30455m1394P35781
$$ -326822 -471283 -572608 -506094 -492362 -634561 -838806 -1106324 -1436779 -1478173 -742392
36964g42392J466248J466153O96084k06538n43991j44637M43364L75803n41979
$$ -742392 723856 2190009 2886093 2679555 2135564 1990927 2434291 2810094 2268115
36955B268115j410240j195905q4057P21650N84092J22296J20005M76013O53167
$$ 2268115 857875 -338030 -422087 299563 883655 1005951 1125956 1601969 2255136
36946B255136N41510L23587k6837m84675n79327L2256P77510O78258l21851j199798
$$ 2255136 2796646 3120233 3093396 2608721 2029394 2061650 2839160 3517418 3195567 1995769
36936A995769j207434p68213o28460o37553q1943R42924J358231O02948m19583
$$ 1995769 788335 20122 -608338 -1245891 -1327834 -384910 973321 1576269 1156686
36927A156686n55425n8531r6490p97254r65807l6280Q56980N22110m71638o63008
$$ 1156686 601261 542730 446240 -351014 -1316821 -1353101 -496121 25989 -445649 -1108657
36917a108657J58457Q20444N69891q4953l98411l24729j96678j49110j09724O0686
$$ -1108657 -950200 -129756 440135 355182 -43229 -367958 -564636 -713746 -823470 -762784
36907g62784M64556Q58640O74480j55924p54853l86943L82975N11932R2485K5185
$$ -762784 -298228 560412 1234892 1078968 324115 -62828 320147 832079 924564 949749
36897I49749L44347K24394l69958n03497K9884K83688j50047m64145k09338q4741
$$ 949749 1294096 1518490 1148532 645035 674919 958607 808560 344415 135077 50336
36887E0336m17036l32090N56867J052015K35111q07969o04082L64703N37042k48762
$$ 50336 -366700 -698790 -141923 910092 1145203 337234 -266848 97855 634897 386135
36877C86135p89630n35159J2658N61086J132027J162072R8150j184575j153340
$$ 386135 -403495 -938654 -925996 -364910 767117 1929189 2027339 842764 -310576
36868c10576Q4248P84143J20347p64777p14913j47625J0506j94370j61660J94174
$$ -310576 -226328 557815 678162 -86615 -801528 -949153 -938647 -1133017 -1294677 -1100503
36858a100503N40592O91644N27948p3040p85758r12292l23119K60829K92990Q6227
$$ -1100503 -559911 131733 659681 586641 -199117 -1111409 -1434528 -1173699 -880709 -794482
36848g94482R6229J83497O4980r0985l7735O6714J6479m6191n629q4766l67783
$$ -794482 -698253 -514756 -449776 -540761 -578496 -511782 -495303 -541494 -547123 -631889 -999672
36837i99672m74712j58503K08765K16146Q4277K58012O49326P83580M80056l8823
$$ -999672 -1474384 -1632887 -1424122 -1207976 -1123699 -865687 -216361 567219 1047275 1008452
36827A008452n34766q78248r28410o04307k2140N62007Q36518N32748k15914o88034
$$ 1008452 473686 -404562 -1332972 -1937279 -1959419 -1397412 -560894 -28146 -244060 -932094
36817i32094k97898M65353N07200k94254p67591r3485J005200J321384P54200
$$ -932094 -1229992 -764639 -257439 -551693 -1319284 -1412769 -407569 913815 1668015
36808A668015R8165k46189m93181o89396n69292j51480J99504L22113L39243K50494
$$ 1668015 1766180 1519991 1026810 337414 -231878 -383358 -183854 138259 477502 727996
36798G27996j4072j90488P6964N56058N64823q2450p77476r40793o74086l62555
$$ 727996 713924 523436 600400 1156458 1721281 1638831 861355 -79438 -753524 -1116079
36788a116079p4420K85907N51783M65970J45755k8439K9772L4545j38559k24861
$$ -1116079 -1190499 -904592 -352809 113161 258916 230477 260249 294794 156235 -68626
36778f8626o2718N6413j25862l08593r5060K31969P1180m19020m26779J67037
$$ -68626 -131344 -74931 -200793 -509386 -604446 -372477 -301297 -720317 -1147096 -980059
36768i80059M73588M9177l10045N1797M29671k1424o62362l49039N22535N62843
$$ -980059 -506471 -457294 -767339 -715542 -285871 -307295 -969657 -1318696 -796161 -233318
36758b33318k58173n53573Q2382M31460j13845m46890K47657R57796M95530n56704
$$ -233318 -491491 -1045064 -962682 -531222 -645067 -1091957 -844300 113496 609026 52322
36748E2322q41615k36497L69876N40134L62472k15389r60229r61419J10641J021018
$$ 52322 -789293 -1025790 -655914 -115780 246692 31303 -928926 -1890345 -1779704 -758686
36738g58686N66057m73749m77929M08502N54769l99847q96086N5342J304794J239246
$$ -758686 -192629 -666378 -1144307 -735805 -181036 -580883 -1476969 -1421627 -116833 1122413
36728A122413n8463j126648r61850P3969Q31176N34107m18972q43040k24188N55132
$$ 1122413 1063950 -62698 -1024548 -950579 -119403 414704 -4268 -847308 -1071496 -516364
36718e16364M73253j47768k81452J14162J87101k36351m10611l4700L22671L16660
$$ -516364 -43111 -190879 -472331 -358169 -171068 -407419 -818030 -852730 -530059 -213399
36708b13399K51021K30724m4570m45874m27360o2353k308k53660j63298K19317
$$ -213399 37622 268346 223776 -222098 -649458 -711811 -714119 -967779 -1131077 -911760
36698i11760R6352m95202n21499J80718M33922k17501n87255P6284O95865K86949
$$ -911760 -815408 -1310610 -1832109 -1651391 -1217469 -1434970 -2022225 -1945941 -1250076 -963127
36688i63127k25730L31716J178874Q50935k69875o36035j47484r3642p33359q82578
$$ -963127 -1188857 -857141 321733 1172668 902793 266758 119274 25632 -707727 -1590305
36678a590305m0146Q14622Q99909O25530M82867K45921k24464m95457l75849k68301
$$ -1590305 -1630451 -815829 84080 709610 1192477 1438398 1213934 718477 342628 74327
36668G4327l17685j25551L49675N58119L62777K83896L77824j4926q75475j044990
$$ 74327 -243358 -368909 -19234 538885 901662 1185558 1563382 1548456 672981 -372009
36658c72009K2590J113318R17680k2245k65471K57637L41927l82540q96804n36492
$$ -372009 -349419 763899 1681579 1659334 1393863 1651500 1993427 1610887 714083 177591
36648A77591j018q7377m20896k13028L77259N09851n117m67035l74493m9008M8835
$$ 177591 176573 89196 -331700 -544728 -167469 342382 337265 -129770 -504263 -553271 -504436
36637e04436N7708L49232P71303P83800K62274l09563n10189m36747l66116l50467
$$ -504436 -446728 -97496 673807 1457607 1719881 1410318 900129 463382 97266 -253201
36627b53201l62041m79221o32897m81388R9027O51846O73312L12393J10640K01349
$$ -253201 -615242 -1094463 -1727360 -2208748 -2109721 -1457875 -784563 -472170 -361530 -160181
36617a60181K40706M6633j85856k92735l03747j92297Q3439K82857J12061k19083
$$ -160181 80525 127158 -58698 -351433 -655180 -847477 -764038 -481181 -369120 -588203
36607e88203j95636J79382L48863J33513M2077L45883M99905m604p30620q67823
$$ -588203 -783839 -604457 -255594 -122081 -80004 265879 765784 761180 30560 -837263
36597h37263l86438J6111n4420l05674l41073r9734K89363O39913O72324K66138
$$ -837263 -1223701 -1207590 -1262010 -1567684 -1908757 -2008491 -1719128 -1079215 -406891 -140753
36587a40753k02067j74329L42062P10122M75176q7632m02925k86718o335J26370
$$ -140753 -342820 -517149 -175087 535035 1010211 922579 519654 232936 226601 352971
36577C52971n091l39638o65377o88514k74204L51990P47305O48863K15700j41883
$$ 352971 347880 8242 -657135 -1345649 -1619853 -1267863 -520558 128305 344005 202122
36567B02122j86607p9066j09724k56495k19226N7287K05364N545j77327N7497
$$ 202122 15515 -63551 -173275 -429770 -648996 -591709 -386345 -380800 -558127 -500630
36557e00630M00578K30176l17671m12470J56208N02351l1412p43307n28746M62786
$$ -500630 -100052 130124 -187547 -600017 -443809 58542 27130 -716177 -1244923 -782137
36547g82137J042599P06436J81404J19181J77036j60932o03288n45636q1820J50465
$$ -782137 260462 966898 1148302 1267483 1444519 1283587 680299 134663 52843 203308
36537B03308r6801m78553o53036n74370k70200J98137N59200N13652J24587k51763
$$ 203308 106507 -372046 -1025082 -1599452 -1869652 -1671515 -1112315 -598663 -474076 -725839
36527g25839l70621j85896K79936P84715P97493J03274o37812n36181L10444Q52888
$$ -725839 -1096460 -1282356 -1002420 -217705 579788 683062 45250 -490931 -180487 672401
36517F72401M53889l78243q12244o66268k59430J76289N26388O23129M44361K15778
$$ 672401 1126290 748047 -64197 -730465 -989895 -813606 -287218 335911 780272 996050
36507I96050M3029k27968n38871m62976R3156M84387J59766m46331m82054P1067
$$ 996050 1039079 811111 272240 -190736 -97580 386807 546573 100242 -381812 -310745
36497c10745L86146j788o12745p89091n35188l28325m08410n33723l34172K49315
$$ -310745 75401 73613 -539132 -1328223 -1863411 -2191736 -2600146 -3133869 -3468041 -3218726
36487c218726Q64742J076391Q10109L96972J47377M6593m8641j35249j53596j59037
$$ -3218726 -2353984 -1277593 -467484 -70512 76865 123458 74817 -60432 -214028 -373065
36477c73065k16161k80624l27689l97075l91677j25203K63561L16334m8779k31916
$$ -373065 -589226 -869850 -1197539 -1594614 -1986291 -2111494 -1847933 -1531599 -1580378 -1812294
36467a812294K56148J005040J170901N34237l21446p16178m04438L60584Q99175
$$ -1812294 -1556146 -551106 619795 1154032 832586 116408 -288030 72554 971729
36458I71729N12188p07409j686786j477235l52123O40602R38332P44266L78288
$$ 971729 1483917 776508 -910278 -2387513 -2739636 -2099034 -1160702 -416436 -38148
36449c8148N7209J05496N97091Q80176K64241q19229j169235m44286L74005L87957
$$ -38148 19061 124557 721648 1601824 1866065 1046836 -122399 -566685 -192680 195277
36439A95277j01182k56228J35223O00741O69669K62556l25308o28640m50394j28322
$$ 195277 94095 -162133 -26910 573831 1243500 1506056 1180748 552108 101714 -26608
36429b6608n3062n1218K37661N28465J94303n92161q84322l33192K98217L07194
$$ -26608 -79670 -130888 106773 635238 829541 237380 -646942 -980134 -681917 -374723
36419c74723o6887l36668n37913p52051n84102J75546Q95553Q32601J68679l16966
$$ -374723 -441610 -778278 -1316191 -2068242 -2652344 -2476798 -1581245 -748644 -579965 -896931
36409h96931l36250k51507l32309m11988k53203J18298M56764N31312M08107M64537
$$ -896931 -1233181 -1484688 -1816997 -2228985 -2482188 -2363890 -1907126 -1375814 -967707 -503170
36399e03170Q35414R62907K55116q32446j124401l04101O24699P55496L47574
$$ -503170 332244 1295151 1550267 717821 -406580 -710681 -85982 669514 1017088
36390A017088O0079m2856j31525k4845L18528L63819k00483p75934o99191k59568
$$ 1017088 1077167 1034311 902786 877941 1196469 1560288 1359805 583871 -115320 -374888
36380c74888j30132k74870k08374Q0668K56402L30021M87288N60754L55927J27123
$$ -374888 -505020 -779890 -988264 -907596 -651194 -321173 166115 726869 1082796 1209919
36370A209919Q2313j03743n78427o92016M5995R31580R51243K27543m04933p52426
$$ 1209919 1292232 1188489 610062 -81954 -35959 895621 1846864 2074407 1669474 917048
36360I17048j075642j068727l60597L21504l7012r16333p94694M28062J119435
$$ 917048 -158594 -1227321 -1587918 -1266414 -1303426 -2219759 -3014453 -2586391 -1466956
36351a466956L91879n91677m45945N16507R95510M72345m67059r94720p03588
$$ -1466956 -1075077 -1666754 -2112699 -1596192 -600682 -128337 -595396 -1590116 -2293704
36342b293704J33930O92703M41037j06684q7651M01452N67263L33770L34788N07980
$$ -2293704 -2159774 -1467071 -1026034 -1132718 -1220369 -818917 -251654 82116 416904 924884
36332I24884Q1817p78116p90693L91606J346355R08817j93487o67751m98822l87238
$$ 924884 1006701 228585 -562108 -170502 1175853 2084670 1891183 1223432 724610 337372
36322C37372l09182J28395N70390L84505j47928k03628K47209M03920j65980r84916
$$ 337372 28190 156585 726975 1111480 963552 759924 1007133 1411053 1245073 260157
36312B60157j250755n61470O87297J371851O38795q52992j401669l98439Q53771
$$ 260157 -990598 -1552068 -864771 507080 1145875 292883 -1108786 -1507225 -653454
36303f53454J031759N20664L83945N57036K71738l82435o42800m64004m72109
$$ -653454 378305 898969 1282914 1839950 2111688 1729253 1086453 622449 150340
36294A50340o89748m73756K60252P71182N88435P5775k24753j76497Q4082L30741
$$ 150340 -539408 -1013164 -752912 18270 606705 682480 457727 281230 365312 696053
36284F96053K90109q7909m90890o58585o52780m77817J9672N33823L52565m22436
$$ 696053 986162 898253 407363 -251222 -904002 -1381819 -1362147 -828324 -475759 -898195
36274h98195o05705L15815J101395N36958n84772o74721J43948L87545k88475
$$ -898195 -1503900 -1188085 -86690 450268 -134504 -809225 -665277 -277732 -566207
36265e66207o89491j97479L58071K50077j36007k66024k50822k53437j04869J40456
$$ -566207 -1255698 -1453177 -1095106 -845029 -981036 -1247060 -1497882 -1751319 -1856188 -1715732
36255a715732J50515K4267J77742M56328L43574N3912K64297P21013M41670n10796
$$ -1715732 -1565217 -1540950 -1363208 -906880 -563306 -509394 -245097 475916 917586 406790
36245D06790q85091k42515L56450K19166R7117N83665Q29384k5787j221632j408289
$$ 406790 -478301 -720816 -364366 -145200 -48083 535582 1364966 1339179 117547 -1290742
36235a290742n80750J50323K31704J12711K95459P03049Q61624L48398o56956
$$ -1290742 -1871492 -1721169 -1489465 -1376754 -1081295 -378246 483378 831776 174820
36226A74820j197116n51836N41152O51355k16775n31349L24145R84700L10962
$$ 174820 -1022296 -1574132 -1032980 -381625 -598400 -1129749 -805604 179096 490058
36217D90058p50610p21113J51555N81913L26732J24134J58124l219l07924l15810
$$ 490058 -260552 -981665 -830110 -248197 78535 202669 360793 357574 49650 -266160
36207b66160j20832r5296l6884L98178P96504N93142J81960K85638N74802J46339
$$ -266160 -386992 -482288 -519172 -120994 675510 1268652 1450612 1736250 2311052 2457391
36197B457391q38508j239112o26693K12273N03642K83828l4651j05904K34035
$$ 2457391 1618883 379771 -246922 -34649 468993 752821 718170 612266 846301
36188H46301O15524K43274r06147j568188q35000L49892N60871P8043J88629Q60638
$$ 846301 1461825 1705099 798952 -769236 -1604236 -1254344 -693473 -615430 -426801 433837
36178D33837R16138K40029j14394O281l27734j052156q95420K88129R79352M78465
$$ 433837 1349975 1590004 1475610 1481891 1154157 102001 -793419 -505290 474062 952527
36168I52527k3423K84300M57700j79281n71495N2091M81278l81282j263926m41190
$$ 952527 929104 1213404 1671104 1491823 920328 972419 1453697 1072415 -191511 -632701
36158f32701J239543J496857J04833r81948p09347j5536J97984K27547L61279
$$ -632701 606842 2103699 2208532 1226584 517237 501701 699685 927232 1288511
36149A288511K16388j97867j68905M23281P19413L00663j55590j72287k81991
$$ 1288511 1504899 1307032 1138127 1561408 2280821 2581484 2425894 2253607 1971616
36140A971616q56566j177337n62133L62238M71103k50195p74845m56824L23268
$$ 1971616 1115050 -62287 -624420 -262182 208921 -41274 -816119 -1272943 -949675
36131i49675Q09914O36523J3877m79568m03465K1238J34217k12409l29360K99001
$$ -949675 -139761 496762 510639 31071 -372394 -351156 -216939 -429348 -758708 -459707
36121d59707J075580R48517j74676j265450j420591p57043J6794M41661M97908
$$ -459707 615873 1564390 1389714 124264 -1296327 -2053370 -2036576 -1594915 -1097007
36112a097007L19986O0294r2838k8681J52364K43701J54619l6923j81548j27685
$$ -1097007 -777021 -716727 -809565 -838246 -685882 -442181 -287562 -324485 -506033 -633718
36102f33718J92587N86254O06794J1462p68483r32113k64949M76202M45790j93741
$$ -633718 -441131 145123 751917 763379 -5104 -937217 -1202166 -725964 -280174 -473915
36092d73915m83403J8483O05842L81909m65803q04289J5177J248968J563142O04440
$$ -473915 -957318 -938835 -332993 48916 -416887 -1221176 -1205999 42969 1606111 2210551
36082B210551o00605r24824m40396n7973j45922j91285J30579L53148Q6532k25688
$$ 2210551 1609946 685122 244726 186753 40831 -150454 -19875 333273 419805 194117
36072A94117o6782K16575O0967j96995J28102O84284M51537m87589q16011K2097
$$ 194117 127335 343910 404877 207882 335984 1020268 1471805 984216 168205 190302
36062A90302Q65336N16658n62424j028195m60339L75297O27579J12743o78494
$$ 190302 1055638 1572296 1009872 -18323 -478662 -103365 524214 636957 -41537
36053d1537r17141k07997P20589P35129p6319m17973K08396O92549K01104m13876
$$ -41537 -958678 -1166675 -446086 289043 212724 -205249 3147 695696 896800 482924
36043D82924j80037K42543j68498q00326m33405M75722M95630k35105k59482N16001
$$ 482924 302887 545430 376932 -423394 -856799 -381077 114553 -120552 -380034 135967
36033A35967N88564m10754r36762j64200O30760L31830k01674J40279P40774M80400
$$ 135967 724531 313777 -622985 -787185 -156425 175405 -26269 114010 854784 1335184
$$ [...]
##END NTUPLES=NMR SPECTRUM
##END=
