##TITLE=31Pdec_PR151_30
 D2O, 24 sc
 30.04.2021
##JCAMPDX= 6.0         $$ Bruker NMR JCAMP-DX V2.0
##DATA TYPE= NMR SPECTRUM
##DATA CLASS= NTUPLES
##ORIGIN= UXNMR, Bruker Analytische Messtechnik GmbH
##OWNER= root
$$ XWIN-NMR		Version 3.5
$$ Fri Apr 30 15:40:10 2021 Russian Standard Time (UT+4h)  she@DPX200
##.OBSERVE FREQUENCY= 81.013821
##.OBSERVE NUCLEUS= ^31P
##.ACQUISITION MODE= SIMULTANEOUS
##.ACQUISITION SCHEME= undefined
##.AVERAGES= 24
##.DIGITISER RES= 16
##SPECTROMETER/DATA SYSTEM= spect
##.PULSE SEQUENCE= zgpg30
##.SOLVENT NAME= CDCl3
##.SHIFT REFERENCE= (INTERNAL, CDCl3, 0, 248.564)
##AUDIT TRAIL= $$ (NUMBER, WHEN, WHO, WHERE, WHAT)
$$ ##TITLE= Audit trail, XWIN-NMR		Version 3.5
$$ ##JCAMPDX= 5.01
$$ ##ORIGIN= Bruker BioSpin GmbH
$$ ##OWNER= she
$$ F:/spectra/data/she/nmr/P31/1/pdata/1/auditp.txt
$$ ##AUDIT TRAIL=  $$ (NUMBER, WHEN, WHO, WHERE, WHAT)
(   1,<2021-04-30 15:39:18.32 +0400>,<she>,<DPX200>,
      <created by zg, POWCHK disabled, PULCHK disabled
       configuration hash MD5:
       00 E9 B6 7A A2 85 ED C7 34 08 36 98 17 FE 4E 26
       data hash MD5: 32K
       8E 57 F8 F9 3D 21 0F 7A 70 B5 C9 D3 61 AC 89 28>)
(   2,<2021-04-30 15:39:23.93 +0400>,<she>,<DPX200>,
      <Start of raw data processing
       efp BC_mod = 2 LB = 1 FT_mod = 6 PKNL = 1 PHC0 = -6393.382 PHC1 = 458.2009 SI = 64K 
       data hash MD5: 64K
       53 05 F8 F9 A5 33 21 DA 26 CA A8 83 5E E7 80 50>)
(   3,<2021-04-30 15:39:47.06 +0400>,<she>,<DPX200>,
      <pk PHC0 = 181.7938 PHC1 = -392.2 
       data hash MD5: 64K
       73 70 78 FD FE 57 4F 20 66 17 7D C9 3C D3 00 72>)
$$ ##END=
$$ 
$$ hash MD5
$$ 29 0F A1 79 C2 4D 47 0B 7A 9B 49 69 55 3B C5 55
##$RELAX= 
##$RELAX= 
##$RELAX= 
##$RELAX= 
##$RELAX= 
##$RELAX= 
##$RELAX= 
##$RELAX= 
$$ Bruker specific parameters
$$ --------------------------
##$DU= <F:/spectra>
##$EXPNO= 1
##$NAME= <P31>
##$PROCNO= 1
##$TYPE= <nmr>
##$USER= <she>
##$AMP= (0..31)
100 100 100 100 100 100 100 100 100 100 100 100 100 100 100 100 100 100 
100 100 100 100 100 100 100 100 100 100 100 100 100 100 
##$AQSEQ= 0
##$AQ_mod= 1
##$AUNM= <au_zg>
##$AUTOPOS= <>
##$BF1= 81.014009
##$BF2= 200.13
##$BF3= 200.13
##$BF4= 200.13
##$BF5= 200.13
##$BF6= 200.13
##$BF7= 200.13
##$BF8= 200.13
##$BYTORDA= 1
##$CFDGTYP= 0
##$CFRGTYP= 5
##$CHEMSTR= <none>
##$CNST= (0..31)
1 1 145 1 1 1 1 1 1 1 1 1 1 1 1 1 1 1 1 1 1 1 1 1 1 1 1 1 1 1 1 1 
##$CPDPRG= <waltz16>
##$CPDPRG1= <>
##$CPDPRG2= <waltz16>
##$CPDPRG3= <>
##$CPDPRG4= <mlev>
##$CPDPRG5= <mlev>
##$CPDPRG6= <mlev>
##$CPDPRG7= <mlev>
##$CPDPRG8= <mlev>
##$CPDPRGB= <>
##$CPDPRGT= <>
##$D= (0..31)
0 1 0 0 0 0 0 0 0 0 0 0.03 2e-05 3e-06 0 0 0 0 0 0 0 0 0 0 0 0 0 0 0 0 
0 0 
##$DATE= 1619782757
##$DBL= (0..7)
120 120 120 11 120 120 24 19 
##$DBP= (0..7)
150 150 150 150 150 150 150 150 
##$DBP07= 0
##$DBPNAM0= <>
##$DBPNAM1= <>
##$DBPNAM2= <>
##$DBPNAM3= <>
##$DBPNAM4= <>
##$DBPNAM5= <>
##$DBPNAM6= <>
##$DBPNAM7= <>
##$DBPOAL= (0..7)
0.5 0.5 0.5 0.5 0.5 0.5 0.5 0.5 
##$DBPOFFS= (0..7)
$$ [...]
##$SUBNAM2= <"">
##$SUBNAM3= <"">
##$SUBNAM4= <"">
##$SUBNAM5= <"">
##$SUBNAM6= <"">
##$SUBNAM7= <"">
##$SUBNAM8= <"">
##$SUBNAM9= <"">
##$SW= 501.771253377433
##$SWIBOX= (0..15)
0 1 3 0 0 0 0 0 0 0 0 0 0 0 0 0 
##$SW_h= 40650.406504065
##$TD= 32768
##$TD0= 1
##$TE= 0
##$TE2= 300
##$TE3= 300
##$TEG= 300
##$TL= (0..7)
0 120 53 12 22 120 120 120 
##$TP= (0..7)
150 150 150 150 150 150 150 150 
##$TP07= 0
##$TPNAME0= <>
##$TPNAME1= <>
##$TPNAME2= <>
##$TPNAME3= <>
##$TPNAME4= <>
##$TPNAME5= <>
##$TPNAME6= <>
##$TPNAME7= <>
##$TPOAL= (0..7)
0.5 0.5 0.5 0.5 0.5 0.5 0.5 0.5 
##$TPOFFS= (0..7)
0 0 0 0 0 0 0 0 
##$TUNHIN= 0
##$TUNHOUT= 0
##$TUNXOUT= 0
##$USERA1= <user>
##$USERA2= <user>
##$USERA3= <user>
##$USERA4= <user>
##$USERA5= <user>
##$V9= 5
##$VALIST= <valist>
##$VCLIST= <CCCCCCCCCCCCCCC>
##$VD= 0
##$VDLIST= <DDDDDDDDDDDDDDD>
##$VPLIST= <PPPPPPPPPPPPPPP>
##$VTLIST= <TTTTTTTTTTTTTTT>
##$WBST= 1024
##$WBSW= 4
##$XGAIN= (0..3)
0 0 0 0 
##$XL= 0
##$YL= 0
##$YMAX_a= 4838
##$YMIN_a= -5598
##$ZGOPTNS= <>
##$ZL1= 120
##$ZL2= 120
##$ZL3= 120
##$ZL4= 120
##$ABSF1= 0
##$ABSF2= 0
##$ABSG= 0
##$ABSL= 0
##$ALPHA= 0
##$AQORDER= 0
##$ASSFAC= 0
##$ASSFACI= 0
##$ASSFACX= 0
##$ASSWID= 0
##$AUNMP= <proc_1d>
##$AZFE= 0.1
##$AZFW= 0.5
##$BCFW= 0
##$BC_mod= 2
##$BYTORDP= 0
##$COROFFS= 0
##$CY= -3
##$DATMOD= 1
##$DC= 0
##$DFILT= <>
##$DTYPP= 0
##$F1P= 0
##$F2P= 0
##$FCOR= 1
##$FTSIZE= 65536
##$FT_mod= 6
##$GAMMA= 0
##$GB= 0
##$INTBC= 1
##$INTSCL= 5.30512e-09
##$ISEN= 30
##$LB= 1
##$LEV0= 0
##$LPBIN= 0
##$MAXI= 10000
##$MC2= 0
##$MEAN= 0
##$ME_mod= 0
##$MI= 50
##$NCOEF= 0
##$NC_proc= -6
##$NLEV= 6
##$NOISF1= 182.463
##$NOISF2= 159.3651
##$NSP= 0
##$NTH_PI= 0
##$NZP= 0
##$OFFSET= 248.5645
##$PC= 4
##$PHC0= -6211.588
##$PHC1= 66.00089
##$PH_mod= 1
##$PKNL= yes
##$PPARMOD= 0
##$PSCAL= 0
##$PSIGN= 0
##$REVERSE= no
##$SF= 81.014009
##$SI= 65536
##$SIGF1= 159.3651
##$SIGF2= -187.1042
##$SINO= 113.3802
##$SIOLD= 16384
##$SREGLST= <1H.CDCl3>
##$SSB= 0
##$STSI= 65536
##$STSR= 0
##$SW_p= 40650.406504065
##$SYMM= 0
##$S_DEV= 0
##$TDeff= 32768
##$TDoff= 0
##$TI= <>
##$TILT= no
##$TM1= 0
##$TM2= 0
##$TOPLEV= 0
##$USERP1= <user>
##$USERP2= <user>
##$USERP3= <user>
##$USERP4= <user>
##$USERP5= <user>
##$WDW= 1
##$XDIM= 65536
##$YMAX_p= 394628721
##$YMIN_p= -283041238
$$ End of Bruker specific parameters
$$ ---------------------------------
##NTUPLES= NMR SPECTRUM
##VAR_NAME=  FREQUENCY,     SPECTRUM/REAL,   SPECTRUM/IMAG
##SYMBOL=    X,             R,               I
##VAR_TYPE=  INDEPENDENT,   DEPENDENT,       DEPENDENT
##VAR_FORM=  AFFN,          ASDF,            ASDF
##VAR_DIM=   65536,         65536,           65536
##UNITS=     HZ,            ARBITRARY UNITS, ARBITRARY UNITS
##FACTOR=    0.620285442955139, 1,           1
##FIRST=     20137.2065510759, 0,            0
##LAST=      -20513.1999529892, 0,           0
##MIN=       -20513.1999529892, -283041238,  0
##MAX=       20137.2065510759, 394628721,    0
$$ Real data points
##PAGE= N=1
##DATA TABLE= (X++(R..R)), XYDATA
$$ [...]
##PAGE= N=2
##DATA TABLE= (X++(I..I)), XYDATA
15282 2270293 898517 -47501 -519886 -855393 -1024569 -508130 770926 1743684 1247307
15273 1247307 -194154 -670245 567694 1847265 1176166 -1228846 -3523746 -4602956
15265 -4602956 -4638663 -3907749 -2683869 -1973580 -2526282 -3022224 -1179641 2786095 5697954
15256 5697954 5411917 3568594 2909144 3240643 2056842 -1369214 -4442278 -4133354 -338559
15247 -338559 3984578 5527509 3484812 125098 -1536033 -718954 864496 1606014 1704001
15238 1704001 1874036 1746566 643545 -1037363 -2420855 -3364905 -3935733 -3556475 -2088882
15229 -2088882 -990528 -1715410 -3422713 -3971776 -2873337 -1454307 -303812 1279595
15221 1279595 2951025 2720633 -24224 -2511050 -1375054 3097285 6992346 7101099
15213 7101099 4201718 1619576 1226956 1818342 1501070 456155 114129 363507 -309408
15204 -309408 -1727175 -1546529 902029 2658545 1171512 -1551903 -1594971 1232120 3420511
15195 3420511 2900405 1123432 20567 -235688 -69942 293365 68519 -1179221 -1683841
15186 -1683841 573529 3715675 3195371 -1724592 -6152228 -5996918 -3015909 -1177893
15178 -1177893 -988579 -342253 1389237 3345251 5458747 7520550 7414752 3720973 -823118
15169 -823118 -1926006 492046 2363606 1328361 -659282 -1130078 -524469 -552059 -1333227
15160 -1333227 -1666094 -852630 792490 2360939 2756987 1633304 182244 -85988 525752
15151 525752 331088 -961947 -1532265 -240687 1337038 916422 -1392177 -3422340 -4061245
15142 -4061245 -4517988 -5977285 -7147514 -5573584 -1309340 2345032 2742464 1190434
15134 1190434 645660 1157213 250003 -2348304 -3591873 -1773467 685447 975451 -62505
15125 -62505 67763 1562017 2885889 3571761 3845376 3045105 1116128 61287 893397
15116 893397 833338 -2780680 -7186636 -7188389 -2846103 474892 -83217 -1696992 -1376541
15107 -1376541 -28772 626418 926154 889231 -1125589 -4798143 -6381797 -3798785 -210992
15098 -210992 497825 -979763 -1787046 -1886331 -2786440 -3398773 -1468985 1905365 3206447
15089 3206447 1535488 -785893 -2323583 -3776921 -5170545 -5243697 -4068163 -3208641 -2784299
15080 -2784299 -1360547 653910 709817 -1646850 -3295946 -1979734 442765 1172120 497736
15071 497736 171734 -262039 -2355046 -4918071 -4658908 -1026211 2323224 2087979 -524980
15062 -524980 -1732027 -110521 2162053 2745789 2091840 2169212 3245849 3391420 1429733
15053 1429733 -771570 -163274 3442774 6399327 5054068 -30005 -4641613 -5532837
15045 -5532837 -3382163 -971212 220965 557089 462547 -62279 -384255 357960 1423625
15036 1423625 998548 -640337 -613298 2380001 5404335 5142290 2789892 2156789 3944526
15027 3944526 5386127 5201788 4996490 5176552 3575421 -173993 -2646271 -1554756 453179
15018 453179 11817 -1554812 -700188 2263260 3547139 1632848 -1021434 -1916486 -980528
15009 -980528 939550 3032372 3725854 1867109 -801861 -1098059 1066487 2338253 907537
15000 907537 -979891 -763138 803335 1468467 784727 -242956 -1053962 -1295495 -266293
14991 -266293 1564253 1885148 -631896 -3934218 -4990981 -3726843 -2551870 -2613441 -2690267
14982 -2690267 -1731759 -502392 -217188 -902330 -1659335 -1733757 -992785 103867 863101
14973 863101 999297 801845 576341 513046 1247129 3417163 6073180 6872463 5016135
14964 5016135 2788456 2669449 3946112 4003450 2172934 159322 -961209 -1863214 -2977442
14955 -2977442 -3551175 -3230622 -2789377 -2755737 -2915493 -3451068 -4642277 -5067226 -2557851
14946 -2557851 1948067 3958119 764886 -4555354 -6649487 -4132999 -190053 2015630
14938 2015630 2107835 1168948 114577 -297742 345538 1421985 1891385 1685750 1510746
14929 1510746 1575897 1679720 2086616 2933224 3260734 2224951 791195 473662 919634
14920 919634 812259 653908 2055138 4374840 4984150 3317229 1777502 1868341 2350975
14911 2350975 2235199 2425588 2900890 1577696 -1787247 -3647983 -1419400 2475281 4305564
14902 4305564 4208682 4220100 3669293 937065 -1949179 -1447697 1430645 2095326 -465344
14893 -465344 -2267143 -874440 1219119 1301918 421802 523699 1019950 557178 -500818
14884 -500818 -1468702 -2783052 -4149474 -3740751 -1296527 369837 -809463 -3017973 -3518304
14875 -3518304 -2611105 -2060763 -1482339 721670 4009238 6086391 5987020 4497027 2217694
14866 2217694 -625427 -3035923 -3943663 -3665041 -3099912 -2166389 -579882 725398 731301
14857 731301 128888 242386 853157 752977 -181513 -990053 -1045559 -207714 1482977 3047718
14847 3047718 2815978 801971 -724367 -531610 -271956 -1105791 -1005014 1569270 3635197
14838 3635197 1452997 -3075190 -4374073 -1252066 1576702 623331 -1992621 -2661386
14830 -2661386 -1046367 1216650 3532022 5706818 6412477 4607292 1417817 -944366
14822 -944366 -1382533 -286084 1216894 1847468 1253489 888331 2436853 5102079 6118515
14813 6118515 4406613 2021047 1353378 2435076 3612558 3478407 1643405 -1037299
14805 -1037299 -2638519 -1902216 19363 896582 335229 -277845 -354430 -460006 -331032
14796 -331032 863564 2147956 1399971 -1133089 -2776359 -2574086 -2564521 -3895921 -4726517
14787 -4726517 -3608331 -2186894 -2488140 -3740981 -3945541 -2785642 -1152544 541943
14779 541943 1918666 2186594 1688809 2115757 3659399 3950222 1643034 -896102 -645729
14770 -645729 1889221 3690380 3179836 1249787 -511967 -896573 516119 2507367 2917340
14761 2917340 1373048 -152617 -472340 -722276 -1499085 -1203720 671652 1394688 -959704
14752 -959704 -3670810 -2971740 332678 2443175 2354199 2215663 2744520 2296601 585087
14743 585087 -267721 914118 2721910 3544120 3373537 2802113 2125159 1695123 1609488
14734 1609488 1277495 766622 1646269 4421839 6211326 3757456 -1792158 -5880324 -5964779
14725 -5964779 -3311950 35205 2938874 4072234 2560606 77406 -755774 -376315
14717 -376315 -1573319 -4484084 -5862641 -4243793 -2297522 -2549701 -3939322 -4402112 -3999655
14708 -3999655 -3499323 -2415644 -616910 299103 -638352 -1907681 -1905940 -1354887 -1400235
14699 -1400235 -1330086 -452846 -344937 -2445521 -4738816 -3848423 85127 3356803 3502729
14690 3502729 1748832 326492 -440255 -1347499 -2134536 -1636996 116967 1144374 -382082
14681 -382082 -3526119 -5211094 -3975793 -1858491 -1263814 -1288597 488349 3374884 3941310
14672 3941310 1257197 -1626202 -2471729 -2721290 -3743968 -3627998 -651161 2766734 3206468
14663 3206468 1556798 1407443 3289413 4481002 4090187 4170263 5272248 4870730 1736858
14654 1736858 -1385925 -1531577 538972 2306666 3349244 4673724 5596578 4221311
14646 4221311 822995 -1742733 -1612535 -180656 21016 -1466179 -2851923 -2451686 -362650
14637 -362650 1907743 2809865 1899785 234334 -373451 964903 3136925 4051498 2848538
14628 2848538 622775 -1150792 -2162167 -2789248 -2889330 -2037036 -582670 551038 1026758
14619 1026758 1173017 1067416 531261 -68319 -135345 46566 -259514 -725227 -407366 99458
14609 99458 -1059391 -3736221 -4858192 -2402283 1339869 2603683 1175218 135867
14601 135867 1042089 1992443 951129 -1285251 -2560042 -2225936 -1300272 -780886 -966301
14592 -966301 -1774944 -2708708 -2950275 -2366499 -2015768 -2811964 -4042488 -4168296 -2912963
14583 -2912963 -1516773 -844185 -337972 680391 1657921 1674476 1096622 1227036 2295275
14574 2295275 2798589 1276798 -1838826 -4555171 -5116703 -3267273 -294709 1760071
14566 1760071 1474452 -709749 -2782785 -3120611 -1927834 -495796 419131 929970 1261737
14557 1261737 1451780 1550074 1448577 787765 -314016 -816859 136068 1953506 3265090
14548 3265090 3563563 3299276 2705419 1674385 647279 401192 821495 888219 8915
14539 8915 -1448128 -2834939 -3566524 -3122634 -1817942 -1140864 -1934281 -2698531 -1448177
14530 -1448177 1143973 2628171 2590019 2885640 3779473 3007149 -85679 -2552785 -2063068
14521 -2063068 -497845 -787596 -2352798 -2712152 -1950794 -2124116 -3111236 -2663537 -511417
14512 -511417 993202 896728 1134865 2819112 3834936 2035069 -1168426 -2598344 -1613808
14503 -1613808 -554753 -1256723 -2918671 -3763808 -3573727 -3733135 -5109851 -6689674 -6749444
14494 -6749444 -5061865 -3136193 -2101815 -1312043 233326 1907978 2101750 550484
14486 550484 -1101759 -1112838 735322 3206670 4642652 4239628 3003014 2908995 4271131
14477 4271131 4766282 2439869 -1133587 -2650858 -1602270 -592099 -1005377 -1104210 483970
14468 483970 2020933 1492226 273040 1211704 3902680 4788304 2300287 -592549 -246864
14459 -246864 2808769 4530062 2274930 -2420601 -6057884 -6917812 -5935377 -4706159 -3846736
14450 -3846736 -3291516 -2980719 -2578145 -1332361 819627 2491196 2284068 820884 213865
14441 213865 1383099 2945689 3076473 1530952 -606190 -2347209 -3451973 -4276607 -5335068
14432 -5335068 -6418405 -6112127 -3291450 652230 2586753 1447713 -293627 -287911 194373
14423 194373 -1395625 -4237288 -4923108 -2892160 -1793663 -4079037 -6968897 -6121116 -1547808
14414 -1547808 2775731 4226036 3628197 2282451 -64412 -3295190 -5394209 -4653782
14406 -4653782 -2174598 -589958 -978582 -2235787 -2865997 -2248868 -683533 658986 251586
14397 251586 -2188156 -4925078 -6027595 -5509467 -4571134 -3366121 -1151450 1629479 3313576
14388 3313576 3349116 2956312 2960156 2655371 1694213 1517945 3467202 6346201 7311440 5021256
14378 5021256 1075388 -1579357 -1317112 775141 2015673 1075347 -416830 -147260 1410450
14369 1410450 1603194 -203576 -1410916 -230336 1398087 835853 -1234388 -2321540
14361 -2321540 -2300705 -3140013 -5025086 -5776363 -4378910 -2414083 -1296943 -506806 382030
14352 382030 127025 -2089795 -4565159 -4960135 -3506549 -2615210 -3476453 -4488183 -3462193
14343 -3462193 -568107 1631685 1124416 -1030336 -1777787 272252 3235317 4596025
14335 4596025 4274291 3730447 3132303 1627874 -2413 333705 2573657 3912685 2754066
14326 2754066 872902 173610 -309244 -1995849 -3478072 -2597096 -384846 424938 91009
14317 91009 1337012 3993321 4187537 341538 -3620735 -3578793 -958995 -43515 -1529059
14308 -1529059 -2482785 -1814545 -1827118 -3880205 -5950302 -5781130 -3820164 -1582634 623697
14299 623697 2705249 3543263 2660542 1523033 1302588 872535 -965615 -2861820 -2986385
14290 -2986385 -2296853 -2800519 -3662688 -2533238 -221336 -81914 -2379022 -3350058 -1179881
14281 -1179881 1029253 418182 -1074014 -334241 1629859 1709341 132282 -29609 2030670
14272 2030670 3891337 3994611 3526887 3767335 4176562 3819781 2707744 1199261 -269199
14263 -269199 -624475 976415 3513233 4974094 4988479 4932411 5358955 5181913 3682582
14254 3682582 1548844 -391185 -1736317 -1602351 859349 4515379 6749446 6614261
14246 6614261 5744782 5529857 5331193 4384881 3472229 3415507 3587874 3280391 3082406 3539395
14236 3539395 3834034 3269154 2771278 3293175 3804877 2630790 40740 -2161716 -3089671
14227 -3089671 -3239432 -2952504 -2026910 -730127 211224 648690 896709 710493 -350707
14218 -350707 -1498024 -997431 1626169 4630429 5912820 5203039 3793251 2503061 741507
14209 741507 -2183382 -5397119 -6892432 -5791687 -3458778 -1772087 -900947 245708
14201 245708 1796884 2531255 1824277 649995 140685 204313 136233 -288119 -854231 -1223014
14191 -1223014 -805376 735841 2421176 2441823 320862 -2332633 -3718870 -3463422 -1957544
14182 -1957544 438457 2725388 3347126 2201574 1280231 1937096 2787060 1952765 212288
14173 212288 -150497 1141814 2251367 2332026 2466410 3267726 3624004 2535557 616569
14164 616569 -1022651 -2164348 -3013097 -3332489 -2782215 -1476303 183037 1610083 1957556
14155 1957556 968511 15674 903126 3108182 3709334 1168209 -2023608 -2040842 1540399
14146 1540399 5336320 6354285 4946140 3182540 1945564 908146 342341 986330
14138 986330 1989399 885506 -3107776 -6888380 -6453659 -1964699 2086896 2421084 810114
14129 810114 838635 2383138 2070645 -976181 -3054842 -1115940 2382182 2709152 -152619
14120 -152619 -1215058 2290632 6652892 6720483 2951753 430900 1764311 4183616 4099274
14111 4099274 1685057 -388629 -690434 191775 1214870 1560355 637251 -1208349 -2691508
14102 -2691508 -3286073 -3861547 -4599397 -3835677 -679032 2668795 3411137 1886265 470864
14093 470864 -177143 -1002768 -1536647 -371385 1505217 1398274 -612141 -1411845 -1865
14084 -1865 739083 -953142 -2567610 -1612529 66097 -534412 -2376319 -1966044 1095478
14075 1095478 3541099 3050163 723041 -936038 -363501 2485464 5918399 7098742
14067 7098742 4688513 735751 -1562055 -1495240 -744842 -468240 -441912 -521236 -803608
14058 -803608 -585487 789800 2179520 1811395 254435 102715 2240632 4277922 3469847
14049 3469847 -113454 -3983030 -5841791 -5355844 -4015692 -3485075 -3802394 -3582709 -2227568
14040 -2227568 -791933 54287 1314131 3487033 4802202 3772234 2057466 2115355 3126227
14031 3126227 2398026 162561 -547534 1184181 2935929 3220437 3435952 4367784 4144093
14022 4144093 1616418 -974415 -976455 979512 2257666 1597062 -430475 -2714935 -3798307
14013 -3798307 -2451877 334758 1624858 378458 -863770 45218 1325884 188426
14005 188426 -2586945 -4022331 -3578807 -3081679 -2740800 -846956 2408950 4238278 3314815
13996 3314815 1689386 1392725 1581690 641233 -925126 -1604667 -1424569 -1438337 -1560654
13987 -1560654 -770046 911946 2162171 1945166 301493 -2058107 -3817858 -3259928 38190
13978 38190 3866543 5360495 4408717 3407475 3443127 2992709 1423796 1229677 4348459
13969 4348459 8027791 7725091 3602933 530292 1080122 2242318 868713 -1125817
13961 -1125817 -251338 2300653 2134069 -1367246 -3773827 -2021140 1509303 2852205
13953 2852205 1494017 -526112 -2255448 -3924341 -4759448 -3576828 -1365584 -864982
13945 -864982 -3042487 -5724209 -6435504 -5229652 -3754031 -2569052 -766058 2023015
13937 2023015 4513680 5093825 3585354 1249286 -482592 -845108 151752 1704034 2574409
13928 2574409 2240814 1525264 1380203 1466200 1011997 594256 1357947 2630545 2510670
13919 2510670 1170641 977709 2337089 2366677 -281951 -2178130 170604 4559248 5863870
13910 5863870 3170669 -5197 -1749217 -3293758 -4508350 -2987814 879354 2638311
13902 2638311 83332 -3042576 -2605877 46477 1176128 702274 1120334 2375481 2160921
13893 2160921 439283 -418009 98435 -150255 -2098697 -4009304 -4495418 -4204561 -3679766
13884 -3679766 -2150506 404699 2187292 1882172 359497 -1006709 -2109539 -3087270
13876 -3087270 -3109949 -1609312 384952 1429139 1327022 573134 -856886 -2932543 -4648613
13867 -4648613 -5039286 -4545425 -4159900 -3794928 -2784874 -1432142 -531978 235024 1707891
13858 1707891 3225084 3193867 1903268 1547645 2605447 2482502 -568760 -4103936 -4409046
13849 -4409046 -1544480 1117589 1694843 1325569 1053013 213066 -1369209 -2290748 -1871757
13840 -1871757 -1289459 -1204940 -486453 1313282 2485622 1914747 1150984 1767057 2726744
13831 2726744 2591915 2247498 2871390 3285667 2335360 1875080 3788856 5793428 4422484
13822 4422484 977453 -107905 1802528 3129231 2450981 2067160 2631649 1761001 -480313
13813 -480313 -255085 3308228 5211654 1920668 -2835624 -3641174 -1054375 683722 546778
13804 546778 665321 1605063 2293323 3087459 4650421 5135074 2738755 -66866 769818
13795 769818 4658917 7164245 6634110 5646151 5794001 5588427 4416771 4298579 5988319
13786 5988319 6843767 4679228 1117904 -914718 -1018277 -785535 -1014568 -1193846 -790366
13777 -790366 253368 1654945 2642881 2330569 763705 -961493 -1840768 -1756786 -1336689
13768 -1336689 -1550067 -2860508 -4106522 -3244491 -195707 2414161 2762287 2361058 3021596
13759 3021596 3236654 783807 -2486262 -2514358 693739 2873201 2058601 1132861 2470853
13750 2470853 4016225 3051297 723910 -62230 869812 1462166 1065989 949477 1754530
13741 1754530 2568468 2425001 1343224 -21680 -892612 -817461 -191796 54652 -405953
13732 -405953 -1056922 -1497431 -1775638 -1766962 -1336550 -1108498 -1735914 -2412385 -1740267 -231893
13722 -231893 -57941 -1802206 -3365132 -2889250 -972384 1021852 3082709 5551549 7310859
13713 7310859 6629945 3425327 -287209 -2072676 -1109306 895511 1068247 -1379921 -3727837
13704 -3727837 -3009407 -132146 1332462 121097 -1551595 -1876688 -1529167 -1131358 300371
13695 300371 2898769 4584637 3947308 2282858 1106201 -70529 -1616372 -1876328 111788
13686 111788 1983961 981929 -1824259 -2996647 -1420523 1120719 3228186 4859845
13678 4859845 5300690 3099566 -1289089 -4922213 -5385808 -3181949 -566675 950261
13670 950261 1414972 1483805 1331290 600533 -567436 -942147 413943 2287345 2258698
13661 2258698 -98351 -2433450 -2696883 -1499056 -553366 -384833 -781229 -1974029 -3815057
13652 -3815057 -4953202 -4388469 -2976166 -2119834 -1938611 -1917073 -2210379 -2914121 -3103437
13643 -3103437 -2051128 -545887 180376 -143913 -1420787 -3672637 -5757484 -5422215 -2356573
13634 -2356573 492862 580962 -933270 -1646930 -1809584 -2985413 -4370783 -3813873 -1766446
13625 -1766446 -873125 -1765178 -2373323 -1644228 -1009805 -1527464 -2104027 -1459603 122249
13616 122249 1745395 2917477 3122820 2063825 813437 1077912 2699286 3328182 1279084
13607 1279084 -2319723 -4730745 -4298378 -1896811 -252811 -1366135 -3937342 -4324630
13599 -4324630 -1082753 2817148 3936669 3041803 3384104 5436258 6447276 5016997
13591 5016997 3003107 2284589 2234244 1432601 -10682 -900201 -561831 595524 1462597
13582 1462597 1300555 921889 1756942 2997699 1751376 -2243896 -4699701 -2602658 609996
13573 609996 -17239 -2966001 -2743166 699938 1606788 -1924175 -4632067 -2700674 473619
13564 473619 589072 -760413 135508 2769989 4471403 5426520 6965372 7513802 5007556
13555 5007556 1345458 -159335 -210840 -1945782 -5205276 -6942020 -6513227 -6002953 -5624615
13546 -5624615 -3377051 436610 2685110 2267247 1664951 2517800 3116190 1731223 -550344
13537 -550344 -1883286 -2103430 -1738433 -817240 71425 -320885 -1695220 -1984529 -616517
13528 -616517 131030 -1433967 -3668412 -4181738 -3424220 -3363660 -3703673 -2048279 2169634
13519 2169634 6055565 6365792 3165549 -475809 -2052289 -2042957 -2414401 -3376816 -3033363
13510 -3033363 -653484 1400488 614609 -1980853 -3262862 -2522357 -1884575 -2291383 -2091268
13501 -2091268 -439637 936185 1008637 1652954 4076556 5390108 2185090 -3658256 -6510171
13492 -6510171 -4431229 -1597049 -2208208 -5014882 -6035525 -4627091 -3902994 -5601165
13484 -5601165 -7329057 -5952382 -2045380 750802 433905 -921581 -133761 2718817
13476 2718817 4347132 2677477 -226026 -625266 2293307 5511098 5654357 2244302
13468 2244302 -2531045 -6014210 -6571431 -4120897 -318322 2292522 2400748 1153863
13460 1153863 600889 1183000 1610742 975260 -190854 -1065366 -1516848 -1490636 -613930
13451 -613930 809837 1481631 825897 116873 625346 1473289 1013002 -182497 158927
13442 158927 2306769 3538941 1868411 -964333 -1706571 272721 2594655 3045503 1727764
13433 1727764 208199 -318402 138211 690984 606277 172582 176620 424667 -252510 -1944460
13423 -1944460 -2736679 -1047721 1834708 2963049 1196496 -1769054 -3643706 -3607604 -2223361
13414 -2223361 -549178 413407 300233 -344605 -895592 -1491302 -2379106 -3000627 -2855237
13405 -2855237 -2710760 -3437672 -4038358 -2749667 -103552 1249400 269531 -1059127 -968856
13396 -968856 -419140 -866908 -1457926 -614537 846042 678883 -1158169 -2237552 -1238246
13387 -1238246 303296 561784 95352 751401 2794846 4394634 3931470 2042305 933572
13378 933572 1718043 2906957 2191082 -382131 -2089606 -877614 2105439 4298483 4993164
13369 4993164 5342860 5906311 6098831 5836705 5712143 5363244 3715196 1400903 869388
13360 869388 2988772 5334227 5273859 3264146 1482224 523280 -561107 -1822622 -2205345
13351 -2205345 -1579040 -1137507 -1653057 -2712809 -3651912 -4009388 -3329300 -1879038 -1184790
13342 -1184790 -2257459 -3685058 -3362826 -1745837 -1090621 -1640906 -1366554 173952 883254
13333 883254 88517 177937 2410685 4177245 3019032 660356 -84532 -17224 -1422826
13324 -1422826 -3171165 -2387504 58581 525057 -1135347 -1224836 1197357 2372385 217319
13315 217319 -2097578 -1593227 -245652 -873463 -1925182 -553392 1903142 2155196 822640
13306 822640 1227473 3312523 3669688 1576223 241881 1218481 1942513 377657 -1736381
13297 -1736381 -2272718 -2057616 -2541518 -2964710 -2341344 -1838073 -2525940 -2930698 -1721258
13288 -1721258 -836821 -2421112 -4085434 -1449738 4777140 8492778 6101656 1170268
13280 1170268 -715424 1120488 3201702 3523060 3228269 3357697 3013820 1437226 -264094
13271 -264094 -692222 -203265 -99180 -482972 -290656 620453 763184 -891101 -2927309
13262 -2927309 -2753981 188288 3566371 4912003 4247965 3135261 2027827 125878
13254 125878 -2370212 -3688399 -2852103 -1249645 -808480 -1553609 -2062147 -1554465 -320478
13245 -320478 1278122 2802032 3136203 1494682 -985378 -2148218 -1482242 -449013 24241
13236 24241 698821 2135359 3393417 3623833 3465746 3632342 3404965 1943293 29209
13227 29209 -974972 -1055875 -1057100 -1153553 -1235511 -1796883 -2805156 -2782892 -995711 514978
13217 514978 -527976 -2994095 -4029863 -3595256 -3901516 -4696517 -3314897 -114792 647142
13208 647142 -2621404 -5519282 -3880876 100594 1637626 487918 79734 1343299
13200 1343299 2012262 1343821 1096225 1645750 1116247 -915338 -2312796 -1890655 -936979
13191 -936979 -333259 721962 1970313 1315384 -1433414 -2984239 -1083449 1727998 1497830
13182 1497830 -1710185 -4414353 -4523599 -2915830 -934605 1099392 2921707 3970028
13174 3970028 4301341 4437465 4190418 2832236 440956 -1900893 -3083806 -2380950 397886
13165 397886 3897345 5098632 2078254 -3173159 -6371235 -5556704 -2603807 -51694
13157 -51694 1626472 2899050 3336837 2601359 2101796 3559943 6047588 6394846 3335964
13148 3335964 -117388 149562 4293260 8119620 7956074 4479881 910214 -1144061
13140 -1144061 -2294637 -2780104 -1890692 -312856 -412606 -2738357 -4356011 -2769688 87429
13131 87429 439720 -1679499 -2517272 -418552 1726929 1121843 -689538 -504347 1489445
13122 1489445 2223269 654995 -668680 555122 3206666 4531915 3639722 1870655
13114 1870655 601303 189224 746623 2366090 4192932 4537144 2779901 422520 -709728
13105 -709728 -754784 -1094585 -1635415 -518004 2810436 5765514 5394156 2316256 251661
13096 251661 1551415 4588976 6036348 4584514 1657648 -726104 -1763893 -1777305 -1225761
13087 -1225761 -193119 1288832 2627717 2778878 1426932 -127699 -68314 1688642 3053625
13078 3053625 2106275 -576495 -2521473 -2095613 -165968 1017895 445115 -304489 1177025
13069 1177025 4667182 6563915 4012377 -827922 -3012214 -1612466 -1306849 -5434849
13061 -5434849 -10361680 -10153125 -5147021 -1595712 -2964093 -5912199 -6024430 -3527114
13053 -3527114 -1157604 240748 1045704 438364 -1855803 -3180306 -976745 2776950
13045 2776950 3750922 1401775 -681624 -504888 91961 -385158 -465916 1113790 2859570
13036 2859570 3206356 3068642 3488208 3229298 1347720 -20034 1402412 3805328 3406609
13027 3406609 5880 -2952431 -3610315 -3539657 -3956154 -3559725 -1508717 414810 665201
13018 665201 729266 2636186 5197135 5458031 3248970 1533576 2019066 2980007 2481132
13009 2481132 1542720 2128730 3397614 2642331 -203860 -1821552 -354702 1467127 277052
13000 277052 -2591559 -2879558 -6834 1666329 -860158 -4847813 -5796872 -3400005 -847049
12991 -847049 212583 876217 1699283 1332222 -902617 -3335863 -3915530 -2516496 -547411
12982 -547411 723338 891923 308606 -283797 -482031 -621867 -995774 -1143095 -757021
12973 -757021 -691378 -1841582 -3500951 -4175264 -3552520 -2232662 -276292 1951783 2250245
12964 2250245 -1172598 -5844452 -6688087 -2608907 1594254 1611417 -909561 -1736455 -482179
12955 -482179 -249992 -2062334 -3330218 -2117765 89945 942330 439724 277090 1281886
12946 1281886 2770795 3783368 3950139 3398927 2464860 1440536 321957 -1069085 -2545110
12937 -2545110 -3363212 -2885587 -1443893 -296900 -435573 -1397742 -1644835 -399225 1292673
12928 1292673 1866128 1238728 684355 919881 1400519 1632280 2000632 2770750 3272582
12919 3272582 2875771 2121032 2107203 3134629 4513542 5344992 5030380 3430404 1079129
12910 1079129 -931542 -1640760 -831678 827214 1937360 1178913 -1143013 -2743930 -1821835
12901 -1821835 310575 648077 -1368535 -3071412 -2494924 -947109 -383156 -235632 1075467
12892 1075467 2866232 2912513 946273 -886276 -1133422 -595370 -362814 -114783 707372
12883 707372 1315671 395042 -1965965 -4113413 -4576109 -3396608 -1585291 264746 2209130
12874 2209130 3812250 3753574 1537725 -904039 -773118 2231712 5430217 6495348 5922506
12865 5922506 5401999 5104318 3955473 1833401 57029 -172960 1045704 2526778 2865906
12856 2865906 1486416 -765288 -2507269 -3367990 -3763709 -3269850 -982368 2048905 2980479
12847 2980479 1068665 -755883 -118963 1073910 -182031 -2833584 -3358108 -1712877
12839 -1712877 -1671518 -4751757 -7632006 -7162275 -4709752 -3207298 -2427338 -237125 2853405
12830 2853405 3705242 1063716 -2678906 -4945576 -6001306 -7196070 -7838671 -5966914
12822 -5966914 -1895306 1111380 591357 -1982775 -3126765 -1730760 -16147 -199684
12814 -199684 -1769550 -2652180 -1875993 -194979 1153275 1439120 681886 -390049 -943476
12805 -943476 -1003410 -1342764 -2171468 -2709997 -2450791 -1941290 -1738212 -1463482 -606913 486258
12795 486258 1124359 1155540 889149 821924 1633215 3407307 4700868 3808272 1259142
12786 1259142 -611916 -910876 -872503 -834322 560470 2802280 2439740 -1855575 -5954788
12777 -5954788 -5363928 -1533410 645660 22835 -353545 856845 1405307 -159020 -2142924
12768 -2142924 -2786844 -2647230 -2884976 -3588086 -4417169 -4719580 -2960955 1295754 4879416
12759 4879416 3716027 -1483050 -5499192 -5296616 -3102898 -1903552 -1578188 -1199545 -1596216
12750 -1596216 -3179152 -4121555 -3299281 -2554023 -3393298 -3804024 -1400974 2147873 3219712
12741 3219712 1630014 587100 1630314 2689356 1606739 -796344 -2077969 -1191655
12733 -1191655 677999 1700501 1369686 854672 1213483 1664847 669905 -1495481 -2885468
12724 -2885468 -2782958 -2536464 -2944892 -2901468 -1640139 -305977 -27793 -313014 -611408
12715 -611408 -1416081 -2399209 -1797899 473938 1548713 -137706 -1708196 -55321 2919031
12706 2919031 3104254 786649 59978 2038450 3196768 1237985 -1516017 -2206091 -1403766
12697 -1403766 -851599 -160565 1542973 2796058 1672903 -627696 -1000500 1060430 2812631
12688 2812631 2400710 1204191 1073692 1285318 37233 -2223377 -3192891 -2321967 -1956188
12679 -1956188 -4038626 -7126749 -7941230 -5121384 -372730 3494736 4666480 3213556
12671 3213556 1172280 1120769 3260633 4547148 2435001 -1150845 -1908460 936196 3542037
12662 3542037 2874139 461194 -675578 -447378 -925603 -2701015 -4272765 -4352186 -2916683
12653 -2916683 -337241 2964006 5974460 7289316 6108342 2875508 -703792 -2363765
12645 -2363765 -1044691 1721169 3185940 2401527 779534 -347475 -1039134 -1293737 -295202
12636 -295202 1897778 3564299 3359307 1880138 394306 -621952 -968220 -261529 1248892
12627 1248892 2787775 4309713 5938486 6217813 3570956 -165012 -905529 2016958
12619 2016958 4745125 4727897 3853062 3939261 3413758 1383009 739555 3247343 5338151
12610 5338151 3515685 613740 1255671 3889156 3587495 841214 570157 3042465 3168007
12601 3168007 -223490 -1598749 2225398 6524862 5917584 2146936 175440 259807 -1085730
12592 -1085730 -4327115 -6063795 -4662980 -2822238 -3579496 -6200067 -7356369 -5337437
12584 -5337437 -1889941 177463 398369 632752 1810802 2544409 1940465 1710871 3402654
12575 3402654 5307731 4968983 3395735 3347206 4292249 3094799 -320943 -2210264 -789208
12566 -789208 1172984 1080468 276003 981963 2409545 2378631 802058 -648211 -957770
12557 -957770 -204865 1204706 2519946 2986988 2935565 3288332 3777116 3360847 2452153
12548 2452153 2519664 3382886 3472334 2915273 3326152 4182146 2960844 -233365 -1986129
12539 -1986129 -985132 -279789 -2095774 -4130377 -3642675 -1836494 -1156476 -1213152 -593224
12530 -593224 -53239 -625074 -986122 -33468 351238 -1344051 -2588519 -587070 2382627
12521 2382627 2084251 -641765 -969658 2274485 5043029 4573391 2878930 2532613 2916911
12512 2916911 2448902 1467488 989656 813772 504858 566048 1312167 1935093 1640173 557735
12502 557735 -962173 -2664220 -3737984 -3395692 -2416183 -2495051 -3654908 -3936134 -2176047
12493 -2176047 474410 2367093 3151220 3102530 2158051 518183 -905446 -1430961 -1168579
12484 -1168579 -282739 1225114 2656899 2877189 2070160 1962936 3434590 5036184 4945890
12475 4945890 3436505 2094888 1255154 -145969 -2149968 -2944594 -1442841 480545
12467 480545 65880 -2264348 -3017304 -662380 1566711 41392 -3611076 -4464508 -1520439
12458 -1520439 861472 -239324 -1989711 -759112 1956271 2282827 429687 22758
12450 22758 1905209 3095731 2182564 1465342 2382821 2561942 -282117 -4247376 -5699411
12441 -5699411 -4086198 -1807147 -458981 335988 1002658 1318678 1655113 2866922 4511192
12432 4511192 4814262 3088020 874306 -144833 -283902 -813814 -1600271 -1245967 583456
12423 583456 2432184 3015504 2673533 2224164 1513844 126744 -1379339 -2223244 -2755126
12414 -2755126 -3711220 -4626228 -4468149 -3416954 -2342133 -950503 1413462 3288760 2074470
12405 2074470 -1922781 -5031886 -4921452 -3272676 -2299473 -1244849 1315694 3872840
12397 3872840 3798386 1638547 495416 1390648 2012860 441022 -2166971 -3446503 -2856153
12388 -2856153 -1858918 -1775472 -2219089 -1813168 -414990 68982 -1815960 -4295551 -4219883
12379 -4219883 -1819803 -784116 -2529575 -3613777 -1161733 2118155 1789545 -1591450
12371 -1591450 -3679547 -3101163 -2744560 -4443530 -6397070 -6597264 -5508833 -4367769 -3515310
12362 -3515310 -3250564 -3907687 -4432292 -3235646 -931572 279025 326727 1451138 3912165
12353 3912165 4678301 1860893 -2309834 -4673865 -4873217 -4094113 -2472286 -36929 1610037
12344 1610037 1019262 -823648 -1955303 -2182114 -2583529 -3300268 -3714101 -4054285 -4925462
12335 -4925462 -5627964 -4606606 -1529703 2143509 4492745 4443468 2469122 681289 1204164
12326 1204164 3520605 4538094 2455171 -599055 -1290465 569744 2253409 2070554
12318 2070554 1037989 641001 924279 1424534 2443895 4266738 5855257 5504162 2927424
12309 2927424 23565 -1020045 -277973 74371 -1066888 -1759838 351920 4039746 5335784
12300 5335784 2755762 -605932 -1366081 -99944 594842 473426 1365815 3411043 4546981
12291 4546981 3842959 2604714 1508694 -696032 -4174848 -5990271 -3455169 1666577
12283 1666577 4723828 3617292 577340 -1448350 -1918804 -1575813 -415119 1615752
12275 1615752 3304765 3457966 2836987 3119865 4350120 5094343 4814538 4194775 3213714
12266 3213714 1116828 -1283442 -1657066 414006 2206480 1566682 -83151 -342608 310137
12257 310137 -266177 -1935942 -2318996 -467016 1925783 3093014 2913652 1860272 153873
12248 153873 -1580990 -2335578 -1791704 -296199 2036602 4797110 6275386 4967243 2101794
12239 2101794 632931 1398282 2234965 1366054 -323756 -1121495 -756168 89392 963675
12230 963675 1395663 813725 -415588 -1058656 -766550 -469685 -492349 169045 1917745
12221 1917745 3483597 3781656 3429021 3323133 3021270 1772399 130212 -670923 -258375
12212 -258375 791086 1705776 1858616 1261269 1001679 1932766 2760422 1296107 -1895685
12203 -1895685 -3422723 -1754747 481404 709531 459354 2458463 5530122 5943069 3210377
12194 3210377 1017694 1981350 4505096 5814450 5543863 4868747 4110083 3002286 1991409
12185 1991409 1454444 531983 -1421264 -2812779 -1360766 2265269 4576591 3953709 3161864
12176 3161864 5325651 8846423 9074826 4784491 37944 -1289448 -199391 -34498
12168 -34498 -1434539 -2381480 -2022179 -1621282 -1942770 -2083760 -1187863 429084 2001011
12159 2001011 2751723 1924844 -31305 -889706 685017 2430900 1018232 -2941940 -5426145
12150 -5426145 -4863906 -4144645 -5536655 -6830925 -4871913 -627767 2050465 1581340 6404
12141 6404 -509612 -381003 -1204375 -2858453 -3188407 -976711 1493860 560572 -3581501
12132 -3581501 -5959236 -3050451 2080280 3828493 1634245 -296723 176566 1204175
12124 1204175 1705722 2893775 4053426 2045515 -2893606 -5753783 -3964673 -1491324
12116 -1491324 -2381649 -4546854 -4132173 -2316162 -2815524 -5279659 -6171476 -4485263 -2010993
12107 -2010993 636859 3792722 5755776 4515815 1720063 734239 1373836 660483 -1741344
12098 -1741344 -3131678 -2687673 -2595944 -3952304 -5259519 -5418517 -4851174 -3410531 -449831
12089 -449831 2916782 4867923 6061591 8301602 10329820 9058195 5139401 2865203
12081 2865203 3701501 4295110 2223543 -520293 -1593456 -1890434 -2805575 -3348325 -2432859
12072 -2432859 -1147011 -447314 705841 2699022 3457472 1729006 -257117 35386 1733259
12063 1733259 2501582 2198470 1955112 1404329 -288725 -1889994 -1450023 453704 1265631
12054 1265631 -114667 -2428146 -4214985 -5058608 -4879448 -3603520 -1682147 -181
12046 -181 731151 117493 -1814012 -4230403 -5878963 -6128518 -4946373 -2201245 1487026
12037 1487026 3524453 1401885 -3477823 -6432905 -4974967 -1502628 434986 163817
12029 163817 -1076912 -2488275 -3212593 -1860463 1139162 2620871 499427 -3088051
12021 -3088051 -4774135 -4550088 -4840925 -6284085 -7153574 -6279075 -4124732 -1443483 1091327
12012 1091327 2452629 2336456 2089253 2906899 3948747 3886631 3178841 2885880 2472875
12003 2472875 1032237 -463067 -592821 -146173 -727146 -1657371 -1143648 229363 314889
11994 314889 -720428 -636015 782269 1170881 -429072 -2109593 -2263401 -1401833 -214308
11985 -214308 1335907 2314329 1178894 -1290613 -2377397 -1633940 -1487355 -2574069 -2247837
11976 -2247837 374448 1843092 -179890 -2503988 -1359466 1168126 441215 -2864456
11968 -2864456 -3565151 -186671 2957567 2788881 1696405 2727729 4615015 4503826 2703932
11959 2703932 1469762 952219 -331122 -1983771 -1887211 176642 1734076 1033815 -716644
11950 -716644 -1332039 -494030 226964 -577411 -2619981 -4033175 -3069914 -286726 1391296
11941 1391296 -106534 -3078671 -3921097 -1801626 534152 990540 733820 1313236 1613899
11932 1613899 107382 -1566946 -430617 3035248 5123596 4107660 2085642 848409
11924 848409 -859835 -4170702 -7008148 -6856142 -4716223 -3405981 -3196876 -2255817 -694100
11915 -694100 -740873 -2702463 -4003566 -3102224 -1443706 -367174 960683 2733963 2572452
11906 2572452 -755857 -3872276 -2597981 1892400 4399047 2859125 399762 -265125
11898 -265125 -533384 -2221097 -3647847 -2413053 214350 1135987 415157 830687 2753464
11889 2753464 3186222 811698 -1326059 -168463 2753071 3633904 1857955 269433
11881 269433 423624 488928 -1328739 -3595912 -3583580 -1175747 1000505 1068111 -70320
11872 -70320 -507028 158840 932517 1304030 1878468 3084900 4070184 3372962 580045
11863 580045 -2877262 -4713815 -3878758 -1729284 -582890 -852660 -592871 1271844 2575907
11854 2575907 846962 -2099219 -1625321 2967289 6443038 4513164 -90850 -1620069
11846 -1620069 643985 2420691 1607270 802095 2040040 3391138 2753185 1522215 1849966
11837 1849966 2816340 2200999 340096 -530382 333219 1812946 2997700 3438624 2282289
11828 2282289 -557985 -3038083 -2996844 -1049818 506603 992524 1325031 1376866 75070
11819 75070 -1912860 -2308814 -577271 1201660 1558612 1553678 2405677 3163361 2342537 677084
11809 677084 481247 2448085 4267557 2954005 -1560678 -5603535 -5313061 -1147252 2339529
11800 2339529 1882186 -800966 -2015959 -1209981 -789467 -1768501 -2403536 -1267206 697785
11791 697785 1720038 1040699 -1044828 -3357002 -4054976 -2481525 -684643 -1121845 -3040246
11782 -3040246 -3478027 -1745229 -114115 153016 269868 689224 -98466 -1912966 -1399779
11773 -1399779 3184366 8190290 8528328 3894380 -1457665 -3884335 -2989023 -365101
11765 -365101 1787238 1599314 -625647 -2089457 -909086 1025528 662653 -1712747 -3076948
11756 -3076948 -2131658 -458135 633356 1638719 2833423 3261033 2621942 2043698 1945301
11747 1945301 1067247 -1086466 -2571804 -1500051 957502 1978675 946459 -33138
11739 -33138 517766 1480475 1255194 266287 -27808 365759 248032 -350421 -48989 1218187
11729 1218187 1467315 -348763 -2457856 -2888431 -2277221 -2115816 -1877325 -563986 260378
11720 260378 -1545453 -4331456 -4214865 -1209626 351784 -1445594 -3185724 -1910894
11712 -1910894 262000 263865 -734749 21418 1754721 1790614 384070 -220240 -132094 -1001728
11702 -1001728 -1852480 -165498 3194552 4536470 3075099 1898308 2633200 3400115 3121310
11693 3121310 3497639 4895574 4492941 1193994 -1276975 511307 4400605 5987800
11685 5987800 4884931 3828088 3438959 2209582 731950 1379204 3593567 3719319 564742
11676 564742 -2573234 -2988552 -2323290 -3084405 -4277298 -3394495 -818398 894562 1114206
11667 1114206 1532299 2812332 3604521 3091946 2153670 1617674 1503553 2381082 5122910
11658 5122910 8486355 9278774 6279668 2045738 -606035 -1940228 -3416469 -4512622
11650 -4512622 -3874162 -2149578 -995949 -293425 906516 1563134 -7709 -2322102 -1793534
11641 -1793534 1861443 4606043 3666553 1215460 799249 2483171 3595996 2716877 993985
11632 993985 330190 1519254 3615362 4727407 4290604 4234040 6195700 8157524 6669835
11623 6669835 2285944 -856851 -1419465 -2510210 -5425946 -6530514 -3387333 446302
11615 446302 924463 11538 1672090 4503809 4258697 1600884 899327 2284415 1710403
11606 1710403 -866955 -409280 4370985 7711147 5480861 1501053 1131173 3220499
11598 3220499 3236139 902194 -509184 -329860 -761164 -1981531 -1782446 -71139 443110
11589 443110 -1308311 -3157481 -3574577 -4108254 -6412159 -9082871 -9331483 -6690131 -3617649
11580 -3617649 -2823953 -4657568 -6799812 -6403449 -3078577 337578 727118 -1812582 -4387298
11571 -4387298 -4927370 -4007735 -3058934 -2428862 -1823336 -1240500 -544322 787833 2519624
11562 2519624 3240676 2201570 694622 293044 426480 -669452 -2945025 -4341922 -3813173
11553 -3813173 -2724589 -2549265 -2798072 -2329748 -1323080 -542220 231526 1369013 1855380
11544 1855380 549034 -1428516 -1658609 111543 1440772 562339 -1526298 -2953122
11536 -2953122 -3195577 -2569433 -1180885 439548 1049003 320937 -348732 137360 809721
11527 809721 139230 -1628456 -2929015 -2903635 -1830489 -324453 817565 822795 37649
11518 37649 -128417 677130 965333 -72689 -854874 39499 1166101 382695 -1466917
11509 -1466917 -1713327 -43941 1210062 741523 -408481 -1221571 -1817509 -1911172 -655923
11500 -655923 1381924 2310168 1576415 475882 -455470 -2199465 -4655760 -5726679 -4250338
11491 -4250338 -1782127 -169074 679132 1257391 837038 -747418 -1489336 328998 3266546
11482 3266546 4579079 4078483 3761057 4031205 2922438 -401822 -3574641 -3756645 -1212020
11473 -1212020 1231534 1790331 1464209 1995320 3207360 3335636 1665564 -294790 -636255
11464 -636255 811413 2706770 3763855 3376097 1543401 -733458 -1662394 -543784 1018565
11455 1018565 1053509 -139353 -710604 -59544 860881 1636391 2676360 3437741 2619942
11446 2619942 507512 -1068887 -1676424 -2917304 -5257832 -6571354 -5247655 -2688653
11438 -2688653 -1006945 -41793 1360165 2581068 2054643 60075 -1423444 -1367843 -590791
11429 -590791 -306126 -1172712 -3387954 -6289792 -8109821 -7459526 -4992675 -2602809 -1266531
11420 -1266531 -641019 -289924 -88031 253082 833816 935955 -167079 -1981586 -3353043
11411 -3353043 -3859058 -3564546 -1982235 1149155 4287967 5053457 3078814 494752 -757480
11402 -757480 -734784 -269215 469076 1292239 1189968 -493618 -2751258 -3946480 -3816786
11393 -3816786 -3449005 -3415489 -2891510 -869012 2281159 4778425 4957278 2930331 701989
11384 701989 221113 1254146 1840418 1074115 395104 1278077 2648544 2161206 -373924
11375 -373924 -2653613 -3048222 -2179596 -850341 1335698 3896290 4198475 770120 -3390005
11366 -3390005 -3748054 -136692 3120859 3106815 1336096 147795 -759141 -2337684 -3348078
11357 -3348078 -2156835 125031 911908 -197104 -1244284 -911965 272097 1363021
11349 1363021 1808700 1095224 -731770 -2412095 -2878219 -2978100 -4187740 -5993691 -6364390
11340 -6364390 -4623299 -2053273 167033 1666680 1630055 -816990 -4402708 -5968227
11332 -5968227 -3933506 -55897 3011990 4474665 4920860 4589810 3356494 1609195
11324 1609195 61316 -978248 -1632049 -2128429 -2665993 -3163451 -3182737 -2646910 -2297539
11315 -2297539 -2560479 -2407287 -679713 1667478 2262744 512636 -1378295 -1140012 969605
11306 969605 2909074 3284310 2389716 1319685 527011 -662081 -2815117 -4808892 -4692923
11297 -4692923 -2634524 -1326489 -2206661 -3088903 -1557420 1043985 1790591 888605 687117
11288 687117 844278 -1311568 -5380085 -7195975 -4915076 -1982470 -1978741 -3707408 -3856335
11279 -3856335 -1944896 67058 1158900 1556635 1002839 -788683 -2722859 -3353861 -2762604
11270 -2762604 -1983431 -1367298 -810941 -662737 -1079342 -1380307 -1212010 -1319144 -2000738
11261 -2000738 -2015818 -435217 1505435 1917519 756021 -594282 -1370043 -1640664 -1283669
11252 -1283669 -318586 263921 -483317 -1858730 -2190187 -1016062 452788 1038295 926572
11243 926572 1164409 2324192 3863030 4741147 4568950 3780139 2602949 732110 -1481977
11234 -1481977 -2776533 -2978488 -3752525 -5566425 -5540301 -1143828 5026617 7591711 5220763
11225 5220763 1681454 82801 -151191 -88742 805482 2200790 2101502 310823 -653760
11216 -653760 182560 573801 -467412 -320982 2517255 5015833 4103275 1377911 -88560
11207 -88560 -649279 -2013503 -3022180 -1737765 376038 715996 286177 1743307 4029563
11198 4029563 3658222 729724 -954941 188088 1759024 1899564 1561110 1485633 637127
11189 637127 -1183130 -2348268 -2305865 -2663919 -4077040 -4635060 -2903649 -418229 545978
11180 545978 96058 -19815 798514 1463139 1011676 -103475 -600017 108529 1148969
11171 1148969 1279847 704399 867307 2086144 2661824 1245480 -1123141 -2498533 -2442816
11162 -2442816 -1748941 -929638 -376142 -900756 -2584871 -3995516 -3872633 -2574554 -728993
11153 -728993 1998530 5264279 6858911 5179138 1615900 -1336073 -2942839 -3447227
11145 -3447227 -2313774 323605 2119976 1186639 -936229 -1587866 -969458 -1037642 -1693883
11136 -1693883 -1215180 352692 1308822 1250342 1105611 811014 -318708 -1532233 -1601308
11127 -1601308 -1067808 -927882 -229239 1975283 3494298 1442040 -2950241 -5681339 -5636340
11118 -5636340 -5158461 -5375956 -4953196 -3506455 -2323489 -1434197 213303 1459230 -58517
11109 -58517 -3084606 -3286217 244989 3193385 2322571 -278317 -1193358 -429078 75901
11100 75901 -268032 -1199770 -2951912 -4991103 -5487177 -3881485 -2152680 -2040779 -2850726
11091 -2850726 -3243990 -3194577 -2909228 -1833844 -57347 1115316 1083497 653712 77519
11082 77519 -1462781 -3616155 -4526800 -3776262 -3223677 -3701745 -3346561 -741145 2490802
11073 2490802 3852992 2893811 636721 -1989803 -3861495 -3736420 -2024823 -827108
11065 -827108 -1111294 -1568761 -1134757 -620916 -861483 -1311995 -1513766 -1891050 -2187449 -1337453
11055 -1337453 246633 747726 225383 1012824 3619848 5256773 4102875 2073692 1362474
11046 1362474 1160726 147007 -604646 41873 588223 -403174 -1091060 869475 4033944
11037 4033944 5045385 3625341 2408820 2592585 2906927 2480869 1722077 448763 -2022975
11028 -2022975 -4664158 -5145840 -3075808 -736107 159564 665650 2519096 5116590 5939530
11019 5939530 3756326 408633 -1107284 -37046 1492782 1500024 634607 563854 1114883
11010 1114883 1071537 1011735 2547994 4735538 4343535 632865 -2965836 -3376505 -1629603
11001 -1629603 -515041 -811727 -1692959 -2752322 -3533437 -2873346 -890689 -5558 -1708467
10992 -1708467 -3753118 -3010959 10274 2066169 1863700 1224815 1701360 2469452 2191237
10983 2191237 1268061 1313244 3071524 5431357 6474469 5540264 4004277 3434861 3398298
10974 3398298 2353856 467078 -355144 483418 1252317 682477 -265961 -501336 -681275
10965 -681275 -1563392 -2235931 -1681356 -729702 -788951 -1710878 -2393030 -2503546 -2273226 -1571221
10955 -1571221 -457933 302473 417326 718537 1590425 1956947 1020533 -223659 -538994
10946 -538994 -375160 -841234 -1744339 -2081952 -1705306 -1178944 -648661 -36230 209077 -387526
10936 -387526 -1491891 -2395537 -2883312 -3216245 -3740732 -4649515 -5435527 -4762642 -2016088
10927 -2016088 1207004 2602240 2048861 1424936 1731655 2259848 2435054 2332328 1438754
10918 1438754 -707318 -2639654 -2320368 -418449 589495 551829 1455520 2902529 1911314
10909 1911314 -1684669 -3922834 -2724895 -1207457 -2468808 -4751582 -4850568 -3216870
10901 -3216870 -2340008 -2514014 -2467483 -2243867 -2468090 -2404794 -1358829 -407069 -475708 -486846
10891 -486846 461851 1107310 366457 -521654 -433079 -618963 -2177400 -3683227 -3828855
10882 -3828855 -3913066 -5033680 -5441276 -3667939 -1675904 -1642533 -2182198 -1298942 -540357
10873 -540357 -2162840 -4342462 -3632145 -686161 745767 -572118 -2740461 -4591338
10865 -4591338 -6107768 -5911134 -2589786 1757030 3146221 876891 -2117895 -3689976
10857 -3689976 -4046285 -3389077 -1338227 1371304 3381552 4547918 4970332 3455325 -176176
10848 -176176 -2809331 -1667567 1084442 1368529 -234320 578413 4738700 8279406 8266102
10839 8266102 6029759 3764346 1854169 667111 1389790 3524771 4351250 2359484
10831 2359484 -803260 -2729168 -2818623 -1990253 -1498382 -2163668 -3267671 -2659392 340188
10822 340188 3075247 2802312 800717 607385 2934709 5148489 5310005 4078624 2967137
10813 2967137 3004189 4494679 6068339 5192292 1783973 -529994 647389 2606173 1833205
10804 1833205 -432836 -1054911 -762723 -1990274 -3206753 -1307198 1904326 2009537 -169207
10795 -169207 229373 3324696 4042876 968756 -1657525 -2072626 -3587373 -6811788 -6942783
10786 -6942783 -2434105 748100 -1708413 -5232963 -3783641 736956 2488771 997556
10778 997556 194523 1109674 1664696 1850286 3360151 5123533 4295602 1077283 -1846092
10769 -1846092 -3887489 -6219211 -7631867 -5553008 -1283798 466488 -1753487 -4010099
10761 -4010099 -2980764 -531455 -330803 -2733129 -5382410 -6894129 -7414171 -6705647 -4301537
10752 -4301537 -1432787 -556297 -2199130 -3784047 -2781317 -129212 959152 -755107
10744 -755107 -3246780 -4512656 -5215638 -6807696 -8640035 -8949360 -7834238 -7000371 -6724258
10735 -6724258 -5231073 -1558908 2617043 4758159 4109950 2170698 1138298 1862572
10727 1862572 2798753 1472402 -2316879 -5575309 -5402969 -2264945 1182966 3294937
10719 3294937 3844943 2589734 -250754 -2837498 -3370653 -2508645 -2126665 -2281549 -1586170
10710 -1586170 -4635 1045034 932715 3056 -1763573 -3911450 -4251935 -1339642 2454410
10701 2454410 3473755 1924071 1150473 2080638 2211951 477500 -850848 -296946 352481
10692 352481 -572360 -1773894 -1544425 -876096 -1909647 -4706273 -7201627 -7501772 -5364708
10683 -5364708 -2295376 -531880 -941428 -1982578 -1895116 -1308739 -1946091 -3478355 -4048370
10674 -4048370 -3513216 -3515639 -4354922 -4464228 -3314977 -2349484 -2522408 -3083097 -3230699 -3068427
10664 -3068427 -2742051 -2444794 -3097034 -5061409 -6624245 -6017280 -4438347 -4467219 -5839364
10655 -5839364 -5602882 -2463664 1645040 4380366 5017035 3815773 1658145 -11014
10647 -11014 -970445 -3040665 -6762210 -8779131 -5828754 -77062 3301080 2965953 1946114
10638 1946114 2222068 3141063 4718305 7787181 10658607 10135488 6431245 3012881 1211290
10629 1211290 -765421 -3088094 -3265932 -926351 741806 -164647 -1732351 -1939263 -1414613
10620 -1414613 -1180747 -870137 -435014 -743953 -1519392 -1346068 -277383 203767 -18862
10611 -18862 338003 1338491 1953189 2305039 2932240 2777766 1018994 -546944 -407303
10602 -407303 -588436 -2890393 -4442583 -2251840 446600 -1199565 -4952673 -4822958 -1482881
10593 -1482881 -974081 -3670249 -3627369 334011 2136471 -858314 -3426027 -1931989 -258697
10584 -258697 -2419206 -6144499 -7831147 -7916791 -7676510 -6150545 -3582984 -2769781 -4058915
10575 -4058915 -3970747 -1232191 861612 157584 -1522430 -2950247 -5249457 -7481768 -6507006
10566 -6507006 -3026313 -1702712 -3601261 -4704234 -3281672 -1980392 -1281478 1638362
10558 1638362 5750576 5681857 705597 -3353673 -3528122 -3374607 -4993570 -5377007 -3277691
10549 -3277691 -1803317 -1664730 231079 3323550 2930534 -783322 -2240306 -653039
10541 -653039 -1214608 -4340312 -4307648 -878162 -973352 -5871916 -8364836 -5871611 -4333988
10532 -4333988 -5726092 -4579930 -678975 -1377637 -6758225 -7009359 15586 3648198
10524 3648198 -1086306 -5343580 -3695556 -3338543 -8160861 -10023303 -4869607 -1378325
10516 -1378325 -4517303 -6909408 -5165671 -6839206 -12344663 -10152598 33965 1642176
10508 1642176 -9522004 -14704934 -4867343 2259539 -5491884 -13142035 -9039847 -7461316
10500 -7461316 -17671457 -21711842 -10049802 -5852055 -22110358 -31519589 -17440213 -13286370
10492 -13286370 -41564289 -60137887 -39315726 -48700299 -167064268 -323474440 -345448433
10485 -345448433 -187031033 -1494723 58802202 19343489 -3507801 19502301 30902404
10478 30902404 10732747 -575616 12858211 19885039 7396000 879329 11483389
10471 11483389 17147884 7290630 656458 7254997 11564514 4935283 658164 5812683
10463 5812683 8211879 1838844 -1564334 4029110 8214952 5652194 5571383 11530698
10455 11530698 13119184 6194744 1454399 4671997 7123057 3683357 2521675 8304208
10447 8304208 12375772 8517163 3648510 4342399 6118536 4208841 2705844 5316058
10439 5316058 7879235 6865393 5526759 6133931 5531474 2771306 1709661 2605798 1008866
10430 1008866 -2249804 -703906 5233452 6738292 1097450 -3538918 -1965477 650191
10422 650191 -286294 -1196853 1147019 3379856 3024983 3199461 5146313 4839347 1404470
10413 1404470 170510 3055383 4651388 2120695 132025 1482523 1733247 -1780116
10405 -1780116 -4138264 -1519789 2130810 2653587 2670307 5475796 8496287 8343301 6700888
10396 6700888 6226231 5759736 3941558 2692579 3316418 3748422 2689307 1880979 2112667
10387 2112667 1915445 1680861 3472528 5724487 4559669 1305240 1432460 4918071 5728165
10378 5728165 2472511 844147 3147834 4555285 2961929 3190538 7108685 8725116
10370 8725116 4500343 153969 1172235 3975536 2826032 -963144 -2892053 -2661238
10362 -2661238 -1964291 -69448 3141646 4524670 2655139 736957 803660 431086 -1254968
10353 -1254968 -566714 3691742 6637018 5268404 3548023 4797187 5699506 3214254
10345 3214254 894656 2341871 4411142 3169695 1067444 1886983 3696883 3050006
10337 3050006 1371276 1178348 749199 -1569802 -2727266 -678523 390737 -2970698
10329 -2970698 -6269938 -3792966 1937543 4567203 3786957 3698454 4961846 5668473 6717277
10320 6717277 9303737 10153033 6210404 1154537 365519 2316573 1962115 -213442 27147
10311 27147 2284200 2540953 834836 536631 1330625 88515 -2266865 -1691657 1858723
10302 1858723 4581890 5236776 5319958 4169073 424565 -2813309 -1190868 3258432 4536172
10293 4536172 2221479 1577603 4272421 6234180 5439393 4927861 6698644 8697123 9254060
10284 9254060 9053086 7741733 4063040 118379 -181092 2244613 2384617 -504694 -1436173
10275 -1436173 1855415 5147141 4679632 2192296 406495 -1233000 -3377082 -4114345
10267 -4114345 -2613515 -1337639 -1811215 -2018300 -532882 762456 705425 1492144 4301564
10258 4301564 6256896 5143014 3481507 4153909 5293064 3764808 1029495 859502
10250 859502 2902900 3232374 752977 -1247850 -419010 1331256 1149097 -524707 -828669
10241 -828669 1322563 3509094 2769567 -370184 -2177766 -584919 1784648 1173989 -2047956
10232 -2047956 -4349757 -4437651 -4243587 -4542495 -3569089 -1091196 118348 -1043138 -1502899
10223 -1502899 962664 3422439 2187538 -984947 -1488879 706207 1011794 -2305115
10215 -2305115 -5071329 -3127111 2029867 5587128 5239787 2686184 743882 798088 2286345
10206 2286345 3273531 2094702 -560927 -1934277 -528932 1792018 2324207 1193975
10198 1193975 746956 1841309 2869196 2511377 1323160 27103 -1694957 -3655224
10190 -3655224 -4292040 -2878539 -1159095 -1102049 -2133313 -2290202 -1128583 288701 1339203
10181 1339203 1802525 782680 -1978919 -4287733 -3599649 -855285 382967 -1078406
10173 -1078406 -2483249 -1268182 1520091 3104275 2565687 1379432 1398546 2986978 4494182
10164 4494182 3735604 877718 -1043768 -55437 1594200 714300 -1651574 -1867868 162556
10155 162556 823683 -974156 -1931952 7325 2483720 3048355 2664267 2671849 2127521
10146 2127521 780440 960021 3392926 4598806 1958152 -1775962 -2853099 -2417400
10138 -2417400 -3539590 -4848386 -2466625 2821355 5730657 4103376 1718359 2271996
10130 2271996 4326938 4194818 1336555 -1257353 -976477 1725004 4397758 5440650
10122 5440650 5303397 4915921 4102439 2760223 2430895 4292351 6271107 5402840 3001002
10113 3001002 3523640 7504549 9972435 7714416 3838668 2546055 3396988 3876377 3846679
10104 3846679 3844968 2400473 -1037396 -3540045 -2923199 -1474690 -1542553 -845883 3087797
10095 3087797 7065401 6373087 2333504 11286 302495 140893 -929074 -478510 1287769
10086 1287769 1607574 505229 676061 2222147 2605861 1543301 906947 302997 -1918783
10077 -1918783 -3837221 -1942668 2345848 4175631 3167186 3412626 5400345 5033543
10069 5033543 1794639 531475 2874315 3944553 784597 -2464135 -1714679 514220
10061 514220 117335 -1876641 -2192877 -1047405 -684416 -1299522 -2098510 -3492395 -5044804
10052 -5044804 -4306648 -778333 2065883 1676173 151233 165598 660300 -153621 -977501
10043 -977501 -286806 148586 -1529709 -3348939 -2723061 -1126772 -1633036 -3872397 -5172718
10034 -5172718 -4840064 -3809621 -1912911 1032915 3123984 2649199 860585 -396758
10026 -396758 -1718872 -3754261 -4246038 -1220577 2892399 4260839 3150774 2591172 3061654
10017 3061654 2552083 861784 -122551 91148 241316 -70236 -311903 -770630 -1693229
10008 -1693229 -1907901 -1008456 -1216934 -3950536 -6430764 -5394287 -2440502 -1616240 -3191795
9999 -3191795 -4203365 -3856454 -3600309 -2785794 489738 4406790 4633945 1123554 -1287897
9990 -1287897 -106196 1760618 1608659 948694 1721465 2550616 1528532 -263149 -650427
9981 -650427 438358 1836140 3274906 4767843 5487627 4891590 3676324 2520571 1211453
9972 1211453 -266769 -1323483 -2020748 -3069256 -4075210 -3572996 -1296492 1314409 3150141
9963 3150141 4111523 3726723 1445288 -1350443 -2078611 -331184 1714217 2776375 4051128
9954 4051128 6682847 9843277 11905143 11582509 7960928 1930075 -2584195 -2094837 1438667
9945 1438667 2603476 108461 -1599511 521727 3604765 3718375 1441035 -212040
9937 -212040 -401385 -183641 -117145 -618110 -2256344 -3541447 -1375367 3793406 6580167
9928 6580167 3681312 -859910 -1292157 1762793 3422815 2501995 2148480 3671815 5017601
9919 5017601 5340042 6192520 7473989 6666992 3506831 1580941 3338145 6425214 7052698
9910 7052698 4885479 2581493 1858361 1903942 1238875 -122700 -674584 591979 2596649
9901 2596649 3396202 2895978 2758040 3325417 2948660 1319943 656257 1817052 2320451
9892 2320451 718223 -350444 1236811 2976844 2542985 2900810 6792994 9809368 6926729
9883 6926729 3285168 7995094 17154244 15046576 -3422956 -22408411 -24807687 -13813691
9875 -13813691 -5485827 -6041158 -7645051 -4078197 803115 1557026 -842852 -2666611
9867 -2666611 -3025853 -2757571 -1976056 -1133416 -1309677 -1999693 -1610088 -826294 -1984695
9858 -1984695 -4483875 -4809680 -2167409 50271 -106544 -312893 1097668 1582077 -1132953
9849 -1132953 -4538632 -4964083 -3035328 -1700831 -901591 1555631 4883269 5373071 1807883
9840 1807883 -2637961 -4662962 -4283056 -3153958 -1923352 -638886 31241 -327029 -774524
9831 -774524 -308585 286691 -645715 -2917181 -4134317 -2703905 -124827 878043 -74142
9822 -74142 -826100 -27634 1157673 1367261 1208189 1660524 1911300 897119 -103932
9813 -103932 965824 3214664 3445177 843908 -1659177 -1619879 -213784 292340 106996
9804 106996 917235 2584515 3051192 1386261 -689925 -807619 1205053 3002541 2373089
9795 2373089 -49832 -1490107 -626264 838294 1115242 1184959 2744706 4653676 4218328
9786 4218328 1436360 -992323 -1706795 -1650665 -997243 1287372 4102711 4211661 1135630
9777 1135630 -1381945 -803081 472893 -848015 -4086399 -6467764 -7313156 -7384131 -6197114
9768 -6197114 -3166138 146020 1869160 2583329 3564294 3806166 1772145 -1156999 -2114859
9759 -2114859 -837826 466463 569418 -64760 -1116684 -2325309 -2501467 -1252649 -542904
9750 -542904 -1691533 -2234823 690427 5010730 5948038 3122011 1011608 2064061 3776362
9741 3776362 3664255 2876440 3002830 2959082 1496908 -23723 -13362 249859 -1453253
9732 -1453253 -4489385 -5891244 -4233152 -1224036 621525 829879 1073153 2586631 4000645
9723 4000645 2840044 -630379 -2961020 -2169818 -710703 -1540452 -3310124 -2812998 -657533
9714 -657533 -297365 -2046013 -2597095 -752297 926146 1116234 1869027 4068830 5036777
9705 5036777 3067640 657164 415556 888449 -567189 -3302138 -4745806 -4213947 -2655136
9696 -2655136 -477126 1821755 2664759 1581086 731392 1880806 3557984 3561755 2380172
9687 2380172 1520516 450038 -1685795 -3025559 -1236990 2260921 3835154 2796019
9679 2796019 1674016 1730901 1611594 547190 -424187 -1013278 -2414538 -4472028 -4754372
9670 -4754372 -1939660 1757751 3091861 1627767 -145072 411 1556758 1994548 -144218
9661 -144218 -3113451 -3848371 -2115234 -1047768 -2583420 -4473591 -3849497 -1827153 -1589685
9652 -1589685 -3168216 -3704227 -2474233 -1811134 -2523406 -2206978 369399 2501569 1459586
9643 1459586 -1260428 -2144979 -532058 1197206 1310916 338950 -482563 -407131 891028
9634 891028 2838408 3614194 1970836 -674050 -1716118 -1046006 -1245853 -3418702 -4953765
9625 -4953765 -3175027 327337 1525966 -410679 -2143390 -1365341 -90565 -921347 -2430865
9616 -2430865 -1294597 2190397 4228301 3157357 1521339 1632796 2364400 2110561 1968593
9607 1968593 3353435 4727413 3861295 1892260 1807249 3663988 4674191 3820375 2978133
9598 2978133 3035992 2300699 -16457 -1751788 -1115039 297193 34655 -1359063 -1403516
9589 -1403516 415293 2048309 1786084 -79470 -2274075 -3623669 -3258111 -1251401 884081
9580 884081 1629057 1388837 1715969 2652094 2439258 272162 -2223417 -3098057 -2427635
9571 -2427635 -1560850 -1038706 -428497 503414 1651347 3065103 4434185 4643923 3212334
9562 3212334 1688324 1902611 2988771 2180627 -1012156 -3557560 -2969852 -797229 -294468
9553 -294468 -1821640 -2641038 -947293 1763963 2688097 880190 -2058698 -3886659 -3897988
9544 -3897988 -3112194 -2285679 -508771 3031272 6463310 6650380 3535710 557988 -227730
9535 -227730 -625608 -2270387 -3349841 -2207840 -1230023 -3119462 -5553866 -4364317 -681703
9526 -681703 400325 -2086891 -3777461 -2448719 -1175035 -2393901 -3956768 -3447908 -1926830
9517 -1926830 -843507 484094 1690670 203763 -3506806 -4173277 557197 4966236
9509 4966236 3053399 -2053579 -2539454 2623323 7107210 7034727 4857477 3241141 1260154
9500 1260154 -1665650 -3082326 -1217877 2018778 3843650 3901472 3289873 2517347 1718777
9491 1718777 1211322 1107563 1691671 3824594 7059696 8271685 5101978 150825 -1771296
9482 -1771296 -329416 347506 -1463309 -2795671 -1819624 -1296556 -3651626 -6431787 -6007459
9473 -6007459 -3101365 -1199176 -1224055 -1071860 462461 2099440 2180433 460360 -1984781
9464 -1984781 -3427352 -2636850 -351963 1170789 887407 205947 742638 2179933 3299140
9455 3299140 3685686 3244632 1493294 -1200181 -2899314 -2217912 -341554 417890 -600683
9446 -600683 -2168774 -2921824 -2296428 -508369 1329107 1707760 275891 -1626681 -2560153
9437 -2560153 -2413356 -1865780 -1419086 -1399199 -1851082 -2089400 -1575916 -1372235 -2961726 -5287812
9427 -5287812 -5186876 -1705820 2176985 3389039 2212535 446957 -1610862 -4250141
9419 -4250141 -6261670 -6238376 -4841644 -3649470 -2702746 -1064038 1224073 3523952 5727386
9410 5727386 7165735 5957962 1839366 -1787335 -1537290 1175029 2115273 346817 -1029157
9401 -1029157 -181012 1038564 861500 478211 1437634 2707059 2442237 1098297 765196
9392 765196 2259891 4467159 6023395 6344415 5320453 3191198 840428 -533900 -421371
9383 -421371 428057 632016 -364026 -1473507 -1151764 434794 1235176 -176653 -2798625
9374 -2798625 -4652300 -5066343 -4501601 -3190092 -1460053 -569707 -1391375 -2701411 -2558720
9365 -2558720 -1098404 -186165 -556183 -1223598 -1622352 -2192544 -2618650 -1634594 799507
9356 799507 2978218 3760698 3709595 3368042 2240511 300481 -1185170 -1265098 -324613
9347 -324613 1107138 2921964 4245036 3718799 1884004 1152486 2219968 2751421 1205339
9338 1205339 -395394 257680 1787900 1249410 -1237563 -2977585 -2968041 -2687944 -3015683
9329 -3015683 -3267478 -3348917 -4135566 -5291826 -5108703 -3122822 -912411 147300 50727
9320 50727 -1044286 -2929788 -3950854 -2087351 1722964 3819014 2513736 165142 -783157
9311 -783157 -1224822 -2794725 -4233764 -3286352 -829232 16868 -1516770 -2897857 -2113126
9302 -2113126 -125985 1055069 971003 572157 647321 1132497 1429261 1080818 356584 -76600
9292 -76600 -299762 -1162228 -2580619 -2964563 -1487648 198259 171297 -712316 -2069 2554344
9282 2554344 4562700 4356649 2767828 1166146 -354804 -2089971 -3488148 -3675941 -2434161
9273 -2434161 -362080 1232141 910177 -1296938 -3291511 -3298756 -2258050 -2086916 -2409705
9264 -2409705 -1590293 -454866 -1553555 -4347669 -4843830 -1459607 2112779 2039387 -481672
9255 -481672 -1698667 -685177 491401 348276 -836858 -2240149 -2749989 -1239946 1524875
9246 1524875 2717424 1077830 -982153 -887924 539214 1394643 2175965 3794038 4339546
9237 4339546 1798316 -1617392 -2134035 -288106 334450 -646496 -420129 1002117 317471
9228 317471 -2658908 -3558757 -326616 3367862 3989903 2914989 2528389 1846226 -435902
9219 -435902 -2232045 -1474501 -334044 -1806030 -4326296 -4149427 -1558690 -352371 -1887206
9210 -1887206 -3650026 -3635519 -2698440 -2344656 -2927221 -4131169 -5058601 -4247073 -1702198
9201 -1702198 57129 -614023 -1464078 218712 2747697 2747370 1512108 3332199 7414711
9192 7414711 7493691 1478478 -4093303 -2862865 2445041 4446607 1405035 -1931077 -2276741
9183 -2276741 -1484339 -2043395 -3122408 -2542721 -84178 2603141 3910950 3297282 1504865
9174 1504865 91003 -233237 -677680 -2627949 -5204638 -6153121 -4953731 -3236122 -2108165
9165 -2108165 -1091736 -41222 44298 -1000742 -1649988 -1008313 -354693 -998787 -2051821
9156 -2051821 -1922021 -835386 -117671 110208 664581 1406162 1560822 1495400 2132696 2814378
9146 2814378 1994212 207260 -101407 1582972 2672786 1528686 324740 1650742 4046427
9137 4046427 3841986 653324 -2059996 -2096896 -1254346 -1984293 -3861361 -5051894 -5284531
9128 -5284531 -5168267 -3982556 -832049 2552924 3015100 359039 -2012848 -1795815 -674588
9119 -674588 -920657 -1445552 55866 2547544 2649757 -158067 -2830615 -3777115 -4966073
9110 -4966073 -7420036 -8149710 -4599219 423443 2073095 298756 -727664 488903
9102 488903 820719 -1733500 -4472544 -4247139 -2167154 -1363017 -2061958 -1680251 1129596
9093 1129596 4820033 7015402 6746715 4944294 3600341 3816543 4185881 2376699 -1093175
9084 -1093175 -2582936 -103538 3559934 4327124 1794226 -1304711 -3093903 -3626946 -3137639
9075 -3137639 -1842906 -880122 -1069641 -1190298 351405 2669209 3429551 2223171 656300
9066 656300 -349488 -873655 -159266 2617652 5741155 6039555 3113670 19327 -765119
9057 -765119 281541 1753217 3157586 3983394 3354609 1680892 714069 1080677 1498514
9048 1498514 1049831 430631 471390 1253450 2910556 5201827 6247199 4317497 1110278
9039 1110278 205728 1732876 2027962 -337734 -2004030 -301707 2270923 1883422 -1105280
9030 -1105280 -3494744 -3912579 -3144187 -1658130 162157 761582 -714878 -2428115 -2280468
9021 -2280468 -1118472 -1017895 -1809728 -2106269 -2380234 -3773943 -4852142 -3101439 644118
9012 644118 2665463 1428207 -830268 -1934378 -2312272 -3026686 -3834674 -4182506 -4137576
9003 -4137576 -3498814 -1660651 1007473 3149989 4174505 4545796 4252657 2771266 754398
8994 754398 -197183 94747 119056 -673687 -858770 534271 2360383 3121934 2864701 2288163
8984 2288163 1356132 -82136 -1445883 -2281600 -2957861 -3543146 -3124973 -1439838 -117279
8975 -117279 -743770 -2339255 -2461968 -657741 871783 358512 -1316956 -2302913 -2368262
8966 -2368262 -2461147 -2505601 -1517815 67277 202352 -1722461 -3359503 -2490492 -306098
8957 -306098 410566 -591153 -1202798 -752115 -668547 -1126623 -230299 2310092 3714704
8948 3714704 2232314 113815 183258 1666008 2114246 1606489 1903943 2730055 2279672
8939 2279672 835155 517675 1419038 1164655 -1074900 -2941282 -2269018 127748 2118428
8930 2118428 2827405 2438979 1064288 -867652 -2114827 -1713189 -171337 968749 466490
8921 466490 -1666896 -3935575 -4331184 -2400200 -21175 846646 613362 883754 1483838
8912 1483838 736763 -1331803 -2361081 -962050 1277399 2207845 1973525 2071826 2748160
8903 2748160 3041885 2915245 3515122 4937899 5245612 2984948 -9368 -190795 2844510
8894 2844510 4992994 2815863 -1390438 -2403208 673578 3362887 2455259 -16929
8886 -16929 -1015165 -1010116 -1489618 -1156871 1532294 4165731 2984176 -1282548 -4167952
8877 -4167952 -3666089 -2007614 -1366704 -1389544 -1311205 -1243814 -800156 702112 2249678 2057474
8867 2057474 659277 237908 845636 514534 -690325 -346534 1955906 3602354 3313850
8858 3313850 2794176 2695692 904987 -3016042 -5394136 -3390501 473972 1843074 436178
8849 436178 -567137 529604 2417481 3192078 2055795 -527017 -2732894 -2559346 -454746
8840 -454746 731659 -270192 -1185836 145467 2334448 2857166 1914199 1319527 1196157
8831 1196157 549176 -130217 344921 1337558 1343070 801812 1331598 2594932 2529022 604249
8821 604249 -1506564 -2601105 -3143226 -3545799 -3225132 -1911683 -447618 253742 124282
8812 124282 -311683 -330319 661596 2384987 3621824 3674131 3351396 3639461 4064942 3452500
8802 3452500 1757600 95739 -631366 -341804 422400 651460 -354322 -1742270 -1714217
8793 -1714217 -56010 1259779 823216 -397683 -1019321 -1294325 -1863992 -2229945 -2061756
8784 -2061756 -2240589 -2813977 -1867369 1316440 3876544 2912400 -143614 -1669905 -1033854
8775 -1033854 -327138 38028 1717886 4683336 6728996 7084456 7262588 7759518 6988660
8766 6988660 4318841 1399236 -434205 -1546614 -2053102 -1157033 574704 905026 -849487
8757 -849487 -2674578 -3160180 -3442670 -4369119 -4367850 -2328536 -363265 -956846 -2857794
8748 -2857794 -2775025 -535881 367513 -2239741 -5989565 -6841399 -3921715 -280126 849160
8739 849160 -417592 -1174276 692445 4344631 7472907 8729507 7914317 5069480 1112630
8730 1112630 -1461509 -825446 1263304 1084144 -2030956 -4504417 -3218183 623324 3549774
8721 3549774 3925776 2506944 473622 -1270028 -1860836 -1295612 -868094 -1376479 -1600952
8712 -1600952 -60251 2361916 3271463 1980542 178414 -659000 -851686 -1003866 -427079
8703 -427079 1737588 4526414 5602859 3902675 1012102 -644416 -536652 -138833 -477218
8694 -477218 -837448 -498609 -425326 -1780780 -3584699 -3788266 -2491248 -2000245 -3273861
8685 -3273861 -4340875 -3212827 -621278 1439060 2441606 3055673 3262843 2535276 1367375
8676 1367375 996130 1679638 2453323 2523337 1914032 843967 -624681 -2325894 -4022427
8667 -4022427 -5545841 -6440040 -5949009 -4016923 -1792241 -407891 222507 700510 983898
8658 983898 867285 822799 1147087 995811 -265049 -1349966 -457433 1926852 3553282
8649 3553282 3722006 3982041 5109417 5582236 4135847 1953266 800154 413199 -525620
8640 -525620 -1840136 -2178372 -1344776 -460685 58197 892155 1964201 1928608 258830
8631 258830 -1508646 -1689523 -730117 -369115 -947807 -849366 1125992 3776625 4664142
8622 4664142 3064990 1036438 1110917 3237348 4752201 3594692 766999 -1113414 -1072602
8613 -1072602 -381042 -152654 -928 400957 101511 -1466037 -2837462 -2321210 -699076
8604 -699076 -42617 -190420 1015465 3562232 4268939 1614630 -1040418 134453 3552568
8595 3552568 4306774 1502407 -553923 796392 2578918 1242066 -1702361 -2497018 -1318962
8586 -1318962 -1489989 -3415301 -3684701 -775562 2257071 2358014 592732 -327488 -17946
8577 -17946 474863 1349655 2988941 3796097 2202336 -83311 3058 2112692 2881474
8568 2881474 1201499 -299842 58723 145589 -2313025 -5759040 -6840632 -4758908 -1374802
8559 -1374802 1731816 4015750 4615191 2681878 -845859 -3516428 -3758025 -2084883 -38738
8550 -38738 1216876 1496644 1548737 2102217 2544342 1439681 -994552 -2236221 -493060
8541 -493060 2768626 4730903 4492839 2834737 90406 -3432731 -5850636 -5247903 -2621070
8532 -2621070 -815203 -582638 -158860 1228279 2213775 2179182 2496317 3822349 4636825
8523 4636825 3851239 2698054 2467247 2308993 1052153 -441671 -698691 -212711 -673813
8514 -673813 -2352987 -3899508 -4216319 -3180893 -1036516 1626178 3611608 3890398 2455528
8505 2455528 -18384 -2649163 -4097823 -3159407 -586070 857661 -553249 -3224740
8497 -3224740 -4180134 -2503578 243155 2185056 2471671 1206191 -592120 -1359327 -400661
8488 -400661 1390970 2833380 3641773 3666885 2288547 -199217 -1859533 -1366236 21857
8479 21857 415431 218758 1084123 2704748 3010978 1399707 -485798 -1407343 -1859601
8470 -1859601 -2247144 -1730495 113474 1962741 2250657 1124310 -5266 -232099 262844
8461 262844 885876 1177597 911648 149065 -816014 -1712399 -2417650 -2828590 -2729801 -1786936
8451 -1786936 251798 3049811 5450389 6353450 5975450 5595251 5847860 6026126 5333548
8442 5333548 3905065 2168965 239026 -1417180 -1758163 -501838 1164912 2037438 2217357
8433 2217357 2221462 1808082 726083 -298778 -493119 -247746 -401881 -1039729 -1844382 -2716525
8423 -2716525 -3197844 -2494437 -1104028 -956166 -2517951 -3293744 -1119304 2330317 3544174
8414 3544174 1794005 -508678 -1445017 -1298564 -958150 -757159 -850953 -1044749 -521619
8405 -521619 778585 1346810 499475 383952 2991581 6157607 5827866 1979107 -1277614
8396 -1277614 -1779555 -1731333 -2938504 -3377006 -843210 2782953 3850613 2004869 304575
8387 304575 947818 3004900 4254403 3714202 2184008 1170490 1465320 2520595 3285369
8378 3285369 3451686 3332237 2822954 1468515 -509986 -2196219 -2899147 -2279805 -75950
8369 -75950 3075694 5120586 4529685 2449644 1302829 1689769 2497648 3388523 4640283
8360 4640283 4875497 2081799 -2635055 -5356108 -4393535 -2267146 -1520522 -1447473 -620634
8351 -620634 93630 -655889 -2004544 -2420802 -2394345 -3218702 -4258150 -3695862 -1294086
8342 -1294086 1463272 3381984 4165865 3716774 2345491 1173979 1139431 2098542 3572931
8333 3572931 5263954 6128854 4667528 1406080 -677373 85627 1525040 859765 -1162217
8324 -1162217 -1806989 -705040 224816 404144 1057137 2212565 2300849 1187869 808642
8315 808642 1892646 2593751 1673939 792932 1787629 3324232 2511839 -828465 -3610786
8306 -3610786 -3357674 -1063531 445452 32362 -803410 -248009 1459951 2484468 1845961
8297 1845961 604124 299081 875697 910178 -351167 -2085699 -3207151 -3725525 -4160159
8288 -4160159 -4188897 -2959340 -797668 487269 -321156 -2208425 -3273415 -3151470 -2896737
8279 -2896737 -2830366 -2175085 -1004623 -696211 -1598519 -1914025 -210036 2231260 2987488
8270 2987488 1448261 -1036053 -2865538 -2828086 -452838 2637855 3204927 268934 -2861764
8261 -2861764 -2760590 -641733 -64187 -1163470 -830693 1856308 4274429 4622412 3989733
8252 3989733 3343686 1901413 -433911 -2128949 -2594744 -2813520 -2646565 -859044 1292337
8243 1292337 461432 -3135334 -4501709 -754845 4465247 6396276 5447893 4567850 3530457
8234 3530457 320580 -3843585 -5551420 -4459081 -3433120 -3677093 -3340911 -1280914 839962
8225 839962 976960 -768609 -2568657 -2618851 -634971 1448232 1038848 -1895455 -4431995
8216 -4431995 -4566773 -3671757 -3642766 -3826635 -2926054 -1779262 -1577648 -1260074 363354
8207 363354 1664130 581713 -1643266 -2527601 -2567822 -3558584 -4095292 -1342992 3253605
8198 3253605 4830721 2084073 -1075767 -1780835 -1838031 -3454133 -5120903 -4179080 -920214
8189 -920214 2063209 2894563 1284999 -1944922 -4933022 -5789096 -4492550 -2611702 -978536
8180 -978536 580449 1213584 -663349 -4306270 -6371629 -4986541 -2170694 -1031841 -2263788
8171 -2263788 -4505561 -6484925 -7505978 -7041899 -5057941 -2195355 705211 2674413
8163 2674413 2741905 1295865 536230 1663498 2514851 606189 -2330251 -2375526 291270
8154 291270 1380317 -540615 -1625102 806860 3718426 3254026 648150 -387564 518651
8145 518651 1146298 1339267 2723921 4671278 4554441 2086731 39951 156916 1132406
8136 1132406 1296790 853706 549353 147998 -643448 -1171993 -819831 -57561 254548 -64145
8126 -64145 -627781 -1029879 -951730 -382402 -10343 -698925 -2186975 -2925030 -1729750 751479
8116 751479 2700321 3074344 2494197 2239350 2747110 3295967 2996041 1853912 856093
8107 856093 1076295 2546200 3887535 3469433 1386270 -214170 322407 1714299 1306746
8098 1306746 -995818 -2312475 -907302 1368140 2055838 1543261 1641500 2386070 2590095
8089 2590095 2302734 2135824 1158567 -1630684 -4375720 -4114261 -1373270 261896 -435086
8080 -435086 -708097 1345410 3559972 3159143 823117 -928839 -1568745 -2473891 -4091376
8071 -4091376 -5187881 -4506644 -1964174 1314813 3431725 3022263 885131 -475729 518564
8062 518564 3142073 5747690 7228017 6865412 4425386 1133922 -887805 -917704 -92066
8053 -92066 847277 2541550 5012948 6502695 5545277 2888930 304664 -1324641 -1881527
8044 -1881527 -1312367 -47230 909019 1008040 343132 -1295145 -3974882 -6094854 -5409253
8035 -5409253 -2191573 690571 1537896 1473105 1686695 1690399 1411908 2136004 3678663 3512272
8025 3512272 967930 -446829 2091336 5731310 5303358 410006 -4252457 -5143478 -3326686
8016 -3326686 -1612655 -1029351 -933105 -795655 -806857 -1238384 -1617453 -790404 1493140 3349039
8006 3349039 2707337 551382 38929 1929043 3507538 2982738 1888965 1532249 401123
7997 401123 -2343969 -3938745 -1907624 1616385 3022820 2487421 2296279 1943062 -637461
7988 -637461 -4209124 -5259502 -3455430 -1813728 -1636065 -1462923 -1044748 -1942838 -3611954
7979 -3611954 -3196886 -384030 1477110 578876 -591728 562982 3008800 4427328 4498838
7970 4498838 3833605 2068737 -821439 -3160228 -3442494 -2239755 -922630 104064 901790
7961 901790 1364573 2002929 3620382 5377719 5170704 2905710 1234139 1760431 2689954
7952 2689954 1868190 163515 -179621 913782 1502761 463109 -1500392 -3090492 -3434246
7943 -3434246 -2373460 -565568 1213916 3100485 5463617 7223204 6604577 3978852
7935 3978852 1943638 1757802 1708299 125109 -1999902 -2896037 -2739349 -2734462 -2812101 -2028145
7925 -2028145 -410866 1054821 1708120 1525536 846232 393257 665287 950547 117555
7916 117555 -1499640 -2612243 -3356512 -4950797 -6810878 -6754666 -4626589 -2630144 -1260098
7907 -1260098 1371859 4705439 4555465 -486266 -5557793 -6145567 -4543182 -5215192 -6985883
7898 -6985883 -5457593 -1089021 1305934 353712 -614377 -252386 -1224903 -4304521 -5883517
7889 -5883517 -3584939 43841 1792392 1978170 2069413 1618412 139109 -908746 -531490
7880 -531490 -43935 -277309 381044 2767096 4433560 3149282 592033 -393044 -204845
7871 -204845 -1041086 -2687150 -3042046 -1878987 -1105909 -1837441 -3583684 -5603545 -6944325
7862 -6944325 -6271214 -3945964 -2912574 -4881077 -7067066 -5832647 -2253252 -421601
7854 -421601 -1169555 -1608080 -546026 132241 -51769 1144606 4209917 6301770 6018463
7845 6018463 5827995 7358701 7965729 5112900 1131524 15937 1635885 2657778 1579592
7836 1579592 -538327 -2899146 -4981691 -4917989 -1703858 1594794 786697 -3338359 -5707183
7827 -5707183 -4107068 -1643444 -1124550 -1146166 207061 1462966 551912 -1178152 -1040199
7818 -1040199 586223 1073273 -310266 -1982344 -2983351 -3440027 -2623367 365801 3896423
7809 3896423 4800387 2691004 562423 205222 -177032 -2274739 -4252363 -3399438 -393046
7800 -393046 1714207 1704770 889379 321361 -76247 84828 1444960 2937979 2668191 1189199
7790 1189199 1149482 2787410 2793750 -571308 -4059168 -3796321 -884012 567552 -485166
7781 -485166 -1467603 -982192 -455794 -934054 -1721122 -2708423 -4657360 -6361492 -5107983
7772 -5107983 -1386793 448029 -1638142 -3890403 -2334407 1159655 1971301 -330776
7764 -330776 -2151784 -1658335 -393464 309300 710106 513400 -1113701 -3051706 -3016148
7755 -3016148 -1345285 -915942 -2607678 -3874597 -2809881 -831609 -133255 -910176 -2226443
7746 -2226443 -3329176 -3157911 -983132 1535362 1576102 -526214 -1146130 1102811 3012883
7737 3012883 2009478 377808 1287964 3449831 3406288 1159817 -366114 -226030 51314
7728 51314 202917 1596034 3743440 4009134 1619654 -837995 -928440 771069 2117357
7719 2117357 1833655 -135219 -2863785 -4324383 -2706221 1255213 4493626 4831430 3027922
7710 3027922 1339101 1147344 2265750 3474117 3479302 2266254 1450980 2263273 3476284
7701 3476284 2714890 -402378 -3953883 -6306382 -7227612 -6576919 -4136797 -1186101 -44620
7692 -44620 -1117652 -2192083 -1627192 -518568 -571372 -1465884 -1759663 -1150275 -422553 -108257
7682 -108257 -412115 -1475861 -2500792 -1704805 1344769 4281695 4546357 2796949 1831448
7673 1831448 2411920 2300484 -75964 -2853401 -2800833 744818 5005308 6446665 3884640
7664 3884640 -507596 -2826300 -781905 3855266 6701635 5432434 2421446 1655498
7656 1655498 3613787 4980661 3511912 1012574 309360 1103898 883474 -1057910 -2837512
7647 -2837512 -2975258 -1992587 -855625 177037 811013 791632 1159996 3312116 6174246
7638 6174246 6719541 4383379 2387754 2969616 3886775 2188601 -740932 -1149358 1428099
7629 1428099 3877725 4267421 3638394 3123977 2333397 996087 -351319 -1705674 -3344671
7620 -3344671 -4155759 -2771285 -517440 -348593 -2332495 -3227837 -1481913 473788 376686
7611 376686 -474414 -67057 806144 550610 187382 1724622 4396749 5551971 4753263
7602 4753263 4273782 5489167 7029250 6888941 4756556 1941781 175166 491370 2216847
7593 2216847 3234077 2302431 700273 303235 624124 -378291 -2698201 -3714205 -1928258
7584 -1928258 684586 1460367 787816 1162834 3047383 3801695 1383311 -2489450 -4315303
7575 -4315303 -3261714 -1938773 -2569944 -4091682 -4110404 -2456514 -1064433 -854864 -716355
7566 -716355 147608 720743 19161 -907492 -245273 1881924 3297706 2368938 -198819
7557 -198819 -2365299 -2915510 -2254095 -1432903 -1018234 -1104319 -1853004 -3183975 -4047113 -3164587
7547 -3164587 -971796 334827 -393277 -1462545 -674251 1417938 2293195 1027475 -751106
7538 -751106 -1315420 -447846 1382263 3521857 4569175 3272540 574602 -984057 -467029
7529 -467029 619805 1202776 2171729 3999078 5057325 4048754 2396895 2226014 3162233
7520 3162233 3130179 1505244 -422035 -1573592 -1901615 -1426359 -157249 1047502 957140
7511 957140 -502594 -2097807 -2617671 -1683501 340918 2372099 3017387 1990889 754003
7502 754003 756606 1466242 1249711 -208267 -1700448 -2496035 -3031060 -3391481 -2622576 -404248
7492 -404248 1586328 1219302 -1321280 -3328033 -2636996 -407319 30424 -2764757 -6363917
7483 -6363917 -7287623 -5072666 -2312428 -1043787 -718583 -1742 1052848 1513132 1147785
7474 1147785 509595 84989 66632 425411 731714 515323 113749 353782 1066154 898732
7464 898732 -887039 -3330363 -4968187 -5283195 -4631448 -3695916 -3283615 -3585987 -3511874
7455 -3511874 -2115801 -678909 -1378357 -3587615 -4081729 -1969091 -579007 -2383285 -4623535
7446 -4623535 -3102301 1290690 3439260 1035732 -2550774 -3076250 -520158 1790133
7438 1790133 1469437 -802393 -2668935 -2647085 -1374117 -568952 -879081 -1236153 -522943
7429 -522943 920464 2001670 2347042 2401448 2642773 3204186 3713776 3343315 1870401
7420 1870401 585685 764274 1444038 810305 -277615 872491 3812778 4496509 1527339
7411 1527339 -952342 493408 3035372 2237067 -695739 -1247860 750926 1244629 -974128
7402 -974128 -2688314 -2067222 -1044742 -878915 81588 2632953 4752524 5210953 5567015
7393 5567015 6689449 6717732 4637295 2705259 2849241 3446263 2365227 794578 1083866
7384 1083866 2571484 2572633 503464 -1549794 -1792811 -300591 1752650 2837152 1756915
7375 1756915 -974192 -3167583 -3500108 -3027441 -3122089 -3290940 -2439429 -917694 377875
7366 377875 1735266 3603839 4780421 3564815 274676 -2947181 -4474166 -4211305 -2941540
7357 -2941540 -1797236 -1648122 -2007983 -1489146 -191791 -88088 -1754806 -2680652 -928890
7348 -928890 1328227 775348 -1876145 -3066971 -2072373 -1705635 -3094920 -3735754 -2208046
7339 -2208046 -1228686 -3370310 -6339808 -5858930 -1968698 927583 213676 -1787483 -1673579
7330 -1673579 463569 1965469 1564277 388470 -406948 -985145 -1507514 -1213289 143694
7321 143694 1084416 62817 -2141166 -3186495 -2398869 -1751897 -2926340 -4572336 -3823128
7312 -3823128 -187379 3400087 3862893 1500638 -587141 -300696 1288532 1966881 1513986
7303 1513986 1477058 2247309 2302631 974730 70175 1195899 2891286 2583867 654751
7294 654751 55682 1818759 3450386 2680085 703656 170125 1294615 1726721 -167138
7285 -167138 -3284020 -5164643 -4634728 -2784932 -1487850 -1202978 -731099 771571 2551615
7276 2551615 3758685 4922876 6386282 6443130 3552950 -67937 -151352 3725053 6865444
7267 6865444 5418307 1062533 -2024563 -2547896 -2059542 -1336630 195675 1974247 1957423
7258 1957423 -698554 -4187615 -5808807 -4489088 -1596093 297530 -123813 -1356571
7250 -1356571 -807886 1615721 3105118 1899996 -119297 -228112 1381390 2551851 2504262
7241 2504262 1928914 767710 -1397414 -3162197 -2336395 529386 2198842 1077994 -765009
7232 -765009 -970592 -201489 -473914 -1750432 -2298530 -1757284 -1674586 -2742703 -3353859 -1978755
7222 -1978755 207895 659864 -963792 -2286030 -1578603 139872 1287131 2091064 2972582
7213 2972582 2303877 -1315865 -5448512 -5937456 -2660752 375140 1185983 2006819 3935827
7204 3935827 3904307 99422 -3470531 -2252074 1587583 2074796 -1756884 -4943088 -4184676
7195 -4184676 -1602126 -247522 -150352 -234279 -606568 -1130452 -474826 1614541 3224514
7186 3224514 2989007 2096776 2301599 3535253 4568748 4580816 3334298 1394638 708844
7177 708844 3049635 7209908 9746944 9248160 7721737 6947090 5904326 3147005 -571954
7168 -571954 -3629868 -5441606 -5540741 -3066433 864522 2560848 194392 -2843758 -1954997
7159 -1954997 2341765 5085844 3483981 -25446 -1624280 -581233 1038456 1420182
7151 1420182 536864 -650653 -1529208 -2124210 -2226336 -929553 1986019 4561068 4283882
7142 4283882 1616149 32572 1612967 4407597 5425080 4341111 2544681 389061
7134 389061 -2259231 -4153716 -4032719 -3040257 -3209422 -4084357 -3449766 -1114365 714373
7125 714373 870780 403617 -15871 -1180553 -3023292 -3679464 -2194390 -237137 344146
7116 344146 188085 1143345 3374264 5194728 5295838 4118882 3284595 4167433 6582201
7107 6582201 8565428 8090141 5318185 2521121 1560784 2191498 3037777 3327579 3213322
7098 3213322 3116740 3319441 3895958 4792483 5980325 7157147 7193471 4975080 1532175
7089 1532175 -115352 1236670 2765080 1477956 -1028260 -887365 1653857 2234472 -737387
7080 -737387 -3493616 -2955372 -1351783 -1919515 -3375903 -2521736 -58908 509698 -1211598
7071 -1211598 -1817628 663349 4295491 6447807 6595698 5374754 3471228 2180153 2733975
7062 2733975 4271552 4534767 3255094 2697231 4046824 5557681 5496799 4702704 4500325
7053 4500325 4007280 1812718 -859620 -1231640 947417 2571264 1027246 -2532343 -4623830
7044 -4623830 -3412168 -375307 1883910 2617211 2998905 3552075 2953771 323800 -2455392
7035 -2455392 -2545044 -8854 2062574 1557541 -464013 -2254404 -3899454 -5758975 -6156454
7026 -6156454 -3191129 1612909 4005123 2066309 -1222881 -1740652 503700 1545306
7018 1545306 -1127434 -5046359 -5808428 -2656907 885123 1917212 1396824 1393977 1423531
7009 1423531 -101949 -2341992 -3128479 -2904614 -3961540 -5611042 -4186703 769510 4352438
7000 4352438 2989982 -117410 128000 3033892 3772497 1256301 -598759 511248 2179579
6991 2179579 2102057 1803568 3184892 4557660 3217111 78223 -1376678 -31235 1646124
6982 1646124 1277555 -650272 -2089217 -1925786 -506872 1270530 2550478 2639113 1319474
6973 1319474 -762901 -2366165 -2720738 -2365767 -2464275 -3099046 -2975431 -1455942 -57974
6964 -57974 -590064 -2227929 -2259341 -8831 1895767 1208040 -638373 -665859 1187046
6955 1187046 1917479 -235882 -3424128 -5018193 -5171926 -5886777 -7336010 -7330582 -4907396
6946 -4907396 -2448167 -2624556 -4401651 -4235177 -989451 2596083 3805157 3075569 2138923
6937 2138923 1213250 -10500 -265779 1813544 4876087 6050503 4785408 3230341 2826494
6928 2826494 2857898 2661371 2863337 3647274 3923563 3195193 2325057 1447597 -799356 -4461532
6918 -4461532 -6579962 -4400348 834940 5259566 6838342 6643193 6191189 5452843 3687886
6909 3687886 833136 -2374575 -4869868 -5721350 -4814191 -3185797 -2191133 -2276695 -2821789
6900 -2821789 -3005256 -2593908 -2107888 -2292790 -3086526 -3305294 -2136625 -723279 -921570
6891 -921570 -2340386 -2319157 398069 3658014 4826201 4213917 3847523 3968578 2982783
6882 2982783 571561 -1284834 -840470 1336772 3384758 4185206 3791008 2597082 886939
6873 886939 -855985 -1667058 -699001 1459768 2473646 378121 -3790043 -6634278 -6183328
6864 -6183328 -3918423 -2415806 -2317307 -2663688 -2876462 -2884739 -2285150 -1069430 -502130 -1590061
6854 -1590061 -3207827 -3430699 -2235088 -1036704 -6259 1864809 3969990 3862765 732385
6845 732385 -2906360 -4268384 -3536657 -2721094 -2579889 -2333895 -1671938 -1216652 -1038769
6836 -1038769 -278901 1258620 2301684 1762344 510629 398350 1648924 2430172 1519796
6827 1519796 277748 791934 2738887 3721546 2678864 1183650 806044 919368 256704
6818 256704 -791751 -1003276 -490733 -324891 -452599 322505 2251156 3893836 3788939
6809 3788939 2037806 25960 -947235 -805918 -743782 -1782222 -3187060 -3221265 -1704876
6800 -1704876 -367995 34521 1082115 3689344 5637421 4468928 1523530 265202
6792 265202 1293053 2048001 1342370 955267 2038187 2925733 1960229 211817 -251015
6783 -251015 864025 2506980 4074907 5288128 5397855 3982293 1885940 359560 -121371
6774 -121371 365725 1493071 2076722 603131 -2411944 -3856455 -1484621 2805873 4911892
6765 4911892 3430962 874662 -160307 -186758 -1102540 -2545411 -2013295 1091927 3441129
6756 3441129 1584214 -2982664 -4982343 -2045062 2274182 3652216 2726253 2942962 4472066
6747 4472066 4072686 639311 -3027544 -4677340 -5216630 -5536207 -4287680 -1109540 952372
6738 952372 -671318 -3815034 -4427226 -2323353 -797404 -1248370 -1662516 -617985 428148
6729 428148 -56074 -1046397 -698907 811542 1724388 1170832 -33943 -775027 -896171
6720 -896171 -947768 -1054739 -380825 1851867 4701267 5648434 3208758 -1041118 -3975189
6711 -3975189 -4201857 -2937346 -1960751 -1973996 -2941680 -4544543 -5763432 -5319510 -3428029
6702 -3428029 -2118860 -2704439 -3657559 -2382231 1168472 4093596 3998871 1543444 -1029174
6693 -1029174 -2613463 -3383288 -3250746 -1953979 -481905 -588271 -2299742 -3273262 -1532451
6684 -1532451 2005011 4481890 3951311 860552 -2431318 -3239312 -853630 2168695 2384387
6675 2384387 -183456 -1841147 -396562 1761100 1679595 525454 1127207 2669614 1908738
6666 1908738 -1047739 -2565432 -1406327 -499953 -1610585 -2396432 -887451 770793 -127534
6657 -127534 -2448062 -3511797 -3561922 -4572580 -6083762 -5650927 -2895635 -226884 402748
6648 402748 -676168 -2037491 -2358320 -865364 1655605 2790660 1127720 -1634190 -2843034
6639 -2843034 -2310721 -1673944 -1311892 -351883 813614 736094 -325523 -430741 801688
6630 801688 1338605 -75692 -1896862 -2032235 -601866 633104 546812 -536730 -1582875
6621 -1582875 -1812062 -1424602 -1467568 -2354692 -2792621 -1266872 1582306 3419628 3122264
6612 3122264 1845211 935837 228089 -977006 -2434894 -3318847 -3367179 -3013896 -2777901
6603 -2777901 -2842574 -2866101 -2139044 -408528 1482618 2324811 1863003 914220 388583 727777
6593 727777 1928422 3370667 3923779 2995696 1280346 -69694 -567476 -246133 727166
6584 727166 1575179 1142087 -397258 -1262066 -681899 -288707 -1300224 -2124868 -1158051
6575 -1158051 -167231 -1530345 -3381206 -1705710 3033594 5923559 4901894 3365748
6567 3365748 3881486 4028649 1446909 -1178113 -339234 2077177 1520494 -2012833 -4265138
6558 -4265138 -3498686 -2315824 -2474412 -2365469 -936779 -221682 -1780791 -3550325 -2788850
6549 -2788850 -182879 1533256 1725485 2045406 3090921 3402030 2062616 364668 70611
6540 70611 1134642 1923412 1146479 -918175 -2788487 -3145898 -2134373 -1273720 -1625604
6531 -1625604 -2208097 -1089303 1853254 4399154 4807327 4057289 4138819 4982490 4769101
6522 4769101 2990246 1273269 822170 967626 1164516 2518605 5622675 8297074 7805368
6513 7805368 4814383 2866713 3772760 5591466 5761159 4344556 3055063 2472508 1714785
6504 1714785 304860 -869292 -505239 1683350 4416204 5706336 4740217 2883590 2130204
6495 2130204 2646732 2919252 2369936 2299243 3568948 4826249 4256381 2100881 143172
6486 143172 -579417 -299252 537199 1386742 1162939 -663256 -2593064 -2364407 11654
6477 11654 1914780 1334533 -805418 -2157724 -1649195 96822 1983573 3064101 2712366
6468 2712366 1294271 219752 362109 883238 622738 65618 512135 1613618 1505590
6459 1505590 -363458 -2310108 -3005221 -3236646 -3880726 -3739338 -1347863 1994026 3270504
6450 3270504 1771247 50333 390439 1966896 2399732 997241 -552474 -277699 1888731
6441 1888731 3913269 3708455 1626409 320538 1393457 3066713 2641776 533356 -307603
6432 -307603 1135167 2451639 1340365 -1504871 -3847788 -4346825 -2810442 -40331 1764352
6423 1764352 630489 -2184037 -3134997 -1400132 -185561 -1532457 -2986534 -1831621
6415 -1831621 419180 946233 410960 1141040 2695901 3243361 3529287 5093942 6040940
6406 6040940 3546209 -249572 -224241 3768990 6281521 4441639 1490482 598608 287928
6397 287928 -1468202 -3077398 -2422147 -611208 469963 1448475 3386560 5016266 4863835
6388 4863835 3854552 3309512 2689494 1651321 1660276 2976492 2935133 284407 -1685779
6379 -1685779 -18861 2603682 1798342 -1361664 -2023617 726571 2826511 1839864 -25496
6370 -25496 -248430 551539 664242 -236276 -1739351 -3391366 -4033075 -2674351 -476862
6361 -476862 322590 -292431 -205265 1243356 2214845 1353933 -504101 -2063110 -2824579
6352 -2824579 -2304617 -291019 1734339 1745931 189660 -430696 657429 1585312 1187732
6343 1187732 588210 625877 302365 -1071780 -2446056 -2814205 -2372961 -1182490 972188
6334 972188 2741302 2099518 59386 257927 3258913 4704602 1589640 -2819547 -3585469
6325 -3585469 -1058398 544548 -238365 -1006620 -295208 453577 26142 -595633 -151552
6316 -151552 1223113 2740580 3644245 3082141 1025312 -814408 -766365 370267 589088
6307 589088 -79055 53531 925089 444198 -1994696 -4335073 -4940096 -4437992 -3645731
6298 -3645731 -2154807 -234716 256230 -1412493 -3155218 -2884570 -1342640 -379156 -128875
6289 -128875 43233 -604074 -2864375 -5196007 -5277110 -3331253 -1427526 3653 2231656
6280 2231656 4966103 5984930 4607927 2977296 2977540 4059794 4963655 5373002 4886223
6271 4886223 2739100 -14974 -378092 2591872 5600036 5121789 1986694 -319319 -465655
6262 -465655 145182 377483 113428 -1140344 -3401776 -4451707 -2058469 2085225 3797325
6253 3797325 2074937 147982 255828 756673 -245095 -1605682 -1458306 -217236 834325
6244 834325 1695971 2268444 1039289 -2357804 -5108261 -4404892 -1304308 1044726 1635310
6235 1635310 1529591 1029575 -42422 -318397 1511344 3558562 2540319 -1284685 -4180617
6226 -4180617 -4235015 -3408136 -3552383 -3545330 -1895182 308168 914223 -409227 -2301037
6217 -2301037 -3462955 -3153951 -1138554 1742625 3825736 4197679 3250681 1482654 -942916
6208 -942916 -3140399 -3636480 -2319123 -926578 -866638 -1723423 -2475461 -2873291 -2947499 -2428207
6198 -2428207 -1448679 -876198 -1399891 -3034023 -5465703 -7776174 -8201502 -5892738 -2633700
6189 -2633700 -760623 257312 2468095 4886670 3957284 -563039 -3987000 -2871883
6181 -2871883 529680 2355279 2559351 3322190 4677336 5108419 4639982 4119944 2984666
6172 2984666 798495 -560638 501806 1966387 936526 -1504590 -1837826 409609
6164 409609 2536586 3396626 4269211 5240110 4812164 3393366 3173098 3926210 2911107
6155 2911107 -100492 -1678462 -123008 1686860 753852 -1952989 -3918847 -4672944 -4798612
6146 -4798612 -3962393 -2172953 -821716 -488718 186164 1740738 2423273 1344947 475216
6137 475216 1278600 2004037 927453 -275898 522105 1844782 953986 -1513480 -2824789
6128 -2824789 -2702591 -2969090 -3662742 -3239403 -2097407 -2244541 -3567290 -3846778 -2599616
6119 -2599616 -1653736 -1606037 -863454 1182202 2888496 3056838 2453256 1963975 1428314
6110 1428314 820494 549518 273815 -672162 -1769903 -2241893 -2824978 -4029825 -3640696
6101 -3640696 353508 4894154 4495352 -774325 -4671624 -3407724 -191818 797934 231703
6092 231703 458727 756486 -509097 -2205642 -2620643 -2661385 -3448948 -3393719 -1222694 729792
6082 729792 97750 -1175214 -197414 1605024 1174328 -453937 -306181 436256 -1598846
6073 -1598846 -4798758 -3716770 2121733 6575666 5525457 1851904 -103445 -138564 153718
6064 153718 918647 2267450 2428762 545895 -1398631 -1783826 -1784768 -2502336 -2564918 -995764
6054 -995764 247760 -798183 -2974866 -4239016 -4762158 -5397129 -5337929 -3859520 -2295931
6045 -2295931 -1815823 -1348352 -146197 21589 -1928901 -3496500 -2285414 -338326 -877168
6036 -877168 -2564679 -1490274 2130044 3920306 2037720 -403583 -379318 1280253 2437725
6027 2437725 2954514 3874755 5350388 6684342 7130852 6077613 3720886 1759579 2053103
6018 2053103 4490304 7291353 8947668 8594609 5576672 806304 -2281094 -781823
6010 -781823 3813663 7065025 6658545 3953845 1156361 -410043 206454 2711089 4322865
6001 4322865 2538416 -899830 -2120521 -1192911 -2080338 -5851106 -8368574 -6644024 -3404803
5992 -3404803 -2454187 -2822199 -1156471 2242591 3605062 1112164 -2950581 -5320935 -4791666
5983 -4791666 -2189367 786133 2426061 1957058 109312 -1452578 -1208461 1249373 4376800
5974 4376800 5295332 2851933 -280392 -619501 1307986 1887377 121112 -1155001 -608379
5965 -608379 -939656 -3987307 -7043376 -7099895 -5657502 -5711569 -6488140 -5244269 -2479325
5956 -2479325 -1023385 -1001962 -50219 1888244 2277826 691438 -346594 39094 -401902
5947 -401902 -2584897 -3862005 -2287453 25599 318283 -543614 -63489 1447685 1616694
5938 1616694 315935 14110 1641760 2888999 1656146 -872290 -2139668 -1873236 -1963022
5929 -1963022 -3161748 -3815927 -2318270 623539 2989755 3665571 2771067 848269 -1021271
5920 -1021271 -1231569 518189 1994965 932576 -1577322 -2338635 -633260 903612 423746
5911 423746 -687120 -489127 805686 2170854 3584831 4875984 4736908 2702338 456793
5902 456793 -425251 -294413 433890 2576263 5577434 6158682 2488136 -2299005 -3932758
5893 -3932758 -2700451 -1924345 -2212242 -1106975 2234867 5780704 7826198 8145144 6341968
5884 6341968 2549414 -573231 -324264 1601348 1057297 -2038568 -3392520 -1184869 1212975
5875 1212975 725331 -1459353 -3195019 -4562324 -5508903 -4217368 -608373 1963646 1475727
5866 1475727 524200 1743369 3139717 1753769 -812536 -916849 995287 1291745 -955894
5857 -955894 -3325464 -4618415 -5754869 -6232512 -4057470 53954 2299785 971058 -1135531
5848 -1135531 -944920 913532 1862099 842250 -1490694 -4069555 -5400622 -4004918 -487554
5839 -487554 2213223 2100484 391248 -794517 -1512163 -2920913 -4345730 -3811230 -1240938
5830 -1240938 1089254 1651702 1357934 1442853 1398955 392071 -534807 295459 2079116
5821 2079116 1897819 -1083778 -3776705 -3135245 -499455 387126 -975171 -1094674 2114640
5812 2114640 6087936 7422720 6609508 6458144 7295212 6816818 4457395 2846224 3897610
5803 3897610 5662998 4752782 804261 -3060876 -3962535 -2217592 -317638 245788 377082
5794 377082 1583285 3544117 4336714 2970981 644071 -905808 -1255950 -813919 450121
5785 450121 2548687 4389694 4531030 2894382 712179 -996732 -1908740 -1757321 -522344
5776 -522344 895948 1531840 1861366 3056706 4655333 4608258 2181012 -742341 -2141353
5767 -2141353 -2287410 -2500972 -2647659 -1578270 400582 1312498 155543 -1558068 -1699766
5758 -1699766 -193667 1128320 1037318 342351 638899 2350570 4511563 6043402 6563874
5749 6563874 6076419 4623751 2516575 445357 -942418 -1392267 -949500 174544 1657296
5740 1657296 3294803 5001929 6204361 5771204 3525443 1424403 1757253 4060683 5391189
5731 5391189 4120390 1869433 909871 1263235 1572513 1447620 1440811 1677166 1959282 2504445
5721 2504445 3370933 3928374 3942544 4168046 4796393 4638995 3139271 1617709 898681
5712 898681 -449876 -3295428 -5263828 -3844223 -627669 997537 1151990 2476539 4643689
5703 4643689 4534276 2011133 556059 1076922 132348 -3536465 -5622255 -2826332 1256724
5694 1256724 1170497 -2320236 -3836213 -1472699 1257530 1153020 -862984 -2003480 -871233
5685 -871233 1920701 4348974 4208020 1409025 -1365290 -1817960 -917874 -923179 -1906322
5676 -1906322 -2537957 -2942818 -3899790 -4259494 -2393161 424761 1478672 1157551 2430142
5667 2430142 5562638 7066592 4856005 1135832 -1116129 -1569854 -1078856 273681 1861720
5658 1861720 1786343 -475657 -2650798 -2761570 -1842461 -1779782 -2272275 -2007096 -1269369 -1047315
5648 -1047315 -679088 1128879 3422071 3465466 359249 -3432745 -4701665 -2757544 338080
5639 338080 2352693 3187030 4214944 5503671 5113738 2304174 -68158 1194103 4706930
5630 4706930 5890540 3285310 137015 -961664 -1330902 -2552639 -3180895 -1619113 657315
5621 657315 1540058 1445150 1287221 -55558 -3020720 -4709389 -2912706 -642009 -2119460
$$ [...]
##END NTUPLES=NMR SPECTRUM
##END=
