##TITLE=31Pdec_PR151S_K1
 D2O, 24 sc
 29.03.2021
##JCAMPDX= 6.0         $$ Bruker NMR JCAMP-DX V2.0
##DATA TYPE= NMR SPECTRUM
##DATA CLASS= NTUPLES
##ORIGIN= UXNMR, Bruker Analytische Messtechnik GmbH
##OWNER= root
$$ XWIN-NMR		Version 3.5
$$ Mon Mar 29 13:27:27 2021 Russian Standard Time (UT+4h)  she@DPX200
##.OBSERVE FREQUENCY= 81.013821
##.OBSERVE NUCLEUS= ^31P
##.ACQUISITION MODE= SIMULTANEOUS
##.ACQUISITION SCHEME= undefined
##.AVERAGES= 24
##.DIGITISER RES= 16
##SPECTROMETER/DATA SYSTEM= spect
##.PULSE SEQUENCE= zgpg30
##.SOLVENT NAME= CDCl3
##.SHIFT REFERENCE= (INTERNAL, CDCl3, 0, 248.564)
##AUDIT TRAIL= $$ (NUMBER, WHEN, WHO, WHERE, WHAT)
$$ ##TITLE= Audit trail, XWIN-NMR		Version 3.5
$$ ##JCAMPDX= 5.01
$$ ##ORIGIN= Bruker BioSpin GmbH
$$ ##OWNER= she
$$ F:/spectra/data/she/nmr/P31/1/pdata/1/auditp.txt
$$ ##AUDIT TRAIL=  $$ (NUMBER, WHEN, WHO, WHERE, WHAT)
(   1,<2021-03-29 13:25:41.40 +0400>,<she>,<DPX200>,
      <created by zg, POWCHK disabled, PULCHK disabled
       configuration hash MD5:
       00 E9 B6 7A A2 85 ED C7 34 08 36 98 17 FE 4E 26
       data hash MD5: 32K
       C5 99 F3 C9 65 7F E6 75 7F 8D FE 87 69 AE 71 7E>)
(   2,<2021-03-29 13:25:45.15 +0400>,<she>,<DPX200>,
      <Start of raw data processing
       efp BC_mod = 2 LB = 1 FT_mod = 6 PKNL = 1 PHC0 = -4252.312 PHC1 = 480.6011 SI = 64K 
       data hash MD5: 64K
       74 6F 35 D9 D7 20 E9 96 09 08 F5 E8 C5 3F FD 2F>)
(   3,<2021-03-29 13:26:27.87 +0400>,<she>,<DPX200>,
      <pk PHC0 = -522.4216 PHC1 = 431.2001 
       data hash MD5: 64K
       CB 19 6D A2 23 61 93 95 0F 3C E6 2D DE 56 75 62>)
(   4,<2021-03-29 13:26:31.21 +0400>,<she>,<DPX200>,
      <abs ABSG = 5 
       data hash MD5: 64K
       BE D2 80 39 1B 72 68 76 99 37 CD 74 B6 06 86 44>)
$$ ##END=
$$ 
$$ hash MD5
$$ EA CB 54 F4 C9 3E 41 5F B5 C0 94 5F F6 71 1A A0
##$RELAX= 
##$RELAX= 
##$RELAX= 
##$RELAX= 
##$RELAX= 
##$RELAX= 
##$RELAX= 
##$RELAX= 
$$ Bruker specific parameters
$$ --------------------------
##$DU= <F:/spectra>
##$EXPNO= 1
##$NAME= <P31>
##$PROCNO= 1
##$TYPE= <nmr>
##$USER= <she>
##$AMP= (0..31)
100 100 100 100 100 100 100 100 100 100 100 100 100 100 100 100 100 100 
100 100 100 100 100 100 100 100 100 100 100 100 100 100 
##$AQSEQ= 0
##$AQ_mod= 1
##$AUNM= <au_zg>
##$AUTOPOS= <>
##$BF1= 81.014009
##$BF2= 200.13
##$BF3= 200.13
##$BF4= 200.13
##$BF5= 200.13
##$BF6= 200.13
##$BF7= 200.13
##$BF8= 200.13
##$BYTORDA= 1
##$CFDGTYP= 0
##$CFRGTYP= 5
##$CHEMSTR= <none>
##$CNST= (0..31)
1 1 145 1 1 1 1 1 1 1 1 1 1 1 1 1 1 1 1 1 1 1 1 1 1 1 1 1 1 1 1 1 
##$CPDPRG= <waltz16>
##$CPDPRG1= <>
##$CPDPRG2= <waltz16>
##$CPDPRG3= <>
##$CPDPRG4= <mlev>
##$CPDPRG5= <mlev>
##$CPDPRG6= <mlev>
##$CPDPRG7= <mlev>
##$CPDPRG8= <mlev>
##$CPDPRGB= <>
##$CPDPRGT= <>
##$D= (0..31)
0 1 0 0 0 0 0 0 0 0 0 0.03 2e-05 3e-06 0 0 0 0 0 0 0 0 0 0 0 0 0 0 0 0 
0 0 
##$DATE= 1617009940
##$DBL= (0..7)
120 120 120 11 120 120 24 19 
##$DBP= (0..7)
150 150 150 150 150 150 150 150 
##$DBP07= 0
##$DBPNAM0= <>
##$DBPNAM1= <>
##$DBPNAM2= <>
$$ [...]
##$SUBNAM3= <"">
##$SUBNAM4= <"">
##$SUBNAM5= <"">
##$SUBNAM6= <"">
##$SUBNAM7= <"">
##$SUBNAM8= <"">
##$SUBNAM9= <"">
##$SW= 501.771253377433
##$SWIBOX= (0..15)
0 1 3 0 0 0 0 0 0 0 0 0 0 0 0 0 
##$SW_h= 40650.406504065
##$TD= 32768
##$TD0= 1
##$TE= 0
##$TE2= 300
##$TE3= 300
##$TEG= 300
##$TL= (0..7)
0 120 53 12 22 120 120 120 
##$TP= (0..7)
150 150 150 150 150 150 150 150 
##$TP07= 0
##$TPNAME0= <>
##$TPNAME1= <>
##$TPNAME2= <>
##$TPNAME3= <>
##$TPNAME4= <>
##$TPNAME5= <>
##$TPNAME6= <>
##$TPNAME7= <>
##$TPOAL= (0..7)
0.5 0.5 0.5 0.5 0.5 0.5 0.5 0.5 
##$TPOFFS= (0..7)
0 0 0 0 0 0 0 0 
##$TUNHIN= 0
##$TUNHOUT= 0
##$TUNXOUT= 0
##$USERA1= <user>
##$USERA2= <user>
##$USERA3= <user>
##$USERA4= <user>
##$USERA5= <user>
##$V9= 5
##$VALIST= <valist>
##$VCLIST= <CCCCCCCCCCCCCCC>
##$VD= 0
##$VDLIST= <DDDDDDDDDDDDDDD>
##$VPLIST= <PPPPPPPPPPPPPPP>
##$VTLIST= <TTTTTTTTTTTTTTT>
##$WBST= 1024
##$WBSW= 4
##$XGAIN= (0..3)
0 0 0 0 
##$XL= 0
##$YL= 0
##$YMAX_a= 3760
##$YMIN_a= -6104
##$ZGOPTNS= <>
##$ZL1= 120
##$ZL2= 120
##$ZL3= 120
##$ZL4= 120
##$ABSF1= 248.5645
##$ABSF2= -253.2056
##$ABSG= 5
##$ABSL= 3
##$ALPHA= 0
##$AQORDER= 0
##$ASSFAC= 0
##$ASSFACI= 0
##$ASSFACX= 0
##$ASSWID= 0
##$AUNMP= <proc_1d>
##$AZFE= 0.1
##$AZFW= 0.5
##$BCFW= 0
##$BC_mod= 2
##$BYTORDP= 0
##$COROFFS= 0
##$CY= -3
##$DATMOD= 1
##$DC= 0
##$DFILT= <>
##$DTYPP= 0
##$F1P= 0
##$F2P= 0
##$FCOR= 1
##$FTSIZE= 65536
##$FT_mod= 6
##$GAMMA= 0
##$GB= 0
##$INTBC= 1
##$INTSCL= 5.30512e-09
##$ISEN= 30
##$LB= 1
##$LEV0= 0
##$LPBIN= 0
##$MAXI= 10000
##$MC2= 0
##$MEAN= 0
##$ME_mod= 0
##$MI= 50
##$NCOEF= 0
##$NC_proc= -6
##$NLEV= 6
##$NOISF1= 182.463
##$NOISF2= 159.3651
##$NSP= 0
##$NTH_PI= 0
##$NZP= 0
##$OFFSET= 248.5645
##$PC= 4
##$PHC0= -4774.733
##$PHC1= 911.8012
##$PH_mod= 1
##$PKNL= yes
##$PPARMOD= 0
##$PSCAL= 0
##$PSIGN= 0
##$REVERSE= no
##$SF= 81.014009
##$SI= 65536
##$SIGF1= 159.3651
##$SIGF2= -187.1042
##$SINO= 113.3802
##$SIOLD= 16384
##$SREGLST= <1H.CDCl3>
##$SSB= 0
##$STSI= 65536
##$STSR= 0
##$SW_p= 40650.406504065
##$SYMM= 0
##$S_DEV= 0
##$TDeff= 32768
##$TDoff= 0
##$TI= <>
##$TILT= no
##$TM1= 0
##$TM2= 0
##$TOPLEV= 0
##$USERP1= <user>
##$USERP2= <user>
##$USERP3= <user>
##$USERP4= <user>
##$USERP5= <user>
##$WDW= 1
##$XDIM= 65536
##$YMAX_p= 498488689
##$YMIN_p= -18016573
$$ End of Bruker specific parameters
$$ ---------------------------------
##NTUPLES= NMR SPECTRUM
##VAR_NAME=  FREQUENCY,     SPECTRUM/REAL,   SPECTRUM/IMAG
##SYMBOL=    X,             R,               I
##VAR_TYPE=  INDEPENDENT,   DEPENDENT,       DEPENDENT
##VAR_FORM=  AFFN,          ASDF,            ASDF
##VAR_DIM=   65536,         65536,           65536
##UNITS=     HZ,            ARBITRARY UNITS, ARBITRARY UNITS
##FACTOR=    0.620285442955139, 1,           1
##FIRST=     20137.2065510759, 0,            0
##LAST=      -20513.1999529892, 0,           0
##MIN=       -20513.1999529892, -18016573,   0
##MAX=       20137.2065510759, 498488689,    0
$$ Real data points
##PAGE= N=1
##DATA TABLE= (X++(R..R)), XYDATA
$$ [...]
13109C647434o14729j534975p48653j82582p16184j035236j15975J073934J159282
13100I32316K70300n09375o54806l90077j02754k00856q85490j536188j065572
13091d142502N26839J742744J448981L90908q932L98432Q21170J115952J611112
13082C904704J709831L59587j883122k843119j470834N97124J076724k18234j542201
13073c09540j525909m38828N69344P75323M36951L43793P92216J128390O49073
13064B420813l51041j111127j574630j946845j533231K96271K151738J867080
13056B19028Q4340m196K405532L825981J515216k124782k987465j112206J99463
13047B020911k63837p64647m05849j36222j16093M60622Q56827m05950k039367
$$ plain form
13109 3647434 3032705 1497730 749077 566495 -149689 -1184925 -1300900 -226966 932316
13100 932316 1202616 693241 38435 -351642 -454396 -655252 -1540742 -3076930 -4142502
13091 -4142502 -3615663 -1872919 -423938 -33030 -41962 356470 1177640 2293592 3904704
13082 3904704 5614535 5974122 4091000 1247881 -222953 374171 1450895 1232661 -309540
13073 -309540 -1835449 -2274277 -1704933 -929610 -492659 -148866 643350 1771740 2420813
13064 2420813 2069772 958645 -615985 -2562830 -4096061 -3799790 -1648052 219028
13056 219028 303368 299172 2704704 6530685 8045901 5921119 2933654 1821448 2020911
13047 2020911 1757074 992427 586578 450356 334263 794885 1651712 1245762 -793605
13038g93605j061647K013331L085311P79210j262028l09588J254507M01240j496662
13029B610069j535469l53307m97273j676617j467730L75678J724064J517196N72509
13020A269120m07737j155367r39396L22028R89369L0158p59701N95972K603163
13011B547609K228384l83814k157016j605332k73857J72775j93118n82709m33230
13002f80308L76954Q99049j61336j796731r96807K348482L850041R90606k209091
12993B620859j210433J554140Q67488k177701k154334J038721K109972q9649q52659
12984A706404J324768J853846j221287l121577o85876J975861P53725j542329
12976A043535p18059J493490J228709o34765j038755o48319j599842k346300l87433
$$ plain form
13038 -793605 -1855252 158079 3243390 4022600 2760572 2450984 3705491 4106731 2610069
13029 2610069 1074600 721293 224020 -1452597 -2920327 -2544649 -820585 696611 1269120
13020 1269120 861383 -293984 -1233380 -911352 78017 108175 -651526 -55554 2547609
13011 2547609 4775993 4392179 2235163 629831 355974 528749 335631 -247078 -680308
13002 -680308 -303354 595695 434359 -1362372 -2359179 -10697 3839344 4829950 2620859
12993 2620859 1410426 2964566 3832054 1654353 -499981 538740 2648712 2559063 1706404
12984 1706404 3031172 4885018 3663731 542154 -143722 1832139 2585864 1043535
12976 1043535 325476 1818966 3047675 2412910 1374155 725836 -874006 -3220306 -3607739
12967c607739K240801J743634r75381j881309m01580N21542j40525o72820l61979
12958c535356N9643P47017J797288J424916j121920k696196n44761K534522K130300
12949G95453n54614q39725J440637J993381l85086k204673j538663m38040l12597
12940b043927J66004J503798K042335J161139J33989o53048j803323k408708j279960
12931c181701j19687j172236k500398o00245K959275L221217m5884k040589r90552
12922d470800m7774l81503P09319L227447L087193k73368j768541P58713K555630
12913C396316L21479j971287k62363K473086J582171j681616l256602k793977
12905b192793k051906o52282J704559K545057Q33997k7624J883158K509456j335634
$$ plain form
12967 -3607739 -1366938 376696 -598685 -2479994 -2881574 -2360032 -2500557 -3173377 -3535356
12958 -3535356 -3475713 -2728696 -931408 493508 -628412 -3324608 -3869369 -1334847 795453
12949 795453 240839 -598886 841751 2835132 2450046 245373 -1293290 -1731330 -2043927
12940 -2043927 -1877923 -374125 1668210 2829349 2963338 2310290 506967 -1901741 -3181701
12931 -3181701 -3301388 -4473624 -6974022 -7574267 -4614992 -1393775 -1439659 -3480248 -4470800
12922 -4470800 -4518574 -4900077 -4190758 -963311 2123882 1850514 81973 840686 3396316
12913 3396316 3717795 1746508 1484145 3957231 5539402 3857786 601184 -2192793
12905 -2192793 -4244699 -4896981 -3192422 -647365 186632 159008 2042166 4551622 3215988
12896C215988n125055l173245J800033K944964J88439q62436J008990J649364
12888A647042m5112m63491J475790K361082O99571p66505m26889o6877n72889
12879C841722m34788L70980j00824j363830n85096J826013J868981j263196l199932
12870I60030j338502J082004N58024j362743j499662j80870L90103J69294M50591
12861g71731R66368N99413l96713j034601j251723j358103j070250k84635M87877
12852d114098J232856K391781L188537K050328n95675k198609j704867j013323
12844g63070j609477k018863l25435K470112L460943J404184j902146l384719
12836b668471j524834J939026L387276J343394j578613k084491m06315R13590
$$ plain form
12896 3215988 -1909067 -5082312 -3282279 -337315 -148876 -1011312 -2322 1647042
12888 1647042 1601930 1138439 2614229 4975311 5674882 4908377 4481488 4414611 3841722
12879 3841722 3406934 3777914 3677090 2313260 1728164 3554177 5423158 4159962 960030
12870 960030 -378472 703532 1261556 -101187 -1600849 -1781719 -1391616 -1222322 -771731
12861 -771731 194637 794050 397337 -637264 -1888987 -3247090 -4317340 -4601975 -4114098
12852 -4114098 -2881242 -489461 2699076 4749404 4153729 1955120 250253 -763070
12844 -763070 -2372547 -4391410 -4716845 -2246733 1214210 2618394 716248 -2668471
12836 -2668471 -4193305 -2254279 1132997 2476391 897778 -1186713 -1593028 -679438
12828f79438J125173J320226J385132K68791j207783j253548m96214r35294j880004
12819b352959q65573J593371K470693J401575P02040K32795k205742m825865k729051
12810f578716L335968N920899J809053k638140j488899J750422R47728k388431
12802F69884k770977n24954j14596j301607J2658L265970L409636j96433k349966
12793I9615o58049J028364k11795j799252r64359N74536M34056k28453L31012
12784a394325Q66777q6846q63655M85293K413040K303994P03603j04225Q012j88589
12774D143079j97659Q74397J190313j460846m694231l537737J833889M916411
12766C067616J573233l928351m807528q67007K307196J658374k62793m23192P05877
$$ plain form
12828 -679438 445735 1765961 3151093 3419884 2212101 958553 462339 -472955 -2352959
12819 -2352959 -3218532 -1625161 845532 2247107 2949147 3181942 976200 -3849665 -6578716
12810 -6578716 -3242748 2678151 4487204 1849064 360165 2110587 3058315 669884
12802 669884 -2101093 -2626047 -2740643 -4042250 -4029592 -763622 2646014 2449581 99615
12793 99615 -558434 469930 258135 -1541117 -2505476 -1930940 -1496884 -1725337 -1394325
12784 -1394325 -527548 -614394 -1478049 -992756 1420284 3724278 4427881 4323656 4331668 4143079
12774 4143079 3945420 4819817 6010130 4549284 -144947 -3682684 -1848795 3067616
12766 3067616 4640849 712498 -4095030 -4962037 -2654841 -996467 -1259260 -1682452 -976575
12757i76575J431245J623015J458431K53553j418097j070529J750746L288841
12749F340630N14858l623979l697290M37166L398692J826032j702622l065916
12741D27571j502379J079390K718051J986287j283779m388472l559153Q61002
12733c661482L652338J321887k885072l302116N81021L948675L259688N6001j966700
12724A004240j371794L34176J136491O99571K19760L91144K11986j317851k939671
12715a631948k380557J42721J782973R70250o73856j181785q01762n08662j26286
12706d408912M70769K30039j177225j986803p56796J262655J975990J325054N70537
12697b494692M6996m79544m23543O78814J741894J406949J0010j095539j265956
$$ plain form
12757 -976575 454670 2077685 3536116 3789669 2371572 1301043 3051789 6340630
12749 6340630 6855488 3231509 -465781 -28615 3370077 5196109 3493487 427571
12741 427571 -1074808 4582 2722633 4708920 3425141 -963331 -4522484 -3661482
12733 -3661482 -9144 1312743 -1572329 -4874445 -4293424 -344749 2914939 2970940 1004240
12724 1004240 -367554 -33378 1103113 1802684 2022444 2413588 2625574 1307723 -1631948
12715 -1631948 -4012505 -3869784 -2086811 -1116561 -1790417 -2972202 -3773964 -4282626 -4408912
12706 -4408912 -3938143 -3708104 -4885329 -6872132 -7628928 -6366273 -4390283 -3065229 -2494692
12697 -2494692 -2447696 -2927240 -3350783 -2671969 -930075 476874 486884 -608655 -1874611
12688a874611n07580R94669K142604J366013q74347j901496o42285N57901j94074
12679i33206j150727j77735J241688O13016q75675j49183K385727L247598J309420
12670E510923q90056j422222j174584j231214j043780j56928N61023L93877j06120
12661D40919q7245O15624J507248J588796J31694j795626j907634o0522Q99157
12652A332411n19688j681800j63194J712059N85260j851063j431183J101118R60744
12643D4664k452551m051763j128963K449192K466946K26951p05601J03780R55516
12634b091829J419877J602971M37559k169209l436909j123061K539063L361535
12626E39997Q45096j531176j346579P7404M12529m04676p53354m2429N72493K57963
$$ plain form
12688 -1874611 -2382191 -1387522 755082 2121095 1246748 -654748 -1297033 -739132 -933206
12679 -933206 -2083933 -2261668 -1019980 -406964 -1282639 -1431822 953905 4201503 5510923
12670 5510923 4620867 3198645 2024061 792847 -250933 -407861 153162 547039 440919
12661 440919 353674 969298 2476546 4065342 4197036 2401410 493776 433254 1332411
12652 1332411 812723 -869077 -1032271 679788 1265048 -586015 -2017198 -916080 44664
12643 44664 -2407887 -6459650 -7588613 -5139421 -2672475 -2445524 -3151125 -3047345 -2091829
12634 -2091829 -671952 931019 1368578 -800631 -4237540 -5360601 -2821538 539997
12626 539997 1385093 -146083 -1492662 -1415258 -1002729 -1407405 -2160759 -2203188 -1630695 -1372732
12616a372732Q1815J285593K502563R22880l073478n054988k329334J772599K448748
12607b816334L03716l49955J157948J139206j634034l387307j205317K668921
12599d123156M443495L401067J041309j358950k517935j377500P15440Q68748
12591A092518r01420j328671N57296J517338j46951j327414K34866J378626j024010
12582E2178l767351j885881K956967M494066J164631k193682j931739J81627J106177
12573A76993O46303J05691m696K58056N52451l4945j508036j751262N05752K405315
12563A351622L06834m019052m850715o13095L857509M302042K025734J34199j036034
12554A459044k117743j984623m3321J520661R61932K9621O48386J045332r68540
$$ plain form
12616 -1372732 -1290917 -5324 2497239 3420119 346641 -4708347 -7037681 -5265082 -2816334
12607 -2816334 -2512618 -2862573 -1704625 -565419 -2199453 -5586760 -6792077 -4123156
12599 -4123156 320339 3721406 4762715 3403765 885830 -491670 223770 1092518
12591 1092518 191098 -1137573 -580277 937061 790110 -537304 -302438 1076188 52178
12582 52178 -3715173 -5601054 -2644087 1849979 3014610 820928 -1110811 -929184 176993
12573 176993 823296 928987 924291 1182347 1734798 1699853 191817 -1559445 -1053693 1351622
12563 1351622 1658456 -2360596 -7211311 -7824406 -3966897 335145 2360879 2495078 1459044
12554 1459044 -658699 -2643322 -2686643 -1165982 -204050 -174429 473957 1519289 550749
12545E50749k973967r64819L544986M555040K71030l944732l074472R77625K879287
12536A820727J085630j474857k242127j499114n07062L48527J195771J864287
12528E91782J845185O77278j299513k480422j449358O75075J028617r15807k102959
12519c430122m26228J711720J094886r62527p65461J342491J330732j520648k882217
12510d507374l11699K647061K197360K08301N00231K191707J479630j523574k657478
12501B24165l21746K116854J447069j203057k596518j425706J000828K413727
12493A655616J299616j584427l294913j826452J139267K410660J578304P35416
12485B113087N56167j98342j351327j008844P91061J549311M45535l47394K26492
$$ plain form
12545 550749 -2423218 -3388037 156949 4711989 4983019 1038287 -2036185 -1058560 1820727
12536 1820727 2906357 1431500 -810627 -2309741 -2816803 -2468276 -1272505 591782
12528 591782 2436967 3114245 1814732 -665690 -2115048 -1439973 -411356 -1327163 -3430122
12519 -3430122 -3856350 -2144630 -1049744 -2012271 -2777732 -1435241 -104509 -1625157 -4507374
12510 -4507374 -4819073 -2172012 25348 233649 733880 2925587 4405217 2881643 224165
12501 224165 -97581 2019273 3466342 2263285 -333233 -1758939 -758111 1655616
12493 1655616 2955232 1370805 -1924108 -3750560 -2611293 -200633 1377671 2113087
12485 2113087 2669254 2470912 1119585 110741 901802 2451113 2896648 2549254 2775746
12476B775746J92690j420056k144080k46356J781011J031890j055900j184856
12468b69911N31339J363955O10938j59592n29805j295733j713332l64447J371960
12459d54628N23091k289865k688268J003223M559591L496667o09753k411645q3681
12450A044732K718394K150363j121396l457636k840414n20144J231726J536479
12442G42104R07770K5083o88912q51520l94937R0769m554m46480n35356r2895
12432a248928N94255J358840J809886J108903n64419j117869Q34975L004456J859788
12423G639887j836474l253196m00649K630498J657864j447703k054596k1840O55162
12414C568953j285121k340315q987L092465K930511m13882l164595k738770l48751
$$ plain form
12476 2775746 2968436 1548380 -595700 -842056 938955 1970845 914945 -269911
12468 -269911 261428 1625383 2236321 2076729 1546924 251191 -1462141 -1826588 -454628
12459 -454628 68463 -2221402 -4909670 -3906447 653144 4149811 3540058 1128413 1044732
12450 1044732 3763126 5913489 4792093 1334457 -1505957 -2026101 -794375 742104
12442 742104 1649874 1674957 986045 134525 -260412 -169643 -174197 -620677 -1156033 -1248928
12432 -1248928 -654673 704167 2514053 3622956 3058537 1940668 2775643 5780099 7639887
12423 7639887 5803413 2550217 2149568 4780066 6437930 4990227 2935631 2913791 3568953
12414 3568953 2283832 -56483 -65470 3026995 5957506 5543624 2379029 -359741 -708492
12405g08492J055076K11587j376721j469201R6110J187767L68784q68357j97614
12396a701061J847322K334558K71435j766415j432482l0476j92743j509190j147931
12387c326983J384872K963767J416549r83492p51527J522742J978387o08182k715605
12378H80528j073163K593588L878945J407214j976456l121700j669521N70215
12370A489650J566303L86596j928514k891711j363959N75612L31166j135342m72592
12361c442791K692615M538919K411338j249416k375075p73720K91256r32997k598010
12352a437881k192195K29049K376676K414904P34463p74341r06561k42446R5126
12343B96794Q4693L75726P99477O09532l0305j92985K21887L93009O112n86532
$$ plain form
12405 -708492 346584 558171 -818550 -2287751 -2191641 -1003874 -635090 -1503447 -1701061
12396 -1701061 146261 2480819 2752254 985839 -446643 -477119 -669862 -2179052 -3326983
12387 -3326983 -1942111 1021656 2438205 1454713 703186 2225928 4204315 3596133 880528
12378 880528 -192635 2400953 6279898 7687112 5710656 2588956 919435 1489650
12370 1489650 3055953 3442549 1514035 -1377676 -2741635 -2166023 -1834857 -2970199 -3442791
12361 -3442791 -750176 3788743 6200081 4950665 2575590 1801870 2093126 1160129 -1437881
12352 -1437881 -3630076 -3401027 -1024351 1390553 2125016 1350675 444114 201668 296794
12343 296794 381487 757213 1556690 2166222 2135917 1942932 2164819 2557828 2563940 1977408
12333A977408j380390k257989j895397O83532L532930L317552j08015l138581
12325G31050l173433j469728l06093J36812O42420R91900Q28083P14731Q81108
12316b3150N34709m27987q36633m00364l46869q46137k86122J489120J995347
12307H51914J20359j441923l00195J621167J245004n59663n69850J395504K295312
12298D657629P02057j359623j656630l96381P90902P93464l45336j553966j515419
12289A16697j38800J125742J036050r1350j205584j632301j051266K27864P87502
12280h25446l14892j537820q42941N47882j63728j898644o28189L249738M074076
12271A660036m4232l212049q30724K882937J907943j920822k890089j155243r76861
$$ plain form
12333 1977408 597018 -1660971 -3556368 -2872836 660094 3977646 3869631 731050
12325 731050 -2442383 -3912111 -4218204 -4081392 -3438972 -2447072 -1618989 -904258 -23150
12316 -23150 511559 83572 -753061 -1153425 -1500294 -2346431 -2632553 -1143433 851914
12307 851914 972273 -469650 -769845 851322 2096326 1536663 966813 2362317 4657629
12298 4657629 5359686 4000063 2343433 1947052 2737954 3531418 3186082 1632116 116697
12289 116697 -22103 1103639 2139689 2048339 842755 -789546 -1840812 -1612948 -825446
12280 -825446 -1140338 -2678158 -3521099 -2973217 -3136945 -5035589 -5663778 -2414040 1660036
12271 1660036 1615804 -1596245 -2426969 455968 2363911 443089 -2447000 -3602243 -4579104
12262d579104j902860J12883M001144M271069N93653j224470R56110K374779P0540
12253D673744k281642j346812L61393k34876j362491m93565O12313n75513k315542
12244b962991j494111J062596K262250J656420R37258L15205r46398j762101n70825
12235a502697J398571J523906M382m21543J042348J977301O28937j349894j357055
12226A944256M49686J494938L71911j384188j569534l03911M35987j77974r40151
12217C21020r14610o95145n72880M23508K157635K186892p89073m000595l858195
12208e741443r18522J248843J246022Q46759J253533J425133L82150j238814k277495
12199c773834k033711l67241J793874K822511K528468K429809K630356J059247
$$ plain form
12262 -4579104 -6481964 -6369081 -2367937 1903132 2496785 1272315 2228425 4603204 4673744
12253 4673744 2392102 1045290 1406683 1171807 -190684 -684249 -71936 -647449 -2962991
12244 -2962991 -4457102 -3394506 -1132256 524164 1461422 1776627 830229 -931872 -1502697
12235 -1502697 -104126 1419780 1424162 1002619 2044967 4022268 4651205 3301311 1944256
12226 1944256 2393942 3888880 4260791 2876603 1307069 1003158 1439145 1261171 321020
12217 321020 -593590 -1288735 -1861615 -1438107 719528 2906420 2117347 -1883248 -5741443
12208 -5741443 -6659965 -5411122 -4165100 -3318341 -2064808 -639675 -257525 -1496339 -3773834
12199 -3773834 -5807545 -6174786 -4380912 -1558401 970067 3399876 6030232 7089479
12191G089479k147083l023391J14950K701968P23448k220575p63562K577961J327935
12182F381130l366066l960769Q27771L794402J263113j612194o59692N94016j480255
12173A781456l644385j903836J318227J764152K97742j17320j39981j431650k136351
12164d211946l31083J371844J1166j943829m55938K975883L665091J324413k13296
12155B192305L05457M11466r49143j854897j180844j32117K67599K46329j16018
12146h09863q31807r17334L45698J668531J409195J52084m11184k08356l65851
12137C1113j023682j447559j402019r04514K64507J615683J980249J438321J339138
12128A891237J645137P47948j242599k061205j150433m93998m90069Q29055K938639
$$ plain form
12191 7089479 4942396 1919005 2033955 4735923 5459371 3238796 2475234 5053195 6381130
12182 6381130 3015064 -945705 -117934 3676468 4939581 3327387 2667695 3261711 1781456
12173 1781456 -1862929 -3766765 -2448538 -684386 -386644 -503964 -643945 -2075595 -4211946
12164 -4211946 -4543029 -3171185 -3160019 -5103848 -5559786 -2583903 1081188 2405601 2192305
12155 2192305 2497762 2909228 1960085 105188 -1075656 -1207773 -940174 -693845 -809863
12146 -809863 -1641670 -2559004 -2213306 -544775 864420 1016504 605320 396964 31113
12137 31113 -992569 -2440128 -3842147 -4746661 -4482154 -2866471 -886222 552099 1891237
12128 1891237 3536374 4284322 3041723 980518 -169915 -663913 -1153982 -324927 2613712
12119B613712K119820j938374m039096j367935J655572N79634k046073j843812
12111d266552j56263n88731j891034n58206K408551L396075K362277J510443M69021
12102B685581j517888j608211K111466N077579K256882k915258l324075K08872
12094B974948O59525k932359m108126m33032K630881J294172j068785p98553N32942
12085a248387N54318J84536L66071j75553j433750j199951L59384J69064j883014
12076d307282j852489J363851L461581J646499j072250j385262n78904q33868
12068c558124j153966j95967Q38360J016245J548115K434554J422865j340839
12060A011243k236267l11618N35527j454333k210230Q97706L586504J618931j644205
$$ plain form
12119 2613712 4733532 2795158 -1243938 -2611873 -956301 -376667 -2422740 -4266552
12111 -4266552 -4422815 -5011546 -6902580 -7460786 -5052235 -1656160 706117 2216560 2685581
12102 2685581 1167693 -440518 1670948 6748527 9005409 6090151 2766076 2974948
12094 2974948 3634473 702114 -3406012 -3839044 -1208163 86009 -982776 -1781329 -1248387
12085 -1248387 -694069 -509533 -143462 -319015 -1752765 -2952716 -2593332 -2424268 -4307282
12076 -4307282 -6159771 -4795920 -1334339 312160 -760090 -2145352 -2724256 -3558124
12068 -3558124 -4712090 -4908057 -4069697 -3053452 -1505337 929217 2352082 1011243
12060 1011243 -1225024 -1536642 -1001115 -2455448 -4665678 -3767972 -181468 1437463 -206742
12051b06742p66201K569076K641900o30483k106057l14616P93265q43641k314221
12042a177720j188342P70236J111693L14108L6855K92148M8853q44963j498361
12033b135493j027390M90550J654855R16674j236099k353131j193281N69230R81239
12024c332846N07723N26575Q14238N27291K49709Q37106J324274K58945j611030
12015A01985k105555o48295J226603K066174J758256R39943K80163K7236l15543
12006C330967j160987j548465k32741J589036Q72248k834193n712201m128915
11998i825251Q15681M720694M586003J044285k636739l032154K28475L307444
11990g91562K414220q04110j458563Q48406J275855j871359l654762o72368K718916
$$ plain form
12051 -206742 -972943 1596133 4238033 3607550 1501493 1186877 1980142 1136501 -1177720
12042 -1177720 -2366062 -1595826 -484133 -170025 -133170 158978 207831 -637132 -2135493
12033 -2135493 -3162883 -2672333 -1017478 -100804 -1336903 -3690034 -4883315 -4314085 -3332846
12024 -3332846 -2825123 -2298548 -1484310 -957019 -707310 129796 1454070 1713015 101985
12015 101985 -2003570 -2651865 -1425262 640912 2399168 3339111 3619274 3646510 3330967
12006 3330967 2169980 621515 388774 1977810 2850058 15865 -5696336 -9825251
11998 -9825251 -9009570 -4288876 297127 1341412 -1295327 -4327481 -4099006 -791562
11990 -791562 1622658 818548 -640015 208391 1484246 -387113 -4041875 -4714243 -1995327
11981a995327J311802k292475k041849J690049L237100R31528j305677j089128
11973a553977j75111J88185R00566J466501L2063k289165k115504L14695R84952
11964b246795j007835j618514J194230L714037K396483p67816j930170q46130
11956a112510M42216J250110J488100J28713k367767k732680N59964L728213K462597
11947C846956j480295k581921M39384L134308K039426q75795j754545j28981J181285
11938C819822J02764k361036l610353k444739k44591R15919Q79615J165564K239123
11929D62088K653480J514108L9141n15286p83307j500693j435169N67353K618295
11920C620010J698151j743375l851366k440288L84184J461397L88484r55094j069091
$$ plain form
11981 -1995327 -683525 -2976000 -5017849 -3327800 -90700 840828 -464849 -1553977
11973 -1553977 -1729088 -1540903 -640337 826164 858227 -1430938 -3546442 -3231747 -2246795
11964 -2246795 -3254630 -4873144 -3678914 35123 2431606 1663790 -266380 -1112510
11956 -1112510 -670294 579816 2067916 2196629 -171138 -2903818 -2343854 1384359 3846956
11947 3846956 2366661 -215260 224124 3358432 5397858 4522063 2767518 2638537 3819822
11938 3819822 3922586 1561550 -2048803 -4493542 -4738133 -3822214 -2942599 -1777035 462088
11929 462088 3115568 4629676 4668817 4153531 3370224 1869531 434362 1001715 3620010
11920 3620010 5318161 3574786 -276580 -2716868 -2332684 -871287 -482803 -1437897 -2506988
11911b506988R1986J490063J634332N8526j318139n9635K805381L063017p15828
11902D542715m005938k135863K625560L921988N57271j993530k93504J893487
11894E112186J41002l178902k716354J080696K577132k36943l049244k363244
11886b633671l18104q0309p23368n9800P72940l15079j656741q6456L130959L377227
11876A407598j03937k608214r69270J850209J581266j066123k117080m13724J401258
11867a038017J278368J05046m98341l16406R9819M32001L62375k79817p43245
11858e98217q8876R84043O51049j132730k044413p92452O83988J56733j217794
11849c398669n97337J871633K880584Q33541j663019j454194Q71542K046392M65663
$$ plain form
11911 -2506988 -2415002 -924939 709393 767919 -550220 -609855 2195526 5258543 4542715
11902 4542715 536777 -1599086 1026474 4948462 5505733 3512203 3218699 5112186
11894 5112186 5253188 2074286 -642068 438628 3015760 2778817 -270427 -2633671
11886 -2633671 -2951775 -3032084 -3755452 -3815252 -3042312 -3357391 -5014132 -5100588 -1969629 1407598
11876 1407598 1303661 -1304553 -2273823 -423614 1157652 91529 -2025551 -2439275 -1038017
11867 -1038017 240351 345397 -152944 -469350 -369531 62470 424845 145028 -598217
11858 -598217 -687093 296950 947999 -184731 -2229144 -3021596 -2337608 -2180875 -3398669
11849 -3398669 -3996006 -2124373 756211 1589752 -73267 -1527461 -655919 1390473 1856136
11840A856136k170923l211913j816269O08602J987398J577008N89624N04401R56387
11831H80451M06487j057467j381078J91557J444302L93589j483467j445950K62857
11822a788719J022669J35999l84855M65794J036489N2885j145445r04873P8088
11813a431968J48905n62027o47573O8686L27727m49737j350323j454022r63122
11804f313454m37086J90066J121595J744018J137679l44369r58078K41823J770631
11795a847175J457123m94005j698197r33962M83951J187259J575406K015737J324718
11786C070855j026278k889222k029171M14952J552000R52361N69420R89774O72526
11777B277217r25879k104234j429079M32631J846376J709046q3275k161210k239668
$$ plain form
11840 1856136 -314787 -3526700 -5342969 -4734367 -2746969 -1169961 -580337 -75936 880451
11831 880451 1286938 229471 -1151607 -960050 484252 877841 -605626 -2051576 -1788719
11822 -1788719 -766050 -630051 -1014906 -549112 487377 540262 -605183 -1510056 -1431968
11813 -1431968 -1283063 -1845090 -2492663 -2423977 -2096250 -2545987 -3896310 -5350332 -6313454
11804 -6313454 -6750540 -6560474 -5438879 -3694861 -2557182 -2901551 -3859629 -3617806 -1847175
11795 -1847175 -390052 -884057 -2582254 -3516216 -3032265 -1845006 -269600 1746137 3070855
11786 3070855 2044577 -844645 -2873816 -2458864 -906864 45497 614917 1604691 2277217
11777 2277217 1351338 -752896 -2181975 -1749344 97032 1806078 1722803 -438407 -2678075
11768b678075O9518J939727J071511n11783M69871K807144K239055j573129l997682
11759a63843k212606J110795K343485J435136K14153o11601j011275r32629j326702
11750a155087l108884m362485k052200K599592M522562J974533r79329r55320
11742c516618L27581M80631O30477K036257K810372J517635J93025L86711J54345
11733E020416j599042k165597k97240L31331k432349m212420j162979K735772
11725c782108K119696l74491J014613M424280L366580j613425l587234r70822
11717E97089N65937j415496k506021q1413K466533K513782K003306K013607M49783
11708F607107k253921k011129J377493K372844j205964l991642k000888Q64854
$$ plain form
11768 -2678075 -2608557 -668830 402681 -109102 360769 3167913 5406968 3833839 -163843
11759 -163843 -2376449 -1265654 1077831 2512967 2727120 2115519 1104244 171615 -1155087
11750 -1155087 -4263971 -8626456 -10678656 -8079064 -3556502 -1581969 -2561298 -3516618
11742 -3516618 -3189037 -2708406 -2077929 -41672 2768700 4286335 4479360 4866071 5020416
11733 5020416 3421374 1255777 958537 1289868 -1142481 -5354901 -6517880 -3782108
11725 -3782108 -1662412 -2036903 -1022290 3401990 6768570 5155145 1567911 597089
11717 597089 1163026 -252470 -2758491 -2839904 -373371 2140411 4143717 6157324 6607107
11708 6607107 4353186 2342057 3719550 6092394 4886430 894788 -1106100 -241246
11700b41246R6332j836829q81443R81496j48952k586396k134715M64860J339456
11691d947437L39280K95172J338414J415740R11534J593170K271858N11994k352771
11682A376954k683835k98476J609989J627359J046196L61102j024281k117516
11674a02508j319996L22133M81921m67618m47636K41969k24582j098720j33188
11665b748225J732239J311491j182823j989900J51312K141966J699074L99026
11657A514160K29694O31108M64151m7618o84965j903392l016364k200736O24819
11648d389143L108189L419381J955792q3165j612711j314395R62084K611210J037286
11639E694528k189897l220441j665484n32230n20641Q23441L451357L534562n1991
$$ plain form
11700 -241246 -144914 -1981743 -2863186 -1881690 -2030642 -4617038 -6751753 -6286893 -4947437
11691 -4947437 -4608157 -4312985 -2974571 -1558831 -647297 945873 3217731 3729725 1376954
11682 1376954 -1306881 -1605357 4632 1631991 2678187 3039289 2015008 -102508
11674 -102508 -1422504 -1100371 -618450 -1086068 -1533704 -1291735 -1516317 -2615037 -2748225
11665 -2748225 -1015986 295505 -887318 -2877218 -2725906 -583940 1115134 1514160
11657 1514160 1743854 2374962 2839113 2791495 2106530 203138 -2813226 -5013962 -4389143
11648 -4389143 -1280954 2138427 4094219 4011054 2398343 1083948 2046032 4657242 5694528
11639 5694528 3504631 284190 -1381294 -1913524 -2434165 -1610724 1840633 5375195 5323204
11630E323204k814233j275449J575713J108402j958678l341506j670848O22815
11622b430580J467004R30074j82055r29589l35345J176228J641825M33157m93511
11613A277208J32170O09117o59633k133129j700631j51269O09367P60718J155743
11604a00339P92291j117757k446734r78465J674243K515353J957118K301262K862438
11595G459410J068532k306258l643312k209593r50707j156724p58743J064412
11587a432983J865355K60162j365545o23612J280150J844356Q75898j81241p01698
11578A820842r26153r30798q19524q03911m82505O01457J559532J170156K37623
11569A426719N31383J372974L23082k294736l039377o68425J666884J290556k01836
$$ plain form
11630 5323204 2508971 1233522 2809235 3917637 1958959 -1382547 -3053395 -2430580
11622 -2430580 -963576 -33502 -215557 -1145146 -1480491 -304263 1337562 1770719 1277208
11613 1277208 1409378 2018495 1358862 -774267 -2474898 -2626167 -2016800 -1256082 -100339
11604 -100339 691952 -425805 -2872539 -3851004 -2176761 338592 2295710 4596972 7459410
11595 7459410 8527942 6221684 2578372 368779 -581928 -1738652 -2497395 -1432983
11587 -1432983 432372 692534 -673011 -1296623 -16473 1827883 2703781 2522540 1820842
11578 1820842 894689 -36109 -855633 -1659544 -2142049 -1540592 18940 1189096 1426719
11569 1426719 1958102 3331076 3654158 1359422 -1679955 -2348380 -681496 609060 407224
11560D07224k26133O71844N78942l53766r02033j173047j554920j142358M83144
11551c211103J787168J737860J574183J952294J005918j946618l607928j289451
11543a997677K166704K317400k5399o50357P90956P72622j326400k109376n58427
11534f19954n9053k138022l063520L46502N223973O339745K921833j242786k942607
11525D766111k188115p65758k69422j040386j820140j115466N65312J163074J86449
11516e18341n36892M2336O02141J31321j65713O75326J280958M14904m78259L12508
11506A760289J542259J039508l87324k70467J051438P52809j608532k918033j171904
11497b09957J537337K237668J043476M6842r3869l13042q21535q29006m22184
$$ plain form
11560 407224 181091 852935 1431877 1078111 176078 -996969 -2551889 -3694247 -3211103
11551 -3211103 -1423935 313925 1888108 3840402 4846320 2899702 -708226 -1997677
11543 -1997677 169027 2486427 2461028 1810671 2601627 3374249 2047849 -61527 -619954
11534 -619954 -679007 -2817029 -5880549 -5534047 -310074 6029671 8951504 7708718 4766111
11525 4766111 2577996 1812238 1542816 502430 -1317710 -2433176 -1867864 -704790 -518341
11516 -518341 -1055233 -1012897 -410756 -279435 -445148 230178 1511136 1926040 1447781 1760289
11506 1760289 3302548 4342056 3954732 3684265 4735703 5488512 3879980 961947 -209957
11497 -209957 1327380 3565048 4608524 4655366 4561497 4248455 3426920 2597914 2175730
11488B175730p96484k188487l069382k172040k79801R27904J119281J346106K124266
11479h12907K531039J415544j111209l568606m169497k212833J025942L075284
11471c827243K656585R49638l33955j330832k849610l579932j270859K980311
11463f605897M759116K149915j265887j375951R71700K125664J122329k07650
11455A673339r76713j541136j224037N85896J918902O54007j266401l66169K085023
11446A542711J421104k400761l799385l17262L221852K296120o44402j102890
11438B17087K07086p9593j435793q46716J268331J832464P00103M77955J326787
11429C667711Q24172r67403j093636Q97469J641057n52778k833756k302832l4691
$$ plain form
11488 2175730 1379246 -809241 -3878623 -6050663 -6330464 -5402560 -4283279 -2937173 -812907
11479 -812907 1718132 3133676 2022467 -1546139 -5715636 -7928469 -6902527 -3827243
11471 -3827243 -1170658 -221020 -554975 -1885807 -4735417 -8315349 -9586208 -6605897
11463 -6605897 -1846781 303134 -962753 -2338704 -1367004 758660 1880989 1673339
11455 1673339 696626 -844510 -2068547 -1482651 436251 1090258 -176143 -542312 1542711
11446 1542711 2963815 563054 -3236331 -3553593 -331741 1964379 1319977 217087
11438 217087 424173 344580 -1091213 -1937929 -669598 1162866 1862969 2340924 3667711
11429 3667711 4491883 3524480 2430844 3328313 4969370 4416592 1582836 -719996 -754687
11420g54687J467621J958815K253719J715368m15007k699901k996655j438481
11412i09208M3515N21549O22351P32592L77746n60808j315515j273988q21156
11403b582922p74585j226723j242520J3709J842385K421794J223492J15922Q56870
11394F47422K321269K100340L84991k27580R64453J449625l71061k397661k128731
11385B743067n21771j4009m13228J59549J299989Q07961j054226j461968R1647
11376A637011M42569j994041l900340j730182K709989M653712K863382K95412
11368D977512q86662j313488j468357m48456J430388K018566P00069l81572P4351
11359D702351M01317q15943k086981j762646r24890r91019q19649P99454J977530
$$ plain form
11420 -754687 712934 2671749 4925468 6640836 6225829 3525928 529273 -909208
11412 -909208 -865693 -344144 278207 1010799 1388545 827737 -487778 -1761766 -2582922
11403 -2582922 -3357507 -4584230 -5826750 -5813041 -3970656 -1548862 -325370 -209448 647422
11394 647422 2968691 5069031 5454022 5226442 6190895 7640520 7269459 4871798 2743067
11385 2743067 2221296 2207287 1794059 1953608 3253597 4061558 3007332 1545364 1637011
11376 1637011 2079580 85539 -3814801 -5544983 -2834994 1818718 4682100 4977512
11368 4977512 4090850 2777362 1309005 860549 2290937 4309503 5009572 4628000 4702351
11359 4702351 5103668 4287725 2200744 438098 -486792 -1477811 -2297460 -1498006 479524
11350D79524O05002j423802r13951J033307O85593j669320j721780J709558M390842
11341C174973L089225K6010j265977r79706j352200k662098l488509l097388j580646
11332h136316P30601K540164K166672J63190p12662N94031J874730J371774M63655
11323A055839Q36637J476953O96614q75349j496634q71220K22813J190449J202128
11314C438230l94322k111946j432969R16151J169664j337515k316226N45740L187024
11305A663831J636425j213624m54257K442786K134704j600960l704858k066779
11297a162732Q1114L49475K48038R54850R18348o15244j642522p41098P86450
11288h23321J501689J701023J545818J23522k361451l837958k924795m07634K191108
$$ plain form
11350 479524 1084526 -339276 -1253227 -219920 465673 -1203647 -2925427 -1215869 3174973
11341 3174973 6264198 6290208 5024231 4044525 2692325 30227 -3458282 -6555670 -8136316
11332 -8136316 -7405715 -4865551 -2698879 -2535689 -3248351 -2654320 -779590 592184 1055839
11323 1055839 1892476 3369429 4066043 3190694 1694060 822840 1045653 2236102 3438230
11314 3438230 3043908 931962 -501007 415144 1584808 247293 -2068933 -1523193 1663831
11305 1663831 3300256 2086632 1632375 4075161 6209865 4608905 904047 -1162732
11297 -1162732 -1081618 -732143 -484105 470745 1389093 773849 -868673 -1609771 -823321
11288 -823321 678368 2379391 3925209 4048731 1687280 -2150678 -5075473 -5483107 -3291999
11279c291999L552187K372645j071722l444551j657399K283748L229274L3499
11271B005682k985816k497286j55220J183802J365974J081143l39970k688378
11263c030069l322062o75728K758189L516482J578481n11210j334056j218791
11255b238764n28432N09648J162672J084104J002098J256826Q50182p13832j993047
11246C91455j596578m09731j14233m83866l6080J201854J486688j3619j857650
11237a431760k123782p97393L00799o1298p93382j6202J836843K133601R7811
11228h54763j271850O06562L522473L364543L37322j501385p48288m01556k071873
11219I81185k831502l53221K434765J444861k103135l261537m75383K564924K357303
$$ plain form
11279 -3291999 260188 2632833 1561111 -1883440 -3540839 -1257091 1972183 2005682
11271 2005682 -980134 -3477420 -3632640 -2448838 -1082864 -1721 -341691 -3030069
11263 -3030069 -6352131 -7027859 -4269670 -753188 825293 314083 -1019973 -2238764
11255 -2238764 -2767196 -2257548 -1094876 -10772 991326 2248152 3098334 2384502 391455
11246 391455 -1205123 -1614854 -1729087 -2212953 -2249033 -1047179 439509 425890 -1431760
11237 -1431760 -3555542 -4352935 -4052136 -4113434 -4906816 -4923018 -3086175 -952574 -854763
11228 -854763 -2126613 -1520051 2002422 5366965 5704287 4202902 3454614 3053058 981185
11219 981185 -1850317 -2203538 231227 1676088 -427047 -3688584 -4163967 -1599043 758260
11210G58260k06200j996204j683468j98863J332360K390516K362923P43927j595408
11201A907843k576334j262863P10879J189537L68817M7505M01730k14526j905719
11192a333131k306533k64353K027139K368269J674753J546891J122741p05197
11184D130579k058470o82486J704201J568070q79961k258928j533336p90339p49200
11175a549870R3631J510626J222714n32917m87936K110144L573290J399907j917315
11166E422274l037047k321795j627899o75412J211094K188157K81870k665273
11158a224031k784720M56518L376925K776567m62640l041915l178988j857593
11150e939877n38008R82192L238166M512892K226841k522179m890625k578000
$$ plain form
11210 758260 552060 -1444144 -3127612 -3326475 -1994115 396401 2759324 3503251 1907843
11201 1907843 -668491 -1931354 -1220475 -30938 337879 385384 787114 572588 -1333131
11192 -1333131 -3639664 -3904017 -1876878 491391 2166144 3713035 4835776 4130579
11184 4130579 2072109 1389623 3093824 4661894 3781933 1523005 -10331 -800670 -1549870
11175 -1549870 -1456239 54387 1277101 744184 256248 2366392 5939682 7339589 5422274
11166 5422274 2385227 63432 -1564467 -2239879 -1028785 1159372 1441242 -1224031
11158 -1224031 -4008751 -3552233 -175308 2601259 2138619 -903296 -4082284 -5939877
11150 -5939877 -6477885 -5495693 -2257527 2255365 4482206 1960027 -2930598 -5508598
11142e508598Q56241J554636R23083J885420K910445J002919j905990j735593
11134a7437K96080j84941k185333o85359L483787L621139j352474m056684n72785
11125a654007L138513J510304j592632l06935L155512L022504k16200j802480
11117E254579j116940j075769j581889k69261J836690J553274o61297j645290
11109B294097j221049j694380k650930j518011J261121K600991J945846J418925
11101B436610J286623n842j652169j236427L83313r2833k365326k417266O04785
11092c058532K457105N86020j781391j033600J151231R35573j440035k223517
11084d407146J09444K898062L217691J402142k59581q82246j496464k501244k418573
$$ plain form
11142 -5508598 -4652357 -3097721 -2174638 -289218 2621227 3624146 1718156 -17437
11134 -17437 278643 93702 -2091631 -2776990 706797 4327936 2975462 -1081222 -1654007
11125 -1654007 1484506 2994810 1402178 1095243 4250755 7273259 7057059 5254579
11117 5254579 4137639 3061870 1479981 1210720 3047410 4600684 3939387 2294097
11109 2294097 1073048 -621332 -3272262 -4790273 -3529152 -928161 1017685 2436610
11101 2436610 3723233 3717391 2065222 828795 1212108 1119275 -1246051 -3663317 -3058532
11092 -3058532 -601427 -15407 -1796798 -2830398 -1679167 -743594 -2183629 -4407146
11084 -4407146 -4297702 -1399640 1818051 3220193 2960612 2078366 581902 -1919342 -4337915
11075d337915k83095K053711J990029q4261j438744j132435p34869q01124O1907
11066d706796J741400J748668n32259k051160p23392J227082J085321o6304K24817
11057b052623J541823J841151R51843L8433o11471q47968J95011J907026J658874
11048D622099j070310k890981j624982K9722o31265j316854R30144L576439K209301
11039C833313j850939l267167q54748J446680J230243O9125o03720j238407j562030
11030b797650n89006N29070k69414j804857q49297K374331M039157K447139p3504
11021C005969j429590j935789j683496J63665K449992K264511n31007k367486
11013f3231r91747J518351K156782Q18101o58774j171584q63727m29319n22942
$$ plain form
11075 -4337915 -4621010 -2567299 -577270 -661531 -2100275 -3232710 -3967579 -4768703 -4706796
11066 -4706796 -2965396 -1216728 -1748987 -3800147 -4523539 -3296457 -2211136 -2277440 -2052623
11057 -2052623 -510800 1330351 2282194 2320627 1709156 861188 1056199 2963225 4622099
11048 4622099 3551789 660808 -964174 -934452 -1565717 -2882571 -1952427 1624012 3833313
11039 3833313 1982374 -1284793 -2139541 -692861 537382 606507 2787 -1235620 -2797650
11030 -2797650 -3386656 -2857586 -3127000 -4931857 -5781154 -3406823 632334 3079473 3005969
11021 3005969 1576379 -359410 -2042906 -1879241 570751 2835262 2304255 -63231
11013 -63231 -1054978 463373 2620155 3438256 2779482 1607898 744171 314852 -208090
11004b08090q09519j2539J808460K354265N03654j143967r0696J577803M73581
10995D452952j915985j286262J931113K601782r40010m109407l082221J27619
10987b220419J779839J532012R51655L16326m34794k39984J076992J481457l48884
10978C894200k563984k601033o46895J025742R57041n48902k215257k554364r38791
10969f192243J420046K604133K268427J487620N85228q88806k081574j250393
10961b047562J153200K195852L34911k338145k910191j208882O07948R57664K59133
10952b996072p1010N71955J211862N87449q18890j152491J1257Q35330Q4654j034375
10942b770331j169412q53050n92692O50624K841328L289339O21759k057973j422000
$$ plain form
11004 -208090 -1017609 -1030148 778312 3132577 3636231 2492264 2401568 3979371 4452952
10995 4452952 2536967 1250705 3181818 5783600 4843590 734183 -2348038 -2220419
10987 -2220419 -440580 1091432 2043087 2359413 1924619 1684635 2761627 4243084 3894200
10978 3894200 1330216 -1270817 -1917712 -891970 65071 -483831 -2699088 -5253452 -6192243
10969 -6192243 -4772197 -2168064 100363 1587983 2173211 1284405 -797169 -2047562
10961 -2047562 -894362 1301490 1636401 -701744 -3611935 -4820817 -4212869 -3255205 -2996072
10952 -2996072 -3067082 -2495127 -1283265 -695816 -1514706 -2667197 -2655940 -1820610 -1735956 -2770331
10942 -2770331 -3939743 -4792793 -5385485 -4734861 -1893533 1395806 2017565 -40408 -1462408
10933a462408Q65325J068445n07988q24417L9435o40810k654336k851993p44859
10924g713606O99094L19622L09849J704191K530498J572163K69115k24339n49855
10915a083268q21442M770J606021K148441J337902P51134P62967J76617q10226
10906D072916n30313P96473Q33383j109134k963252l055233j765629K3963J506986
10897b189840J332158o91842j903913k5129K768180K646248n024j690092j716304
10888a475558k095321k349596j32534L025449K736262o54520j706037J271436
10880a380419L206484O67266k595327k077115N18082R98413m62716o62200R16323
10871h71209J781111N68126j491216k525137j639182O32658K544713K788686K066402
$$ plain form
10933 -1462408 -597083 471362 -36626 -861043 -821608 -1462418 -4116754 -6968747 -7713606
10924 -7713606 -7014512 -6694890 -6385041 -4680850 -2150352 -578189 -309074 -533413 -1083268
10915 -1083268 -1904710 -1899940 -293919 1854522 3192424 3943558 4706525 4883142 4072916
10906 4072916 3542603 4339076 5172459 4063325 1100073 -1955160 -3720789 -3696826 -2189840
10897 -2189840 -857682 -1549524 -3453437 -3478566 -710386 1935862 1930838 240746 -1475558
10888 -1475558 -3570879 -5920475 -6053009 -3027560 -291298 -945818 -2651855 -1380419
10880 -1380419 1826065 2493331 -101996 -2179111 -1661029 -662616 -1125332 -1787532 -871209
10871 -871209 909902 1478028 -13188 -2538325 -4177507 -3544849 -1000136 1788550 3854952
10862C854952J624992Q90032j102510k773973j765911Q34463J626901L1215j419614
10853A800547j628966j723369j562145K5912J568773L95002k023346j380454K231188
10844b296858L887783J663962p65534q65204p86343k021751k199968o6527J506558
10835a943882O37485j41088J198511K257578O48010j614862j658778k82568L07902
10826e91692K02445K79388q2622j092459j124862L99191J434776O75992l06349
10817b06192j02408K74898j97239q01469j039964j307898q55363J327065L144687
10808B36117J371037k392076k905348M49969K303640k6251k446464j295013J136821
10799c567568J534224P08938L46820m72214j996579j728925R02948K347195P50139
$$ plain form
10862 3854952 5479944 6369976 5267466 2493493 727582 1562045 3188946 3220161 1800547
10853 1800547 171581 -1551788 -3113933 -3088021 -1519248 -1124246 -3147592 -4528046 -2296858
10844 -2296858 1590925 3254887 2489353 1624149 837806 -1183945 -3383913 -3450440 -1943882
10835 -1943882 -1306397 -1447485 -248974 2008604 2656614 1041752 -617026 -899594 -591692
10826 -591692 -389247 -109859 -192481 -1284940 -2409802 -2010611 -575835 100157 -206192
10817 -206192 -308600 -33702 -230941 -1032410 -2072374 -3380272 -4235635 -2908570 236117
10808 236117 1607154 -784922 -3690270 -3240301 -936661 -962912 -3409376 -4704389 -3567568
10799 -3567568 -2033344 -1324406 -977586 -1449800 -3446379 -5175304 -4272356 -1925161 -1175022
10790a175022o56637O27937J981807P68611q87541l69305Q48430P63527O19143
10781B520950J338063P41981j773366k528698K58785K373228L00147k626875j822162
10772a217947J119267J923098P52801L93029N82960n30999j953538j598414q1053
10763f10796J104009K265885K991598Q63368l510368m746558n82167L153021R00860
10754A828852l716440l617518Q46498L532058K309385L72156n17704j530196k313311
10745b806220r24990J806321K585348N00186j897722k138627J0711K921376L776498
10736C832881Q50398l255950l596647K02604K863037J318053j062105q48595J25446
10727D29122n17289j011929J48566L72923j660358k121544J109759L155256q045
$$ plain form
10790 -1175022 -1831659 -1203722 778085 1546696 659155 289850 1138280 1901807 2520950
10781 2520950 3859013 4600994 2827628 298930 557715 2930943 3231090 604215 -1217947
10772 -1217947 -98680 1824418 2577219 2970248 3553208 3022209 1068671 -529743 -610796
10763 -610796 493213 2759098 5750696 6614064 3103696 -1642862 -2225029 927992 1828852
10754 1828852 -1887588 -5505106 -4658608 -1126550 1182835 1554991 1037287 -492909 -2806220
10745 -2806220 -3731210 -1924889 660459 1160645 -737077 -2875704 -2864993 56383 3832881
10736 3832881 4683279 1427329 -2169318 -1966714 896323 2214376 1152271 303676 429122
10727 429122 -88167 -1100096 -951530 -578607 -2238965 -4360509 -3250750 -95494 -103539
10718a03539l628346j449982L511745L599570j192271l841661j480127J842767
10710b741844K891322K749512K471617J092469j370378l150179l211666j764592
10702c033739O51869K442886J630405o87094r23074R46880O83798k364498k902583
10693c555150R85286L103488p69058n004757l289986Q13518O57112j800627l02495
10684i162669M009314M734524J199556j611451j925309j782764r40012J904043
10676c574768L909430J830951j264444n67024J820981P80586k034474j089876
10668a88638K512195K647034r32816k425853k55673J147615j07668j119993p53562
10659E22641r71998j400688L68313K925622K266912j116418k768291j604439m89845
$$ plain form
10718 -103539 -3731885 -5181867 -1670122 1929448 737177 -3104484 -4584611 -2741844
10710 -2741844 149478 2898990 5370607 6463076 5092698 1942519 -1269147 -3033739
10702 -3033739 -2381870 61016 1691421 1004327 81253 1028133 1711931 -652567 -3555150
10693 -3555150 -2569864 533624 -235434 -5240191 -8530177 -7716659 -7059547 -8860174 -9162669
10684 -9162669 -5153355 -418831 780725 -830726 -2756035 -4538799 -5478811 -3574768
10676 -3574768 334662 2165613 901169 334145 2155126 2935712 901238 -188638
10668 -188638 2323557 4970591 4037775 1611922 1356249 2503864 2396196 1276203 522641
10659 522641 -449357 -1850045 -1481732 1443890 3710802 2594384 -173907 -1778346 -2268191
10650b268191j29812J229217K640421J401358j300161j677129L29367J542098
10642A767168J203348P59155j95663k196502k474421Q49908L824162K149949j426070
10633D261034j837529l47239j074968k454749n11920K402066J055916k854436
10625a361825l275008k37150J079430j3939J99687J658549J141264k86495J023973
10616g1514L469042K402635j185172k311890p35677j21242n06124M23314J001384
10607B364756j294225l269540r71890K176375J029813j490402J02944K938211
10599A586042J077729k550721j220069K530145J394109k625225j836561K406919
10591G62368K372615j061445m07156L214675J721044l949676m602354M47280K397495
$$ plain form
10650 -2268191 -2398003 -1168786 1471635 2872993 1572832 -104297 225070 1767168
10642 1767168 2970516 3729671 3534008 1337506 -1136915 -287007 3537155 5687104 4261034
10633 4261034 2423505 2076266 1001298 -1453451 -1965371 436695 1492611 -1361825
10625 -1361825 -4636833 -4873983 -3794553 -3808492 -3608805 -1950256 -808992 -1095487 -71514
10616 -71514 3397528 5800163 4614991 2303101 1567424 1446182 940058 1363372 2364756
10607 2364756 1070531 -2199009 -3170899 -994524 35289 -1455113 -1352169 1586042
10599 1586042 2663771 113050 -1107019 1423126 2817235 192010 -1644551 762368
10591 762368 3134983 2073538 1666382 4881057 6602101 2652425 -1949929 -1502649 894846
10582H94846n88126r80501K718388L144144j176438k734889N43208J654475j749831
10573A725276l312493o38862Q38655n29158K57456L475784K938407j793012l634323
10564f72270p04254J099575r4003J48106J879690L10447l089524j828483K698754
10555b51962K715656j385854j817268J433805Q76653l112655k600415K024131
10547b117909K318638j721445j640760K703802K998937p01419k20988L621100
10539E239956K078662l358896k655698K880320K037916m733267n583849M77448
10531c617408K528606p31108j7863L966509J626211m223147j973308M701996J872259
10522D132747o834325n097929M720187N083189k930285j892863O586386M141187
$$ plain form
10582 894846 306720 -673781 2044607 5188751 4012313 1277424 1820632 3475107 1725276
10573 1725276 -1587217 -2226079 -1387424 -1916582 -1659126 1816658 4755065 2962053 -672270
10564 -672270 -1376524 -276949 -370952 -222846 1656844 1967291 -1122233 -2950716 -251962
10555 -251962 2463694 1077840 -739428 694377 1571030 -1541625 -4142040 -2117909
10547 -2117909 200729 -1520716 -3161476 -457674 2541263 1839844 1618856 5239956
10539 5239956 7318618 3959722 1304024 4184344 6222260 1488993 -4094856 -3617408
10531 -3617408 -1088802 -1819910 -1837773 2128736 3754947 -468200 -2441508 2260488 4132747
10522 4132747 -2701578 -7799507 -3079320 2003869 -926416 -2819279 3767107 7908294
10514G908294o574318m729518P006440N193776p866146n794930R902758R326852
10506A4373208q074708r470001Q250331J0196024q647894j1206224Q698718J0866669
10498A4986123j1343720j2377132J5228924J7705549j4459057j5435762K8178039
10491B2482964L0953311k8563194k1950941J23349249K41621485J30595815j27441523
10484C71047166k47298847j31907079K0473553L1905812l0690655k9331161J9587232
10477C786021K1314469j6505352j8920504J2028719J4884136j1478250j5276585
10470a0167346P037871J2086928m593664p187835O961143O516342q662658q224926
10462f234145P638090Q728493o630110r772240L174986O745313l399172m662230
$$ plain form
10514 7908294 1333976 -3395542 3610898 8804674 938528 -4856402 5046356 14373208
10506 14373208 6298500 -3171501 5078830 15274854 6626960 -4579264 4119454 14986123
10498 14986123 3642403 -8734729 6494195 24199744 9740687 -5695075 22482964
10491 22482964 53436275 24873081 2922140 126271389 367892874 498488689 371047166
10484 371047166 123748319 -8158760 12314793 44220605 13529950 -15801211 3786021
10477 3786021 25100490 8595138 -10325366 1703353 16587489 5109239 -10167346
10470 -10167346 -3129475 8957453 4363789 -2824046 4137097 10653439 1990781 -6234145
10462 -6234145 1403945 10132438 3502328 -6269912 -3094926 3650387 251215 -4411015
10454d411015O328051P805136l892552p875930O79552L250388m505259n471151
10446h092780L862199O430332j865736m739036K686238N698276o97136l580024
10438b97667J225566K129981l260485k956769M341017M938844l569368o790485
10430d239366r4835L545338j525791m252052Q12780L912503L4632k186536J345927
10421b647400K483864j815534k822214K617885N441721J335568k144452r76867
10413A472571j064635m126304l244231K420780M157172j52823j818783K096447
10405b59806L496344o83657k619107R73611K676835q27121k465802R69293K495617
10396C756207j188556l196975J13500K331839l32116k181904K08909J605159p10113
$$ plain form
10454 -4411015 1917036 9722172 5829620 -2046310 -1366758 1883630 -2621629 -8092780
10446 -8092780 -4230581 2199751 334015 -4405021 -1718783 3979493 3282357 -297667
10438 -297667 927899 3057880 -202605 -3159374 1181643 6120487 2551119 -4239366
10430 -4239366 -4334201 -788863 -2314654 -6566706 -5753926 -1841423 -1806791 -3993327 -2647400
10421 -2647400 -163536 -1979070 -4801284 -2183399 3258322 4593890 2449438 1472571
10413 1472571 407936 -3718368 -6962599 -4541819 -384647 -537470 -2356253 -259806
10405 -259806 3236538 2552881 -66226 907385 3584220 2757099 291297 1260590 3756207
10396 3756207 2567651 -629324 -515824 1816015 1483899 -698005 -489096 1116063 405950
10387D05950j339195J906497K898961q11685k574838Q41008K819870p42059l823572
10378d19063j648384R59199n49514k180892K1001K305365R25579r15729j24275
10369a626713L64782j450004j772943J241777K781950k4912k497273p79645J715098
10360b047883J467632Q86944J949350J411715k097650l576865n3759L367945J738270
10351C045699j789274k024930N6017P95248K67010j1364r11941k536778j967843
10342e078156J542492L845962K289516L0696K68067J153334K63426p63627j241
10333C550469Q54785O2010q22906l99819j28838q02523o04436P77521O60036j477664
10323A668635k072226N49209K866784J722460j017580k088805j343715l24198
$$ plain form
10387 405950 -933245 973252 3872213 3060528 485690 1326698 4146568 3404509 -419063
10378 -419063 -2067447 -1108248 -1657762 -3838654 -3817653 -1512288 -586709 -1502438 -1626713
10369 -1626713 -1261931 -2711935 -4484878 -3243101 -461151 -486063 -2983336 -3762981 -2047883
10360 -2047883 -580251 306693 2256043 3667758 1570108 -2006757 -2060516 1307429 3045699
10351 3045699 1256425 -768505 -712488 82760 349770 338406 -573535 -3110313 -5078156
10342 -5078156 -3535664 310298 2599814 2630510 2898577 4051911 4315337 3551710 3550469
10333 3550469 4405254 4467264 3644358 3244539 3115701 2313178 1708742 2486263 3146299 1668635
10323 1668635 -403591 145618 3012402 4734862 3717282 1628477 284762 -39436
10315c9436K39226j32019j390698j474699J096841L331924J346200k588324k608124
10306b219109J195611K757163K31027j363161O20207K254245Q09059n99044L53786
10297D039784O18384k064202m248353k397771J293140K663621J324086n25195
10289G03494j515289j012905R79405K353651R56675j329959r41232J009663K71338
10280A474841k634619k683337P80163K632204Q70180m70892O59467R22232j065541
10271D84698j445936J374887K997333O94805j743834q87851P92129L86772l15108
10262B337895O16742J053090o31310j880344p71238M12514n028J82796K006119
10253C321236K310682m28368k528414j243034N81254r3632j379310o53473Q89167
$$ plain form
10315 -39436 199790 67771 -1322927 -2797626 -1700785 1631139 2977339 389015 -2219109
10306 -2219109 -1023498 1733665 1964692 601531 1221738 3475983 4285042 3685998 4039784
10297 4039784 4658168 2593966 -1654387 -4052158 -2759018 -95397 1228689 703494
10289 703494 -811795 -1824700 -845295 1508356 2465031 1135072 193840 1203503 1474841
10280 1474841 -1159778 -3843115 -3062952 -430748 439432 -31460 628007 1550239 484698
10271 484698 -961238 413649 3410982 4105787 2361953 1474102 2266231 2653003 2337895
10262 2337895 2954637 4007727 3376417 1496073 724835 1137349 1132321 1315117 3321236
10253 3321236 5631918 5203550 2675136 1432102 2013356 1919724 540414 -113059 776108
10244G76108J587241K431817L351120J497913l093187n400855k859473L11728
10236a397588J31547j208653n88814M38010q9422r3735J806252K357309m23223
10227I31683k573095p80242J493555K80575j553329K56027L110914J877885j987004
10218A056969k854479n8592K116814J796437O79851o10507k502984l107009m84831
10209c968331K702831K148578j231804k469461j98524J736063N88593j633270
10201b325325j746967M08686K358910J955971l82541j875277o21127J421636Q94835
10192H8801j546669j841297P73027K138854M8611k024294q94376J187619R60260
10183a109464m00380l88905r8388j478030k583913l52527L789133N430227L130863
$$ plain form
10244 776108 2363349 4795166 8146286 9644199 6551012 1150157 -1709316 -1397588
10236 -1397588 -1266041 -2474694 -3063508 -2625498 -2714920 -2808655 -1002403 1354906 931683
10227 931683 -1641412 -2421654 -928099 -647524 -2200853 -1944826 1166088 3043973 1056969
10218 1056969 -1797510 -1856102 260712 2057149 2737000 2126493 -376491 -3483500 -3968331
10209 -3968331 -1265500 883078 -348726 -2818187 -3016711 -1280648 -692055 -2325325
10201 -2325325 -4072292 -3663606 -1304696 651275 268734 -1606543 -2227670 -806034 88801
10192 88801 -1457868 -3299165 -2526138 -387284 -338673 -2362967 -3257343 -2069724 -1109464
10183 -1109464 -1509844 -1898749 -1997137 -3475167 -6059080 -6411607 -2622474 2807753 5938616
10174E938616n45016k828377k833778j136820M53164O5029j665877j985117m2444
10165d580620J959293K450805K101306J019400j536579l680192k053632K009598
10157b310621K935586l93512k363581J47998K682199J167292j444895j339039
10149i18573n20933j725903k320729M28162L095877J787863n59259M19757K212377
10140A898639K32390k904845j436699K919812L331108n10820k008427J030550
10132B551708L141549P01864k680473k684694l24975J149526R27130j02644j288933
10123A390058j651484j84945K069675K673570J174676l92978o48467k80326j88053
10114C961726k78557l08478l76544n56200q80810j143187m83018J344535K376512
$$ plain form
10174 5938616 5393600 2565223 -268555 -1405375 -952211 -887182 -2553059 -4538176 -4580620
10165 -4580620 -2621327 -170522 1930784 2950184 1413605 -2266587 -4320219 -2310621
10157 -2310621 624965 231453 -2132128 -1984130 698069 1865361 420466 -918573
10149 -918573 -1439506 -3165409 -5486138 -5057976 -1962099 -174236 -733495 -313738 1898639
10140 1898639 2131029 -773816 -2210515 709297 4040405 3529585 1521158 2551708
10132 2551708 5693257 6395121 3714648 1029954 704979 1854505 2781635 2678991 1390058
10123 1390058 -261426 -446371 1623304 4296874 5471550 5078572 4430105 4149779 3961726
10114 3961726 3683169 3374691 2998147 2441947 1561137 417950 -65068 1279467 3655979
10105C655979P09229j681144j091820J637519J839639j013590j926721R29365
10097C058456K674283L21896j821420j69055J362676j282031m268561k476220
10089b599976J156150R17560j502018p33543K006456J494490j300630r92169J883825
10080C30145J738513j554601k354052L49533J348610r27829j754497Q09378K372945
10071C58145L58765j623781m97201J581804K047978J694468J186454n92306k523894
10062A990432j309950K244634K920238m68131k484246n2003K250017R1075l160053
10053B022013k219321J370770K208067j93694j500519m4901J176951O2145j405220
10044A476291p38551J112981J189074j229188l372896k360450J009365L100879
$$ plain form
10105 3655979 4365208 2684064 1592244 3229763 5069402 4055812 2129091 3058456
10097 3058456 5732739 6054635 4233215 4064160 5426836 4144805 -123756 -2599976
10089 -2599976 -1443826 -526266 -2028284 -2761827 -755371 739119 -561511 -1553680 330145
10080 330145 2068658 514057 -1839995 -1490462 -141852 -1069681 -2824178 -2014800 358145
10071 358145 716910 -906871 -1404072 177732 2225710 3920178 5106632 4514326 1990432
10062 1990432 680482 2925116 5845354 5377223 2892977 2840974 5090991 5182066 2022013
10053 2022013 -197308 1173462 3381529 3187835 1687316 1642415 2819366 2881511 1476291
10044 1476291 737740 1850721 3039795 1810607 -1562289 -3922739 -2913374 187505
10036A87505K017638m70544k084845k671104k388569k73805K971600L807598Q65778
10027A961252j692169L7946L227895K668868o71859j497900P21450J208610j536218
10018D427875l293970j577216N45157J97421r57004o28571K28815M9234m11473
10009a419732q2368M04633M15954L71581Q1880j091572j856984j68430K665749
10000f79289K849026j05286k366927j643989q1767K7390m61507k11267J57548
9991b516068N1873L25928J265795J826223J752522J763649J353517m74881k364630
9982B983928k104416o80455p11087j395841l1158J935758N01533l049288k857362
9973e408388J689716M179226J539198j301513n27255L14684k048408l794557r74064
$$ plain form
10036 187505 2205143 1734599 -350246 -3021350 -5409919 -5683724 -2712124 1095474 1961252
10027 1961252 269083 307029 3534924 6203792 5531933 4034033 4755483 5964093 4427875
10018 4427875 1133905 -443311 101846 299267 -657737 -1286308 -1057493 -1008259 -1419732
10009 -1419732 -1502100 -1097467 -681513 -309932 -228052 -1319624 -3176608 -3345038 -679289
10000 -679289 2169737 2064451 -302476 -1946465 -2028232 -2000842 -2462349 -2673616 -2516068
9991 -2516068 -2464195 -2138267 -872472 953751 2706273 4469922 5823439 5348558 2983928
9982 2983928 879512 199057 -512030 -1907871 -1939029 -3271 498262 -2551026 -5408388
9973 -5408388 -3718672 460554 1999752 698239 170984 485668 -1562740 -5357297 -6331361
9964f331361K650996J719644j441546j030273K157977K466823p84838k507692
9956c100270l41436K381460K516599Q69459n33147j035935q13031n68230j431693
9947b056224k933243k559508K56861K116328P55932p31428J082979L654916K453640
9938B040253j075316j694826P83000J438851j104406k578350o35949J657475J773467
9929F04199J506309K268891J766836j300487l530456j676153J972312K893968
9921D505419O82017j499073j961142j509341p33251L49193P14904n14619j783520
9912a749413q17232J587544K297214M86133j236333r26759J52325K58560O694
9903E8733O37357J266245K06303j857923k379242n69684J475783J686370M48000
$$ plain form
9964 -6331361 -3680365 -1960721 -3402267 -4432540 -2274563 192260 -592578 -3100270
9956 -3100270 -3441706 -1060246 1456353 2325812 1792665 756730 -56301 -624531 -2056224
9947 -2056224 -4989467 -7548975 -7292114 -5175786 -4419854 -5151282 -4068303 -413387 2040253
9938 2040253 964937 -729889 53111 1491962 387556 -2190794 -2826743 -1169268 604199
9929 604199 2110508 4379399 6146235 4845748 1315292 -360861 1611451 4505419
9921 4505419 5187436 3688363 1727221 217880 -515371 -166178 548726 34107 -1749413
9912 -1749413 -2566645 -979101 1318113 1804246 567913 -358846 -206521 52039 58733
9903 58733 696090 1962335 2168638 310715 -2068527 -2638211 -1162428 523942 971942
9894I71942n39846n67733j97130r8170m93091j249464j805111j379914N6500J240363
9884d061654P52807j071094j897510J7496K702770J502319m593483q704032k664192
9875a8016573J0635529J6959943P717522p075342j0456316r05813O662775K998147
9867H519872l568334k256844L540968L831925j233915l345695p33981N74093j186808
9858D141281j308117R83587N01529l354882m069505L90476K924448p04988l996253
9849d492424n23485M879208L940213j620987l518030l32821J684939n995r01031
9840h90413J594253L513651J298903k281770k591490K09261K213209J314354r57438
9831C422520k045550r57634J213316K281665Q83434j981389l641062k368702P91389
$$ plain form
9894 971942 432096 -135637 -332767 -430937 -924028 -2173492 -3978603 -5358517 -5302017 -4061654
9884 -4061654 -3308847 -4379941 -6277451 -6259955 -3557185 -2054866 -6648349 -15352381 -18016573
9875 -18016573 -7381044 9578899 17296421 10221079 -235237 -1141050 5521725 8519872
9867 8519872 4951538 2694694 6235662 10067587 8833672 5487977 4753996 5328089 4141281
9858 4141281 2833164 3816751 4318280 963398 -3106107 -2715631 208817 -496171 -4492424
9849 -4492424 -5015909 -136701 3803512 2182525 -1335505 -1668326 16613 10618 -890413
9840 -890413 703840 4217491 5516394 3234624 643134 852395 3065604 4379958 3422520
9831 3422520 1376970 419336 1632652 3914317 4797751 2816362 -824700 -3193402 -2402013
9822b402013K906831J986860q54482k404054j047979J221462J590446K47067n76384
9813F67754n40014j190268k200648j281444J352798K241784P9488j822167p99854
9804c492571R78758O38886l85165O69636K516502J909790n19378j172776M45519
9795A589201J083517o28395k010276p98280J531522K276789R54876r71757k033119
9786I94078j557703q702R84393K60354j098450j102735J60447P44532P4148k01175
9776g50813Q76357J853126J111475o83380j555569o80850J045257K194445J863267
9767E273315J54199j792874k672247k302756j663773j465461j273239m25247P15845
9758e452238J107464N52462J97366J018989K199356J987581L42198n85071M96285
$$ plain form
9822 -2402013 504818 2491678 1637196 -766858 -1814837 -593375 997071 1244138 667754
9813 667754 127740 -1062528 -3263176 -4544620 -3191822 -950038 -870550 -2692717 -3492571
9804 -3492571 -2513813 -1874927 -2260092 -1590456 926046 2835836 2316458 1143682 1589201
9795 1589201 2672718 2044323 34047 -764233 767289 3044078 3998954 3027197 994078
9786 994078 -563625 -572327 412066 672420 -426030 -1528765 -1368318 -623786 -549638 -750813
9776 -750813 125544 1978670 3090145 2406765 851196 170346 1215603 3410048 5273315
9767 5273315 5427514 3634640 962393 -1340363 -3004136 -4469597 -5742836 -6168083 -5452238
9758 -5452238 -4344774 -3792312 -3594946 -2575957 -376601 1610980 1953178 1368107 1864392
9749A864392J829142J201081l89398k42635J344926J197299j323768k584200k84155
9740B612684K362424J139457k649773l918630j156291J751016J380528r09494
9732F11921j843848q63458Q3834p6796m99888l54014m620R1514L58745J116543
9722a380067J448713L24997j364710j395073P04928K595212K197083N50432P2241
9713C753756R27967J084121m22453k219047k670618j645852j08059Q19940N50022
9704F9777j51341K80859J695175J698212n54899k023531j72429K288580J246610
9695D377013j703456j359175K281498L495022J73654k699197j446435N49246o31939
9686C036231k624643j519604R28764N75614j720984j881451K10760J085842J52735
$$ plain form
9749 1864392 3693534 4894615 4505217 4262582 5607508 6804807 5481039 2896839 2612684
9740 2612684 4975108 6114565 3464792 -453838 -1610129 140887 1521415 611921
9732 611921 -1231927 -2095385 -2011551 -2088347 -2588235 -2942249 -2946869 -2855355 -2496610 -1380067
9722 -1380067 68646 393643 -971067 -2366140 -1661212 934000 3131083 3681515 3753756
9713 3753756 4681723 5765844 5343391 3124344 453726 -1192126 -1300185 -480245 69777
9704 69777 -81564 199295 1894470 3592682 3037783 1014252 841823 3130403 4377013
9695 4377013 2673557 1314382 3595880 7090902 7264556 4565359 3118924 3668170 3036231
9686 3036231 411588 -1108016 -179252 396362 -1324622 -3206073 -2995313 -1909471 -1756736
9677a756736K20778J790577J998215j00143j568911j19111K649633L652292J739234
9668H505828j754516m164736l491407p86080N35985o16445j139665J059714K895034
9659A043712R86366k051353j418189J749816K211222l88107j163666J067704J682957
9650C720462j082108k421857O32168L401533J023934l277388l187135Q06049K624421
9641B240079M1818k892849k680151o47875M34612J66456l79697o36732l55214
9632d709553O80519J819470J862970P90767j08787j56228M525q3719J09519Q11170
9622A020653J083131Q3027j579128k466971j854151k06297J400281J979880J274176
9613G34601J47189p3693Q57409J586990P93369r45497j748087r18336J19504j47115
$$ plain form
9677 -1756736 -1535958 254619 2252834 2152691 583780 464669 3114302 6766594 8505828
9668 8505828 6751312 2586576 -904831 -1690911 -1154926 -1771371 -2911036 -1851322 1043712
9659 1043712 2030078 -21275 -1439464 310352 2521574 2133467 969801 2037505 3720462
9650 3720462 2638354 216497 848665 4250198 5274132 1996744 -1190391 -384342 2240079
9641 2240079 2281897 -610952 -3291103 -3938978 -3504366 -3337910 -3717607 -4354339 -4709553
9632 -4709553 -4029034 -2209564 -346594 444173 335386 179158 183683 99964 209483 1020653
9622 1020653 2103784 2186811 607683 -1859288 -3713439 -3919736 -2519455 -539575 734601
9613 734601 881790 808097 1665506 3252496 4045865 3100368 1352281 433945 553449 406334
9603D06334j210878j391676k72877Q85029J071808O56973L13170q0803q48395
9594d71315j608275j636797p33340O27635J616172J499036M52644j72700N78315
9585A51375J546130P98260j191725j709402J02333J493770L5552k563536k770340
9576d107583j84350K176619K020551P6559j566748j567403J29593K184850K426093
9567A588181J83024k099506j450593J393720K464862j37231l448471l417114j8916
9558d942044L056756L163301J418162M17145O02924J65018j673465k836168j085412
9549a713783K253785L272494N65395k608954k510290K65765J978333Q41679j196309
9540A148115j676701o29543L30917N15498O20833J144890J373655L60100j455764
$$ plain form
9603 406334 -804544 -2196220 -2469097 -1584068 -512260 144713 457883 377080 -471315
9594 -471315 -2079590 -3716387 -4449727 -3822092 -2205920 -706884 -254240 -426940 151375
9585 151375 1697505 2495765 1304040 -405362 -303029 1190741 1226293 -1337243 -4107583
9576 -4107583 -4291933 -2115314 -94763 -18204 -1584952 -3152355 -3022762 -837912 1588181
9567 1588181 1771205 -328301 -1778894 -385174 2079688 1942457 -1506014 -4923128 -4942044
9558 -4942044 -1885288 1278013 2696175 3113320 3716244 3881262 2207797 -628371 -1713783
9549 -1713783 540002 3812496 4377891 1768937 -741353 -475588 1502745 2344424 1148115
9540 1148115 -528586 -1158129 -827212 -311714 309119 1454009 2827664 3187764 1732000
9531A732000k393026j648697m73725l28733o37225O8767J270521R56210q12986
9522b266894j320939P96506L205880L074454P84264j249373j885666j540333n15286
9513i17387R37359J779770J215836q7700j103207j765003j973528p87486J657290
9504a044056K942100J319355j277652j607514K98082J459303M67012q61593n54007
9495A141030R18709J744381J094293k46130r36380o08386l98220j346281k411337
9486a048321j624515N93033J486314P1871j392174j229730o75778o30529N10777
9477c939052L065747L573138o0248l898555l142815L34507R26374j730960k575254
9468g447118L85395L261564K866275Q27741m66011j347092k237405j639396P70938
$$ plain form
9531 1732000 -661026 -2309723 -2783448 -3112181 -3749406 -3680639 -2410118 -1453908 -2266894
9522 -2266894 -3587833 -2791327 414553 3489007 4273271 3023898 1138232 -402101 -917387
9513 -917387 19972 1799742 3015578 2927878 1824671 59668 -1913860 -2701346 -1044056
9504 -1044056 1898044 3217399 1939747 332233 630315 2089618 2556630 1695037 1141030
9495 1141030 2059739 3804120 4898413 4652283 3715903 3107517 2709297 1363016 -1048321
9486 -1048321 -2672836 -2079803 -593489 -521618 -1913792 -3143522 -3819300 -4449829 -3939052
9477 -3939052 -873305 2699833 2639585 -1258970 -4401785 -4067278 -3140904 -4871864 -7447118
9468 -7447118 -7061723 -3800159 -933884 -106143 -572154 -1919246 -4156651 -5796047 -5025109
9459e025109K313410J053556j130523j380659L25189J967699K254961J178079
9451A556603m88331j215463P241J799581J778625J53472n39178L56870O72268
9442D081688n75363j479093q39528k54920q64013j011767O43557K294640J723026
9433C718227j55578r31104l60050j01188q31745j575990j353292k69864N75098
9424a285486n3032j802505k175862M20392L436316K856958p36825k348268J49600
9415a538712K688106J085426k874494m338270j936709J549538L399577L052241
9407A086703J138337j154023k378490k148846j483746r63162P3071J676346K544564
9398a609246K146497J515286R69024l94227j815650p65673K390746L166824o85727
$$ plain form
9459 -5025109 -2711699 -1658143 -2788666 -4169325 -3844136 -1876437 378524 1556603
9451 1556603 1068272 -147191 -139950 1659631 3438256 3591728 3052550 3409420 4081688
9442 4081688 3506325 2027232 1187704 932784 68771 -942996 -299439 1995201 3718227
9433 3718227 3562649 2631545 2271495 2170307 1338562 -237428 -1590720 -1860584 -1285486
9424 -1285486 -1338518 -3141023 -5316885 -4896493 -1460177 1396781 659956 -1688312 -1538712
9415 -1538712 1149394 2234820 -639674 -4977944 -6914653 -5365115 -1965538 1086703
9407 1086703 2225040 1071017 -1307473 -3456319 -4940065 -5903227 -5830156 -4153810 -1609246
9398 -1609246 537251 2052537 3021561 2627334 811684 46011 2436757 5603581 4917854
9389D917854m813694l974060N11509L221059K529594J330675J026536q2162k173204
9380B494107k437205K18041K609636J543464j716922l308610j719175R03818J812791
9371C99945O61064p10110p81529N2639O17714P93342J025379O98049r42026k411270
9361e96803j243847J818439K892265N06865j953843j319176P92574J038548n91252
9352A343770j724948j457654k79625J786044L905229L434569l45203l546191k567186
9343E48805K51948K12132k202914k444742L50283K200154J036355n79500m22561
9334a050040L70542M83484M66121L88664o40593j627960m44511J691923J081175
9325G18805j935171k504952P65154K975649J053424j009565O49743K698860N09341
$$ plain form
9389 4917854 104160 -3869900 -3358391 -137332 2392262 3722937 4749473 4667311 2494107
9380 2494107 56902 274943 2884579 4428043 2711121 -597489 -2316664 -1412846 399945
9371 399945 1061009 350899 -430630 -377991 239723 1033065 2058444 2756493 1814467 -596803
9361 -596803 -1840650 -22211 2870054 3376919 1423076 103900 896474 1935022 1343770
9352 1343770 -381178 -1838832 -2118457 -332413 3572816 7007385 6662182 3115991 548805
9343 548805 800753 1012885 -1190029 -3634771 -3284488 -1084334 -47979 -627479 -1050040
9334 -1050040 -679498 -196014 270107 658771 18178 -1609782 -2054293 -362370 718805
9325 718805 -1216366 -3721318 -2956164 19485 1072909 63344 713087 3411947 3921288
9316C921288l215084k624506J275801K253686p53866k405301m06954J107969n12671
9307a359638j800655L03873K740897J393695k046674k812914k07707K216137K218741
9298F45755Q84844k41767q73695j002945o22396l29105m74720k34790Q78224J496949
9288A26354K79896j625222k087724j107995k28086K76700J124198J740676J073071
9279d28132J15290N41299J221221l52077l153566l175481L36002L330190L086262
9270A521008J713470J440216Q04077j298095j997686O78128K812256n8180m932802
9261F82392m837644N71995M243704K164800j457541j425968J262519K495469J311671
9252E011397l60281j447642j917360j146787R14329K278616J139568j416929k877721
$$ plain form
9316 3921288 706204 -1918302 -642501 1611185 857319 -1547982 -1954936 -846967 -1359638
9307 -1359638 -3160293 -2856420 -115523 1278172 -768502 -3581416 -3789123 -1572986 645755
9298 645755 1530599 1288832 415137 -587808 -1210204 -1539309 -2014029 -2248819 -1370595 126354
9288 126354 406250 -1218972 -3306696 -4414691 -4642777 -4366077 -3241879 -1501203 -428132
9279 -428132 -312842 228457 1449678 1097601 -2055965 -5231446 -4895444 -1565254 1521008
9270 1521008 3234478 4674694 5478771 4180676 2182990 2861118 5673374 5615194 682392
9261 682392 -4155252 -3583257 660447 2825247 1367706 -58262 1204257 3699726 5011397
9252 5011397 4651116 3203474 1286114 139327 1053656 3332272 4471840 3054911 177190
9243A77190k414046q54555J082882K636726K397768K1000k357280k424398p21753
9234b456466M14822K06945j11532L77233J257044J719273J089265r96997l502744
9225b003157l896014r48860K967413M294860K590847M77247l52690p65790j640402
9216G23454k072971j140719K95116Q19875M04243K9473K07892Q26414J693797
9207A786574K232012J342770j122523l202031k721000m04535O69391o11782j538024
9198c569148L66559L138378K950146L6143j481808m4416R76168q77743k722313
9189a228034j008508K315698K600385k66904k038272q74849O52066N22089j39391
9180E34280k36207m46835o78079M18637K109355J579261j184875k424494m84440
$$ plain form
9243 177190 -2236856 -3091411 -2008529 628197 3025965 3046965 689685 -1734713 -2456466
9234 -2456466 -2041644 -1834699 -1946231 -1568998 -311954 1407319 2496584 1499587 -2003157
9225 -2003157 -5899171 -6848031 -3880618 414242 3005089 3482336 3129646 2363856 723454
9216 723454 -1349517 -2490236 -2195120 -1375245 -971002 -941529 -733637 92777 1786574
9207 1786574 4018586 5361356 4238833 1036802 -1684198 -2088733 -1419342 -2031124 -3569148
9198 -3569148 -3202589 -64211 2885935 2922078 1440270 1395854 2372022 1494279 -1228034
9189 -1228034 -2236542 79156 2679541 2412637 374365 -500484 151582 673671 534280
9180 534280 298073 -148762 -826841 -408204 1701151 3280412 2095537 -328957 -813397
9171h13397J310039K20126j311243K1215K719110K995233O34093j427922j758604
9162B588650j302404q52744n17617n60157n44141P50679K634021K163812j188187
9153C171912l533879k229338k16378q46851j861640K95271L144879J641585k702494
9144c136933l326904P96435L259568M32576l035619j924036J797319K899702P74487
9135a463405q53926L0309J671953J758015J76009j331209j113751N91895J780196
9126A246086J286968M83125Q07961Q75313j240924l845024l376314n7687K140841
9117a679655J490236L96852N59338M87768p04220j149739J04088R71924Q5410
9108E62002p76477l15443l24237k021085l064518j275646J521308K485066J950688
$$ plain form
9171 -813397 496642 716768 -594475 -573260 2145850 5141083 5775176 4347254 2588650
9162 2588650 1286246 433502 -84115 -644272 -1188413 -437734 2196287 4360099 3171912
9153 3171912 -361967 -2591305 -2807683 -3654534 -5516174 -5220903 -2076024 -434439 -3136933
9144 -3136933 -6463837 -5667402 -2407834 -1975258 -5010877 -6934913 -5137594 -2237892 -1463405
9135 -1463405 -2317331 -2287022 -615069 1142946 1318955 -12254 -1126005 -534110 1246086
9126 1246086 2533054 3016179 3824140 4699453 3458529 -386495 -3762809 -3820496 -1679655
9117 -1679655 -189419 207433 766771 1254539 550319 -599420 -495332 476592 562002
9108 562002 -214475 -529918 -854155 -2875240 -5939758 -7215404 -5694096 -3209030 -1258342
9099a258342J526365O69933j350831k527288r86570J212558J108842j14589O55717
9090a064205K635075K200826q36154k709965j662385j01809n2572m02268P8312
9081a915145M40932j27990n50105m9669K52354m89664j104709l84596Q65602J214313
9071a848677P18710M05934O97130J289051J679232J248005j46444j385235j211771
9062A445935k58248k42236r86924n01554J348988J885103k35239k394868j767269
9053a706312K87537L81883j532071k091723K63535K868145K532035k83196k260454
9044a540621j254189J483101K849785J268698j514086k323807m06310J552428
9036A14999J022702r36732j447096j05972Q12654K69530j05734P87348J467023
$$ plain form
9099 -1258342 268023 937956 -412875 -2940163 -3926733 -2714175 -1605333 -1719922 -1064205
9090 -1064205 1570870 3771696 2935542 225577 -1436808 -1538617 -1591189 -1993457 -1915145
9081 -1915145 -1474213 -1602203 -2152308 -2201977 -1949623 -2439287 -3543996 -3928592 -3062990 -1848677
9071 -1848677 -1129967 -724033 -26903 1262148 2941380 4189385 4042941 2657706 1445935
9062 1445935 1187687 945451 -41473 -543027 805961 2691064 2455825 60957 -1706312
9053 -1706312 -1418775 -1036892 -2568963 -4660686 -4397151 -1529006 1003029 719833 -1540621
9044 -1540621 -2794810 -1311709 1538076 2806774 1292688 -1031119 -1437429 114999
9036 114999 1137701 200969 -1246127 -1352099 -539445 -269915 -375649 411699 1878722
9027A878722N60109n89011j19253J080285P48047j026773k014217j415988o83475
9018a581554o22788j45597J410571K839560K902286J884390M75975j155126k282709
9009C725008j593121M67729J278585l44618k026451j435347j24359q90669k739203
9000c682446k160863R73320K757869J245394o29629J14463J906707J479053q68869
8991A134999j883491k08301K107503K699283J362492n65985j688965j436000o69199
8982H52336j003539k377819k281895P88176M139752L813432K53016k132054j357041
8973F94364k38208j074631j694285M12140L065344K467237m62582j254491J065602
8964B980490K541836O08618k275013k975919k076599j537405j010719M77702J473721
$$ plain form
9027 1878722 2438831 1849820 1730567 2810852 3558899 2532126 517909 -898079 -1581554
9018 -1581554 -2204342 -2349939 -939368 1900192 4802478 6686868 7162843 6007717 3725008
9009 3725008 2131887 2599616 3878201 3533583 1507132 71785 -52574 -943243 -3682446
9000 -3682446 -5843309 -4869989 -2112120 -866726 -1496355 -1381892 524815 2003868 1134999
8991 1134999 -748492 -956793 1150710 3849993 5212485 4646500 2957535 1521535 852336
8982 852336 -151203 -2529022 -4810917 -4022741 117011 3930443 4183459 2051405 694364
8973 694364 456156 -618475 -2312760 -1900620 1164724 3631961 3169379 1914888 2980490
8964 2980490 5522326 6130944 3855931 880012 -1196587 -2733992 -3744711 -3267009 -1793288
8955a793288K27885j546620p34550J953525K522575k52217k815759k045681M94873
8946c989257J403781L79136o2404J212338K364070J417734q27488j678313j3106
8937B06491K101792J989647N019r58212K44143J359804N28386o37235j8330J041018
8927E862523l0621k262190k488762p83713k68660j470774j483287L96045J031527
8918a497912p23054j372295J185148L442033J935280p66499m03420J720476J210205
8909D729962j686271k636358p98752M540j723457k486470K9988K758049K036474
8900B27705q18810j953331p61096P2094p05776j224804J92675K248045K390968
8891c32330M39598r10722M01054K773457K804186n4056k633708k484575j029217
$$ plain form
8955 -1793288 -1565403 -3112023 -3846573 -1893048 629527 377310 -2438449 -4484130 -3989257
8946 -3989257 -2585476 -2206340 -2268744 -1056406 1307664 2725398 1897910 219597 206491
8937 206491 2308283 4297930 4302949 3344737 3588880 4948684 5477070 4839835 4821505 5862523
8927 5862523 5831902 3569712 1080950 297237 28577 -1442197 -2925484 -2529439 -1497912
8918 -1497912 -2220966 -3593261 -2408113 1033920 2969200 2202701 1799281 3519757 4729962
8909 4729962 3043691 407333 -391419 -386879 -2110336 -4596806 -4566818 -1808769 227705
8900 227705 -591105 -2544436 -3305532 -3233438 -3939214 -5164018 -4971343 -2723298 -332330
8891 -332330 107268 -803454 -402400 2371057 5175243 5121187 2487479 2904 -1026313
8882a026313p53301j247817m84198J332212K076039J281651N58402N14376L2359
8873B283410j024611j021594O40611K075547J415609p46386k358531k173898l91550
8864a301393J783818K653820J213617j549553l334425k849178q07803J308634
8856b882463K508322K340182Q42371j180479k440464j947054M77982L746845N365225
8847F830467L222390j463457m441689l134948K48461J886953J129674M7532l32241
8838C993142o42572r02737m36881K39187j08155j266388j939790j765699j020470
8829c850363O32456K750944K889994j28220l052315k115981R06987J079554j705670
8820b592614k374386R44999L663989K061004j030880j199710P25884Q66485j184178
$$ plain form
8882 -1026313 -1779614 -3027431 -3511629 -2179417 -103378 1178273 1736675 2251051 2283410
8873 2283410 1258799 237205 877816 2953363 4368972 3622586 1264055 -909843 -1301393
8864 -1301393 482425 3136245 4349862 2800309 -534116 -3383294 -4191097 -2882463
8856 -2882463 -374141 1966041 2808412 1627933 -812531 -2759585 -2281603 1465242 6830467
8847 6830467 10052857 8589400 4147711 1012763 1261224 3148177 4277851 4325383 3993142
8838 3993142 3350570 2447833 2010952 2250139 2141984 875596 -1064194 -2829893 -3850363
8829 -3850363 -3217907 -466963 2423031 2294811 -757504 -2873485 -1966498 -886944 -2592614
8820 -2592614 -4967000 -4022001 -358012 1702992 672112 -527598 198286 1064771 -119407
8811a19407k186849n99206J438305J530558J7441r78852k13067J417980J937575
8802B244478N86522j255174j923512j497813r53512l43468N48430Q91290K64148
8793a438611J63609J453511J848058n54648k742364m98306M148437M788094L26086
8784G493866l138133j700355J003750N96389j400013j541410m92767o70139j365552
8775a214364o55713M72840K2855j126505r42420O2923K10774j57132L9128J85318
8765c102296j97170M79237K780279L751248J154913k171435k231080n0446L94822
8756H08072j272935j991920q79024m6784k27952R6499J170904J410056N67635
8747c65449Q5456J87031k28578q39746j95087J250254J465930K74501m99534l23789
$$ plain form
8811 -119407 -2306256 -2905462 -1467157 63401 80842 -898010 -1111077 306903 2244478
8802 2244478 2831000 1575826 -347686 -1845499 -2799011 -3142479 -2594049 -1702759 -1438611
8793 -1438611 -1275002 178509 2026567 1471919 -1270445 -1768751 2379686 7167780 7493866
8784 7493866 4355733 2655378 3659128 4255517 2855504 1314094 821327 151188 -1214364
8775 -1214364 -1870077 -1397237 -1374382 -2500887 -3443307 -3380384 -3169610 -3326742 -3287614 -3102296
8765 -3102296 -3299466 -2820229 -39950 3711298 4866211 2694776 463696 413250 808072
8756 808072 -464863 -2456783 -3335807 -3382591 -3610543 -3514044 -2343140 -933084 -365449
8747 -365449 -279993 -92962 -321540 -1161286 -1356373 -106119 1359811 1634312 1134778 810989
8737H10989m30472r24056m68555P93522R51546m11765j289905l55195J246856
8728g7035J975290J871907J686265J428391M62213j571302l823385m081988r56648
8719c086292L153511L609877l76622l841611k640783Q33252J763958Q2986o94025
8710a195749K50850P65735N04190R96755J592121K80622j736628j345864O90356
8701H02388O14405j355604q76317K493403L415526m67499l870465j954280J962219
8692G63776J844921j578199k530003N13467K938006J417503j503084j654911J051439
8683A262915L095818K039538r28486k916666k746026j740476j274496p80408Q15695
8674c172592K727471L124840J801402J70814j028401k021514k373127j429655
$$ plain form
8737 810989 380517 -543539 -1012094 -218572 732974 321209 -968696 -1323891 -77035
8728 -77035 1898255 3770162 5456427 6884818 7347031 5775729 1952344 -2129644 -3086292
8719 -3086292 67219 3677096 3300474 -541137 -3181920 -2348668 -584710 -501724 -1195749
8710 -1195749 -944899 -179164 325026 1321781 2913902 3194524 1457896 112032 802388
8701 802388 1416793 61189 -815128 1678275 5093801 4626302 755837 -1198443 763776
8692 763776 2608697 1030498 -1499505 -986038 1951968 3369471 1866387 211476 1262915
8683 1262915 4358733 6398271 5469785 2553119 -192907 -1933383 -3207879 -3988287 -3172592
8674 -3172592 -445121 2679719 4481121 4651935 3623534 1602020 -771107 -2200762
8666b200762k00736k26204o46680O52398K821432K442490r75809l473283k285144
8657d092298K70646Q28825J5028N48506K378932K900845J080046j304799k243120
8648C82611j426133J49210J117721N83907r65201j942034j435586q8029J067126
8639b556408J588150J234173K3553r84320n98335M50430K69397r76883j004211
8630b554454O21368J226132o53518k342790p77923K818960M599623L022337k89572
8621E670163l353598m941172l924559l87046K941398L028244M86546j075413J11136
8612a444301K045480K423280J708709J386099J009311q39848l419752m036350
8604a167372j813637P48227J256176Q60296K056131M022881L296718n01682l042145
$$ plain form
8666 -2200762 -2401498 -2627702 -3274382 -2621984 199448 2641938 1666129 -1807154 -4092298
8657 -4092298 -3821652 -2992827 -2977799 -2429293 -50361 2850484 3930530 2625731 382611
8648 382611 -1043522 -894312 223409 807316 -157885 -2099919 -3535505 -3623534 -2556408
8639 -2556408 -968258 265915 289468 -694852 -1293187 -842757 -573360 -1550243 -2554454
8630 -2554454 -1933086 -706954 -1360472 -3703262 -4481185 -1662225 2937398 5959735 5670163
8621 5670163 2316565 -2624607 -6549166 -6936212 -3994814 -966570 -480024 -1555437 -1444301
8612 -1444301 601179 3024459 4733168 6119267 7128578 6288730 2868978 -1167372
8604 -1167372 -2981009 -2232782 -976606 -116310 1939821 5962702 9259420 8757738 5715593
8595E715593j288427J821432J659936j348850k973615j805191m96542p36781j147372
8586e99817p05005m25453n92289K29558K095357K749265J220500n80352j221225
8577B170539j647987k226683j231545J603145L215910J549064j008088j330797
8569A093558j82579l1104n54581Q5611J187139N62605j248609j519534J50865
8560d56629J210599K79227j049663j148354n95238n22010o44759j28851P39657
8551b316021Q57005j07267j108937q84964M06445J189313N78896k08821L17054
8542a277297J417930J272948R3376l28148Q3556j73580o63926O90852L057102
8533D172813K671114q54104k625483K27552L544389K380731j382465k542854q79135
$$ plain form
8595 5715593 4427166 6248598 7908534 6559684 3586069 1780878 1284336 547555 -599817
8586 -599817 -1304822 -1730275 -2322564 -2093006 2351 2751616 3972116 3391764 2170539
8577 2170539 522552 -1704131 -2935676 -1332531 1883379 3432443 2424355 1093558
8569 1093558 910979 879875 325294 410905 1598044 2160649 912040 -607494 -456629
8560 -456629 753970 1033197 -16466 -1164820 -1760058 -2282068 -2926827 -3055678 -2316021
8551 -2316021 -1459016 -1566283 -2675220 -3560184 -3153739 -1964426 -1385530 -1594351 -1277297
8542 -1277297 140633 1413581 1506957 1178809 1262365 1088785 424859 1115711 4172813
8533 4172813 6843927 5989823 3364340 3591892 7136281 9517012 8134547 5591693 4712558
8524D712558l55893j656544j453098R96375K035723m73609l782982m340272k019673
8515f337415R56082K658999K150453p6533j755119j081632O19721P46679m22177
8506b540942l08844J412205K177682Q00850r08926j475736j571334j630109p20116
8497d765270J033679J713601O36228l68843r667M59236l51552j586093j559547
8488d798228k0527J934625K889140J796187p33961k020046l04361K226010K105318
8479C074157j56917r07720O77347J520330J17208j216990q34967k52467m98062
8470A521919k05511O69908l35996l148779l496796M13736L993134L021850J11280
8461B544745k85145O31778p70781l005011j793027J787187K345663r35977k899344
$$ plain form
8524 4712558 4356665 2700121 1247023 2243398 4279121 3805512 22530 -4317742 -6337415
8515 -6337415 -5381333 -2722334 -571881 -648414 -2403533 -3485165 -2865444 -2118765 -2540942
8506 -2540942 -2849786 -1437581 740101 1540951 632025 -843711 -2415045 -4045154 -4765270
8497 -4765270 -3731591 -2017990 -1381762 -1750605 -1760272 -1301036 -1652588 -3238681 -4798228
8488 -4798228 -4818755 -2884130 5010 1801197 1067236 -952810 -1257171 968839 3074157
8479 3074157 2917240 2009520 2686867 4207197 4324405 3107415 2272448 2019981 1521919
8470 1521919 1316408 1986316 1650320 -1498459 -4995255 -4581519 -588385 2433465 2544745
8461 2544745 2259600 2891378 2120597 -884414 -2677441 -890254 1455409 519432 -2379912
8452b379912o43108K562502L020631J352040k09854j073604j136369j161J187229
8443B678394M31827j534241j786740j27229M50054q40309j138560N75262J296003
8434D461l81167j193236J005691K820958P86319k505940k490075Q6753J087117
8425g79119R7221K05235J767064J855924l1909p87747Q31788J906730J39589k552596
8415B652180l103613j347216P20950J711900J419746K96344m61367K40032J562959
8406C691915J299897q80312k417548j281619J033317J465788n05869k304140j739678
8397a638249K00226P95842n95820j461453K58025K658242K249039m95200j267193
8388G03459J416480L483944J696179j013269n77803J101694m19820l785545l559991
$$ plain form
8452 -2379912 -3023020 -460518 2560113 3912153 3702299 2628695 1492326 1491165 2678394
8443 2678394 3110221 1575980 -210760 -337989 112065 -728244 -1866804 -1291542 4461
8434 4461 -376706 -1569942 -564251 2256707 3043026 537086 -1952989 -1866236 -779119
8425 -779119 -681898 -476663 1290401 3146325 3114416 2326669 3158457 5065187 5204776 2652180
8415 2652180 -451433 -1798649 -1077699 634201 2053947 2350291 1888924 2128956 3691915
8406 3691915 4991812 4111500 1693952 412333 1445650 2911438 2405569 101429 -1638249
8397 -1638249 -1438023 -642181 -1238001 -2699454 -2441429 216813 2465852 1970652 703459
8388 703459 2119939 5603883 7300062 6286793 5708990 6810684 6390864 2605319 -954672
8379i54672K83277J784505r71160k484909O32436L563811J312951k808630k612248
8370b254639J036748K186154n56598k738669j741168M3953K79865J39631J301841
8361b302882K924456L130626J429729j107662k592907j401302J784058L585374
8353E449490J600276k181491l766952k208731P4485J195767J285526O09670q85086
8344A172954k143634j672382J88311J645550J847226J061866o49259k687383k979719
8335d216470n42092K126791K266039J193359J784913K974901J470471j756204
8327E301708k209342M98691J562163r22671k564702j77769K651281J467581j903646
8318C703294k778941r99411M1084l65893N8278J662176K247764J208186K94201
$$ plain form
8379 -954672 -671395 1113110 141950 -2342959 -1710523 1853288 3166239 357609 -2254639
8370 -2254639 -1217891 968263 411665 -2327004 -4068172 -4024219 -3744354 -3604723 -2302882
8361 -2302882 621574 3752200 5181929 4074267 1481360 80058 1864116 5449490
8353 5449490 7049766 4868275 1101323 -1107408 -1032923 162844 1448370 2058040 1172954
8344 1172954 -970680 -2643062 -2454751 -809201 1038025 2099891 1450632 -1236751 -4216470
8335 -4216470 -4758562 -2631771 -365732 827627 2612540 5587441 7057912 5301708
8327 5301708 3092366 3591057 5153220 4230549 1665847 1488078 4139359 5606940 3703294
8318 3703294 924353 -75058 -33974 -399867 -341589 1320587 3568351 4776537 5070738
8309E070738Q99j189720l282304l803373j648916P96308J064627J11688M62859
8300b417194K149928K720598J079925o99399k72938J495192J462544j518153m750882
8291g50379m859512j772752J547399K736742K128995J415693J391392J361610
8283C199188L37934j339912j901729m91145Q04271p31368l859292l980791L12263
8274g650581M393541L792566K76636j618614j375523j441738j615634J86638K682972
8265b369737K370022k32655r49638J069901K167876P63114l75993K39412L38790
8256C021092j182622k055257j287116q82831j031834Q07101L801141L011344k053034
8247B147984m680608j088892L087529J912721j292128l16461L101434K770189
$$ plain form
8309 5070738 5071637 3881917 599613 -3203760 -4852676 -4056368 -2991741 -2880053 -2417194
8300 -2417194 -267266 2453332 3533257 2833858 2560920 4056112 5518656 4000503 -750379
8291 -750379 -5609891 -7382643 -5835244 -3098502 -969507 446186 1837578 3199188
8283 3199188 3537122 2197210 295481 -195664 608607 -122761 -3982053 -7962844 -7650581
8274 -7650581 -3257040 535526 812162 -806452 -2181975 -3623713 -5239347 -5052709 -2369737
8265 -2369737 285 -232370 -1182008 -112107 2055769 2818883 2442890 2682302 3021092
8256 3021092 1838470 -216787 -1503903 -2386734 -3418568 -2611467 1189674 4201018 2147984
8247 2147984 -2532624 -3621516 -533987 1378734 86606 -229855 2871579 5641768
8239E641768j052680k546921l85390R45953n73387j931646j152985J02450O59343
8230b93495J416588K248026J763291M37643L6506K14697m65266j046551O5130
8221D376569J110949m61144k701632j785327J114108J477243o91820j074832R11906
8212B276020J123978j362919k240296J73698J659676m98405k792042j627635R58820
8203b329105J495469O30727O35214R68050J59872p35130p8929J195162J297248
8194C238578M86744r5617n14708r63506o49057M81041Q96172k44864j967702l337932
8184b670851l953064k446576J889928N665495M209049j078838l381444l33883
8176b100184K487282R00947j172284R24536M047142K512559k002464l020008L29019
$$ plain form
8239 5641768 4589088 2042167 1656777 2602730 2029343 97697 -1055288 -952838 -293495
8230 -293495 1123093 3371119 5134410 5572053 5608559 5823256 5357990 4311439 4376569
8221 4376569 5487518 5026374 2324742 539415 1653523 3130766 2438946 1364114 2276020
8212 2276020 3399998 2037079 -203217 -29519 1630157 1131752 -1660290 -3287925 -2329105
8203 -2329105 -833636 -202909 432305 1400355 1560227 825097 746168 1941330 3238578
8194 3238578 3725322 3629705 3114997 2151491 1502434 1983475 2879647 2634783 667081 -2670851
8184 -2670851 -6623915 -9070491 -7180563 -1515068 2693981 1615143 -1766301 -2100184
8176 -2100184 387098 1288045 115761 1040297 5087439 7599998 5597534 2577526 2906545
8167B906545K527892Q00767j490802j311714k02063m23510j288613j373184j160859
8158a015541j535784j893548j314330p6664R68664J355978R70694J80563q3289
8149b443257M62011O65784k55039r97339j24074J161720O26674j131171j211990
8140c246681J091092L097209K740340J228643M60759k2473j574184l257572k444719
8131a927586J358801N025385N053621J533080k170182l414791k679756j694128
8123A084444q40578K52681Q89644J74443r88766j004910k70503l14632o39154
8114a657331N77482K597332K461028j02910j857051j429207j457664l225536l386136
8105g479993M87367M705321M301680N62400j139885M86381J681147L63219j099408
$$ plain form
8167 2906545 5434437 6235204 4744402 3432688 3230625 2807115 1518502 145318 -1015541
8158 -1015541 -2551325 -4444873 -5759203 -5835867 -4867203 -3511225 -2540531 -2359968 -2443257
8149 -2443257 -1981246 -1315462 -1570501 -2567840 -2691914 -1530194 -903520 -2034691 -3246681
8140 -3246681 -2155589 941620 3681960 4910603 5371362 5348889 3774705 517133 -1927586
8131 -1927586 -568785 4456600 9510221 11043301 8873119 5458328 2778572 1084444
8123 1084444 243866 496547 1386191 1560634 571868 -433042 -703545 -1018177 -1657331
8114 -1657331 -1079849 1517483 3978511 3875601 2018550 589343 -868321 -4093857 -7479993
8105 -7479993 -6992626 -2287305 2014375 2576775 1436890 1923271 3604418 3967637 2868229
8096B868229n78172N40759K76789q26200j122099l19017P20830J173482O27225
8087C361826m64770o93651N00470J359859M3874k189687k442787n41710P94902
8078b71674K79210l74400J28190N29698l96184j525171j255991O5304J092489
8069a728529J439256J373008P91728k52143j028380j157478j187646j331825q34427
8060c916436M28937J016024o0532j409401r94415P84368J515318L21257p25160
8051c040040M22315K570196K597940j56124k561426j789692O55669J134957n22422
8042f88627o98654J933647L474323N74881l595154l263012J331429L952011J347810
8033D368654k419061k444517K62293J552346P07016L81395J487175K050154J017590
$$ plain form
8096 2868229 2290057 2830816 3107605 2281405 1159306 840289 1561119 2734601 3361826
8087 3361826 2897056 2203405 2703875 4063734 4107608 1917921 -524866 -1066576 -271674
8078 -271674 7536 -366864 -238674 291024 -105160 -1630331 -2886322 -2821018 -1728529
8069 -1728529 -289273 1083735 1875463 1623320 594940 -562538 -1750184 -3082009 -3916436
8060 -3916436 -3487499 -2471475 -2532007 -3941408 -4935823 -4151455 -2636137 -2314880 -3040040
8051 -3040040 -2617725 -47529 2550411 2394287 -167139 -1956831 -1301162 -166205 -688627
8042 -688627 -1387281 546366 4020689 4595570 1000416 -2262596 -931167 3020844 4368654
8033 4368654 1949593 -494924 -232631 1319715 2026731 2408126 3895301 5945455 6963045
8024F963045j35801k47224k69719j195325k189360k045013j097745m97872n43475
8015a258489p51426q37078p33756k37265N90864J146128J018334N39905J79191
8006c43592K4915K16903R41535J504856O52281j337195k269700j026801N11342
7997a125456L01443n63384J38334J614528J127405j254028k524244j605468o34720
7988d525590n93411L55641K563219L027261M06540j891177r17032J011405O40408
7979G7264l58335J242486L592108K264957k019733m168115k766837j406467j679101
7970e221773r83608J401331K064976l49378k085000m36369J738315J131970n17642
7961c257178N9317K031814K424709J158892K41809j03661q89113j541950r70822
$$ plain form
8024 6963045 6827244 6580020 6310301 5114976 2925616 880603 -217142 -715014 -1258489
8015 -1258489 -2009915 -2846993 -3580749 -3818014 -3227150 -2081022 -1062688 -522783 -343592
8006 -343592 -318677 -101774 839761 2344617 2996898 1659703 -609997 -1636798 -1125456
7997 -1125456 -824013 -1387397 -1249063 365465 1492870 238842 -2285402 -3890870 -4525590
7988 -4525590 -5119001 -4763360 -2200141 827120 1233660 -657517 -1574549 -563144 77264
7979 77264 -281071 961415 4553523 6818480 4798747 630632 -2136205 -3542672 -5221773
7970 -5221773 -6205381 -4804050 -2739074 -3088452 -5173452 -5609821 -3871506 -2739536 -3257178
7961 -3257178 -3197861 -1166047 1258662 2417554 2659363 2555702 1666589 124639 -846183
7952h46183j24426m70186j128403l19676J432777K112045J212762k32894j436783
7943A99033j749559l67134J869875K245354r1462k185212j448548M59963P13131
7934c54559l2224N27444J759958J216202q11325j631490n75105K71276l28175
7925D2002j150864o20149J325300L196162K771883p09995m302656l761528M40333
7916b769512K835461P64552j608338k47042K243486J636769n45198m52135Q01136
7907B659179j47159j695595n0190K862726K103309r72301n93428K599715J801655
7898H567911l757417o278798j973140K713259J811519j215317p32644J690197
7890H25570J523119m51758o53142M86424L44968m31963O0152L91362j342173k761889
$$ plain form
7952 -846183 -970609 -1440795 -2569198 -2888874 -1456097 655948 1868710 1635816 199033
7943 199033 -1550526 -1917660 -47785 2197569 2106107 -79105 -1527653 -1067690 -354559
7934 -354559 -386783 140661 1900619 3116821 2305496 674006 98901 370177 42002
7925 42002 -1108862 -1729011 -403711 2792451 5564334 4854339 551683 -3209845 -2769512
7916 -2769512 65949 830501 -777837 -1024879 1218607 2855376 2310178 1858043 2659179
7907 2659179 2512020 816425 766235 3628961 5732270 4759969 4166541 6766256 8567911
7898 8567911 4810494 -1468304 -3441444 -728185 1083334 -131983 -864627 825570
7890 825570 2348689 1896931 1243789 1730213 2075181 1643218 1703370 2094732 752559 -2009330
7880b009330q46303K090349J801318n26390l45965K210455K685269K01805j309598
7871C951610l29072j32650k351894l604981j232942J938467J884366n44220j263619
7862a684935R40413L069123K318399m58845k234491j611990k48851l68061j570860
7853a850098j390453Q72951K682469J741533p30101j937144j351578m92660M2112
7844b412969Q23956J461892Q59046m26377n17175P73925J473297M88181q99895
7835A623881j270029r62092q64106q62873n29754j51588q4489J544L64093M74894
7825b260519q5790o90829n17296J20828K15071l38289m98864L42434J305495J178000
7815a229759K55031P2183J115261J830778P52706j162218j626402j36257J450163
$$ plain form
7880 -2009330 -2855633 -765284 1036034 509644 163679 2374134 5059403 5261208 3951610
7871 3951610 3622538 3489888 1137994 -2466987 -3699929 -1761462 122904 -421316 -1684935
7862 -1684935 -744522 2324601 4643000 4184155 1949664 337674 88823 -279238 -1850098
7853 -1850098 -3240551 -2367600 314869 2056402 1326301 -610843 -1962421 -2455081 -2412969
7844 -2412969 -1589013 -127121 731925 305548 -211627 562298 2035595 2523776 1623881
7835 1623881 353852 -608240 -1472346 -2335219 -2864973 -3016561 -3101050 -3099506 -2735413 -2260519
7825 -2260519 -2346309 -3037138 -3554434 -3433606 -3218535 -3556824 -4055688 -3713254 -2407759 -1229759
7815 -1229759 -974728 -902545 212716 2043494 2796200 1633982 7580 -128677 1321486
7806A321486J521670M60838n48611j038027r94496m04020K04897m7269q80106
7797d03638p31942R59530K560445K417341J124914L51671L64154J87599m43686
$$ plain form
7806 1321486 2843156 3303994 2755383 1717356 722860 318840 523737 476468 -403638
7797 -403638 -1135580 -176050 2384395 4801736 5926650 6278321 6642475 6830074 6386388
$$ [...]
##END NTUPLES=NMR SPECTRUM
##END=
