##TITLE=31Pdec_PR1452_W
 D2O, 24 sc
 8.04.2021
##JCAMPDX= 6.0         $$ Bruker NMR JCAMP-DX V2.0
##DATA TYPE= NMR SPECTRUM
##DATA CLASS= NTUPLES
##ORIGIN= UXNMR, Bruker Analytische Messtechnik GmbH
##OWNER= root
$$ XWIN-NMR		Version 3.5
$$ Thu Apr  8 14:44:25 2021 Russian Standard Time (UT+4h)  she@DPX200
##.OBSERVE FREQUENCY= 81.013821
##.OBSERVE NUCLEUS= ^31P
##.ACQUISITION MODE= SIMULTANEOUS
##.ACQUISITION SCHEME= undefined
##.AVERAGES= 24
##.DIGITISER RES= 16
##SPECTROMETER/DATA SYSTEM= spect
##.PULSE SEQUENCE= zgpg30
##.SOLVENT NAME= D2O
##.SHIFT REFERENCE= (INTERNAL, D2O, 0, 248.564)
##AUDIT TRAIL= $$ (NUMBER, WHEN, WHO, WHERE, WHAT)
$$ ##TITLE= Audit trail, XWIN-NMR		Version 3.5
$$ ##JCAMPDX= 5.01
$$ ##ORIGIN= Bruker BioSpin GmbH
$$ ##OWNER= she
$$ F:/spectra/data/she/nmr/P31/1/pdata/1/auditp.txt
$$ ##AUDIT TRAIL=  $$ (NUMBER, WHEN, WHO, WHERE, WHAT)
(   1,<2021-04-08 14:42:41.21 +0400>,<she>,<DPX200>,
      <created by zg, POWCHK disabled, PULCHK disabled
       configuration hash MD5:
       00 E9 B6 7A A2 85 ED C7 34 08 36 98 17 FE 4E 26
       data hash MD5: 32K
       1E 72 CB 01 1D F5 A4 05 5D 5F 52 46 DE 2C 79 77>)
(   2,<2021-04-08 14:42:55.39 +0400>,<she>,<DPX200>,
      <Start of raw data processing
       efp BC_mod = 2 LB = 1 FT_mod = 6 PKNL = 1 PHC0 = -5482.33 PHC1 = 810.4021 SI = 64K 
       data hash MD5: 64K
       3D 28 78 A9 78 55 C8 D0 B8 B4 B7 A3 17 65 34 E7>)
(   3,<2021-04-08 14:43:36.34 +0400>,<she>,<DPX200>,
      <pk PHC0 = 93.884 PHC1 = -191.5999 
       data hash MD5: 64K
       AC D6 8F C2 9B 99 02 B8 5F 5A 02 9B 0E C2 4B C5>)
(   4,<2021-04-08 14:43:39.56 +0400>,<she>,<DPX200>,
      <abs ABSG = 5 
       data hash MD5: 64K
       FD 7B 15 B5 5B 5E AE 28 6A DE C4 EA 18 12 05 57>)
$$ ##END=
$$ 
$$ hash MD5
$$ A8 0C 92 C9 76 C6 8B 4B 5D 81 0C 90 AC 62 6D 15
##$RELAX= 
##$RELAX= 
##$RELAX= 
##$RELAX= 
##$RELAX= 
##$RELAX= 
##$RELAX= 
##$RELAX= 
$$ Bruker specific parameters
$$ --------------------------
##$DU= <F:/spectra>
##$EXPNO= 1
##$NAME= <P31>
##$PROCNO= 1
##$TYPE= <nmr>
##$USER= <she>
##$AMP= (0..31)
100 100 100 100 100 100 100 100 100 100 100 100 100 100 100 100 100 100 
100 100 100 100 100 100 100 100 100 100 100 100 100 100 
##$AQSEQ= 0
##$AQ_mod= 1
##$AUNM= <au_zg>
##$AUTOPOS= <>
##$BF1= 81.014009
##$BF2= 200.13
##$BF3= 200.13
##$BF4= 200.13
##$BF5= 200.13
##$BF6= 200.13
##$BF7= 200.13
##$BF8= 200.13
##$BYTORDA= 1
##$CFDGTYP= 0
##$CFRGTYP= 5
##$CHEMSTR= <none>
##$CNST= (0..31)
1 1 145 1 1 1 1 1 1 1 1 1 1 1 1 1 1 1 1 1 1 1 1 1 1 1 1 1 1 1 1 1 
##$CPDPRG= <waltz16>
##$CPDPRG1= <>
##$CPDPRG2= <waltz16>
##$CPDPRG3= <>
##$CPDPRG4= <mlev>
##$CPDPRG5= <mlev>
##$CPDPRG6= <mlev>
##$CPDPRG7= <mlev>
##$CPDPRG8= <mlev>
##$CPDPRGB= <>
##$CPDPRGT= <>
##$D= (0..31)
0 1 0 0 0 0 0 0 0 0 0 0.03 2e-05 3e-06 0 0 0 0 0 0 0 0 0 0 0 0 0 0 0 0 
0 0 
##$DATE= 1617878560
##$DBL= (0..7)
120 120 120 11 120 120 24 19 
##$DBP= (0..7)
150 150 150 150 150 150 150 150 
##$DBP07= 0
##$DBPNAM0= <>
##$DBPNAM1= <>
##$DBPNAM2= <>
$$ [...]
##$SUBNAM3= <"">
##$SUBNAM4= <"">
##$SUBNAM5= <"">
##$SUBNAM6= <"">
##$SUBNAM7= <"">
##$SUBNAM8= <"">
##$SUBNAM9= <"">
##$SW= 501.771253377433
##$SWIBOX= (0..15)
0 1 3 0 0 0 0 0 0 0 0 0 0 0 0 0 
##$SW_h= 40650.406504065
##$TD= 32768
##$TD0= 1
##$TE= 0
##$TE2= 300
##$TE3= 300
##$TEG= 300
##$TL= (0..7)
0 120 53 12 22 120 120 120 
##$TP= (0..7)
150 150 150 150 150 150 150 150 
##$TP07= 0
##$TPNAME0= <>
##$TPNAME1= <>
##$TPNAME2= <>
##$TPNAME3= <>
##$TPNAME4= <>
##$TPNAME5= <>
##$TPNAME6= <>
##$TPNAME7= <>
##$TPOAL= (0..7)
0.5 0.5 0.5 0.5 0.5 0.5 0.5 0.5 
##$TPOFFS= (0..7)
0 0 0 0 0 0 0 0 
##$TUNHIN= 0
##$TUNHOUT= 0
##$TUNXOUT= 0
##$USERA1= <user>
##$USERA2= <user>
##$USERA3= <user>
##$USERA4= <user>
##$USERA5= <user>
##$V9= 5
##$VALIST= <valist>
##$VCLIST= <CCCCCCCCCCCCCCC>
##$VD= 0
##$VDLIST= <DDDDDDDDDDDDDDD>
##$VPLIST= <PPPPPPPPPPPPPPP>
##$VTLIST= <TTTTTTTTTTTTTTT>
##$WBST= 1024
##$WBSW= 4
##$XGAIN= (0..3)
0 0 0 0 
##$XL= 0
##$YL= 0
##$YMAX_a= 10515
##$YMIN_a= -13401
##$ZGOPTNS= <>
##$ZL1= 120
##$ZL2= 120
##$ZL3= 120
##$ZL4= 120
##$ABSF1= 248.5645
##$ABSF2= -253.2056
##$ABSG= 5
##$ABSL= 3
##$ALPHA= 0
##$AQORDER= 0
##$ASSFAC= 0
##$ASSFACI= 0
##$ASSFACX= 0
##$ASSWID= 0
##$AUNMP= <proc_1d>
##$AZFE= 0.1
##$AZFW= 0.5
##$BCFW= 0
##$BC_mod= 2
##$BYTORDP= 0
##$COROFFS= 0
##$CY= -3
##$DATMOD= 1
##$DC= 0
##$DFILT= <>
##$DTYPP= 0
##$F1P= 0
##$F2P= 0
##$FCOR= 1
##$FTSIZE= 65536
##$FT_mod= 6
##$GAMMA= 0
##$GB= 0
##$INTBC= 1
##$INTSCL= 5.30512e-09
##$ISEN= 30
##$LB= 1
##$LEV0= 0
##$LPBIN= 0
##$MAXI= 10000
##$MC2= 0
##$MEAN= 0
##$ME_mod= 0
##$MI= 50
##$NCOEF= 0
##$NC_proc= -6
##$NLEV= 6
##$NOISF1= 182.463
##$NOISF2= 159.3651
##$NSP= 0
##$NTH_PI= 0
##$NZP= 0
##$OFFSET= 248.5645
##$PC= 4
##$PHC0= -5388.446
##$PHC1= 618.8022
##$PH_mod= 1
##$PKNL= yes
##$PPARMOD= 0
##$PSCAL= 0
##$PSIGN= 0
##$REVERSE= no
##$SF= 81.014009
##$SI= 65536
##$SIGF1= 159.3651
##$SIGF2= -187.1042
##$SINO= 113.3802
##$SIOLD= 16384
##$SREGLST= <1H.CDCl3>
##$SSB= 0
##$STSI= 65536
##$STSR= 0
##$SW_p= 40650.406504065
##$SYMM= 0
##$S_DEV= 0
##$TDeff= 32768
##$TDoff= 0
##$TI= <>
##$TILT= no
##$TM1= 0
##$TM2= 0
##$TOPLEV= 0
##$USERP1= <user>
##$USERP2= <user>
##$USERP3= <user>
##$USERP4= <user>
##$USERP5= <user>
##$WDW= 1
##$XDIM= 65536
##$YMAX_p= 378923211
##$YMIN_p= -13610121
$$ End of Bruker specific parameters
$$ ---------------------------------
##NTUPLES= NMR SPECTRUM
##VAR_NAME=  FREQUENCY,     SPECTRUM/REAL,   SPECTRUM/IMAG
##SYMBOL=    X,             R,               I
##VAR_TYPE=  INDEPENDENT,   DEPENDENT,       DEPENDENT
##VAR_FORM=  AFFN,          ASDF,            ASDF
##VAR_DIM=   65536,         65536,           65536
##UNITS=     HZ,            ARBITRARY UNITS, ARBITRARY UNITS
##FACTOR=    0.620285442955139, 1,           1
##FIRST=     20137.2065510759, 0,            0
##LAST=      -20513.1999529892, 0,           0
##MIN=       -20513.1999529892, -13610121,   0
##MAX=       20137.2065510759, 378923211,    0
$$ Real data points
##PAGE= N=1
##DATA TABLE= (X++(R..R)), XYDATA
$$ [...]
$$ plain form
13128 3998617 4767970 3087622 1768138 1200122 -539724 -2998151 -3010737 -89721 2054100
13119 2054100 1400202 1054965 3842248 6989351 6116264 1933322 -1331280 -2354298 -2979416
13110 -2979416 -3184537 -879554 2982705 3853385 -290442 -5840336 -8330329 -7484245 -5771014
13101 -5771014 -4423600 -2986435 -1219376 406447 1346757 1247040 413300 131534 1082879
13092 1082879 1636124 -60108 -2312050 -1218138 3474546 7054450 5882618 1716128
13084 1716128 -1878856 -4270413 -6241639 -6670922 -4387376 -1431166 -676826 -1369441 -636104
13075 -636104 1476499 2326466 1643852 2131126 4628759 6421729 5519489 3483422 2586954
13066 2586954 2822599 3212913 3733409 4308165 3878609 2121418 501667 158052 179629
$$ packed form
13128C998617P69353j680348j319484n68016j739846k458427j2586K921016K143821
13119B054100o53898l45237K787283L147103q73087m182942l264602j023018o25118
13110b979416k05121K304983L862259Q70680m143827n549894k489993Q46084J713231
13101e771014J347414J437165J767059J625823R40310r9717q33740k81766R51345
13092A082879N53245j696232k251942J093912M692684L579904j171832m166490
13084A716128l594984k391557j971226m29283K283546K956210P54340o92615P33337
13075f36104K112603Q49967o82614M87274K497633J792970r02240k036067q96468
13066B586954K35645L90314N20496N74756m29556j757191j619751l43615K1577
$$ plain form
13057 179629 -666945 -1846311 -2016104 -964290 473721 1363435 854208 -1158982 -2924883
13048 -2924883 -2199854 460384 1859019 633625 -890390 -777960 -498420 -1427628 -1251996
13039 -1251996 2389342 6669224 6537973 2305591 -344411 1457472 3807957 2035611
13031 2035611 -2683496 -5274692 -3364122 526548 2541876 1437275 -855116 -1693053
13023 -1693053 -739026 -276264 -1836089 -3413402 -2068645 1123608 1689170 -1952147 -5801336
13014 -5801336 -5610766 -2354662 -18634 67654 -215268 259406 404115 -687651 -2338061
13005 -2338061 -3575732 -4054048 -3574105 -2282842 -1294921 -1477598 -1711667 -175078 2606498
12996 2606498 3970809 2716728 534112 -724436 -1238636 -1831913 -2274216 -2164202 -1930981
$$ packed form
13057A79629q46574j179366j69793J051814J438011Q89714n09227k013190j765901
13048b924883P25029K660238J398635j225394j524015J12430K79540r29208J75632
13039a251996L641338M279882j31251m232382k650002J801883K350485j772346
13031B035611m719107k591196J910570L890670K015328j104601k292391q37937
13023a693053R54027M62762j559825j577313J344757L192253N65562l641317l849189
13014e801336J90570L256104K336028Q6288k82922M74674J44709j091766j650410
13005b338061j237671m78316M79943J291263R87921j82677k34069J536589K781576
12996B606498J364311j254081k182616j258548n14200n93277m42303J10014K33221
$$ plain form
12987 -1930981 -1765342 -1072740 -159946 -638049 -2509063 -2791662 534373 4757113 5607284
12978 5607284 3282347 1916836 3252258 4502438 3258699 947281 -234453 -703998
12970 -703998 -1603467 -2181344 -1693528 -1662518 -3171437 -3730429 -461492 4626969 6377458
12961 6377458 3289478 -1040292 -3445348 -4354279 -4636370 -3287836 -247876 1829225
12953 1829225 1274665 345704 1622567 3499967 2512079 -1023521 -2974392 -861051 3214955
12944 3214955 5341179 3698590 -301635 -3316013 -2760451 492637 2687848 1697054
12936 1697054 -240173 -84189 1232359 485178 -2348799 -3855368 -2510298 -701145
12928 -701145 -604258 -1365532 -1778808 -2637006 -4336558 -4801511 -2476824 451292 677793
$$ packed form
12987a930981J65639O92602R12794m78103j871014k82599L326035M222740Q50171
12978E607284k324937j365511J335422J250180j243739k311418j181734m69545
12970g03998q99469n77877M87816L1010j508919n58992L268937N088461J750489
12961F377458l087980m329770k405056r08931k82091J348534L039960K077101
12953A829225n54560r28961J276863J877400r87888l535600j950871K113341M076006
12944C214955K126224j642589m000225l014378N55562L253088K195211r90794
12936A697054j937227J55984J316548p47181k833977j506569J345070J809153
12928g01145R6887p61274m13276q58198j699552m64953K324687K928116K26501
$$ plain form
12919 677793 -1454065 -2578120 -1260649 305055 -151010 -1922639 -2720650 -1699669 -12424
12910 -12424 975957 1016549 570466 -96245 -774483 -601555 1329435 4160056 5352956
12901 5352956 3847203 1990623 2395747 3755622 2484188 -1711184 -5094118 -5348252
12893 -5348252 -4399879 -4338215 -3909985 -1619852 544450 -123371 -2433772 -2983057 -1289472
12884 -1289472 227522 678930 1547650 3243710 4296533 4373462 4880678 5853557 5344168
12875 5344168 3000921 1371544 2141456 3586969 3495827 2414722 2010920 2009272 972883
12866 972883 -1014913 -2460570 -2549613 -1548501 191174 2194053 3454241 3399091 2763507
12857 2763507 2473672 2359908 1952375 1577207 1438652 655118 -1261269 -2911170 -2822139
$$ packed form
12919F77793k131858j124055J317471J565704m56065j771629p98011J020981J687245
12910a2424R88381M0592m46083o66711o78238J72928J930990K830621J192900
12901E352956j505753j856580M05124J359875j271434m195372l382934k54134
12893e348252R48373O1664M28230K290133K164302o67821k310401n49285J693585
12884a289472J516994M51408Q68720J696060J052823P6929N07216R72879n09389
12875E344168k343247j629377P69912J445513r1142j081105m03802j648j036389
12866I72883j987796j445657q9043J001112J739675K002879J260188n5150o35584
12857B763507k89835j13764m07533l75168j38555p83534j916387j649901Q9031
$$ plain form
12848 -2822139 -2049332 -2862715 -5108917 -6096162 -4421989 -1948894 -1229562 -2455705 -3754688
12839 -3754688 -3358205 -799175 2947759 5743860 5615801 2660507 -886363 -2950793
12831 -2950793 -3407322 -3348172 -3532985 -4052828 -4541120 -4030998 -1579535 2051024 4204325
12822 4204325 2982219 -452725 -3283675 -4187822 -3891069 -3187533 -2115807 -1052262 -811498
12813 -811498 -1149841 -791256 248539 -24326 -2617926 -5314028 -5352099 -3517484 -3142852
12804 -3142852 -5068199 -6216757 -4181422 -874143 317664 -664239 -1095923 63991
12796 63991 1136683 1185825 1520817 2666909 2567481 -122023 -2979436 -2765965 -271668
12787 -271668 777502 -692065 -1746607 -236950 2084164 2741125 2282301 2564895 3072846
$$ packed form
12848b822139P72807q13383k246202r87245J674173K473095P19332j226143j298983
12839c754688L96483K559030L746934K796101j28059k955294l546870k064430
12831b950793m56529N9150j84813n19843m88292N10122K451463L630559K153301
12822D204325j222106l434944k830950r04147K96753P03536J071726J063545K40764
12813h11498l38343L58585J039795k72865k593600k696102l8071J834615L74632
12804c142852j925347j148558K035335L307279J191807r81903m31684J159914
12796F3991J072692M9142L34992J146092r9428k689504k857413K13471K494297
12787b71668J049170j469567j054542J509657K321114O56961m58824K82594N07951
$$ plain form
12778 3072846 1774084 -1001596 -2278297 -372723 2917957 4720074 4183951 2513539
12770 2513539 1131003 649034 940216 1548683 2287802 3415724 4700275 4765970 2657537
12761 2657537 -47736 -359502 2382648 5417414 5987526 4313362 2008889 -820539
12753 -820539 -4808551 -8495911 -8851425 -5202618 -807870 689306 -578989 -1320624 523270
12744 523270 3353422 4367548 3409548 2991123 4504068 6027919 4990183 1843397 -632729
12735 -632729 -1107561 -741646 -586986 -327766 -144472 -1311390 -3626817 -4541167 -2717338
12726 -2717338 -486049 -487016 -1610544 -1094937 638160 631940 -1521240 -2688584 -818165
12717 -818165 2381070 4245620 4057710 2153541 -1256607 -4823940 -5835138 -3280241
$$ packed form
12778C072846j298762k775680j276701J905574L290680J802117n36123j670412
12770B513539j382536m81969K91182O08467P39119J127922J284551O5695k108433
12761B657537k705273l11766K742150L034766N70112j674164k304473k829428
12753h20539l988012l687360l55514L648807M394748J497176j268295p41635J843894
12744E23270K830152J014126r58000m18425J512945J523851j037736l146786k476126
12735f32729m74832L65915J54660K59220J83294j166918k315427r14350J823829
12726b717338K231289r67j123528N15607J733097o220k153180j167344J870419
12717h18165L199235J864550j87910j904169l410148l567333j011198K554897
$$ plain form
12709 -3280241 216750 1277568 -433730 -2678765 -3768683 -3685852 -3052986 -2634870 -3270980
12700 -3270980 -4853071 -5863618 -5255254 -4248071 -4774890 -6482627 -6926686 -4908447 -2152564
12691 -2152564 -1013038 -1473238 -1347069 778598 3595212 4499912 2710301 171288 -1012147
12682 -1012147 -1152428 -1890558 -3154659 -2987175 -611694 2095607 3038370 2420090 1774080
12673 1774080 1585996 1163064 237384 -502306 -334582 691278 1701537 1557521 16444
12664 16444 -1583210 -1636185 -291223 1036169 2165797 4300314 7086877 7732975 4631143
12655 4631143 198144 -1874614 -1144780 -267160 -1070631 -2752040 -3678764 -3238417 -1854374
12646 -1854374 -456197 39513 -367195 -606811 -1485 786145 1126753 1731782 3219343
$$ packed form
12709c280241L496991J060818j711298k245035j089918Q2831O32866M18116o36110
12700c270980j582091j010547O08364J007183n26819j707737m44059K018239K755883
12691b152564J139526m60200J26169K125667K816614R04700j789611k539013j183435
12682a012147j40281p38130j264101J67484K375481K707301R42763o18280o46010
12673A774080j88084m22932r25680p39690J67724J025860J010259j44016j541077
12664A6444j599654n2975J344962J327392J129628K134517K786563O46098l101832
12655D631143m432999k072758P29834Q77620q03471j681409r26724M40347J384043
12646a854374J398177M95710m06708k39616O05326P87630L40608O05029J487561
$$ plain form
12637 3219343 4283076 3088766 80371 -2350615 -2891384 -2461440 -2330350 -2510014 -2280999
12628 -2280999 -1317447 -89897 341122 -718984 -2363495 -2663249 -1211901 160531 350731
12619 350731 1015540 3642937 6060089 4782946 319976 -2924882 -2338600 55976 1151841
12610 1151841 610766 -65229 -222871 -158892 185701 1038509 1805519 1320168 -982272
12601 -982272 -4338214 -6799525 -6448873 -3377264 -199164 532391 -730588 -1358568 -90003
12592 -90003 1710409 2320618 1630779 538963 -320520 -873588 -1534684 -2811889 -4157040
12583 -4157040 -3840770 -1317290 1093586 818871 -1307593 -2314644 -1563108 -1170361 -2034190
12574 -2034190 -2591359 -2131549 -2134223 -3092468 -3054292 -1035323 884996 910292 419688 1143023
$$ packed form
12637C219343J063733j194310l008395k430986n40769M29944J31090j79664K29015
12628b280999R63552J227550M31019j060106j644511k99754J451348J372432J90200
12619C50731O64809K627397K417152j277143m462970l244858N86282K394576J095865
12610A151841n41075o75995j57642O3979L44593Q52808P67010m85351k302440
12601i82272l355942k461311L50652L071609L178100P31555j262979o27980J268565
12592i0003J800412O10209o89839j091816q59483n53068o61096j277205j345151
12583d157040L16270K523480K410876k74715k126464j007051P51536L92747q63829
12574b034190n57169M59810k674r58245L8176K018969J920319K5296m90604P23335
$$ plain form
12564 1143023 1808367 547783 -1167981 -393239 2405883 3702290 2100123 174419
12556 174419 510061 2368680 3417577 3012303 2337041 2157790 1807960 483344 -1249239
12547 -1249239 -1921742 -1187426 -540174 -1191351 -1963274 -891485 1379028 2007621 215638
12538 215638 -1302499 -481893 942491 413005 -1236302 -1267955 401130 1147541 -61732
12529 -61732 -1144267 -242690 1687822 2628623 2184728 1383086 829413 145973 -1178648
12520 -1178648 -3012996 -4475707 -4493590 -2847983 -662909 599055 559872 -85692 -723671
12511 -723671 -1285764 -1779399 -2167222 -2648659 -3272497 -3337240 -2115412 -287399 377602
12502 377602 -784632 -2349795 -2650090 -1766783 -707096 678761 3290967 6244654 6760193
$$ packed form
12564A143023O65344j260584j715764P74742K799122J296407j602167j925704
12556A74419L35642J858619J048897m05274o75262j79251l49830j324616j732583
12547a249239o72503P34316O47252o51177p71923J071789K270513O28593j791983
12538B15638j518137Q20606J424384n29486j649307l1653J669085P46411j209273
12529f1732j082535R01577J930512R40801m43895q01642n53673o83440j324621
12520a178648j834348j462711j7883J645607K185074J261964l9183o45564o37979
12511g23671n62093m93635l87823m81437o23838o4743J221828J828013O65001
12502C77602j162234j565163l00295Q83307J059687J385857K612206K953687N15539
$$ plain form
12493 6760193 3860988 637331 693826 3143300 3806476 1366076 -858188 -385527 470149
12484 470149 -1417508 -4741431 -5926483 -4760165 -3961405 -4097789 -3150533 -1015062 -90695
12475 -90695 -693406 -161316 2041563 2477049 -805282 -4694291 -5701704 -4965566 -5330276
12466 -5330276 -6235840 -5306887 -3019143 -1799047 -1688647 -744154 943868 1382168 652370
12457 652370 1136700 3313954 4562343 3129562 683300 -268593 517930 1629214 2107282
12448 2107282 1838149 905958 -496935 -1984294 -3088531 -3167587 -1732122 356112 889058
12439 889058 -1052785 -3172989 -2494517 555986 2653583 2210387 1347978 2523621 4961803
12430 4961803 5703777 3350437 -298602 -2160540 -967612 1566587 2715317 1755769
$$ packed form
12493F760193k899205l223657N6495K449474O63176k440400k224264M72661Q55676
12484D70149j887657l323923j185052J166318P98760j36384R47256K135471R24367
12475i0695o02711N32090K202879M35486l282331l889009j007413P36138l64710
12466e330276r05564R28953K287744J220096J10400R44493J688022M38300p29798
12457F52370M84330K177254J248389j432781k446262r51893P86523J111284M78068
12448B107282k69133r32191j402893j487359j104237p9056J435465K088234N32946
12439H89058j941843k120204O78472L050503K097597m43196q62409J175643K438182
12430D961803P41974k353340l649039j861938J192928K534199J148730r59548
$$ plain form
12422 1755769 412116 289836 1103490 1995219 3085888 4447265 4815475 3031856 12164
12413 12164 -2246172 -2957950 -2520911 -1171266 666911 1601396 768559 -529911 -551829
12404 -551829 173843 -174538 -1648497 -2593297 -2308596 -1434634 -75767 2071793 3912586
12395 3912586 3805465 2347858 1801451 2398705 1815941 -871810 -3153969 -2344585 913913
12386 913913 3775445 4521988 3543396 1972592 602317 -136364 61813 1291395 2871175
12377 2871175 3095301 753552 -2658449 -3877737 -2089961 -344170 -1114785 -2594918
12369 -2594918 -1939711 -105688 105598 -659221 724122 4101242 5729367 4111265 1910518
12360 1910518 1170792 725095 -302235 -420442 881668 1320950 -370105 -1960620 -1448306
$$ packed form
12422A755769j343653j22280Q13654Q91729J090669J361377L68210j783619l019692
12413A2164k258336p11778M37039J349645J838177R34485q32837j298470k1918
12404e51829P25672l48381j473959r44800K84701Q73962J358867K147560J840793
12395C912586j07121j457607n46407N97254n82764k687751k282159Q09384L258498
12386I13913K861532P46543r78592j570804j370275p38681J98177J229582J579780
12377B871175K24126k341749l412001j219288J787776J745791p70615j480133
12369b594918O55207J834023K11286p64819J383343L377120J628125j618102k200747
12360A910518p39726m45697j027330j18207J302110M39282j691055j590515N12314
$$ plain form
12351 -1448306 -426261 -1152218 -2737312 -2963866 -1919036 -1269327 -1539690 -2273531 -3240827
12342 -3240827 -3585315 -1760908 1616059 3052363 800478 -1897040 -1051798 2403016
12334 2403016 4393123 3744150 2903528 3271252 3362769 2002657 516195 754574 2586872
12325 2586872 4099810 3528588 966886 -1396556 -1382540 469711 1555301 957642 479746
12316 479746 1051908 882114 -945863 -1948707 -223076 1617515 208569 -2824449 -3224717
12307 -3224717 -1018530 -303002 -2282218 -3338270 -1019201 2360441 3786972 3559774
12299 3559774 3206226 2560401 1345854 1121688 2983623 5125348 5204487 3759139 2873021
12290 2873021 2610214 1388380 -736684 -1859116 -1383123 -939198 -1440027 -1357103 678395
$$ packed form
12351a448306J022045p25957j585094k26554J044830O49709k70363p33841r67296
12342c240827l44488J824407L376967J436304k251885k697518Q45242L454814
12334B403016J990107o48973q40622L67724R1517j360112j486462K38379J832298
12325B586872J512938n71222k561702k363442J4016J852251J085590n97659m77896
12316D79746N72162j69794j827977j002844J725631J840591j408946l033018m00268
12307c224717K206187P15528j979216j056052K319069L379642J426531k27198
12299C559774l53548o45825j214547k24166J861935K141725P9139j445348q86118
12290B873021k62807j221834k125064j122432M75993M43925n00829Q2924K035498
$$ plain form
12281 678395 3073238 3019372 511852 -1377085 -580920 1384610 1963255 1180364 966080
12272 966080 1800406 2373513 2469083 3566387 5713293 6231599 3255864 -1208918 -3762790
12263 -3762790 -3868488 -3552228 -3843277 -3854082 -2972876 -1677645 -125793 2038536 4205245
12254 4205245 4936893 3999623 2675289 1643196 143860 -2124203 -3774337 -3368204 -1254610
12245 -1254610 1117615 2882675 3832837 3532924 1665684 -694269 -1302676 876374 3867302
12236 3867302 4419553 1989921 -177563 837221 3437267 3507581 224525 -2842551 -2947521
12227 -2947521 -1530042 -930858 -694578 391118 1051336 -392434 -2324671 -1823589 489919
12218 489919 1198374 -566689 -2102595 -1766635 -1139760 -1624074 -2031171 -1030610 554622
$$ packed form
12281F78395K394843n3866k507520j888937P96165J965530N78645p82891k14284
12272I66080Q34326N73107R5570J097304K146906N18306k975735m464782k553872
12263c762790j05698L16260k91049j0805Q81206J295231J551852K164329K166709
12254D205245P31648r37270j324334j032093j499336k268063j650134M06133K113594
12245a254610K372225J765060R50162k99913j867240k359953o08407K179050K990928
12236C867302N52251k429632k167484J014784K600046P0314l283056l067076j04970
12227b947521J417479N99184K36280J085696O60218j443770j932237N01082K313508
12218D89919P08455j765063j535906L35960O26875m84314m07097J000561J585232
$$ plain form
12209 554622 1523854 2317819 3647766 4734691 4439844 2969121 1327165 164523 -80982
12200 -80982 774636 1726652 1102999 -1163224 -3129554 -3427240 -2812651 -2445614 -2240013
12191 -2240013 -1877764 -1971943 -3142452 -5063478 -7087858 -8531759 -8044642 -4675228 -244147
12182 -244147 1603000 -102627 -2229728 -1959640 -347306 265345 92147 798703 2385784
12173 2385784 3731950 4807789 5779037 5200578 1921272 -2135990 -3986698 -3810498 -4327059
12164 -4327059 -6295239 -7569053 -6720262 -4784757 -2990351 -1379999 -341245 -993921
12156 -993921 -3045318 -4361817 -3761530 -2495123 -2010950 -1907302 -1082372 524546 2196090
12147 2196090 3170953 2647453 607392 -1016883 -8469 2728497 3802377 2336823
$$ packed form
12209E54622R69232P93965J329947J086925k94847j470723j641956j162642k45505
12200h0982Q55618R52016o23653k266223j966330k97686O14589L67037K05601
12191b240013L62249r4179j170509j921026k024380j443901M87117L369414M431081
12182b44147J847147j705627k127101K70088J612334O12651j73198P06556J587081
12173B385784J346166J075839R71248n78459l279306m057262j850708J76200n16561
12164d327059j968180j273814Q48791J935505J794406J610352J038754o52676
12156i93921k051397j316499O00287J266407M84173J03648Q24930J606918J671544
12147B196090R74863n23500k040061j624275J008414K736966J073880j465554
$$ plain form
12139 2336823 1571585 3666540 5693462 3738948 -984037 -3659323 -2558970 -641718
12131 -641718 -533427 -1316059 -1110371 27401 1176152 2394619 3952221 5118978 5055898
12122 5055898 3977531 2547717 1085513 57097 183797 1178200 1429810 -93369 -2503068
12113 -2503068 -4384764 -5598124 -6740996 -7675200 -7684819 -6600537 -4927905 -3266549 -2066331
12104 -2066331 -1278508 65495 2846741 6016777 7204863 5860826 4122728 3595879
12096 3595879 3299152 2316559 2151207 3942811 5379215 3716774 512599 -456019 786433
12087 786433 807400 -759214 17223 4573498 8332928 6851881 2075889 -935613 -1030300
12078 -1030300 -980030 -2015952 -2245725 -338546 2343544 3797788 3478330 1989914 282960
$$ packed form
12139B336823p65238K094955K026922j954514m722985k675286J100353J917252
12131f41718J08291p82632K05688J137772J148751J218467J557602J166757o3080
12122E055898j078367j429814j462204j028416J26700R94403K51610j523179k409699
12113b503068j881696j213360j142872r34204r619J084282J672632J661356J200218
12104b066331P87823J344003K781246L170036J188086j344037j738098n26849
12096C595879k96727r82593j65352J791604J436404j662441l204175r68618J242452
12087G86433K0967j566614P76437M556275L759430j481047m775992l011502r4687
12078a030300N0270j035922k29773J907179K682090J454244l19458j488416j706954
$$ plain form
12069 282960 -593622 -119899 1184136 2466887 3207537 2639531 -157984 -4434980 -7453182
12060 -7453182 -7554270 -6211485 -5356980 -4323477 -1743487 1112085 1933034 1288258 1652556
12051 1652556 3073072 3285952 2028466 1513512 2129860 1509396 -892110 -2006260 -1859
12042 -1859 2267054 1327127 -1805294 -3445679 -2478961 -937938 -439918 -726120 -1186395
12033 -1186395 -1498827 -1034131 391840 1417098 593423 -1316660 -2302118 -2108740 -2272079
12024 -2272079 -3107083 -2874457 -669029 1782480 2423764 1527709 607455 -207235 -1791918
12015 -1791918 -3458736 -2992580 71950 3040799 3341087 1951362 1701810 2964684 3480338
12006 3480338 2451790 1992656 3438656 4858797 4165151 2490792 1972871 2014201 846922
$$ packed form
12069B82960q76582M73723J304035J282751P40650n68006k797515m276996l018202
12060g453182j01088J342785Q54505J033503K579990K855572Q20949o44776L64298
12051A652556J420516K12880j257486n14954O16348o20464k401506j114150K004401
12042a859K268913r39927l132421j640385R66718J541023M98020k86202m60275
12033a186395l12432M64696J425971J025258q23675j910083r85458J93378j63339
12024b272079q35004K32626K205428K451509O41284q96055r20254q14690j584683
12015a791918j666818M66156L064530K968849L00288j389725k49552J262874N15654
12006C480338j028548m59134J446000J420141o93646j674359n17921M1330j167279
$$ plain form
11997 846922 -537814 245979 2204464 1616606 -2013517 -4554836 -3179313 -261039 552558
11988 552558 -794800 -2083083 -2505172 -2541513 -2065339 -1041781 -675639 -1709020 -2931286
11979 -2931286 -3267781 -3684333 -4923276 -5222127 -2955481 15017 598485 -1082193 -2481455
11970 -2481455 -2774139 -2918950 -2478814 -254761 2042119 890938 -3334395 -5522554 -2474806
11961 -2474806 2548272 4039242 844295 -3509177 -5481514 -4570468 -2756118 -2485207
11953 -2485207 -4500032 -6711586 -6154133 -2698703 569272 1421197 1129646 1808203 3041108
11944 3041108 3174730 2532750 2870392 4249958 4863309 3981702 2975055 2904868 2778501
11935 2778501 1017492 -2385363 -5897344 -7970080 -8004301 -6302699 -3627354 -770148
$$ packed form
11997H46922j384736P83793J958485n87858l630123k541319J375523K918274Q13597
11988E52558j347358j288283m22089l6341M76174J023558L66142j033381j222266
11979b931286l36495m16552j238943k98851K266646K970498N83468j680678j399262
11970b481455k92684j44811M40136K224053K296880j151181m225333k188159L047748
11961b474806N023078J490970l194947m353472j972337R11046J814350K70911
11953b485207k014825k211554N57453L455430L267975Q51925k91551O78557J232905
11944C041108J33622o41980L37642J379566O13351q81607j006647p0187j26367
11935B778501j761009l402855l511981k072736l4221J701602K675345K857206
$$ plain form
11927 -770148 1595777 2802588 2394308 714214 -1192408 -2664317 -3903599 -4959314
11919 -4959314 -5047391 -3711839 -1879144 -583688 684402 2833167 4858448 4707792 2589459
11910 2589459 1226960 1980733 2806622 1563159 -493826 -743049 480046 336635 -1980043
11901 -1980043 -3955369 -3685981 -2624947 -2966291 -4210233 -4281463 -2872842 -1550255 -1020507
11892 -1020507 -316350 1206550 2721318 3146410 2284773 531237 -1352895 -2032398 -618373
11883 -618373 1667164 2322484 787601 -599798 103109 1580495 1217071 -1037515 -2617696
11874 -2617696 -1911191 -211707 176245 -1378930 -3416130 -3926978 -2196132 322001 1114088
11865 1114088 -719404 -3198673 -3738337 -2281530 -924574 -687735 -355265 1136961 2855618
$$ packed form
11927g70148K365925J206811m08280j680094j906622j471909j239282j055715
11919d959314q8077J335552J832695J295456J268090K148765K025281j50656k118333
11910B589459j362499P53773Q25889j243463k056985k49223J223095j43411k316678
11901a980043j975326K69388J061034l41344j243942p1230J408621J322587N29748
11892a020507P04157J522900J514768M25092q61637j753536j884132o79503J414025
11883f18373K285537O55320j534883j387399P02907J477386l63424k254586j580181
11874b617696P06505J699484L87952j555175k037200n10848J730846K518133P92087
11865A114088j833492k479269n39664J456807J356956K36839L32470J492226J718657
$$ plain form
11856 2855618 3335541 2600837 1583807 490541 -957275 -2228929 -2270029 -998105 456897
11847 456897 1019554 495218 -720224 -1998743 -2565019 -1882247 -79498 2256394 4414558
11838 4414558 5362485 3985261 559670 -2455721 -2498494 75821 2216545 1715111 -593272
11829 -593272 -2547458 -3280570 -3218537 -2524054 -956816 974837 1892642 840221 -1743077
11820 -1743077 -4294411 -5173491 -3925864 -1917986 -1106491 -1655307 -1626243 139396 1927300
11811 1927300 1434330 -731489 -1935732 -1531493 -1435013 -2325046 -2105746 362570 2482247
11802 2482247 1293924 -1946344 -3340975 -1788225 -74439 -546216 -2326768 -3474975
11794 -3474975 -3579401 -3020893 -1531453 879071 2698878 2282630 44761 -1878977 -1914011
$$ packed form
11856B855618M79923p34704j017030j093266j447816j271654m1100J271924J455002
11847D56897N62657n24336j215442j278519n66276O82772J802749K335892K158164
11838D414558R47927j377224l425591l015391m2773K574315K140724n01434k308383
11829e93272j954186p33112O2033O94483J567238J931653R17805j052421k583298
11820a743077k551334q79080J247627K007878Q11495n48816K9064J765639J787904
11811A927300m92970k165819j204243M04239R6480q90033K19300K468316K119677
11802B482247j188323l240268j394631J552750J713786m71777j780552j148207
11794c474975j04426N58508J489440K410524J819807m16248k237869j923738l5034
$$ plain form
11785 -1914011 -195417 2091995 3538346 2995823 434973 -2424057 -3166418 -942710
11777 -942710 2539494 4636806 4404122 3395300 3625871 4914322 4966716 2529932 -349968
11768 -349968 -423426 2630985 5593697 5547205 2945189 109471 -1926799 -3581927 -4552651
11759 -4552651 -3480735 -191874 3119851 3890806 1869870 -874351 -2355843 -2407390 -2013335
11750 -2013335 -1701909 -1317854 -1116205 -1978120 -3987024 -5646341 -5571450 -4524326 -4486348
11741 -4486348 -5771346 -6493209 -5303978 -3273017 -2195483 -2168612 -2020630 -1416177 -1238689
11732 -1238689 -2090905 -3413690 -4083286 -3294153 -1102611 1330630 2425068 1762943 587977
11723 587977 117502 30344 -450530 -764644 184166 1789033 2081313 562208 -942130
$$ packed form
11785a914011J718594K287412J446351n42523k560850k859030p42361K223708
11777i42710L482204K097312k32684j008822K30571J288451N2394k436784k879900
11768c49968p3458L054411K962712m6492k602016k835718k036270j655128r70724
11759d552651J071916L288861L311725P70955k020936k744221j481492n1547L94055
11750b013335L11426L84055K01649q61915k008904j659317P4891J047124L7978
11741d486348j284998p21863J189231K030961J077534K6871J47982O04453J77488
11732a238689q52216j322785o69596P89133K191542K433241J094438o62125j174966
11723E87977m70475q7158m80874l14114R48810J604867K92280j519105j504338
$$ plain form
11714 -942130 -895973 -74531 15696 -448772 -128405 1166816 2070876 1526262 24063 -1210544
11704 -1210544 -1594738 -1518106 -1652299 -2039459 -1804627 -121987 2300854 3386300 2104638
11695 2104638 203292 368006 2815969 5028656 5057649 3641541 2368535 1206346 -769384
11686 -769384 -3152652 -4422011 -4069621 -2978868 -1779747 -406077 585646 7475 -2000455
11677 -2000455 -3544290 -3463298 -2926587 -3408285 -4254334 -3730183 -1692795 331911 1306017
11668 1306017 1463841 1163411 340790 -822081 -1748266 -2066582 -1666797 -482172 997444
11659 997444 1621573 1086080 817124 1897172 2847879 1449949 -1631038 -3345576 -2480595
11650 -2480595 -1008016 -721119 -953472 -666704 -524688 -1338831 -2243562 -2111735 -1412909
$$ packed form
11714i42130M6157Q21442R0227m64468L20367J295221R04060n44614j502199j234607
11704a210544l84194P6632j34193l87160K34832J682640K422841J085446j281662
11695B104638j901346J64714K447963K212687K8993j416108j273006j162189j975730
11686g69384k383268j269359L52390J090753J199121J373670R91723n78171k007930
11677b000455j543835Q0992N36711m81698q46049N24151K037388K024706R74106
11668A306017J57824l00430q22621j162871r26185l18316L99785J184625J479616
11659I97444O24129n35493k68956J080048R50707j397930l080987j714538Q64981
11650b480595J472579K86897k32353K86768J42016q14143r04731J31827O98826
$$ plain form
11641 -1412909 -1101179 -927269 -405174 -176934 -698632 -765217 698590 2328607 1912818
11632 1912818 -325858 -2130190 -2490864 -2419497 -2619889 -2563723 -2120384 -2134692 -2877460 -3522885
11622 -3522885 -3567514 -3266750 -2446326 -665053 1065630 800784 -1248860 -2251634 -771647
11613 -771647 702658 -751384 -3984912 -5265588 -3447060 -925266 420338 1332098
11605 1332098 2481652 2498291 526768 -1326117 -591022 1646903 2062006 -58548 -1900144
11596 -1900144 -1317775 602649 2023599 2947420 3805036 3565452 1411737 -1120332 -1986011
11587 -1986011 -1659037 -1981715 -2731535 -1987390 307937 1952978 2046239 2263499 3672520
11578 3672520 4707167 3679159 1307997 -768309 -2279785 -3461848 -3442092 -1523729
$$ packed form
11641a412909L11730J73910N22095K28240n21698o6585J463807J630017m15789
11632A912818k238676j804332l60674P1367k00392N6166M43339j4308p42768o45425
11622c522885m4629L00764Q20424J781273J730683k64846k049644j002774J479987
11613g71647J474305j454042l233528j280676J818528K521794J345604R11760
11605A332098J149554J6639j971523j852885P35095K237925M15103k120554j841596
11596a900144N82369J920424J420950R23821Q57616k39584k153715k532069q65679
11587a986011L26974l22678p49820P44145K295327J645041R3261K17260J409021
11578C672520J034647j028008k371162k076306j511476j182063J9756J918363
$$ plain form
11570 -1523729 828806 1302270 -237522 -1597954 -1107500 560654 1479429 595467 -1305630
11561 -1305630 -2433081 -1960584 -1119469 -1655435 -3297478 -3949016 -2546059 -262072 1529411
11552 1529411 2781442 3496009 2764037 427211 -1767607 -2149835 -1122766 64040 1210988
11543 1210988 2402262 2695212 1347289 -611236 -1659635 -1786660 -1811391 -1806899 -1701268
11534 -1701268 -2184526 -3291971 -3424799 -1772492 -318981 -1050488 -2468681 -1764286 476552
11525 476552 1024029 -845160 -2314956 -1507635 127222 713360 438443 20521 -868697
11516 -868697 -2276123 -3004440 -2280457 -824527 702728 2614278 4563899 4888889 3049902
11507 3049902 1163618 1354083 2612365 2063068 -1102761 -4451257 -5041945 -2389492 1346910
$$ packed form
11570a523729K352535M73464j539792j360432M90454J668154R18775q83962j901097
11561a305630j127451M72497Q41115n35966j642043o51538J402957K283987J791483
11552A529411J252031P14567p31972k336826k194818l82228J027069J186806J146948
11543A210988J191274K92950j347923j958525j048399j27025k4731M492J05631
11534a701268m83258j107445j32828J652307J453511p31507j418193P04395K240838
11525D76552N47477j869189j469796Q07321J634857N86138k74917m17922q89218
11516h68697j407426p28317P23983J455930J527255J911550J949621L24990j838987
11507C049902j886284J90465J258282n49297l165829l348496n90688K652453L736402
$$ plain form
11498 1346910 3551034 3481520 2669506 3028217 4789534 6614797 7266803 6399679 4162997
11489 4162997 1291928 -479513 448736 3457609 5774618 5290041 2747614 682653
11481 682653 554322 1263364 515357 -2223235 -4394302 -3009315 1171931 3842730 2613695
11472 2613695 345148 867319 3011806 2214099 -2396498 -6170611 -5114533 -842314
11464 -842314 2254606 2411700 1074748 -209324 -1193365 -1907005 -2118159 -1811198 -1145816
11455 -1145816 -63204 1346358 2398346 2492108 2039733 2016976 2585754 2752574 1685635
11446 1685635 42543 -612835 115389 694492 -278924 -1962859 -2570173 -2235233 -2502180
11437 -2502180 -3058375 -1762848 1309466 2918666 1398800 -646207 -661510 -145585 -1293621
$$ packed form
11498A346910K204124o9514q12014L58711J761317J825263O52006q67124k236682
11489D162997k871069j771441R28249L008873K317009m84577k542427k064961
11481F82653j28331P09042p48007k738592k171067J384987M181246K670799j229035
11472B613695k268547N22171K144487p97707m610597l774113J056078M272219
11464h42314L096920J57094j336952j284072r84041p13640k11154L06961O65382
11455a145816J082612J409562J051988R3762m52375k2757N68778J66820j066939
11446A685635j643092o55378P28224N79103r73416j683935o07314L34940k66947
11437b502180n56195J295527L072314J609200j519866k045007j5303N15925j148036
$$ plain form
11428 -1293621 -2534878 -1392254 557893 198977 -1398474 -854577 1061404 461680 -2469139
11419 -2469139 -3244441 -758797 718082 -1030577 -2359510 -99780 3174289 3568871
11411 3568871 1669708 520569 920831 1850875 2877657 3328335 1620737 -1966844 -4269080
11402 -4269080 -3262572 -611959 1734053 4344358 7435888 8685966 6849676 4421986
11394 4421986 3714470 3439359 2203565 1794974 3347184 3932470 1385665 -958143 545333
11385 545333 3057092 1554187 -2521047 -3522931 -1153040 -744566 -3964136 -6041686
11377 -6041686 -3724286 -75894 961352 7867 -350120 154976 408431 481322 1119355
11368 1119355 2395671 3901353 4682429 3142957 -624647 -3086308 -1214579 2378532
$$ packed form
11428a293621j241257J142624J950147l58916j597451N43897J915981n99724k930819
11419b469139p75302K485644J476879j748659j328933K259730L274069L94582
11411C568871j899163j149139M00262R30044J026782M50678j707598l587581k302236
11402d269080J006508K650613K346012K610305L091530J250078j836290k427690
11394D421986p07516k75111j235794m08591J552210N85286k546805k343808J503476
11385E45333K511759j502905m075234j001884K369891M08474l219570k077550
11377f041686K317400L648392J037246r53485l57987N05096K53455P2891O38033
11368A119355J276316J505682P81076j539472l767604k461661J871729L593111
$$ plain form
11360 2378532 2507448 -529625 -1099216 2710988 5862347 4502746 1846796 2149747 3427861
11351 3427861 1174575 -3715022 -6100835 -4300928 -1765161 -1284668 -1720183 -1162075 -61817
11342 -61817 80551 -866926 -1751578 -1629796 -544519 685034 1322597 1537072 1909806
11333 1909806 2056493 885069 -1338801 -2657960 -2056976 -953206 -818088 -730447 1029095
11324 1029095 3952192 5665282 4853520 2441713 297236 -130582 1460018 3638907
11316 3638907 4027595 1878993 -760672 -1610712 -1009428 -799540 -1307738 -1368746 -806277
11307 -806277 -645379 -792568 228398 2460205 3361509 878057 -3454153 -5944113 -4837032
11298 -4837032 -1763503 712093 1714362 1821019 1313246 -75100 -1764118 -2018355 64966
$$ packed form
11360B378532J28916l037073n69591L810204L151359j359601k655950L02951J278114
11351C427861k253286m889597k385813J799907K535767M80493m35515N58108J100258
11342f1817J42368r47477q84652J21782J085277J229553O37563K14475L72734
11333A909806J46687j171424k223870j319159O00984J103770J35118Q7641J759542
11324A029095K923097J713090q11762k411807k144477m27818J590600K178889
11316C638907L88688k148602k639665q50040O01284K09888n08198o1008N62469
11307h06277J60898j47189J020966K231807R01304k483452m332210k489960J107081
11298d837032L073529K475596J002269J06657n07773j388346j689018k54237K083321
$$ plain form
11289 64966 2892443 3838805 2266519 8820 -1245418 -1796018 -2596354 -3246197 -2503974
11280 -2503974 -361900 1484638 1357910 -719987 -3041674 -3614891 -1784173 1180438
11272 1180438 3285278 3774131 3507901 3298097 2745253 1378248 73942 106914 1158685
11263 1158685 1675922 1291002 1411578 2779653 3840961 2874455 879252 514884 2187182
11254 2187182 3108061 1174077 -1752041 -2112798 542917 3022981 2853625 1234173 739500
11245 739500 1634214 2035689 984605 -335228 -447074 678139 2068189 2913875 2755103
11236 2755103 1303672 -1079854 -3018467 -3073900 -1299376 694940 1610871 1926250 2769265
11227 2769265 3689194 2957567 548448 -784950 1070114 4122957 4326891 813251 -3114637
$$ packed form
11289F4966K827477R46362j572286k257699j254238n50600q00336o49843P42223
11280b503974K142074J846538j26728k077897k321687n73217J830718K964611
11272A180438K104840M88853k66230k09804n52844j367005j304306L2972J051771
11263A158685N17237l84920J20576J368075J061308r66506j995203l64368J672298
11254B187182R20879j933984k926118l60757K655715K480064j69356j619452m94673
11245G39500Q94714M01475j051084j319833j11846J125213J390050Q45686j58772
11236B755103j451431k383526j938613n5433J774524J994316R15931L15379Q43015
11227B769265R19929p31627k409119j333398J855064L052843K03934l513640l927888
$$ plain form
11218 -3114637 -4501437 -4025021 -3870213 -4346034 -4125895 -2529443 -105806 2205505 3469535
11209 3469535 3250042 2522115 2896596 4144705 4057704 1812359 -402967 -686353 -418835
11200 -418835 -1783347 -3933073 -4340916 -2929264 -1999792 -2483368 -2925393 -2141098 -516466
11191 -516466 1407825 3557998 5474862 6651105 7486248 8139091 7180664 3760513 353612
11182 353612 281750 2719138 3484575 1072845 -1566434 -2021997 -1593512 -1987091 -2204493
11173 -2204493 -913861 788319 1382550 1539812 2406408 3169904 2690325 1891906 2099087
11164 2099087 2408738 1224416 -732422 -1489532 -1062851 -1106776 -1868370 -1949577 -880496
11155 -880496 333800 1126218 1630962 1053930 -1841538 -6091765 -8492231 -7163775 -3664852
$$ packed form
11218c114637j386800M76416J54808m75821K20139J596452K423637K311311J264030
11209C469535k19493p27927L74481J248109q7001k245345k215326k83386K67518
11200d18835j364512k149726m07843J411652R29472m83576m42025P84295J624632
11191e16466J924291K150173J916864J176243Q35143O52843r58427l420151l406901
11182C53612p1862K437388P65437k411730k639279m55563M28485l93579k17402
11173b204493J290632J702180N94231J57262Q66596P63496m79579p98419K07181
11164B099087L09651j184322j956838p57110M26681m3925p61594q1207J069081
11155h80496J214296P92418N04744n77032k895468m250227k400466J328456L498923
$$ plain form
11146 -3664852 -770229 428665 380605 -433992 -1445359 -1387731 564963 3190810 4139836
11137 4139836 2829816 1368180 1809191 3177764 2510953 -1022486 -4446615 -4488803 -1823766
11128 -1823766 -102272 -997730 -2292222 -1495924 711706 2148399 2556987 3143725 3606484
11119 3606484 2248931 -845783 -3173295 -3109068 -1816499 -774740 590425 2985862
11111 2985862 4571669 2889376 -963465 -2831057 -795367 2299151 2795192 809025
11103 809025 -774302 -412172 1081172 2753090 4419383 5532809 5346399 4519090 4662607
11094 4662607 5839889 6281577 5057352 3162470 1386918 -754897 -3046549 -3847862
11086 -3847862 -2817185 -2102403 -2906121 -3093505 -750275 1934044 1696633 -244624 397932
$$ packed form
11146c664852K894623J198894m8060q14597j011367N7628J952694K625847R49026
11137D139836j310020j461636M41011J368573o66811l533439l424129m2188K665037
11128a823766J721494q95458j294492P96298K207630J436693M08588N86738M62759
11119C606484j357553l094714k327512O4227J292569J041759J365165K395437
11111B985862J585807j682293l852841j867592K035690L094518M96041j986167
11103H09025j583327L62130J493344J671918J666293J113426j86410q27309J43517
11094D662607J177282M41688j224225j894882j775552k141815k291652q01313
11086c847862J030677P14782q03718j87384K343230K684319k37411j941257O42556
$$ plain form
11077 397932 4293966 7165647 5898006 2485016 428796 126059 -180816 -1007949 -1390445
11068 -1390445 -834643 270473 1462521 2187961 1704059 14955 -1765759 -2738660 -3117297
11059 -3117297 -3203669 -2544038 -976248 498702 988216 1096434 1883351 2914609 2573220
11050 2573220 371590 -1955676 -2173113 -144397 1793838 1469021 -396672 -1051548 566557
11041 566557 2435167 2596208 2005004 2487386 3307595 2369418 132281 -604994 1077968
11032 1077968 3003404 3402474 2965799 2550840 1499525 -413739 -1715437 -1578583 -1460534
11023 -1460534 -2634418 -3825445 -3256702 -1664521 -1240328 -2500558 -4034066 -4620892 -3930874
11014 -3930874 -1791962 1508751 4520428 5679746 4927954 3329340 1631173 267099
$$ packed form
11077C97932L896034K871681j267641l412990k056220l02737l06875q27133l82496
11068a390445N55802J105116J192048P25440m83902j689104j780714r72901l78637
11059c117297q6372O59631J567790J474950M89514J08218P86917J031258l41389
11050B573220k201630k327266k17437K028716J938235l24817j865693o54876J618105
11041E66557J868610J61041n91204M82382Q20209r38177k237137p37275J682962
11032A077968J925436L99070m36675m14959j051315j913264j301698J36854J18049
11023a460534j173884j191027N68743J592181M24193j260230j533508n86826O90018
11014c930874K138912L300713L011677J159318p51792j598614j698167j364074
$$ plain form
11006 267099 22702 1166658 2309037 1749868 8677 -481398 1374504 3623662 3612125
10997 3612125 1291639 -824059 -838251 432561 1008688 480416 -49502 -380062 -1705490
10988 -1705490 -4117654 -5539150 -4596132 -2970527 -2940097 -3864563 -3496270 -1816870 -768189
10979 -768189 -643265 224709 2134896 3412367 3508246 3663106 3838271 2200516 -1201121
10970 -1201121 -3415611 -2824348 -1423611 -1069474 -475160 1669556 3400113 2313795 -410188
10961 -410188 -1936741 -2072045 -2485960 -2960572 -1809234 589370 1944242 1721897 1764764
10952 1764764 2862175 3273171 1550796 -1072545 -2254280 -1459122 -393997 -827974 -2387809
10943 -2387809 -2802623 -773792 1834181 2048685 -21374 -1110209 489583 2539595
$$ packed form
11006B67099k44397J143956J142379n59169j741191m90075J855902K249158j1537
10997C612125k320486k115698j4192J270812N76127n28272n29918l30560j325428
10988a705490k412164j421496R43018J625605L0430r24466L68293J679400J048681
10979g68189J24924Q67974J910187J277471R5879J54860J75165j637755l401637
10970a201121k214490N91263J400737L54137N94314K144716J730557j086318k723983
10961d10188j526553j35304m13915m74612J151338K398604J354872k22345M2867
10952A764764J097411M10996j722375k623341j181735P95158J065125m33977j559835
10943b387809m14814K028831K607973K14504k070059j088835J599792K050012
$$ plain form
10935 2539595 2536219 1348916 1083945 1445671 914426 -4054 395389 1955782 3190176
10926 3190176 4031173 5222446 5673340 3556244 -118887 -2088391 -1250197 304080 985013
10917 985013 1462293 1993090 1119986 -1282928 -2221563 728322 5315005 6609800 2866479
10908 2866479 -2361064 -4273411 -1965471 1064855 1196348 -1263811 -2885873 -1615788
10900 -1615788 875384 1884149 1267821 947649 1823471 2961955 3362084 2755113 952569
10891 952569 -1706291 -3343151 -2078843 1036193 2673388 1577793 321041 1493245
10883 1493245 3920567 4549384 2977484 1820083 2668963 3833835 2964728 412378 -1478427
10874 -1478427 -1729248 -1652766 -2213728 -2161572 -36167 2981230 4035562 2357708 339293
$$ packed form
10935B539595l376j187303k64971L61726n31245r18480L99443J560393J234394
10926C190176Q40997J191273M50894k117096l675131j969504Q38194J554277O80933
10917I85013M77280N30797q73104k402914r38635K949885M586683J294795l743321
10908B866479n227543j912347K307940L030326J31493k460159j622062J270085
10900a615788K491172J008765o16328l20172Q75822J138484M00129o06971j802544
10891I52569k658860j636860J264308L115036J637195j095595j256752J172204
10883A493245K427322O28817j571900j157401Q48880J164872q69107k552350j890805
10874a478427k50821P6482n60962N2156K125405L017397J054332j677854k018415
$$ plain form
10865 339293 263961 1416461 1526888 47497 -1477545 -1935932 -2037814 -2810515 -3801270
10856 -3801270 -3716811 -2491871 -1611051 -1935503 -2173847 -743532 1323469 1223190 -1486555
10847 -1486555 -3703110 -3009952 -1114483 -1030826 -2531059 -3163281 -2638922 -2853541 -3853710
10838 -3853710 -3295194 -456389 2397497 3572114 3897440 4024751 2825150 164958 -1493576
10829 -1493576 -441694 1474616 1584547 163278 -636807 -108227 837342 1536707 1590953
10820 1590953 91896 -3117037 -6095664 -6604933 -5005002 -3961211 -5285837 -7872392
10812 -7872392 -8762860 -6167195 -1714781 851442 58549 -1353428 -554843 900145 -157374
10803 -157374 -2500039 -1778647 2155247 4264563 2051519 -668325 -117783 1901010 2046019
$$ packed form
10865C39293p5332J152500J10427j479391j525042m58387j01882p72701r90755
10856c801270Q4459J224940Q80820l24452k38344J430315K067001j00279k709745
10847a486555k216555O93158J895469Q3657j500233o32222N24359k14619j000169
10838c853710N58516K838805K853886J174617L25326J27311j199601k660192j658534
10829a493576J051882J916310J09931j421269q00085N28580R45569O99365N4246
10820A590953j499057l208933k978627n09269J599931J043791j324626k586555
10812g872392q90468K595665M452414K566223p92893j411977P98585J454988j057519
10803a57374k342665P21392L933894K109316k213044k719844N50542K018793J45009
$$ plain form
10794 2046019 980840 1009086 1407571 263881 -1422490 -1430907 -282765 16064 -465048
10785 -465048 -485920 -398851 -952198 -1090181 100782 1121984 620076 86965 993658 1597616
10775 1597616 -24973 -2151670 -2296408 -1576401 -2213886 -2936589 -1287599 1338425 1527502
10766 1527502 -743120 -2858165 -4168860 -5391287 -5101657 -1822341 1717054 1636863 -720324
10757 -720324 -787211 1621593 2374770 420731 -871878 -338005 -1056055 -4229897 -6322530
10748 -6322530 -4502777 -729335 1700746 2175914 1614875 464834 -605231 -689328 -318612
10739 -318612 -734175 -1356378 -821328 -131633 -1127266 -2218387 -93749 4183224 5649997
10730 5649997 2839244 -163990 -389868 133992 -903585 -2125940 -1797883 -1178294 -1770355
$$ packed form
10794B046019j065179K8246L98485j143690j686371q417J148142K98829m81112
10785d65048k0872Q7069n53347j37983J190963J021202n01908n33111R06693O03958
10775A597616j622589k126697j44738P20007o37485p22703J648990K626024J89077
10766A527502k270622k115045j310695j222427K89630L279316L539395q0191k357187
10757g20324o6887K408804P53177j954039j292609N33873p18050l173842k092633
10748f322530J819753L773442K430081M75168n61039j150041j070065q4097L70716
10739c18612m15563o22203N35050O89695r95633j091121K124638M276973J466773
10730E649997k810753l003234k25878N23860j037577j222355L28057O19589n92061
$$ plain form
10721 -1770355 -2533985 -2460300 -2899502 -4714657 -5825014 -4185650 -981093 1359321 2169365
10712 2169365 1670886 -451544 -3380534 -4315135 -1781743 1808253 3076625 1825505
10704 1825505 453254 543851 1788173 3191235 3714527 2506654 -170906 -2761445 -3970574
10695 -3970574 -3965223 -3589094 -3091893 -2034466 -26180 2444061 3745464 2500334 -271248
10686 -271248 -1726107 -723779 944523 1843435 2931109 4589041 4587681 1846345 -535756
10677 -535756 467092 2963958 3467290 2700356 3588449 5485381 5406717 3530090 2376840
10668 2376840 1804781 116424 -1061245 1123123 4453499 3662801 -1151953 -4141573
10660 -4141573 -2308237 1194405 3072914 3596979 3340798 1655519 -365292 -241875 1668070
$$ packed form
10721a770355p63630P3685m39202j815155j110357J639364L204557K340414Q10044
10712B169365m98479k122430k928990r34601K533392L589996J268372j251120
10704A825505j372251R0597J244322J403062N23292j207873k677560k590539j209129
10695c970574N351L76129M97201J057427K008286K470241J301403j245130k771582
10686b71248j454859J002328J668302Q98912J087674J657932j360k741336k382101
10677e35756J002848K496866N03332p66934Q88093J896932p8664j876627j153250
10668B376840n72059j688357j177669K184368L330376p90698m814754k989620
10660d141573J833336L502642J878509N24065k56181j685279k020811J23417J909945
$$ plain form
10651 1668070 2757110 2908685 3620915 3161993 -1018451 -5516708 -4194164 1343695 2714828
10642 2714828 -2200239 -5753280 -2943863 1164116 766568 -1685157 -1265045 1060131
10634 1060131 1649599 715457 234409 -368058 -1595082 -972100 2668173 5768704 5178379
10625 5178379 3043189 2583463 2767364 1336699 -416315 -146869 1267776 1767085 1647818
10616 1647818 1773863 1165790 -536432 -1177436 402076 1849735 950965 -1061026 -2073296
10607 -2073296 -1973281 -1155720 544824 1929652 1043149 -1170107 -1788672 -1034340 -1598109
10598 -1598109 -2627459 -620324 2983002 2447174 -2401566 -4926051 -2783453 -1742440
10590 -1742440 -4731224 -5977359 -1459038 3068293 1168153 -4108840 -6120625 -4739562
$$ packed form
10651A668070J089040J51575P12230m58922m180444m498257J322544N537859J371133
10642B714828m915067l553041K809417M107979l97548k451725M20112K325176
10634A060131N89468r34142m81048o02467j227024O22982L640273L100531n90325
10625E178379k135190m59726J83901j430665j753014K69446J414645M99309j19267
10616A647818J26045o08073j702222o41004J579512J447659q98770k011991j012270
10607b073296J00015Q17561J700544J384828q86503k213256o18565P54332n63769
10598a598109j029350K007135L603326n35828m848740k524485K142598J041013
10590a742440k988784j246135M518321M527331j900140n276993k011785J381063
$$ plain form
10582 -4739562 -3646691 -2801108 -503507 1475804 1217403 1092523 3268025 5012286 3768552
10573 3768552 2290513 3361835 4237685 1969075 -539211 371482 2523267 2206905 650076
10564 650076 460104 -13342 -2936015 -5637977 -4629782 -1401211 634361 1290759 1589353
10555 1589353 788529 -923140 -1424733 -1271957 -3599704 -6951331 -5519532 536864 3620427
10546 3620427 1215272 183816 3808223 5181298 -45202 -4994097 -3468588 -434976
10538 -434976 -2119779 -5269061 -5085052 -4423558 -6072441 -5335057 491145 4829984 3186379
10529 3186379 1633457 4649688 5699066 164124 -4297912 -1704010 388181 -4480344
10521 -4480344 -7993482 -2058679 5226903 3862241 -205786 2409503 6527255 3846539
$$ packed form
10582d739562J092871Q45583K297601J979311k58401j24880K175502J744261j243734
10573C768552j478039J071322Q75850k268610k508286R10693K151785l16362j556829
10564F50076j89972m73446k922673k701962J008195L228571K035572O56398K98594
10555A589353q00824j711669n01593J52776k327747l351627J431799O056396L083563
10546C620427k405155j031456L624407J373075n226500m948895J525509L033612
10538d34976j684803l149282J84009O61494j648883P37384N826202M338839j643605
10529C186379j552922L016231J049378n534942m462036K593902K092191m868525
10521d480344l513138N934803P285582j364662m068027K615289M117752k680716
$$ plain form
10513 3846539 185427 3770151 8577635 6954825 5477667 10116914 10937748 1325553
10505 1325553 -4892373 2395314 7825985 -1810964 -10072610 -742436 8769869 -443763
10497 -443763 -8966372 5414475 19231219 3644901 -13610121 6598684 32296217
10490 32296217 10975360 -8366595 84254618 272104769 378923211 288199103 102844463
10483 102844463 2782671 17382497 39628595 13618749 -10733485 3718574 20769090
10476 20769090 9251171 -4751498 3953463 14491885 5619689 -4946293 1643842
10469 1643842 10251017 3916640 -4240526 1053301 7879864 1989862 -5388259 211775
10461 211775 9159368 6587281 -962037 -369591 3609000 337806 -4854606 -1502279
$$ packed form
10513C846539l661112L584724M807484j622810j477158M639247Q20834r612195
10505A325553o217926P287687N430671r636949q261646R330174R512305r213632
10497d43763q522609J4380847J3816744j5586318j7255022K0208805K5697533
10490C2296217k1320857j9341955R2621213J87850151J06818442r0724108j85354640
10483A02844463j00061792J4599826K2246098k6009846k4352234J4452059J7050516
10476B0769090j1517919j4002669Q704961J0538422q872196j0565982O590135
10469A643842Q607175o334377q157166N293827O826563n890002p378121N600034
10461B11775Q947593k572087p549318N92446L978591l271194n192412L352327
$$ plain form
10453 -1502279 5354915 4612302 -672696 -126874 4985753 5691310 1669169 -437073 308906
10444 308906 209746 -200459 1467309 3023417 2069703 1507640 3513930 4164597 784340
10435 784340 -2038107 -356735 2088969 1100459 -737037 -264667 -86938 -2487051 -3962465
10426 -3962465 -1853179 322125 -355548 -1048255 136914 -227800 -3425875 -4596591 -1553766
10417 -1553766 418229 -1910034 -3731043 -1627927 -329629 -3360633 -5472142 -1982546
10409 -1982546 2196511 974972 -2483130 -1968398 1328335 2643090 2333356 2954212 2774370
10400 2774370 -264390 -2846989 -1669969 56542 -1722777 -4402802 -3660245 -1305185
10392 -1305185 -1303877 -2254274 -715788 1848673 2108603 1212373 1813843 2380615 581042
$$ packed form
10453a502279O857194p42613n284998N45822N112627P05557m022141k106242P45979
10444C08906r9160m10205J667768J556108r53714n62063K006290O50667l380257
10435G84340k822447J681372K445704r88510j837496M72370J77729k400113j475414
10426c962465K109286K175304o77673o92707J185169l64714l198075j170716L042825
10417a553766J971995k328263j821009K103116J298298l031004k111509L489596
10409a982546M179057j221539l458102N14732L296733J314755l09734O20856j79842
10400B774370l038760k582599J177020J726511j779319k680025P42557K355060
10392a305185J308r50397J538486K564461K59930q96230O01470N66772j799573
$$ plain form
10383 581042 -1277752 -254896 1317008 -138446 -2968881 -3605841 -2808231 -2890535 -2398452
10374 -2398452 518168 2958509 1558261 -1313088 -1509448 -13913 -47829 -625397 865649
10365 865649 2721719 1807539 -336315 -344246 662307 -315365 -1832711 -595090 1849379
10356 1849379 1339446 -1729704 -3510800 -3403687 -3784246 -4488048 -3405137 -1483619 -1549558
10347 -1549558 -2935401 -2431640 130519 1908272 1742474 592839 -1255946 -3143185
10339 -3143185 -2171603 2761010 7013831 5574639 745721 -1012878 1525570 3966095
10331 3966095 4277284 4839721 6401200 6051756 2552297 -1145540 -2255047 -1361167 -169224
10322 -169224 816802 1501455 1611408 1383875 1049561 163427 -838663 -14392 2837373
$$ packed form
10383E81042j858794J022856J571904j455454k830435o36960P97610q2304M92083
10374b398452K916620K440341j400248k871349j96360J495535l3916n77568J491046
10365H65649J856070r14180k143854p931J006553r77672j517346J237621K444469
10356A849379n09933l069150j781096J07113l80559p03802J082911J921518o5939
10347a549558j385843N03761K562159J777753j65798j149635j848785j887239
10339c143185R71582M932613M252821j439192m828918j758599K538448K440525
10331C966095L11189N62437J561479l49444l499459l697837j109507Q93880J191943
10322a69224R86026O84653J09953k27533l34314q86134j002090Q24271K851765
$$ plain form
10313 2837373 4437588 2584833 165493 864705 3079420 2585004 -465091 -2150994
10305 -2150994 -1330953 -540572 -820503 -598776 193565 -367723 -2002635 -1847566 821962
10296 821962 3188285 3066709 1238440 -936821 -3000651 -3956220 -2585767 16140 1050901
10287 1050901 -225149 -1920972 -2880229 -3711019 -4172355 -2823509 -215833 640963 -1451429
10278 -1451429 -3524991 -2137458 2099566 5241336 4451918 678827 -2689433 -3211066
10270 -3211066 -1451343 252962 656936 342504 -71083 -622573 -656748 932377 3248767
10261 3248767 3635166 1632429 88906 699018 1345999 149044 -875670 639309 2772992
10252 2772992 1987062 -1326645 -3758307 -4137033 -4221858 -4925374 -5298775 -4906125 -4268555
$$ packed form
10313B837373J600215j852755k419340O99212K214715m94416l050095j685903
10305b150994Q20041P90381k79931K21727P92341n61288j634912J55069K669528
10296H21962K366323j21576j828269k175261k063830r55569J370453K601907J034761
10287A050901j276050j695823r59257q30790m61336J348846K607676Q56796k092392
10278a451429k073562J387533M237024L141770p89418l773091l368260n21633
10270c211066J759723J704305M03974l14432m13587n51490l4175J589125K316390
10261C248767L86399k002737j543523O10112O46981j196955j024714J514979K133683
10252B772992p85930l313707k431662l78726q4825p03516l73401L92650O37570
$$ plain form
10243 -4268555 -3330185 -1979809 -1307269 -1830450 -1606709 1031842 4009274 3984292 1409575
10234 1409575 -257126 202169 788383 337915 63475 673249 1028914 437301 -125277
10225 -125277 172671 762604 715839 -211261 -1534489 -2126191 -1100974 453675 131121
10216 131121 -2133526 -3199475 -1488396 -89356 -2103824 -5221645 -4910832 -1466087
10208 -1466087 576758 -557305 -1959371 -1370421 -189618 -18010 217022 1882999 3868607
10199 3868607 4039373 2107853 -241655 -1428109 -1590536 -2355778 -4689770 -6890107 -6105453
10190 -6105453 -2493599 163684 -592983 -2525273 -2308894 -368834 529093 -310774 -1452273
10181 -1452273 -2216746 -2680370 -2085572 -215326 907207 -270636 -1672764 -340419 2854721
$$ packed form
10243d268555R38370J350376O72540n23181K23741K638551K977432k4982k574717
10234A409575j666701M59295N86214m50468k74440O09774L55665n91613n62578
10225a25277K97948N89933m6765r27100j323228n91702J025217J554649l22554
10216A31121k264647j065949J711079J399040k014468l117821L10813L444745
10208a466087K042845j134063j402066N88950J180803J71608K35032J665977J985608
10199C868607J70766j931520k349508j186454j62427p65242k333992k200337P84654
10190f105453L611854K657283p56667j932290K16379J940060Q97927q39867j141499
10181a452273p64473m63624N94798J870246J122533j177843j402128J332345L195140
$$ plain form
10172 2854721 4629314 4358042 4137620 4617323 4516328 3841278 3885787 4172626 2892439
10163 2892439 383847 -1078613 -901543 -448838 16122 1327003 2608262 2093355 831395
10154 831395 1898968 5398164 7686092 6391627 3168855 707927 -143626 472070 2425009
10145 2425009 4768663 5999282 5780406 4850622 3542745 2331355 2922478 6004610 8658657
10136 8658657 7301246 2924773 110362 930016 3120710 4223610 4009928 2633266
10128 2633266 31163 -2232262 -1918042 353480 1555636 706511 -248487 -312280 -731808
10119 -731808 -1835575 -2083805 -1108550 -340625 174137 2049851 4737561 5207649 2854574
10110 2854574 1049503 1999336 3472590 2732249 612306 -652395 -955435 -1258369 -1254486
$$ packed form
10172B854721J774593k71272k20422M79703j00995o75050M4509K86839j280187
10163B892439k508592j462460J77070M52705M64960J310881J281259n14907j261960
10154H31395J067573L499196K287928j294465l222772k460928q51553O15696J952939
10145B425009K343654J230619k18876r29784j307877j211390N91123L082132K654047
10136H658657j357411m376473k814411Q19654K190694J102900k13682j376662
10128B633266k602103k263425L14220K271522J202156q49125r54998o3793m19528
10119g31808j103767k48230R75255P67925N14762J875714K687710M70088k353075
10110B854574j805071R49833J473254p40341k119943j264701l03040l02934L883
$$ plain form
10101 -1254486 -443656 263460 76906 -94557 718719 1928197 2887982 4254746 6254160
10092 6254160 7260511 5807525 2697806 -277301 -2356859 -3289289 -2320288 720408
10084 720408 4345213 6686728 7064633 5638486 2826579 -77005 -1162210 -64057
10076 -64057 1077568 -18905 -2976326 -5109406 -4288347 -1124251 1524015 1419962 -485758
10067 -485758 -1193280 244801 1384963 321722 -1096726 -239967 1876814 2126581 39934
10058 39934 -2197905 -3660156 -5086431 -5878171 -4445833 -1646689 -310785 -1041600 -1898378
10049 -1898378 -2398709 -3969093 -5895150 -5071081 -1177732 1792493 1064474 -1271524 -2122801
10040 -2122801 -1700740 -1695947 -2011254 -1883634 -2024781 -3139874 -4040076 -3451437 -2225160
$$ packed form
10101a254486Q10830P07116j86554j71463Q13276J209478R59785J366764J999414
10092F254160J006351j452986l109719k975107k079558r32430R69001L040696
10084G20408L624805K341515L77905j426147k811907k903584j085205J098153
10076f4057J141625j096473k957421k133080Q21059L164096K648266j04053j905720
10067d85758p07522J438081J140162j063241j418448Q56759K116781K49767k086647
10058C9934k237839j462251j426275p91740J432338K799144J335904p30815q56778
10049a898378n00331j570384j926057Q24069L893349K970225p28019k335998q51277
10040b122801M22061M793l15307J27620j41147j115093r00202N88639J226277
$$ plain form
10031 -2225160 -1746684 -1508429 -264541 1427447 1734542 155902 -1757728 -2095430 -325589
10022 -325589 2329516 3992386 3958522 3206239 2680522 2065720 1237312 1410658 2981133
10013 2981133 3747714 1902714 -470961 -73848 2270431 2525598 -496589 -3536345 -3693277
10004 -3693277 -1693298 77642 32831 -2273513 -5541100 -6587681 -3651902 526258
9996 526258 1877549 448367 -794750 -1445019 -3396106 -5772581 -5385311 -2530109 -1116046
9987 -1116046 -2186426 -2369214 94419 2721065 3483012 3318087 2675374 513876 -1907185
9978 -1907185 -1447354 1168908 1469315 -1185644 -2052033 707615 2475036 97245 -2811858
9969 -2811858 -2454025 -928270 -1216787 -1539220 238464 1549293 -32999 -1370398 1000273
$$ packed form
10031b225160M78476K38255J243888J691988L07095j578640j913630l37702J769841
10022c25589K655105J662870l3864p52283n25717o14802q28408J73346J570475
10013B981133P66581j845000k373675L97113K344279K55167l022187l039756j56932
10004c693277J999979J770940m4811k306344l267587j046581K935779M178160
9996E26258J351291j429182j243117o50269j951087k376475L87270K855202J414063
9987a116046j070380j82788K463633K626646P61947j64925o42713k161498k421061
9978a907185M59831K616262L00407k654959q66389K759648J767421k377791k909103
9969b811858L57833J525755k88517l22433J777684J310829j582292j337399K370671
$$ plain form
9960 1000273 4166979 3558533 1025438 1668401 4994840 5847339 2871010 -76012 -530904
9951 -530904 -99787 -478992 -1271650 -2032883 -3005111 -3759747 -3673293 -3114376 -2153896 165484
9941 165484 3061989 3144834 -669060 -4142387 -3265559 -144959 755093 -346043 -82657
9932 -82657 1479560 1118787 -1571715 -3443006 -2888523 -1450032 -271752 1271470 3073445
9923 3073445 3589506 2196964 156885 -914069 -272483 1499625 2353001 680505 -1868990
9914 -1868990 -2007669 -49374 81134 -2586515 -4071081 -2331453 -1075811 -3219511 -5600631
9905 -5600631 -4627955 -2434573 -2378361 -2903481 -1402474 41297 -1300356 -2966863 -1665855
9896 -1665855 387636 -144249 -956330 1448651 4499768 4015983 1888492 1645658 906662
$$ packed form
9960A000273L166706o08446k533095O42963L326439Q52499k976329k947022m54892
9951e30904M31117l79205p92658p61233r72228p54636Q6454N58917R60480K319380
9941A65484K896505Q2845l813894l473327Q76828L120600R00052j101136K63386
9932h2657J562217l60773k690502j871291N54483J438491J178280J543222J801975
9923C073445N16061j392542k040079j070954O41586J772108Q53376j672496k549495
9914a868990j38679J958295J30508k667649j484566J739628J255642k143700k381120
9905e600631R72676K193382N6212n25120J501007J443771j341653j666507J301008
9896a665855K053491n31885q12081K404981L051117m83785k127491k42834p38996
$$ plain form
9887 906662 -3108359 -5755120 -3067195 -1927956 -8401345 -10515292 9166548 43291301
9879 43291301 61215595 46958927 19123812 4099520 4329355 5217926 1122924 -1293977
9871 -1293977 815339 2311890 792291 -133042 1267753 2363380 2133876 2679935 4248182
9862 4248182 4423287 2621230 737773 -587823 -2225144 -3425250 -2249194 1136824
9854 1136824 4635674 7021798 8077235 7349704 5373840 4359867 4981797 4579560 1422454
9845 1422454 -1740465 -1843393 -689809 -1770048 -3899608 -2850247 1529644 4475832
9837 4475832 2844050 -1195107 -3612957 -2918430 -520042 1283605 1198709 -64863 -825826
9828 -825826 -895115 -1739872 -3600815 -4537484 -3503690 -2015606 -1215270 164784 2928590
$$ packed form
9887I06662m015021k646761K687925J139239o473389k113947J9681840L4124753
9879D3291301J7924294j4256668k7835115j5024292K29835Q88571m095002k416901
9871a293977K109316J496551j519599r25333J400795J095627k29504N46059J568247
9862D248182J75105j802057j883457j325596j637321j200106J176056L386018
9854A136824L498850K386124J055437p27531j975864j013973O21930m02237l157106
9845A422454l162919j02928J153584j080239k129560J049361M379891K946188
9837D475832j631782m039157k417850O94527K398388J803647q4896j263572p60963
9828h25826o9289q44757j860943r36669J033794J488084Q00336J380054K763806
$$ plain form
9819 2928590 5085544 4777071 3247547 2531937 2447102 2173767 2276326 2641262 1242722
9810 1242722 -2066882 -3488003 -589416 3060623 2727299 -395163 -1545820 -38145
9802 -38145 510043 -1291883 -2795556 -2055538 -119247 1690964 3039152 2920897 383594
9793 383594 -2698070 -2947110 -160278 2291068 2151503 578550 -527132 -639895 359227
9784 359227 2553839 4801532 5420090 4352247 2646406 196309 -3384924 -6106554 -5156899
9775 -5156899 -1339039 1364647 1260930 690159 1404915 1707355 -11626 -1939409 -1597970
9766 -1597970 143469 518396 -822803 -1505472 -158075 1666897 1756738 73193 -1488829
9757 -1488829 -1618182 -1002570 -1120422 -2369375 -4017115 -5366698 -5847570 -4482270 -1024189
$$ packed form
9819B928590K156954l08473j529524p15610q4835k73335J02559L64936j398540
9810A242722l309604j421121K898587L650039l33324l122462j150657J507675
9802c8145N48188j801926j503673P40018J936291J810211J348188j18255k537303
9793C83594l081664k49040K786832K451346j39565j572953j105682j12763R99122
9784C59227K194612K247693O18558j067843j705841k450097l581233k721630R49655
9775e156899L817860K703686j03717n70771P14756L02440j718981j927783L41439
9766a597970J741439L74927j341199o82669J347397J824972Q9841j683545j562022
9757a488829j29353O15612j17852j248953j647740j349583m80872J365300L458081
$$ plain form
9748 -1024189 2489278 3478120 2395992 2110653 3192808 2955639 487293 -955119 912030
9739 912030 3192958 2180900 -812391 -1920842 -709324 679074 2409384 5924677
9731 5924677 9169209 8291767 4034167 1210286 1374219 1168113 -1110733 -2649001 -1649101
9722 -1649101 -638791 -1578069 -2175899 -407622 1119506 -829508 -4559097 -5751801 -3426256
9713 -3426256 -155612 2126108 3329052 3459195 2719152 2505286 3650643 4494130 3149315
9704 3149315 753416 -135644 474502 468442 -424521 -147068 2030495 4106301 4306150
9695 4306150 3233662 2182170 1179358 -117222 -966304 -417864 908372 1124145 -638727
9686 -638727 -2782160 -2658288 295212 3332312 3287514 589063 -1075285 407288 2804919
$$ packed form
9748a024189L513467R88842j082128k85339J082155k37169k468346j442412J867149
9739I12030K280928j012058k993291j108451J211518J388398J730310L515293
9731E924677L244532q77442m257600k823881J63933k06106k278846j538268R99900
9722a649101J010310r39278n97830J768277J527128j949014l729589j192704K325545
9713c426256L270644K281720J202944J30143p40043k13866J145357Q43487j344815
9704C149315k395899q89060O10146o060q92963K77453K177563K075806J99849
9695D306150j072488j051492j002812j296580q49082N48440J326236K15773j762872
9686f38727k143433J23872K953500L037100m4798k698451j664348J482573K397631
$$ plain form
9677 2804919 2915015 1150735 597858 2251417 3687349 2747930 399608 -1057215 -1137157
9668 -1137157 -1220111 -2155756 -3072215 -2661965 -945615 715841 1334300 1546089 2551670
9659 2551670 3964765 3836741 1397737 -1292561 -1612191 338883 2116572 2308876 1928090
9650 1928090 2160687 2301275 938702 -1661350 -3471329 -2842143 -131901 2658920 3501237
9641 3501237 1876750 -772337 -2232261 -1616774 -292166 -318928 -1924706 -3059393 -1915739
9632 -1915739 461493 1017734 -1505942 -4521874 -4456200 -1258276 1489665 1257622 -336129
9623 -336129 -211148 1889644 3679752 3992186 3768722 3481034 2153409 -216400 -1624375
9614 -1624375 -1002836 -307597 -1686398 -4046068 -4805882 -4007378 -3884258 -4790165 -4667914
$$ packed form
9677B804919J10096j764280n52877J653559J435932r39419k348322j456823p9942
9668a137157q2954r35645r16459M10250J716350J661456O18459K11789J005581
9659B551670J413095j28024k439004k690298l19630J951074J777689J92304l80786
9650A928090K32597J40588j362573k600052j809979O29186K710242K790821Q42317
9641C501237j624487k649087j459924O15487J324608k6762j605778j134687J143654
9632a915739K377232N56241k523676l015932O5674L197924K747941k32043j593751
9623c36129J24981K100792J790108L12434k23464k87688j327625k369809j407975
9614a624375O21539O95239j378801k359670p59814P98504J23120r05907J22251
$$ plain form
9605 -4667914 -2933444 -1736799 -2173297 -2187802 -187034 1829266 1361188 -330456 -142053
9596 -142053 1944606 3182824 2737643 2568708 3501939 3912878 3219117 3338719 5013404
9587 5013404 5662937 3272631 88284 -358421 1709589 3202058 3039445 2973288 3809533
9578 3809533 4000748 2680718 1430668 1751028 2761959 2890211 2357012 2330588 2519863
9569 2519863 1366247 -1473865 -4121353 -4291156 -1591420 2100960 4315179 4151610 2924820
9560 2924820 2404029 2498124 1487389 -1222344 -3789059 -4361006 -3782333 -4224598 -5611113
9551 -5611113 -5527388 -3048247 -474658 -36187 -738139 -402118 613641 343134 -866973
9542 -866973 -479981 1859602 3175117 1620905 -704115 -1299933 -1046159 -1770769 -2189170
$$ packed form
9605d667914J734470J196645m36498j4505K000768K016300m68078j691644J88403
9596a42053K086659J238218m45181j68935R33231M10939o93761J19602J674685
9587E013404O49533k390306l184347m46705K068010J492469j62613o6157Q36245
9578C809533J91215j320030j250050L20360J010931J28252n33199k6424J89275
9569B519863j153616k840112k647488j69803K699736L692380K214219j63569j226790
9560B924820n20791R4095j010735k709733k566715n71947N78673m42265j386515
9551e611113Q3725K479141K573589M38471p01952L36021J015759k70507j210107
9542h66973L86992K339583J315515j554212k325020n95818K53774p24610m18401
$$ plain form
9533 -2189170 163419 4073794 5632975 4000910 2406900 2737635 2838447 680988 -2227843
9524 -2227843 -3848170 -5009201 -6833030 -7164087 -3396428 2290246 4576264 2099998
9516 2099998 -664883 265925 3278390 4359955 3035607 2229172 3245226 4075509 3190135
9507 3190135 2242994 3210276 4635658 3356749 -501010 -3002731 -1580376 1563045 2559066
9498 2559066 518393 -2580706 -4965827 -5952324 -5167753 -3370248 -2984502 -5118649 -6926117
9489 -6926117 -5047968 -1047214 312252 -1811801 -3168628 -1310169 738593 -143263
9481 -143263 -2076638 -1620178 685388 1752292 872571 -265436 -1082273 -2311500 -3552363
9472 -3552363 -3609614 -2810914 -2503301 -2736113 -2640262 -2432668 -2834671 -3190687 -2374763 -907682
$$ packed form
9533b189170K352589L910375J559181j632065j594010L30735J00812k157459k908831
9524b227843j620327j161031j823829l31057L767659N686674K286018k476266
9516B099998k764881R30808L012465J081565j324348q06435J016054Q30283q85374
9507C190135r47141R67282J425382j278909l857759k501721J422355L143421R96021
9498B559066k040673l099099k385121r86497P84571J797505L85746k134147j807468
9489f926117J878149M000754J359466k124053j356827J858459K048762q81856
9481a43263j933375M56460K305566J066904q79721j138007q16837j229227j240863
9472c552363n7251P98700L07613k32812R5851K07594m02003l56016Q15924J467081
$$ plain form
9462 -907682 -46169 458944 1508339 2441214 2061463 1055130 864263 911567 -359297
9453 -359297 -2332995 -3015447 -2549519 -2904373 -4184663 -4318762 -2619261 -706759 460987
9444 460987 1566686 2449819 1635253 -774921 -2540080 -2756492 -3299090 -5372697 -6947540
9435 -6947540 -5448423 -1407676 2258489 3645255 3270892 2740397 2859444 2862708 1519207
9426 1519207 -714071 -1603877 -239728 1145912 322405 -1400707 -1465784 -661791 -1840142
9417 -1840142 -4531002 -4928139 -1762341 1763581 3077925 3537623 4904200 5999975 5267218
9408 5267218 3917847 3920526 4773677 4588546 2911072 609271 -1635806 -3133122 -2941663
9399 -2941663 -1344834 -171330 -284243 -189027 1528365 3823079 4669961 3760670 2482783
$$ packed form
9462i07682Q61513N05113J049395R32875l79751j006333j90867M7304j270864
9453c59297j973698o82452M65928l54854j280290j34099J699501J912502J167746
9444D60987J105699Q83133q14566k410174j765159k16412n42598k073607j574843
9435f947540J499117M040747L666165J386766l74363n30495J19047L264j343501
9426A519207k233278q89806J364149J385640q23507j723112o5077Q03993j178351
9417a840142k690860l97137L165798L525922J314344M59698J366577J095775p32757
9408E267218j349371K679Q53151j85131j677474k301801k245077j497316J91459
9399b941663J596829J173504j12913R5216J717392K294714Q46882r09291j277887
$$ plain form
9390 2482783 2055408 2445209 2422498 690828 -2028314 -2829637 -402548 2216452 1590765
9381 1590765 -647182 -391420 1719141 1074874 -2674252 -4354442 -1866442 314123 -925924
9372 -925924 -2234017 -634527 676071 -1342015 -3037400 -310295 3271271 1894321
9364 1894321 -2548529 -3761789 -1714686 -1662036 -3899251 -3242719 1060598 3401599 1408861
9355 1408861 -279365 1543004 3407491 1817845 -850617 -1091454 -16195 -211579 -742246
9346 -742246 616883 3057088 4235979 3821037 2663857 717080 -1614527 -2275248 -221016
9337 -221016 2645950 4198406 4634586 4643533 3634698 1731509 821767 1495774 1656864
9328 1656864 360929 38175 2254837 4286805 3158171 483587 -244652 978340 1638887
$$ packed form
9390B482783m27375L89801k2711j731670k719142q01323K427089K619000o25687
9381A590765k237947K55762K110561o44267l749126j680190K488000K180565j240047
9372i25924j308093J599490J310598k018086j695385K727105L581566j376950
9364A894321m442850j213260K047103N2650k237215O56532M303317K341001j992738
9355A408861j688226J822369J864487j589646k668462k40837J075259j95384n30667
9346g42246J359129K440205J178891m14942j157180j946777k331607o60721K054232
9337b21016K866966J552456M36180Q947j008835j903189r09742O74007J61090
9328A656864j295935l22754K216662K031968j128634k674584p28239J222992O60547
$$ plain form
9319 1638887 1191703 891766 672477 -101460 -57037 2204696 4541396 3593573 121871
9310 121871 -1791630 -628414 1219703 1986142 2580973 3545839 3561645 2115385 689896
9301 689896 150725 -480765 -1625788 -1985362 -876765 482506 1035542 1128334 850107
9292 850107 -539152 -2459312 -2707136 -780272 691279 -440611 -2764234 -3758077 -3500283
9283 -3500283 -3616913 -3934634 -2904107 -774461 331340 -270417 -674217 705546 2760150
9274 2760150 3280653 1824732 -212163 -1837436 -3430992 -5221781 -5899437 -3907239 -42246
9265 -42246 2464341 1339280 -1846633 -3292121 -1385617 1578667 2439861 1010701 108101
9256 108101 2013509 5569866 7210293 4966597 1002336 -715838 757582 2315047
$$ packed form
9319A638887m47184k99937k19289p73937M4423K261733K336700r47823l471702
9310A21871j913501J163216J848117P66439N94831R64866J5806j446260j425489
9301F89896n39171o31490j145023l59574J108597J359271N53036R2792k78227
9292H50107j389259j920160k47824J926864J471551j131890k323623r93843K57794
9283c500283j16630l17721J030527K129646J105801o01757m03800J379763K054604
9274B760150N20503j455921k036895j625273j593556j790789o77656J992198L864993
9265d2246K506587j125061l185913j445488J906504K964284Q61194j429160r02600
9256A08101J905408L556357J640427k243696l964261j718174J473420J557465
$$ plain form
9248 2315047 1309349 -745949 -915429 274755 -135183 -2081589 -1920878 1553679 4230563
9239 4230563 2344501 -1793291 -3062289 -682286 1675389 1989996 1960555 2716368 2559794
9230 2559794 562881 -953374 89139 2001682 1963588 449818 177538 1694970 2967159
9221 2967159 3004486 3050344 3832313 4149268 3005854 1136644 -519884 -2123996 -3697630
9212 -3697630 -4167043 -2894585 -1007836 -37307 -102686 -304618 50617 1296858 3190446
9203 3190446 4080592 1955550 -2484360 -5575510 -5182523 -3672782 -4213532 -5797230 -4953074
9194 -4953074 -1365392 1679941 2317908 2193419 2984531 3911429 3748965 2755033 1509699
9185 1509699 108141 -584231 705603 3015889 3414651 1200193 -667648 226309 2677144
$$ packed form
9248B315047j005698k055298j69480J190184m09938j946406J60711L474557K676884
9239D230563j886062m137792j268998K380003K357675L14607k9441P55813j56574
9230B559794j996913j516255J042513J912543l8094j513770k72280J517432J272189
9221B967159L7327M5858P81969L16955j143414j869210j656528j604112j573634
9212c697630m69413J272458J886749R70529o5379k01932L55235J246241J893588
9203C190446Q90146k125042m439910l091150L92987J509741n40750j583698Q44156
9194d953074L587682L045333O37967j24489P91112R26898j62464r93932j245334
9185A509699j401558o92372J289834K310286L98762k214458j867841Q93957K450835
$$ plain form
9176 2677144 4566141 5823625 6676118 5906976 3552446 2562340 4577508 6571363 5296040
9167 5296040 2640357 2268056 3097364 1445900 -1596364 -1083797 3218481 5362376 2152357
9158 2152357 -1950535 -1821062 999598 1698250 -507563 -2536487 -2688836 -1809415 -509010
9149 -509010 1206100 2086621 504241 -2729733 -4596264 -3137990 787735 4672024 6160213
9140 6160213 4425386 976638 -1535134 -2165477 -2288301 -2711132 -2094700 349401 2639768
9131 2639768 2623356 1101716 32659 -776151 -2456314 -3985796 -3507341 -1829561 -1252227
9122 -1252227 -1440572 -43960 2727183 4054366 3556762 4294616 7314939 9167061 7287632
9113 7287632 4427807 4396299 5930853 4783742 664544 -1950351 -71028 4057910 6270580
$$ packed form
9176B677144J888997J257484Q52493p69142k354530r90106K015168J993855j275323
9167E296040k655683l72301Q29308j651464l042264N12567M302278K143895l210019
9158B152357m102892J29473K820660O98652k205813k028924j52349Q79421J300405
9149e09010J715110Q80521j582380l233974j866531J458274L925725L884289J488189
9140F160213j734827l448748k511772o30343j22824m22831O16432K444101K290367
9131B639768j6412j521640j069057q08810j680163j529482M78455J677780N77334
9122a252227j88345J396612K771143J327183m97604P37854L020323J852122j879429
9113G287632k859825l1508J534554j147111m119198k614895J879323M128938K212670
$$ plain form
9104 6270580 4999234 1517911 -2094273 -3853243 -2484349 1080137 3713363 3172981
9096 3172981 715047 -667253 -206104 -45444 -1918444 -4690915 -5947639 -4955181 -3047342
9087 -3047342 -1670607 -1105528 -930832 -795017 -581692 -420870 -633723 -1235171 -1617167
9078 -1617167 -1273519 -622238 -364644 -245663 529232 1674769 1847339 597633 -873416
9069 -873416 -1425543 -1321202 -1203323 -916800 -361854 -509610 -2174309 -4228211 -4370309
9060 -4370309 -1735884 2093248 4745598 5186341 4218302 3283332 2877189 2243055 787616
9051 787616 -761746 -1450284 -1767871 -2734125 -3615369 -2589181 101162 1953142 1876210
9042 1876210 1667140 2718635 3803743 3764184 3814412 4947784 5477931 3894406 2008492
$$ packed form
9104F270580j271346l481323l612184j758970J368894L564486K633226n40382
9096C172981k457934j382300M61149J60660j873000k772471j256724R92458J907839
9087c047342J376735N65079J74696J35815K13325J60822k12853o01448l81996
9078a617167L43648O51281K57594J18981P74895J145537J72570j249706j471049
9069h73416n52127J04341J17879K86523N54946j47756j664699k053902j42098
9060d370309K634425L829132K652350M40743r68039r34970m06143o34134j455439
9051G87616j549362o88538l17587r66254q81244J026188K690343J851980p6932
9042A876210k09070J051495J085108l9559N0228J133372N30147j583525j885914
$$ plain form
9033 2008492 2132991 3010411 2009174 -242246 -1216876 -1142072 -2099815 -3411878 -2485538
9024 -2485538 93853 1051537 162761 654802 3215085 4586701 3428200 2585147 3612640
9015 3612640 3947077 2097178 929153 2528171 4101783 2811813 884578 1663875 3770309
9006 3770309 3681358 1542108 -87737 -1028682 -2390399 -2622373 375231 4420599 5250320
8997 5250320 2908599 1285833 1697577 1637188 -45631 -1426253 -1568230 -1945523 -2896630
8988 -2896630 -2736242 -1496762 -1595924 -3401746 -3986249 -2070039 -560216 -1894377 -4039313
8979 -4039313 -3770389 -1414873 404872 846224 979909 1157059 734558 -205982 -750732
8970 -750732 -411285 674953 2191333 3393845 3272491 1904607 882868 1550203 3394412
$$ packed form
9033B008492J24499Q77420j001237k251420r74630P4804r57743j312063R26340
9024b485538K579391R57684q88776M92041K560283J371616j158501q43053J027493
9015C612640L34437j849899j168025J599018J573612j289970j927235P79297K106434
9006C770309q8951k139250j629845r40945j361717k31974K997604M045368Q29721
8997E250320k341721j622766M11744o0389j682819j380622j41977l77293r51107
8988b896630J60388J239480r9162j805822n84503J916210J509823j334161k144936
8979d039313K68924K355516J819745M41352J33685J77150m22501r40540n44750
8970g50732L39447J086238J516380J202512j21354j367884j021739O67335J844209
$$ plain form
8961 3394412 4694470 4149567 1755155 -1064930 -2293637 -1426644 -483011 -1467209 -3266937
8952 -3266937 -3093481 -727060 1190044 1231516 776047 893603 511796 -1077591 -2432890
8943 -2432890 -2228124 -1225834 -569204 -9210 910552 1800719 2639463 3957907 4829396
8934 4829396 3183662 -553041 -2804416 -1539089 956763 1831077 1462476 1336073 945156
8925 945156 -430272 -1321955 -459261 564052 -7617 -818726 18732 1155817 294974
8916 294974 -1610758 -2082875 -1292555 -708860 587640 3876649 6703882 5791041 2954943
8907 2954943 2740052 4709861 4030828 68153 -1905887 801150 4118647 4159033 2880767
8898 2880767 3340635 4108735 2677237 600930 571394 1169676 -711058 -4021027 -4678563
$$ packed form
8961C394412J300058n44903k394412k820085j228707Q66993R43633r84198j799728
8952c266937J73456K366421J917104M1472m55469J17556l81807j589387j355299
8943b432890K04766J002290O56630N59994R19762Q90167Q38744J318444Q71489
8934D829396j645734l736703k251375J265327K495852Q74314l68601j26403l90917
8925I45156j375428q91683Q62694J023313n71669q11109Q37458J137085q60843
8916B94974j905732m72117P90320N83695J296500L289009K827233r12841k836098
8907B954943k14891J969809o79033l962675j974040K707037L317497M0386j278266
8898B880767M59868P68100j431498k076307k9536N98282j880734l309969o57536
$$ plain form
8889 -4678563 -1642705 2049897 3831871 3826829 2904576 1626379 1051847 1993728 3530475
8880 3530475 4305848 4709006 5620306 5967393 4225783 1603049 726524 1529937 1544709
8871 1544709 212844 -396381 351716 224842 -1980128 -3982377 -3294030 -877781 357899
8862 357899 -725167 -2970431 -4947657 -5747411 -4450799 -608529 4519784 8234710 8496855
8853 8496855 5749729 2560009 1236403 1725002 2219838 1776517 1255018 1338214 1242108
8844 1242108 556535 692969 2583018 4346957 3722167 1787938 1458509 2961326 3943300
8835 3943300 3692616 3713522 3980986 2513363 -470360 -1864093 -580696 671590 391081
8826 391081 1101840 4492414 7503267 6811646 4120964 3069376 3496711 3021700 2084595
$$ packed form
8889d678563L035858L692602J781974n042r22253j278197n74532R41881J536747
8880C530475P75373M03158R11300L47087j741610k622734q76525Q03413J4772
8871A544709j331865o09225P48097j26874k204970k002249O88347K416249J235680
8862C57899j083066k245264j977226p99754J296612L842270N128313L714926K62145
8853H496855k747126l189720j323606M88599M94836m43321n21499Q3196r6106
8844A242108o85573J36434J890049J763939o24790j934229l29429J502817R81974
8835C943300k50684K0906K67464j467623k983723j393733J283397J252286k80509
8826C91081P10759L390574L010853o91621k690682j051588M27335m75011r37105
$$ plain form
8817 2084595 2750180 4115632 3722609 2316015 2187501 1810430 -2148572 -7716538 -8792202
8808 -8792202 -4421195 -676714 -1311368 -2733439 -1454197 -493043 -3482168 -7163354 -5752468
8799 -5752468 68806 4338375 4367661 2741942 1693261 678970 -446289 -496740 251104
8790 251104 232781 38957 1909780 5175470 6058676 3219587 -12745 -505671 686751
8781 686751 972587 101535 -652046 -997373 -1313067 -1502456 -1756825 -2792325 -4001108
8772 -4001108 -3400755 -969699 283606 -1305227 -2925032 -1398929 1497064 1499761 -1355486
8763 -1355486 -2573820 -137830 2420436 1475326 -1529963 -2957006 -2577108 -2952762 -4385055
8754 -4385055 -4249116 -1836283 -441899 -2672151 -5999727 -5775358 -1627987 2081721 2189454
$$ packed form
8817B084595O65585J365452l93023j406594j28514l77071l959002n567966j075664
8808h792202M371007L744481o34654j422071J279242R61154k989125l681186J410886
8799e752468N821274M269569K9286j625719j048681j014291j125259n0451P47844
8790B51104j8323j93824J870823L265690Q83206k839089l232332m92926J192422
8781F86751K85836q71052p53581l45327l15694j89389k54369j035500j208783
8772d001108O00353K431056J253305j588833j619805J526103K895993K697k855247
8763a355486j218334K435990K558266r45110l005289j427043L79898l75654j432293
8754d385055J35939K412833J394384k230252l327576K24369M147371L709708J07733
$$ plain form
8745 2189454 236160 -841733 -859668 -1351055 -2367464 -2784317 -2760156 -3438002 -4617934
8736 -4617934 -4952297 -4293994 -3745960 -3443096 -2484417 -1186723 -1018559 -1806034 -1505269
8727 -1505269 244331 806462 -1558112 -4531191 -4626820 -1902828 467760 613981 -252940
8718 -252940 -399119 70618 86177 -377012 -233760 895138 1622266 404958 -1783212
8709 -1783212 -1830796 1278711 4003812 2384044 -2079588 -3868547 -1035071 2241537 2057816
8700 2057816 100447 -58602 1180900 1032917 -320791 -240469 1366594 1757466 177879
8691 177879 -886187 -81172 640338 -413086 -1849248 -1700857 -456175 346632 827227
8682 827227 2098297 4030805 5461416 5962716 6000809 5807503 5216891 4282756 3265988
$$ packed form
8745B189454j953294j077893j7935m91387j016409m16853K4161o77846j179932
8736d617934l34363O58303N48034L02864R58679J297694J68164p87475L00765
8727a505269J749600N62131k364574k973079r5629K723992K370588J46221q66921
8718b52940j46179M69737J5559m63189J43252J128898P27128j217308k188170
8709a783212m7584L109507K725101j619768m463632j788959K833476L276608j83721
8700B057816j957369j59049J239502j47983j353708Q0322J607063L90872j579587
8691A77879j064066Q05015P21510j053424j436162J48391J244682Q02807M80595
8682H27227J271070J932508J430611N01300L8093j93306n90612r34135j016768
$$ plain form
8673 3265988 2346908 1792171 1821384 1995156 1609435 1045416 1526778 2863095 2775091 -286578
8663 -286578 -4548927 -6519345 -4773403 -1080277 1833535 2574207 1476531 -70912 -546727
8654 -546727 648805 2763433 4529427 5268891 5022048 4155670 3300703 3088588 3340711
8645 3340711 3066774 1906553 922935 1123162 1838884 1683784 656403 -2941 137536
8636 137536 157399 -554098 -1318769 -1249068 -345714 885353 2088418 2954665 3211578 3053074
8626 3053074 2902809 2595631 1677981 644708 608352 1272934 711078 -1826335 -4224016
8617 -4224016 -4115465 -2200954 -1206997 -2161455 -3652496 -4544882 -5260685 -5986420 -5706965
8608 -5706965 -4056107 -2531520 -2574917 -3512472 -3617992 -2442994 -1016407 -386166 -905038
$$ packed form
8673C265988r19080n54737K9213J73772l85721n64019M81362J336317q8004l061669
8663b86578m262349j970418J745942L693126K913812P40672j097676j547443m75815
8654e46727J195532K114628J765994P39464k46843q66378q54967k12115K52123
8645C340711k73937j160221r83618K00227P15722j55100j027381o59344J40477
8636A37536J9863p11497p64671O9701R03354J231067J203065Q66247K56913j58504
8626C053074j50265l07178r17650j033273l6356O64582n61856k537413k397681
8617d224016J08551J914511R93957r54458j491041q92386p15803p25735K79455
8608e706965J650858J524587m3397r37555j05520J174998J426587O30241n18872
$$ plain form
8599 -905038 -2280208 -3411487 -2956833 -1111404 -18566 -1140792 -2966038 -2888924 -859425
8590 -859425 674890 401173 -197729 650861 2463930 3461585 3023686 2073606 1480035
8581 1480035 1066760 292657 -658952 -899525 -14183 1117412 1206767 173392 -868529
8572 -868529 -1263714 -1407651 -1490772 -1100013 -672221 -1581536 -3555240 -3815735 -689814 3479570
8562 3479570 5350127 5176283 5589563 6787176 6351275 3760628 1677163 2046847 3769078
8553 3769078 5040159 5415133 4792788 2992478 1190335 1095950 1779134 226439 -3688025
8544 -3688025 -5862925 -3488041 819601 2615620 1112541 -1123552 -1934801 -857507
8536 -857507 1527452 3455974 2877288 281172 -1260796 -508464 -61912 -1956883 -4082406
$$ packed form
8599i05038j375170j131279M54654J845429J092838j122226j825246P7114K029499
8590h59425J534315k73717n98902Q48590J813069R97655m37899r50080n93571
8581A480035m13275p74103r51609k40573Q85342J131595Q9355j033375j041921
8572h68529l95185j43937q3121L90759M27792r09315j973704k60495L125921M169384
8562C479570J870557j73844M13280J197613m35901k590647k083465L69684J722231
8553C769078J271081L74974o22345j800310j802143r4385O83184j552695l914464
8544c688025k174900K374884M307642J796019j503079k236093q11249J077294
8536h57507K384959J928522n78686k596116j541968P52332M46552j894971k125523
$$ plain form
8527 -4082406 -3754731 -2184174 -2058798 -3047796 -3372679 -3647403 -4974875 -5121394 -1451302
8518 -1451302 3426797 4124714 414804 -2388761 -1566867 -482199 -2355175 -5099909 -4990777
8509 -4990777 -2191672 228636 764937 516189 900373 2063345 3041714 2856875 2000714
8500 2000714 2433581 4833183 6753597 5734027 3397627 3421074 5777965 6561641 3927394
8491 3927394 607490 -459436 445226 2059372 4354906 6662336 6746193 4102220 1642651
8482 1642651 1781824 3113117 3290896 2942379 3915702 5409298 4990486 2656731 1097075
8473 1097075 2044238 4424394 6121148 6054722 4580170 2982861 2468220 2918415 3003122
8464 3003122 1919633 210218 -1504027 -3294832 -4742411 -4516284 -2416158 -647360
$$ packed form
8527d082406L27675J570557J25376r88998l24883k74724j327472j46519L670092
8518a451302M878099O97917l709910k803565Q21894J084668j872976k744734J09132
8509d990777K799105K420308N36301k48748L84184J162972R78369j84839q56161
8500B000714M32867K399602J920414j019570k336400K3447K356891P83676k634247
8491C927394l319904j066926R04662J614146K295534K307430Q3857k643973k459569
8482A642651J39173J331293J77779l48517R73323J493596m18812k333755j559656
8473A097075R47163K380156J696754o6426j474552j597309n14641M50195Q4707
8464C003122j083489j709415j714245j790805j447579K26127K100126J768798
$$ plain form
8456 -647360 -1536356 -4589884 -7081942 -7165457 -5369201 -3265844 -1595196 37338 1830935
8447 1830935 2565220 589766 -3529338 -6599276 -6317390 -4108157 -2806126 -2762187 -2563070
8438 -2563070 -2357913 -3171242 -3514481 -621691 4478195 6954390 4486591 326632 -1302054
8429 -1302054 134361 2692482 4716088 4919171 2762063 282719 507638 2643910 2364796
8420 2364796 -1488147 -4581394 -3834014 -2156882 -3098549 -4857895 -3939804 -1381094 -500111
8411 -500111 -1056814 -625021 294189 -368592 -1390492 -10451 2508619 2355036 -362665
8402 -362665 -1911417 -1511024 -2096885 -4027026 -3747062 -355305 1800305 -290043 -3487466
8393 -3487466 -3400924 -674558 926563 201279 -1010913 -1455363 -1614327 -1996156 -2465836
$$ packed form
8456f47360q88996l053528k492058q3515J796256K103357J670648J632534J793597
8447A830935P34285j975454m119104l069938K81886K209233J302031M3939J99117
8438b563070K05157q13329l43239K892790N099886K476195k467799m159959j628686
8429a302054J436415K558121K023606K03083k157108k479344K24919K136272k79114
8420B364796l852943l093247P47380J677132r41667j759346R18091K558710Q80983
8411e00111n56703M31793R19210o62781j021900J380041K519070j53583k717701
8402c62665j548752M00393n85861j930141K79964L391757K155610k090348l197423
8393c487466Q6542K726366J601121p25284j212192m44450j58964l81829m69680
$$ plain form
8384 -2465836 -2841053 -2756250 -1622273 165153 900823 -367128 -2259194 -2673408 -1366848
8375 -1366848 -21989 -221974 -2010459 -4042631 -4830109 -4303242 -4098484 -5516333 -7413744
8366 -7413744 -7347361 -4764089 -1622118 302185 1137169 1543476 1293406 113198 -1334284
8357 -1334284 -2287973 -2776053 -2855163 -1915257 241633 2287955 2471935 747667 -988081
8348 -988081 -1013390 237353 686024 -820276 -2871515 -3029286 -803898 1856240 3102036
8339 3102036 2948954 2162309 1000272 26475 552492 2696713 4236272 3200694 722703
8330 722703 -527508 -9166 566239 297659 178562 1085767 2471884 3390618 3602123
8321 3602123 3493858 3718207 4643907 5469646 4649279 2106993 -42535 -178375 652589
$$ packed form
8384b465836l75217Q4803J133977J787426P35670j267951j892066m14214J306560
8375a366848J344859j99985j788485k032172p87478N26867K04758j417849j897411
8366g413744O6383K583272L141971J924303Q34984M06307k50070j180208j447482
8357a334284r53689m88080p9110R39906K156890K046322J83980j724268j735748
8348i88081k5309J250743M48671j506300k051239j57771K225388K660138J245796
8339C102036j53082p86645j162037r73797N26017K144221J539559j035578k477991
8330G22703j250211N18342N75405k68580j19097R07205J386117R18734K11505
8321C602123j08265K24349R25700Q25739q20367k542286k149528j35840Q30964
$$ plain form
8312 652589 684686 141418 159464 433533 159979 39989 872991 1398850 344430 -555870
8302 -555870 1098827 3816040 3722937 498970 -1981962 -1382595 361087 926928 766178
8293 766178 995371 1197887 1027439 1441376 2579910 2603209 429223 -2151284 -2776419
8284 -2776419 -1501627 -40730 725081 1134149 1586503 2097674 2423786 2140637 1226727
8275 1226727 508763 569340 596235 -316846 -1276200 -834867 336997 228719 -1305309 -2469179
8265 -2469179 -2576315 -2708946 -3223727 -3094542 -2044095 -1028407 -398184 251047 600131
8256 600131 389431 1055384 3489569 4860134 1721730 -3784434 -5473763 -1693735 2297170
8247 2297170 2041019 -615113 -1914159 -1698607 -1549608 -1127426 209859 864931 -719758
$$ packed form
8312F52589L2097n43268J8046K74069k73554j19990Q33002N25859j054420r00300
8302e55870J654697K717213r3103l223967k480932N99367J743682N65841j60750
8293G66178K29193K02516j70448M13937J138534K3299k173986k580507o25135
8284b776419J274792J460897P65811M09068M52354N11171L26112k83149r13910
8275A226727p17964O0577K6895r13081r59354M41333J171864j08278j534028j163870
8265b469179j07136j32631n14781J29185J050447J015688O30223O49231L49084
8256F00131k10700O65953K434185J370565l138404n506164j689329L780028L990905
8247B297170k56151k656132j299046K15552J48999M22182J337285O55072j584689
$$ plain form
8238 -719758 -3208454 -4222598 -3170585 -628313 2549155 4050263 1390145 -3672618
8230 -3672618 -5621959 -2506974 940083 269169 -2588715 -3611481 -3044946 -3165221 -3231979
8221 -3231979 -1578918 90306 -472448 -1323923 488026 3156310 2886945 608641 188929
8212 188929 1268388 -31879 -3749002 -5555628 -3947285 -2163213 -2045393 -1506624 470385
8203 470385 1531193 577820 -18432 965150 1119128 -980016 -2703387 -1833358 -554902
8194 -554902 -1642844 -3453675 -2361734 1526599 4485271 4209251 2028883 388112 215192
8185 215192 904892 1566682 1974977 2611291 3645992 4207292 3526683 2402859 2157043
8176 2157043 2478388 2043279 1012206 773852 1200690 600659 -1133824 -1800011 -206100
$$ packed form
8238g19758k488696j014144J052013K542272L177468J501108k660118n062763
8230c672618j949341L114985L447057o70914k857884j022766N66535j20275o6758
8221c231979J653061J669224n62754q51475J811949K668284k69365k278304m19712
8212A88929J079459j300267l717123j806626J608343J784072J17820N38769J977009
8203D70385J060808r53373n96252R83582J53978k099144j723371Q70029J278456
8194e54902j087942j810831J091941L888333K958672k76020k180368j640771j72920
8185B15192O89700O61790M08295O36314J034701N61300o80609j123824k45816
8176B157043L21345m35109j031073k38354M26838o00031j734483o66187J593911
$$ plain form
8167 -206100 2038563 3189507 3748793 4775521 5548709 4546343 1738481 -1271166 -2641167
8158 -2641167 -1307254 2217268 5483848 5807848 2990317 -627814 -2974953 -3753815 -3156399
8149 -3156399 -1085667 1717714 3576533 3756418 3083953 2296084 1390241 849337 1424028
8140 1424028 2206557 1271950 -930795 -1342562 1258374 4046089 4133593 2483465 1675860
8131 1675860 1808666 1318230 471181 999229 2675658 2996492 649675 -2662611 -4415594
8122 -4415594 -3911067 -2257025 -747725 113940 413425 114931 -1165427 -3337632 -5043080
8113 -5043080 -4622261 -2078951 824288 2663078 3550344 4062982 4288002 4370822 4590062
8104 4590062 4245231 1998248 -1722214 -4122622 -3091687 320582 3591287 5581574
$$ packed form
8167b06100K244663J150944N59286J026728P73188j002366k807862l009647j370001
8158b641167J333913L524522L266580L24000k817531l618131k347139p78862N97416
8149c156399K070732K803381J858819J79885o72465p87869r05843n40904N74691
8140A424028P82529r34607k202745m11767K600936K787715Q7504j650128q07605
8131A675860J32806m90436q47049N28048J676429L20834k346817l312286j752983
8122d415594N04527J654042J509300Q61665K99485k98494j280358k172205j705448
8113e043080M20819K543310K903239J838790Q87266N12638K25020Q2820K19240
8104D590062l44831k246983l720462k400408J030935L412269L270705J990287
$$ plain form
8096 5581574 6366015 5602623 3026348 -140530 -2099724 -2521307 -2321498 -1882666 -916320
8087 -916320 360326 1423966 2488233 3823456 4321827 2510804 -841506 -2807920 -1612446
8078 -1612446 1321926 3251307 3073668 1726024 392187 -687338 -1637096 -1917691 -625902
8069 -625902 1862467 3189140 1216006 -2859408 -5061620 -3333345 -461126 -723680 -4383065
8060 -4383065 -7457413 -6787413 -3268436 304157 2464803 3070373 1993402 -205685 -1329500
8051 -1329500 453990 3680418 4654700 2040504 -1267540 -1876345 -117039 1012613 260019
8042 260019 -550177 341084 2072531 2653267 1716305 607573 432160 1074940 1753988
8033 1753988 1672993 497666 -1005171 -1222410 506796 2706941 3357110 2373296 1431764
$$ packed form
8096E581574P84441p63392k576275l166878j959194m21583J99809M38832R66346
8087i16320J276646J063640J064267J335223M98371j811023l352310j966414J195474
8078a612446K934372J929381j77639j347644j333837j079525r49758k80595J291789
8069f25902K488369J326673j973134m075414k202212J728275K872219k62554l659385
8060d383065l074348O70000L518977L572593K160646O05570j076971k199087j123815
8051a329500J783490L226428R74282k614196l308044o08805J759306J129652p52594
8042B60019q10196Q91261J731447N80736r36962j108732j75413O42780O79048
8033A753988q0995j175327j502837k17239J729206K200145O50169r83814r41532
$$ plain form
8024 1431764 1504692 1784393 1172099 -271051 -1674928 -2322734 -2024548 -1232334 -819338
8015 -819338 -954871 -341335 2249615 5613556 6756075 4498806 1126504 -494319 -293973
8006 -293973 -208661 -865933 -847587 720382 2531643 2888477 1994276 1171809 353962 -1900943
7996 -1900943 -5468908 -7461601 -5500254 -1251677 1249835 545427 -1076550 -1509924 -1438815
7987 -1438815 -1987251 -2274038 -1379266 -858624 -2637750 -5490205 -6405077 -5003616 -3822169
7978 -3822169 -4142405 -4289569 -2800803 -907415 -642434 -2193665 -4368853 -6353273 -7702498
7969 -7702498 -7510166 -5035799 -1152325 1664355 1329906 -1634155 -4169594 -3825604 -1811148
7960 -1811148 -1411745 -2982407 -2868165 1124941 5674318 6170268 3074999 490477 -256826
$$ packed form
8024A431764P2928K79701o12294j443150j403877o47806K98186P92214M12996
8015h19338j35533O13536K590950L363941J142519k257269l372302j620823K00346
8006b93973Q5312o57272J8346J567969J811261L56834q94201q22467q17847k254905
7996a900943l567965j992693J961347M248577K501512p04408j621977m33374P1109
7987a438815n48436k86787Q94772N20642j779126k852455r14872J401461J181447
7978c822169l20236j47164J488766J893388K64981j551231k175188j984420j349225
7969g702498J92332K474367L883474K816680l34449k964061k535439L43990K014456
7960a811148L99403j570662J14242L993106M549377M95950l095269k584522p47303
$$ plain form
7951 -256826 -1290919 -2957436 -2774359 -390111 1029205 25682 -758271 384994 851164
7942 851164 -1571886 -4096823 -2836431 1088804 3245559 2197652 453490 -11066 252804
7933 252804 359714 312248 -59649 -1030441 -1785120 -1257840 -76236 154298 -651586 -1054564
7923 -1054564 -462014 222249 352892 422762 1024624 2062649 3025269 3260210 2346852 925406
7913 925406 410432 1016493 1145662 -47291 -716117 1287803 5004906 7358779 7054935
7904 7054935 5491612 4014883 2366543 238491 -1387926 -1395492 -213880 396345 -811973
7895 -811973 -3061951 -4141708 -3014698 -1472295 -1976909 -4090868 -4961655 -3581618 -2097781
7886 -2097781 -1921553 -1264373 1506930 4410427 4345190 1478015 -1361939 -2421041 -1829125
$$ packed form
7951b56826j034093j666517J83077K384248J419316j003523p83953J143265M66170
7942H51164k423050k524937J260392L925235K156755j047907j744162m64556K63870
7933B52804J06910m7466l71897r70792p54679N27280J181604K30534q05884m02978
7923a054564N92550O84263J30643O9870O01862J038025R62620K34941r13358j421446
7913I25406n14974O06061J29169j192953o68826K003920L717103K353873l03844
7904G054935j563323j476729j648340k128052j626417p566J181612O10225j208318
7895h11973k249978j079757J127010J542403n04614k113959q70787J380037J483837
7886b097781J76228O57180K771303K903497o5237k867175k839954j059102N91916
$$ plain form
7877 -1829125 34186 2483959 3891180 3460088 2608570 2493726 1836102 -197840 -1038881
7868 -1038881 1632679 4869132 3619776 -1681261 -5340532 -4394612 -1792561 -809080 -858587
7859 -858587 -531043 -649783 -1923602 -2811494 -2143625 -1213190 -1104109 -518772 1494281
7850 1494281 3110130 2480656 771721 -62332 -583478 -2257470 -4214242 -4564601 -3822516
7841 -3822516 -4070479 -5312223 -5446926 -3764541 -1984539 -1570409 -2127081 -2929247 -4171111
7832 -4171111 -5808956 -6442417 -4530441 -498549 3002236 3322036 569116 -2099236 -1712897
7823 -1712897 985184 2328422 293103 -3066754 -4396410 -2838248 -2401 2493679
7815 2493679 3898691 3709845 2060268 458749 532287 1947943 2815489 2201530 1052066
$$ packed form
7877a829125J863311K449773J407221m31092q51518j14844o57624k033942q41041
7868a038881K671560L236453j249356n301037l659271R45920K602051R83481m9507
7859h58587L27544j18740j273819q87892O67869R30435J09081N85337K013053
7850A494281J615849o29474j708935q34053n21146j673992j956772l50359P42085
7841c822516k47963j241744j34703J682385J780002M14130n56672q02166j241864
7832d171111j637845o33461J911976M031892L500785L19800k752920k668352L86339
7823a712897K698081J343238k035319l359857j329656J558162K835847K496080
7815B493679J405012j88846j649577j601519P3538J415656Q67546o13959j149464
$$ plain form
7806 1052066 456840 196869 -494951 -1684716 -2952742 -4207187 -5422766 -5875162 -4693859
$$ packed form
7806A052066n95226k59971o91820j189765j268026j254445j215579m52396J181303
$$ [...]
##END NTUPLES=NMR SPECTRUM
##END=
