##TITLE=31Pdec_PR1452
 D2O, 24 sc
 12.03.2021
##JCAMPDX= 6.0         $$ Bruker NMR JCAMP-DX V2.0
##DATA TYPE= NMR SPECTRUM
##DATA CLASS= NTUPLES
##ORIGIN= UXNMR, Bruker Analytische Messtechnik GmbH
##OWNER= root
$$ XWIN-NMR		Version 3.5
$$ Fri Mar 12 13:07:29 2021 Russian Standard Time (UT+4h)  she@DPX200
##.OBSERVE FREQUENCY= 81.013821
##.OBSERVE NUCLEUS= ^31P
##.ACQUISITION MODE= SIMULTANEOUS
##.ACQUISITION SCHEME= undefined
##.AVERAGES= 24
##.DIGITISER RES= 16
##SPECTROMETER/DATA SYSTEM= spect
##.PULSE SEQUENCE= zgpg30
##.SOLVENT NAME= D2O
##.SHIFT REFERENCE= (INTERNAL, D2O, 0, 248.564)
##AUDIT TRAIL= $$ (NUMBER, WHEN, WHO, WHERE, WHAT)
$$ ##TITLE= Audit trail, XWIN-NMR		Version 3.5
$$ ##JCAMPDX= 5.01
$$ ##ORIGIN= Bruker BioSpin GmbH
$$ ##OWNER= she
$$ F:/spectra/data/she/nmr/P31/1/pdata/1/auditp.txt
$$ ##AUDIT TRAIL=  $$ (NUMBER, WHEN, WHO, WHERE, WHAT)
(   1,<2021-03-12 13:06:21.35 +0400>,<she>,<DPX200>,
      <created by zg, POWCHK disabled, PULCHK disabled
       configuration hash MD5:
       00 E9 B6 7A A2 85 ED C7 34 08 36 98 17 FE 4E 26
       data hash MD5: 32K
       51 C0 50 F8 F1 B3 5B 00 0A E8 45 02 DE 33 64 F3>)
(   2,<2021-03-12 13:06:24.14 +0400>,<she>,<DPX200>,
      <Start of raw data processing
       efp BC_mod = 2 LB = 1 FT_mod = 6 PKNL = 1 PHC0 = -4408.713 PHC1 = 745.2012 SI = 64K 
       data hash MD5: 64K
       0F 34 87 86 AC A2 C1 D7 31 0B 75 F0 A7 87 88 97>)
(   3,<2021-03-12 13:06:58.54 +0400>,<she>,<DPX200>,
      <pk PHC0 = 65.92175 PHC1 = -35.40001 
       data hash MD5: 64K
       ED 81 3A 50 42 21 EA C2 A4 5A E2 D6 C3 EF EE 96>)
(   4,<2021-03-12 13:07:01.64 +0400>,<she>,<DPX200>,
      <abs ABSG = 5 
       data hash MD5: 64K
       8B 67 EE 2A B0 40 4C 61 A3 4F 66 43 3B 7C C7 11>)
$$ ##END=
$$ 
$$ hash MD5
$$ 82 D8 B8 E9 04 19 5B 83 73 E4 4E 05 64 B4 ED 7F
##$RELAX= 
##$RELAX= 
##$RELAX= 
##$RELAX= 
##$RELAX= 
##$RELAX= 
##$RELAX= 
##$RELAX= 
$$ Bruker specific parameters
$$ --------------------------
##$DU= <F:/spectra>
##$EXPNO= 1
##$NAME= <P31>
##$PROCNO= 1
##$TYPE= <nmr>
##$USER= <she>
##$AMP= (0..31)
100 100 100 100 100 100 100 100 100 100 100 100 100 100 100 100 100 100 
100 100 100 100 100 100 100 100 100 100 100 100 100 100 
##$AQSEQ= 0
##$AQ_mod= 1
##$AUNM= <au_zg>
##$AUTOPOS= <>
##$BF1= 81.014009
##$BF2= 200.13
##$BF3= 200.13
##$BF4= 200.13
##$BF5= 200.13
##$BF6= 200.13
##$BF7= 200.13
##$BF8= 200.13
##$BYTORDA= 1
##$CFDGTYP= 0
##$CFRGTYP= 5
##$CHEMSTR= <none>
##$CNST= (0..31)
1 1 145 1 1 1 1 1 1 1 1 1 1 1 1 1 1 1 1 1 1 1 1 1 1 1 1 1 1 1 1 1 
##$CPDPRG= <waltz16>
##$CPDPRG1= <>
##$CPDPRG2= <waltz16>
##$CPDPRG3= <>
##$CPDPRG4= <mlev>
##$CPDPRG5= <mlev>
##$CPDPRG6= <mlev>
##$CPDPRG7= <mlev>
##$CPDPRG8= <mlev>
##$CPDPRGB= <>
##$CPDPRGT= <>
##$D= (0..31)
0 1 0 0 0 0 0 0 0 0 0 0.03 2e-05 3e-06 0 0 0 0 0 0 0 0 0 0 0 0 0 0 0 0 
0 0 
##$DATE= 1615539980
##$DBL= (0..7)
120 120 120 11 120 120 24 19 
##$DBP= (0..7)
150 150 150 150 150 150 150 150 
##$DBP07= 0
##$DBPNAM0= <>
##$DBPNAM1= <>
##$DBPNAM2= <>
$$ [...]
##$SUBNAM3= <"">
##$SUBNAM4= <"">
##$SUBNAM5= <"">
##$SUBNAM6= <"">
##$SUBNAM7= <"">
##$SUBNAM8= <"">
##$SUBNAM9= <"">
##$SW= 501.771253377433
##$SWIBOX= (0..15)
0 1 3 0 0 0 0 0 0 0 0 0 0 0 0 0 
##$SW_h= 40650.406504065
##$TD= 32768
##$TD0= 1
##$TE= 0
##$TE2= 300
##$TE3= 300
##$TEG= 300
##$TL= (0..7)
0 120 53 12 22 120 120 120 
##$TP= (0..7)
150 150 150 150 150 150 150 150 
##$TP07= 0
##$TPNAME0= <>
##$TPNAME1= <>
##$TPNAME2= <>
##$TPNAME3= <>
##$TPNAME4= <>
##$TPNAME5= <>
##$TPNAME6= <>
##$TPNAME7= <>
##$TPOAL= (0..7)
0.5 0.5 0.5 0.5 0.5 0.5 0.5 0.5 
##$TPOFFS= (0..7)
0 0 0 0 0 0 0 0 
##$TUNHIN= 0
##$TUNHOUT= 0
##$TUNXOUT= 0
##$USERA1= <user>
##$USERA2= <user>
##$USERA3= <user>
##$USERA4= <user>
##$USERA5= <user>
##$V9= 5
##$VALIST= <valist>
##$VCLIST= <CCCCCCCCCCCCCCC>
##$VD= 0
##$VDLIST= <DDDDDDDDDDDDDDD>
##$VPLIST= <PPPPPPPPPPPPPPP>
##$VTLIST= <TTTTTTTTTTTTTTT>
##$WBST= 1024
##$WBSW= 4
##$XGAIN= (0..3)
0 0 0 0 
##$XL= 0
##$YL= 0
##$YMAX_a= 9840
##$YMIN_a= -11331
##$ZGOPTNS= <>
##$ZL1= 120
##$ZL2= 120
##$ZL3= 120
##$ZL4= 120
##$ABSF1= 248.5645
##$ABSF2= -253.2056
##$ABSG= 5
##$ABSL= 3
##$ALPHA= 0
##$AQORDER= 0
##$ASSFAC= 0
##$ASSFACI= 0
##$ASSFACX= 0
##$ASSWID= 0
##$AUNMP= <proc_1d>
##$AZFE= 0.1
##$AZFW= 0.5
##$BCFW= 0
##$BC_mod= 2
##$BYTORDP= 0
##$COROFFS= 0
##$CY= -3
##$DATMOD= 1
##$DC= 0
##$DFILT= <>
##$DTYPP= 0
##$F1P= 0
##$F2P= 0
##$FCOR= 1
##$FTSIZE= 65536
##$FT_mod= 6
##$GAMMA= 0
##$GB= 0
##$INTBC= 1
##$INTSCL= 5.30512e-09
##$ISEN= 30
##$LB= 1
##$LEV0= 0
##$LPBIN= 0
##$MAXI= 10000
##$MC2= 0
##$MEAN= 0
##$ME_mod= 0
##$MI= 50
##$NCOEF= 0
##$NC_proc= -5
##$NLEV= 6
##$NOISF1= 182.463
##$NOISF2= 159.3651
##$NSP= 0
##$NTH_PI= 0
##$NZP= 0
##$OFFSET= 248.5645
##$PC= 4
##$PHC0= -4342.791
##$PHC1= 709.8011
##$PH_mod= 1
##$PKNL= yes
##$PPARMOD= 0
##$PSCAL= 0
##$PSIGN= 0
##$REVERSE= no
##$SF= 81.014009
##$SI= 65536
##$SIGF1= 159.3651
##$SIGF2= -187.1042
##$SINO= 113.3802
##$SIOLD= 16384
##$SREGLST= <1H.CDCl3>
##$SSB= 0
##$STSI= 65536
##$STSR= 0
##$SW_p= 40650.406504065
##$SYMM= 0
##$S_DEV= 0
##$TDeff= 32768
##$TDoff= 0
##$TI= <>
##$TILT= no
##$TM1= 0
##$TM2= 0
##$TOPLEV= 0
##$USERP1= <user>
##$USERP2= <user>
##$USERP3= <user>
##$USERP4= <user>
##$USERP5= <user>
##$WDW= 1
##$XDIM= 65536
##$YMAX_p= 350087334
##$YMIN_p= -10654788
$$ End of Bruker specific parameters
$$ ---------------------------------
##NTUPLES= NMR SPECTRUM
##VAR_NAME=  FREQUENCY,     SPECTRUM/REAL,   SPECTRUM/IMAG
##SYMBOL=    X,             R,               I
##VAR_TYPE=  INDEPENDENT,   DEPENDENT,       DEPENDENT
##VAR_FORM=  AFFN,          ASDF,            ASDF
##VAR_DIM=   65536,         65536,           65536
##UNITS=     HZ,            ARBITRARY UNITS, ARBITRARY UNITS
##FACTOR=    0.620285442955139, 1,           1
##FIRST=     20137.2065510759, 0,            0
##LAST=      -20513.1999529892, 0,           0
##MIN=       -20513.1999529892, -10654788,   0
##MAX=       20137.2065510759, 350087334,    0
$$ Real data points
##PAGE= N=1
##DATA TABLE= (X++(R..R)), XYDATA
$$ [...]
43092 194881 1563269 3106612 3316522 1780942 -461374 -1847496 -1331367 749523 2629417
43083 2629417 2732809 1466085 528872 533237 589634 275484 295388 684684 181714 -1576878
43073 -1576878 -2844475 -2110390 -350718 569771 636700 1127187 2132067 2492935 1841975
43064 1841975 976649 300480 -545395 -1441173 -1632668 -1050639 -546674 -535749 -481387 20304
43054 20304 656836 1135000 1526382 1659473 1168867 419517 347396 992989 1207562 342431
43044 342431 -709771 -817973 -162823 258783 94857 -115684 214294 1149916 2142604
43035 2142604 2188004 683812 -1435910 -2168250 -748973 1157328 1465875 361192 -113374
43026 -113374 1065291 2635590 2912354 1927672 1124921 1450832 2369817 2668715 1848940
43017 1848940 581111 -164287 -244071 -293735 -583745 -536896 230782 1006928 902464 285945
43007 285945 267330 816523 588116 -956233 -2307143 -1652815 721739 2693137 2741889
42998 2741889 1373120 158290 55806 826465 1596339 1725968 1344509 1161180 1645470
42989 1645470 2456800 2882757 2723709 2411560 2285423 2158713 1774657 1393487 1593466
42980 1593466 2467340 3225066 2847960 1253035 -406574 -946470 -561719 -513962 -1338436
42971 -1338436 -2065407 -1645652 -488138 150826 -142667 -728500 -1115102 -1393046 -1508934
42962 -1508934 -1102033 -254670 463112 928376 1590922 2408455 2616975 2005867 1443483
42953 1443483 1470686 1290778 52049 -1618181 -2410645 -2131192 -1610077 -1205864 -599433
42944 -599433 55244 5243 -853602 -1579347 -1388259 -557030 155410 391635 264103 42690
42934 42690 -45629 -88333 -530423 -1486144 -2189589 -1803334 -615690 367960 853360 1261053
42924 1261053 1425510 648952 -707509 -1157275 -246942 605781 329606 -107225 515156
42915 515156 1416126 1067328 -114905 -322610 657093 1031826 -132233 -1468714 -1449806
42906 -1449806 -476398 119775 27134 -126124 25491 476965 1347684 2535284 3312676
42897 3312676 3121151 2400297 1873385 1441645 635557 -260479 -567924 -468024 -798924 -1594084
42887 -1594084 -1863315 -1019044 383270 1549310 2218714 2281870 1573931 525144 159455
42878 159455 785046 1329416 664580 -891805 -2055756 -2172185 -1705192 -1416624 -1605391
42869 -1605391 -1968240 -1847416 -892861 300660 737782 445166 538705 1407154 1870686
42860 1870686 1034348 -77442 -91382 352611 -432125 -2253682 -3025437 -1790105 69060
42851 69060 1068299 1366497 1601227 1592915 1181387 1027998 1506071 1855311 1449410 903410
42841 903410 911160 996119 551394 171285 678666 1625602 2046010 1947315 1714816 841813
42831 841813 -1098228 -2817199 -2560545 -824823 52478 -807375 -1711263 -1045722 580069
42822 580069 1605737 1609750 1187600 709401 209099 -22819 397453 1335417 2140609 2204431
42812 2204431 1473946 630177 578432 1341988 1753882 867597 -680561 -1555849 -1600685 -1698496
42802 -1698496 -1989097 -1610274 -354242 786570 1119865 1081608 1105207 845230 127341
42793 127341 -388502 -165801 469377 1097236 1790635 2387458 2169643 946097 -429238
42784 -429238 -1251449 -1770661 -2223021 -2158883 -1544150 -1401686 -2254292 -2869138 -1821521 358642
42774 358642 1864262 1960309 1434195 1010653 533959 -260295 -1090152 -1416363 -945032 61286
42764 61286 762097 502788 -169996 -55066 764093 634079 -1256978 -3346869 -3717379
42755 -3717379 -2637145 -1735438 -1510456 -1247890 -801211 -723938 -892713 -611336 -3430
42746 -3430 133600 -249298 -565853 -899106 -1622377 -1928459 -626112 1475639 1986113 269172
42736 269172 -1520319 -1524551 -519204 -98151 -198936 92327 557061 368548 -167816 -53776
42726 -53776 564055 472538 -703796 -1873442 -1933177 -979283 132370 776280 891955 754461
42716 754461 580164 226380 -576775 -1564016 -1916056 -1276642 -395375 -250858 -852817 -1469840
42706 -1469840 -1735812 -1827513 -1731455 -1185267 -453103 -350968 -1120949 -1897856 -1803738 -1088640
42696 -1088640 -525218 -34078 1116064 2677053 3097225 1512034 -759610 -1766007 -1498561
42687 -1498561 -1604720 -2620080 -3048854 -1749817 180564 948619 448390 -101723 -132504
42678 -132504 -5081 158712 535053 746996 272233 -448109 -591012 -506780 -1280275 -2717600
42668 -2717600 -3292269 -2397312 -1181193 -639291 -285925 527206 1203147 754546 -782999
42659 -782999 -2555854 -3767160 -3797037 -2392655 -435350 410996 -351178 -1239501 -714737
42650 -714737 865665 2031403 2128228 1520714 598104 -356538 -833503 -652495 -441816
42641 -441816 -666583 -668869 321435 1640873 1784418 392591 -1331211 -2148816 -1928125
42632 -1928125 -1307003 -932213 -1032258 -1250263 -1026065 -462058 -351212 -909468 -1166673
42623 -1166673 -333187 912459 1406730 1130765 791714 367329 -628253 -1779659 -2059057
42614 -2059057 -1403337 -739472 -440848 -1259 673517 911347 471229 -24857 -163006
42605 -163006 -241050 -455004 -595200 -798504 -1521508 -2423456 -2388988 -1165684 52366 266668
42595 266668 -55212 -20413 266950 151768 -345428 -563446 -98454 866950 1743200 1707976
42585 1707976 297644 -1789734 -3145783 -3290136 -3055800 -2920651 -2101028 -219673 1259901
42576 1259901 798945 -620441 -440177 1885655 3912591 3414657 1236195 -64369 443606
42567 443606 1312249 1030806 -118056 -829313 -520022 355704 1244275 1915323 2055549
42558 2055549 1341149 232476 -76090 875948 1946714 1754713 508479 -427993 -528078
42549 -528078 -548074 -970037 -1236484 -955795 -734210 -1046409 -1161308 -176323 1396059 2067362
42539 2067362 1216645 -298751 -1305128 -1414592 -958798 -414422 -76132 3052 -102147
42530 -102147 -352654 -629326 -507187 340819 1319269 1132993 -625287 -2576195 -2920788
42521 -2920788 -1477089 248138 857697 362344 -213003 36424 1166014 2366152 2654168
42512 2654168 1844113 724264 77106 -166255 -483813 -894331 -1056325 -924594 -734388
42503 -734388 -561507 -436005 -615882 -1146191 -1447612 -1053876 -475717 -494569 -829382 -525209
42493 -525209 383635 748346 99593 -512284 12884 1368652 2428622 2588951 1968793
42484 1968793 939501 94827 128731 1056338 1967334 2133537 1895435 1845981 1716792 934865
42474 934865 -178780 -816564 -1024613 -1459855 -1848336 -1028651 1060151 2688341 2448206
42465 2448206 1105309 347265 452004 460293 188419 492470 1411489 1613312 420685
42456 420685 -829203 -531168 888596 1650241 1150241 512224 704974 1391484 1886152
42447 1886152 2093628 2013263 1319739 115508 -697593 -553510 -108634 -256317 -836647
42438 -836647 -1143091 -1170770 -1374109 -1568401 -1193502 -524156 -459803 -1015129 -1151667 -432778
42428 -432778 237824 123474 -42343 822992 2280642 2671084 1250202 -810281 -1832973
42419 -1832973 -1505386 -905557 -912077 -1164385 -802332 216749 1117475 1484905 1682137 1874154
42409 1874154 1456560 84802 -1375697 -1817437 -1424174 -1273076 -1618235 -1623139 -821474
42400 -821474 182407 663868 509666 -200492 -1367661 -2303384 -1986801 -427171 1070801
42391 1070801 1539758 1424182 1465164 1453898 946198 414513 588843 1091582 792852 -614403
42381 -614403 -2210356 -2924563 -2406346 -1046227 248432 558130 -106605 -580927 139192
42372 139192 1647391 2808157 3263703 3419385 3287369 2432296 1025646 -91577 -569270
42363 -569270 -865580 -1172811 -917630 226061 1524556 1952254 1414634 801446 1017150
42354 1017150 2120901 3173656 2885769 799868 -2033938 -3886112 -3973169 -3017083 -2220576
42345 -2220576 -2075551 -2223869 -2072701 -1372340 -433719 136132 77126 -214879 -231930 -25145
42335 -25145 4723 -190577 -250907 19901 406259 543843 144778 -858906 -2078057 -2804440
42325 -2804440 -2710848 -2138075 -1451657 -643940 89834 167903 -366551 -520360 111904 463780
42315 463780 -189745 -632486 395908 1687736 1203398 -390022 -529763 953925 1413835
42306 1413835 -74943 -927304 636284 2391140 1581429 -697960 -1414135 -286965 468387
42297 468387 142118 167526 1016993 1394575 864006 730978 1612489 2263569 1683685 623468
42287 623468 110628 -8283 -164742 -22010 756799 1726666 2383192 2744410 2702510 1877631
42277 1877631 652100 150429 516825 461975 -606632 -1262983 -80994 2010731 2792514
42268 2792514 1593655 -235609 -1325208 -1504690 -1167113 -598551 -107671 44447 77693
42259 77693 477451 1233944 1793900 1834517 1612657 1433414 1171944 538128 -355886 -886875
42249 -886875 -501288 530272 1164574 730215 -179836 -518219 -324656 -592416 -1504762
42240 -1504762 -1876363 -890190 546819 1004532 409897 -173752 -174191 16815 -49315 -340639
42230 -340639 -625162 -643867 -129523 794242 1434938 1301960 816104 706822 1011928 1277046
42220 1277046 1385476 1461997 1271186 530059 -400194 -939744 -1196392 -1625953 -2044865 -1948822
42210 -1948822 -1630471 -1880068 -2601497 -2868439 -2454449 -2112805 -2091139 -1639966 -522428
42201 -522428 185112 -385984 -1478575 -1682232 -689349 660311 1512018 1487607 629195
42192 629195 -404010 -557702 494049 1842640 2507940 2536186 2330020 1668720 393374
42183 393374 -565790 -150752 1066459 1379364 277249 -891561 -872124 -75004 307903
42174 307903 -42492 -440634 -274469 315184 645674 117499 -1195913 -2480677 -2919915
42165 -2919915 -2497111 -1813740 -1262557 -829919 -581542 -713432 -1062197 -1138796 -765283 -198137
42155 -198137 390128 990809 1355490 1221520 969045 1232462 1745554 1526617 469961
42146 469961 -340194 -414368 -783806 -2242784 -3697278 -3524476 -1903332 -425787 202400
42137 202400 611242 1062876 899173 47379 -360765 356922 1231883 1037753 134491 -128988
42127 -128988 545733 1039486 486484 -602261 -1192612 -1061007 -800375 -837004 -953372 -719758
42117 -719758 19067 1124621 2215129 2592864 1628231 -348896 -1947883 -2155742 -1605382
42108 -1605382 -1592081 -2035796 -1638599 -271176 270633 -1189404 -3098175 -3001438 -834895
42099 -834895 1037986 795404 -1122668 -3076275 -3726597 -2586393 -423128 837844 -54077
42090 -54077 -1834867 -2107791 -673949 190808 -820648 -2203748 -2123019 -924118 140520
42081 140520 1045538 2110926 2329051 742445 -1242486 -1189308 848383 2220054 1355749
42072 1355749 -325118 -784297 -16701 611811 485956 87277 -137572 -277400 -522491
42063 -522491 -818124 -898755 -481646 372847 1074004 1038782 417342 -161576 -523213 -1018019
42053 -1018019 -1602996 -1566140 -505171 919472 1603705 1131751 81370 -598898 -409710
42044 -409710 331794 922504 1153706 1545370 2507100 3607075 4018581 3359991 1783314
42035 1783314 -229673 -1712510 -1615053 -156474 952422 669957 254544 1345533 3072179
42026 3072179 2979292 708948 -1295120 -1203232 -37121 329310 -229259 -622446 -474161
42017 -474161 -334900 -695091 -1619386 -2730511 -3104097 -2089587 -608625 -416847 -1572971
42008 -1572971 -2094629 -861097 766612 1266310 1177488 1551985 1838765 1211314 618176
41999 618176 1308242 2371817 2125410 1141239 1299619 2307495 2017827 260229 -582056
41990 -582056 540305 1652873 1100567 92557 340502 1257479 1390773 1006895 1209556
41981 1209556 1652845 1189079 50890 -542269 -475148 -612316 -898119 -427218 612153
41972 612153 879388 96092 -313884 581597 1768991 1856181 1001950 328019 210396 187404
41962 187404 79266 185382 557078 936676 1359794 2026992 2536675 2071068 646786
41953 646786 -517565 -387950 608323 1249689 1089828 663167 320366 -276601 -1304471
41944 -1304471 -2163755 -2174973 -1444241 -597559 15248 440152 744217 969760 1247111 1535144
41934 1535144 1436440 667608 -462053 -1396698 -1926585 -2079638 -1767073 -1037931 -370809
41925 -370809 -148986 -155372 -163526 -545336 -1432982 -1780496 -548654 1350868 1799593 398055
41915 398055 -880179 -567563 271887 -38816 -1137437 -1403717 -602433 -60584 -445316
41906 -445316 -953689 -897483 -714206 -913204 -1131541 -940035 -781542 -1285622 -2107056 -2251256
41896 -2251256 -1428199 -446209 -183786 -581603 -785982 -65770 1484122 2968561 3370646
41887 3370646 2418906 930927 160184 607119 1538687 1878890 1477535 1128099 1309782
41878 1309782 1481444 989304 143265 -299356 -376065 -704819 -1093712 -520439 1064317
41869 1064317 1996740 918818 -1097546 -1597067 189367 2316854 2428113 423810 -1542057
41860 -1542057 -1424127 631161 2495096 2299415 424147 -1015170 -679732 604182 1321751
41851 1321751 1328754 1480487 1745930 1122651 -456882 -1546285 -1169184 -278174 -285437 -929593
41841 -929593 -781237 480528 1489301 983171 -746031 -2456980 -3301994 -3230148 -2614505
41832 -2614505 -1920338 -1441732 -1029308 -272101 846080 1716796 1755406 1054285 164347
41823 164347 -546380 -1037623 -1289637 -1217408 -900410 -663563 -846170 -1497232 -2205365 -2265245
41813 -2265245 -1331305 -33637 467455 -112626 -607411 188133 1745466 2201177 644064
41804 644064 -1673398 -2750638 -1987748 -546294 58288 -687074 -2067261 -2842707 -2326643
41795 -2326643 -1078675 -360282 -653982 -1046191 -475159 786151 1548915 1383935 1025882
41786 1025882 1040328 1015165 519500 55614 272391 751635 560861 -171577 -336738 290719
41776 290719 402996 -896043 -2403822 -2265046 -651347 443166 137218 -176268 740714
41767 740714 1891343 1732333 825152 926019 1906357 1723465 -256110 -1964280 -1594417
41758 -1594417 -127150 468214 180459 369563 1128044 1204836 320535 -287633 141263
41749 141263 899544 1234484 1416172 1789330 1923825 1485497 1064024 1302992 1837704 1891042
41739 1891042 1481938 1295636 1602867 1939085 1780543 1147097 604900 833315 1938176
41730 1938176 3061328 3066750 1833170 450289 -110537 -29952 -1849 -107774 46778 355749
41720 355749 79654 -1180471 -2755452 -3393238 -2481349 -753159 370898 278886 -227701
41711 -227701 -99373 575529 971895 981818 1259927 1809018 1680259 492849 -813369 -1397296
41701 -1397296 -1731093 -2522446 -3222516 -2717215 -1070943 472101 1023300 717932 82058
41692 82058 -373855 -111020 924713 1768798 1340997 -24515 -812985 -253425 826135
41683 826135 1313242 1148323 931603 922327 1008457 1169947 1376252 1339272 902600 456057
41673 456057 464465 737115 670211 155902 -272180 -277070 -188270 -386469 -683959 -769535 -913675
41662 -913675 -1534708 -2172420 -1781589 -327025 817538 726478 362989 1085397 2265515
41653 2265515 1867316 -591587 -3145594 -3919729 -3270048 -2670384 -2618115 -2626585 -2383634 -1784209
41643 -1784209 -461277 1548188 3094107 2994097 1587743 257145 -322211 -488396 -483111
41634 -483111 -185282 162361 80096 -269049 -322293 -219990 -614664 -1360273 -1533364 -917777
41624 -917777 -309450 -55059 531890 1796361 2849750 2720141 1596350 365421 -347315
41615 -347315 -225184 766055 1859791 1816219 488179 -719547 -694452 -99349 -106495 -446727
41605 -446727 57442 1467546 2529189 2424091 1627745 921107 463969 54106 -401087
41596 -401087 -866701 -1122228 -721703 424964 1527277 1704080 1291642 1520035 2711485
41587 2711485 3669959 3274194 1932652 888305 646353 734439 642105 353894 151504
41578 151504 405998 1350594 2535161 2765713 1307544 -903131 -2002697 -1311172 -15925
41569 -15925 511891 359356 517397 1306340 2138491 2534184 2522908 2071165 942935 -609108
41559 -609108 -1628139 -1319551 169209 2013636 3412385 3898718 3413838 2370718 1378594
41550 1378594 728071 373034 358384 760910 1206360 1130767 666319 521654 791150 805087
41540 805087 496908 769207 1810367 2260416 1170325 -268424 -381240 467655 716544
41531 716544 335429 671345 1737535 1865909 510651 -610126 -45547 1341928 1834345
41522 1834345 978888 -699537 -2719235 -4233922 -3907774 -1631176 590063 895203 -30481
41513 -30481 -225591 562909 786437 -328079 -1707430 -2064624 -1402148 -694595 -910752
41504 -910752 -2317595 -3991782 -4266417 -2542626 -342827 433027 -83553 -284238 301863
41495 301863 530474 -164786 -749134 -284756 695456 1194671 1065263 683975 278774 165780
41485 165780 697501 1385689 1101862 -161842 -849759 -93246 701874 -191477 -2153337
41476 -2153337 -3075110 -2396329 -1574108 -1581847 -1691189 -1212136 -864536 -1419281 -2083653 -1521747
41466 -1521747 36632 953498 387918 -729623 -1188715 -1066640 -1209918 -1719292 -1767947
41457 -1767947 -839381 568175 1660977 2190982 2212336 1507055 -76096 -1879103 -2754688
41448 -2754688 -2300187 -1258730 -490304 -44201 442503 929286 1086538 943617 873284
41439 873284 1044752 1351340 1742257 2088545 1833347 521429 -1156344 -1619122 -210696
41430 -210696 1778125 2538978 1839718 974553 863583 1112145 1053305 798625 792980 1023192
41420 1023192 1249888 1475362 1552938 884237 -644523 -1850255 -1457007 39373 876206
41411 876206 457031 -28081 191656 78637 -1395738 -3185021 -3367867 -1858129 -449248
41402 -449248 -286886 -656768 -458341 334070 1110031 1546553 1545231 973294 17966 -723478
41392 -723478 -954949 -1038121 -1304253 -1519320 -1411579 -1223114 -1282774 -1449852 -1423888 -1229046
41382 -1229046 -969828 -497905 207514 685060 537311 67355 -114764 114559 449225
41373 449225 739080 1000948 1067510 803736 560062 850751 1613781 2291980 2619830 2792067
41363 2792067 2790429 2100151 387214 -1830964 -3446314 -3633205 -2475063 -894733 59900
41354 59900 67220 -285698 -239267 316722 844597 792780 70622 -916340 -1552684 -1569130 -1433044
41343 -1433044 -1829285 -2625662 -2920563 -2395079 -1844969 -1771753 -1319605 283823 1883032
41334 1883032 1532894 -627497 -2240794 -1846784 -672799 -585428 -1526528 -2069149 -1633949
41325 -1633949 -897953 -411962 35834 702146 1351750 1544897 1050755 88027 -575857
41316 -575857 -174497 1003603 1655034 1145504 546335 1130212 2359649 2525851 1164739
41307 1164739 -412516 -1077067 -1134460 -1253664 -1302012 -964166 -674184 -1043337 -1810474 -2156283
41297 -2156283 -1843575 -1387988 -1202683 -1164726 -1082276 -1128325 -1582421 -2296381 -2606359 -1931859
41287 -1931859 -570133 319650 -54876 -963621 -847419 618484 1848271 1319733 -311914
41278 -311914 -992247 -6069 1125269 836370 -344990 -708674 144395 896799 630257
41269 630257 148802 589740 1666494 2291681 2337494 2537360 2910491 2703421 2005710 1918962
41259 1918962 2623417 2789880 1789448 1004789 1640902 2578404 2140522 903787 611888
41250 611888 1022526 352574 -1331750 -1930228 -981463 -731874 -2331560 -3503359 -1895116
41241 -1895116 1203280 2714721 1987149 866969 474999 268306 -38021 177799 1005555
41232 1005555 1624394 1629454 1453845 1382224 1268640 1135930 973307 271836 -1015315 -1579904
41222 -1579904 -403814 1195316 1118227 -170151 -118695 1922560 3618647 3238683 1986879
41213 1986879 1605494 1760060 1323618 525720 149714 -31183 -399521 -338788 414063 476196
41203 476196 -1261745 -3416378 -3774629 -2401914 -1092479 -404251 518665 1562554 1544509
41194 1544509 629722 497900 1566178 2189492 1396955 394765 280576 146478 -1093856
41185 -1093856 -2515824 -2514307 -1262421 -153196 450970 1181550 1838858 1417802 4149
41176 4149 -944668 -599213 225550 550778 625629 1110830 1691761 1453906 351858 -502590
41166 -502590 -133154 1159069 2171553 2183961 1724514 1774514 2337013 2308918 1038990 -559447
41156 -559447 -1139465 -789465 -776357 -1464315 -1693768 -698758 507896 628793 118640 418174
41146 418174 1557878 2031553 1208703 422253 974562 2202498 2535410 1720448 829168
41137 829168 440170 66247 -563443 -804727 -141661 883161 1402036 1405643 1571931 2147875
41127 2147875 2587590 2317959 1434798 495511 -93021 -244048 85239 924229 1858965
41118 1858965 1953614 691269 -1030794 -1553839 -436523 858868 818866 -178259 -625963
41109 -625963 -163642 83156 -575294 -1353915 -1301871 -646176 -185663 -121770 -235325 -623241
41099 -623241 -1402680 -2020005 -1695332 -501478 601405 789592 24561 -1157933 -2032930
41090 -2032930 -1998484 -1018801 245460 1097522 1497696 1774975 1886806 1492258 667529
41081 667529 4972 -50968 433135 1146278 1711975 1641117 702259 -480839 -744358 306245
41071 306245 1597597 1613888 51421 -1841668 -2582448 -1873642 -619842 254058 671354
41062 671354 1036906 1398011 1412100 1023898 609488 303541 -279884 -1315855 -2214932 -2313240
41052 -2313240 -1826736 -1520306 -1536717 -1210262 -206381 719748 556438 -591966 -1460677
41043 -1460677 -1085240 32285 584240 155721 -304752 67483 752787 647091 -235446
41034 -235446 -804570 -601722 -439163 -1010867 -1794767 -1916166 -1359366 -638191 108569 891736
41024 891736 1231493 672972 -264897 -525510 88717 659010 403901 -351703 -660980 -125795
41014 -125795 565845 293436 -1147738 -2474495 -2235314 -717591 297240 -60001 -661047
41005 -661047 -351413 177731 -293449 -1253053 -1163753 -24080 507868 -373459 -1563617
40996 -1563617 -1893778 -1676446 -1791836 -2265548 -2413515 -1713767 -131871 1764292 2818908
40987 2818908 2253257 846244 242928 832421 1333145 817044 -46435 -364204 -438780
40978 -438780 -900722 -1412127 -1328440 -947499 -1002770 -1409810 -1543999 -1379231 -1371024 -1505147
40968 -1505147 -1388830 -1049199 -779700 -444952 198756 775474 832014 834007 1512034 2371834
40958 2371834 2144686 835858 -30256 350821 872725 320357 -780584 -1185231 -933022
40949 -933022 -1012096 -1495072 -1433367 -576975 148218 187647 167227 575503 730965 -16699
40939 -16699 -875260 -573196 692365 1494848 1251021 823884 881352 881392 236597 -558493
40929 -558493 -783327 -707930 -1012138 -1496177 -1377702 -646219 -135274 -191195 -125573 692319
40919 692319 1773637 2006666 1082110 81942 354211 1704720 2181930 364995 -2401791
40910 -2401791 -3253325 -1493416 382413 117553 -1305901 -1481828 -208515 609234 82486
40901 82486 -697764 -779914 -531368 -402058 -193211 -17188 -474120 -1332324 -1411376 -346961
40891 -346961 795322 1147276 949933 405537 -801131 -2137915 -2040168 -151569 1696117
40882 1696117 1908171 1192752 981784 1175187 963490 650540 877465 960752 -126370
40873 -126370 -1726061 -2244502 -1504580 -662686 -169159 431380 932528 563782 -318587
40864 -318587 -397068 537617 1277872 1208046 1058758 1315146 1418795 1058902 823683 964661
40854 964661 822003 112525 -438158 -382836 -265114 -405377 -243991 357026 498448 -104639
40844 -104639 -205962 959828 1980477 1217806 -468114 -869658 153413 478721 -927141
40835 -927141 -2420373 -2143906 -506829 812065 1149030 936984 344688 -747952 -1734286
40826 -1734286 -1617040 -492700 442447 683143 1107011 2267476 3059167 2209154 448279
40817 448279 -224571 657461 1393608 620490 -897826 -1743223 -1922677 -2278508 -2627709
40808 -2627709 -2005500 -560976 262901 -237844 -965881 -578018 678440 1354298 620092
40799 620092 -853704 -1718304 -1360185 -485981 -229964 -604824 -304540 1414294 3186333
40790 3186333 3001921 1100739 -34899 941587 2302992 1801410 42606 -389116 1193484
40781 1193484 2438535 1202429 -1501537 -2855749 -1732232 351566 1484240 1391083
40773 1391083 995880 934126 1170208 1585845 2164533 2627672 2467105 1527463 285503
40764 285503 -554656 -613585 -73897 411578 195915 -660187 -1313419 -1119108 -436881 39493
40754 39493 371529 931994 1184472 224294 -1364629 -1740631 -492815 470557 -194406
40745 -194406 -1002918 71413 2219965 2891171 1704454 875377 1608749 2431480 1910459
40736 1910459 953668 1049508 1735013 1431848 -88415 -1592043 -2251925 -2294013 -2001733
40727 -2001733 -1271605 -246596 473497 468103 -94901 -681964 -745073 -94324 744172 863276
40717 863276 24115 -1002104 -1458882 -1411621 -1097316 -223941 1264042 2334682 1879792
40708 1879792 336699 -724159 -565500 94531 407835 364860 250851 23982 -359241
40699 -359241 -578312 -272373 556713 1502507 1829983 921921 -713802 -1300008 264788
40690 264788 2508961 2809072 851031 -882830 -620779 408830 337461 -302795 199841
40681 199841 1472411 1376610 -485082 -1853480 -1095451 446027 571103 -615088 -1125754
40672 -1125754 -23738 1488696 1839510 890155 -228907 -431118 391171 1385524 1585745
40663 1585745 897084 123746 -126729 -228625 -862371 -1844516 -2181534 -1298512 159073
40654 159073 862898 54067 -1675878 -2845792 -2535867 -1350808 -589960 -559096 -358677
40645 -358677 588916 1658599 2010097 1625876 904591 76472 -430540 -13290 991984
40636 991984 1257551 421113 -84188 658530 1234271 108726 -1548694 -1509428 -129131
40627 -129131 258089 -802555 -1481283 -1179827 -1401925 -2470428 -2474320 -764761 415520
40618 415520 -434032 -1479615 -782059 296300 -429640 -2056740 -2170392 -924184 -396861
40609 -396861 -756524 -266850 1207373 1793681 889920 65872 225976 384100 -87425
40600 -87425 -317014 101697 112170 -774019 -1262234 -310297 1069258 1309237 535259 120143
40590 120143 651693 1326737 1091188 -160622 -1424507 -1639496 -1098676 -1234849 -2397267
40581 -2397267 -2806480 -1024283 1432684 1837542 88949 -1369516 -1293140 -917214 -1225324
40572 -1225324 -1356238 -505617 685103 1516454 2101069 2066795 467195 -2003188 -2835758
40563 -2835758 -1118384 805526 614492 -843259 -1370383 -719922 -114210 187050 733304
40554 733304 1208534 897417 234656 167930 486975 351067 -6459 386483 1549132 2497237
40544 2497237 2563498 1737194 240186 -1213585 -1453216 -269226 927128 946805 444655
40535 444655 529427 819322 370021 -433222 -594079 -308464 -330177 -296269 483352 1259521
40525 1259521 850982 -140781 -225530 299895 -121538 -1253224 -1028336 1040543 2725404
40516 2725404 2180285 280486 -1093919 -1540044 -1821974 -2240909 -2380031 -1861249 -743848
40507 -743848 392776 670922 -128796 -973297 -815729 -155480 -220503 -892518 -908366 -22198
40497 -22198 663484 671267 806309 1474960 1904118 1547289 855397 137564 -954737 -2236823
40487 -2236823 -2627916 -1642962 -121610 995374 1447323 956018 -707512 -2472922 -2486120
40478 -2486120 -708327 561818 -276796 -2067213 -2929964 -2843474 -2861900 -3110512 -3120476 -3136730
40468 -3136730 -3535266 -3733884 -3160092 -2595926 -3065773 -3969650 -3849382 -2612753 -1509447
40459 -1509447 -1146265 -973042 -641121 -463852 -428390 -46233 529477 360627 -858985
40450 -858985 -2101344 -2224706 -1332753 -468826 -293433 -454022 -216864 470315 773177
40441 773177 80081 -878292 -695853 778552 1969063 1506913 -29518 -930391 -400362
40432 -400362 841169 1593143 1210290 -50764 -1213254 -1405968 -798244 -221486 283854
40423 283854 1575359 3597770 4668387 3577238 1413752 49740 -396918 -1129434 -2288699
40414 -2288699 -2687672 -1822336 -606412 82290 298973 249730 -188982 -819002 -996917
40405 -996917 -534448 59849 414171 570771 404296 -247569 -779949 -262355 1066463
40396 1066463 1870487 1632123 1323830 1671244 1991414 1574024 1103124 1591951 2666891
40387 2666891 3068903 2407056 1381504 607910 217589 383726 1215884 2140860 2281368
40378 2281368 1579685 857348 674270 774340 757928 655684 626915 616322 543460 439719
40368 439719 255273 -86463 -369886 -284709 -34379 -192735 -745725 -883743 -167265 631531
40358 631531 491616 -323065 -398650 1090289 3287132 4530153 4086699 2812928 2115458
40349 2115458 2343190 2385520 1108206 -955553 -1958661 -1006917 613827 1071320 271453
40340 271453 -380333 -122268 420188 620000 733071 1024182 1143890 992759 1169549 1731450
40330 1731450 1484270 -323927 -2298789 -2295480 -283082 1509800 1370407 -146115 -1444729
40321 -1444729 -1769283 -1395562 -782577 -113609 701821 1815291 2934138 3200157 2218704
40312 2218704 1013178 1011947 2110469 2805045 2344911 1532637 1109630 719920 75709
40303 75709 -228955 13079 -185819 -1364358 -2278297 -1629625 -220751 227244 -283948
40294 -283948 -379248 107968 -78756 -1193083 -1859680 -1377207 -786733 -818997 -544752 668186
40284 668186 1381861 30441 -2303270 -2993126 -1450797 212708 240405 -736951 -1268077
40275 -1268077 -1184434 -1113417 -959685 -218130 667123 620537 -310840 -675026 443822 2037051
40265 2037051 2423746 1409607 402213 491203 1159657 1127673 -37539 -1537770 -2319941
40256 -2319941 -2054660 -1192545 -374314 73471 199664 184602 113283 -43924 -297978 -530182
40246 -530182 -521526 -124188 552727 1158276 1365816 1106544 529409 -99496 -338179 274225
40236 274225 1571548 2485099 2082746 896036 438362 1187177 1917030 1514041 534896
40227 534896 149374 353730 349333 67975 -30986 -275620 -1308289 -2380193 -1877968 65325
40217 65325 1213829 279793 -1248111 -1455585 -738837 -631474 -1018877 -522750 801190
40208 801190 1250104 192574 -846742 -553459 212976 -68623 -1138791 -1414801 -483722
40199 -483722 251922 -343193 -1492191 -1650045 -715563 -172079 -991486 -2220019 -2198255
40190 -2198255 -777063 426715 30376 -1491482 -2518486 -2213167 -1250290 -730178 -871018
40181 -871018 -1058873 -962244 -1055191 -1727377 -2293838 -1693827 -236802 320826 -945584 -2585511
40171 -2585511 -2505631 -725450 813552 977354 614424 825481 1401172 1583915 1336660
40162 1336660 1053735 691489 -47375 -1038275 -1786829 -1928140 -1453357 -759900 -475110
40153 -475110 -713739 -648782 389920 1564401 1417373 125087 -503381 441277 1859424
40144 1859424 2504507 2430718 1965083 912002 -271598 -198980 1271506 2155409 1113135
40135 1113135 -416829 -553121 87961 -113415 -708869 -162869 1005335 865360 -501229
40126 -501229 -1005026 -26138 814366 727170 914558 1857276 1974158 293268 -1587024
40117 -1587024 -1689092 -263119 1129993 1782986 1802654 1145103 52786 -491714 19824
40108 19824 725588 717695 414783 623312 1119458 1262944 1234174 1514206 1773584 1391826
40098 1391826 581210 19006 -132318 34208 754501 1927438 2541741 1943664 1124649
40089 1124649 1457110 2561047 2847330 1985129 1276105 1389608 1259062 -89928 -1802913
40080 -1802913 -2261778 -1191372 245242 1048679 1132735 651071 -344820 -1263264 -944554
40071 -944554 921276 2881939 3198419 2017261 1016026 930248 787672 -10404 -395409
40062 -395409 530519 1689349 1568375 592110 224789 458534 220764 -164282 730306
40053 730306 2583140 3157532 1616922 -162919 -497986 -62006 32682 381345 1913023
40044 1913023 3855679 4752455 4441151 3585531 2330375 908999 501980 1764310 3248231
40035 3248231 2947330 887855 -1230140 -2344812 -2550774 -2005589 -967882 -459915 -1250439
40026 -1250439 -2430340 -2442764 -1230380 9877 748934 1261323 1304970 458095 -441771
40017 -441771 -45403 1294783 1832466 1090488 444622 737637 1076566 608268 -48389
40008 -48389 90997 1019044 2123972 2956367 3198966 2837109 2575801 3013444 3346262 2267321
39998 2267321 280803 -543928 445936 1503086 1226264 572296 1023776 2235431 2834525
39989 2834525 2423367 1491543 330241 -653103 -420906 1464142 3662305 4391088 3526651
39980 3526651 2333930 1663382 1547681 2016523 2959174 3477460 2717669 1301996 761852
39971 761852 1498131 2348962 2279388 1523547 862201 629800 701444 781324 491592 -233398
39961 -233398 -703969 -38991 1633654 3079551 3276670 2402714 1365054 795629 702762
39952 702762 731305 529596 80002 -242434 -174726 -112171 -739037 -1966754 -2657984 -1808533
39942 -1808533 138456 1587358 1545001 779274 857007 2136829 3297465 3095437 1960929
39933 1960929 1220191 1230349 1258332 1005728 1050011 1535669 1586345 616347 -671092 -1261302
39923 -1261302 -1058089 -519856 131994 619447 358014 -587698 -1056193 -333546 562986
39914 562986 328927 -586692 -836924 -524295 -895155 -1847661 -1756913 -215435 944642
39905 944642 279535 -1183334 -1652557 -1072916 -554327 -328840 111618 444243 -193569
39896 -193569 -1433107 -1760303 -634912 796763 1497587 1765469 2023679 1665088 263951
39887 263951 -975894 -547692 893483 1064566 -653665 -2068445 -1224788 732958 1201498
39878 1201498 -223015 -1521750 -1411262 -750135 -453937 -16830 838544 770090 -1285077
39869 -1285077 -3973666 -5074620 -4410837 -3383325 -2266928 -231869 2080055 2494813
39861 2494813 459585 -1884741 -2707712 -2599583 -2563030 -1962788 -230562 1103886 341792
39852 341792 -1480980 -1904933 -628544 483063 601212 744881 1309118 1191133 17208
39843 17208 -863611 -545902 49719 -12074 -113359 474598 1023650 608563 -215737 -400786
39833 -400786 -107460 -26209 117992 858886 1500960 971488 -277583 -797185 -294026 246060
39823 246060 336629 303619 -28209 -1189675 -2441485 -2098447 -46593 1656666 1508476
39814 1508476 551182 691139 2092275 3261524 3007963 1449513 -407888 -1467461 -1417029
39805 -1417029 -1201125 -1991087 -3463933 -4049478 -3189398 -2126484 -1877208 -1781586 -1003412
39796 -1003412 -161869 -194326 -674404 -706803 -638736 -1337426 -2396879 -2625959 -1891856 -1014336
39786 -1014336 -242362 664058 1236435 829976 118947 391973 1472347 2008529 1729756
39777 1729756 1596029 1722843 1220458 368939 725494 2348817 3075149 1673155 -215512
39768 -215512 -641995 -118982 -225666 -904305 -954896 -205313 545452 1023427 1383244 1272505
39758 1272505 439545 -322719 -196080 313099 322304 96568 207702 45314 -1112357 -2297636
39748 -2297636 -2087301 -1087244 -1043783 -1796923 -1470495 233198 1346502 752635 -285000
39739 -285000 -532079 -597339 -1198013 -1493717 -581721 787386 1389894 1261183 1011472 589316
39729 589316 28773 265204 1699486 2922282 2497313 1263244 1150440 2219227 2670043
39720 2670043 1660058 415712 332816 1357838 2594408 3408951 3586507 3252754 2889611
39711 2889611 2760992 2369420 1272770 220684 338684 1214421 1147628 -353693 -1634288
39702 -1634288 -1124518 566470 1654601 1445703 626078 -103438 -577124 -595825 81434
39693 81434 988433 1052587 -80418 -1318394 -1280643 -4123 1071489 917149 165545
39684 165545 132405 1000931 1726657 1657218 1333344 1385521 1521756 1230583 765334 638452
39674 638452 705015 597379 538919 767347 692012 -180613 -940402 -361353 953491 1222277
39664 1222277 311508 -39238 721825 836692 -652918 -1698784 -85573 2938667 4210169
39655 4210169 3120804 2087243 2587554 3179738 2250131 686771 365068 1232712 1543746
39646 1543746 503790 -789982 -1121364 -711491 -503671 -588940 -105200 1365420 2938826
39637 2938826 3377529 2633143 1867770 1880865 2142637 1768415 898675 423137 602906 751005
39627 751005 330919 -286010 -389483 182747 964787 1415523 1418798 1388750 1850764 2746610
39617 2746610 3322333 2975154 1971475 953702 72522 -780915 -1171305 -456641 1005420
39608 1005420 1866017 1357984 246649 -143907 620523 1879791 2654884 2374405 1284900
39599 1284900 374894 449395 1125887 1301817 755549 507301 1236641 2197081 2350877 1828671
39589 1828671 1392564 1045173 258995 -706501 -881229 -37984 947834 1421219 1692886
39580 1692886 2063380 2004673 1049441 -111589 -338862 367651 878998 602499 271159
39571 271159 659410 1248019 983355 28477 -254429 761815 1974859 2054330 1237530
39562 1237530 784076 1051182 1165556 627003 190857 694808 1770029 2406505 2393267
39553 2393267 2457782 3012265 3397272 2728618 1267255 439181 1172993 2498260 2503757 838129
39543 838129 -602847 -118104 1455807 1933489 820297 -232609 54558 1085812 1721311
39534 1721311 1738703 1388067 740436 235459 746764 2208650 3169902 2649564 1489458
39525 1489458 885158 624452 52432 -210159 808431 2372897 2710309 1616559 737973
39516 737973 1092906 1806900 1713188 952042 404042 434148 740566 886381 675031 372176
39506 372176 492058 939290 800106 -233694 -781306 660560 3349627 4865522 4018222
39497 4018222 1897524 69413 -824018 -619264 534426 1506568 969818 -568424 -1065617
39488 -1065617 79907 1020951 342285 -781276 -674914 109464 -60483 -1071489 -1336203
39479 -1336203 -402901 527548 639107 528776 987233 1894576 2607746 2685625 2113298 1361008
39469 1361008 1110125 1418486 1489808 851862 252692 581241 1412966 1657687 1272896 1150925
39459 1150925 1464710 1378121 546670 -220967 -169403 421694 910242 1285675 2009394 3221606
39449 3221606 4412844 4700508 3446725 974005 -1322822 -2003745 -886011 841548
39441 841548 1763151 1364553 259708 -425707 -78577 777833 1114223 740311 537009
39432 537009 1155158 2126923 2627283 2421857 1612328 265948 -1047845 -1216055 22256
39423 22256 1372611 1632417 1302420 1491953 2037324 2097079 1958274 2605211 3829401 4437687
39413 4437687 4219180 4057346 4087149 3462322 2170634 1347123 1323314 1035229 50844 -403290
39403 -403290 599231 2034831 2373499 1690030 1210813 1443540 1802453 1706422 1242143
39394 1242143 925213 1227936 2099480 2840827 2915129 2816086 3376464 4294076 4381940 3352650
39384 3352650 2205330 1684729 1602839 1868904 2714005 3529131 3130273 1813882 1446744
39375 1446744 2645412 3632010 3051308 2124333 2440157 3282742 3139960 2536097 3088380
39366 3088380 4595200 5361178 4973703 4593336 4719244 4771380 4863555 5916912 7742009
39357 7742009 8862191 8637492 7927537 7317408 6380524 5178229 4790167 5591756 6447173
39348 6447173 6431850 6089106 6149298 6187097 5495310 4333257 3387588 2759847 2273800 2056705
39338 2056705 2095302 1949950 1625796 1985308 3518998 5390723 6508611 6896450 7142259
39329 7142259 7123362 6352495 5210810 4704989 5044940 5435476 5406370 5471278 6076288 6537166
39319 6537166 5694559 3540760 1640718 1554920 3001283 4129426 3820078 3085590 3545988
39310 3545988 5007158 5633858 4521013 2963973 2735654 3974071 5378496 5867270 5420313
39301 5420313 4735467 4639827 5541520 6989690 7999283 8118877 7876384 7904104 8012059
39292 8012059 7497186 6129518 4576236 3979619 5015547 6960233 7921010 6795905 4915082
39283 4915082 4665662 6366125 7815470 7401182 6192012 6005128 6785226 7342671 7630999
39274 7630999 8480947 9603102 9755686 8926867 8681761 9993615 12084693 13800556 14849560
39265 14849560 15163471 14285429 12252271 10207690 9244616 9188228 9238027 9268550 9678502
39256 9678502 10294779 10281574 9159063 7377592 5831060 5106415 5130758 5262683 4843905
39247 4843905 3965145 3570420 4442258 6105447 7112204 6576194 5198577 4522102 5205464
39238 5205464 6314339 6507047 5683036 4967811 5049179 5239239 4689151 3930513 4241479
39229 4241479 5628833 6542153 5940811 4697077 4258893 4630969 4652365 3936088 3394444
39220 3394444 3646549 3925608 3292824 2382163 2942470 5519424 8370391 9270003 8080780
39211 8080780 6829155 7130294 8202842 7979479 5849048 3506667 2881585 3838248 4506502
39202 4506502 3679090 2215545 1832202 2965565 4379302 4817730 4465266 4445170 5247593
39193 5247593 6210906 6532168 6270489 6121237 6514689 7208568 7617362 7363372 6620254
39184 6620254 6000876 5944095 6196434 6189113 5943935 6120302 6971073 7835410 8132662 8344914
39174 8344914 9304661 10819477 11853781 12034459 12114043 12706848 13308373 13011104 11684828
39165 11684828 9980934 8532372 7617399 7338990 7605523 7998768 8067479 7746423 7212188
39156 7212188 6475677 5565476 5032083 5583588 6911919 7501997 6319292 4428476 4056049
39147 4056049 5868019 7985169 8217860 6652358 5259959 5344350 6341798 7083648 7224909
39138 7224909 7105186 7026566 7175837 7668630 8179859 8032149 7122921 6281767 6221004 6623709
39128 6623709 6817087 6842726 7184597 7859861 8520742 9114553 9665805 9710391 8828687 7570472
39118 7570472 6944742 7038139 7028377 6596996 6400005 6927450 7729742 8101814 7874719 7255266
39108 7255266 6512298 6097469 6446536 7298084 7722535 7201639 6336055 6262757 7668417
39099 7668417 10365689 13327845 15130008 15024974 13767665 12824375 12701101 12716737 12423048
39090 12423048 12245908 12384605 12112077 10899345 9512136 9155456 9923331 10819931 11128066
39081 11128066 11213560 12019337 13989769 16376755 17680867 17208300 16060516 15867368 16660770
39072 16660770 17088969 16828684 17318469 19422508 21772015 22592574 22096748 21669686 21484639
39063 21484639 20553843 18817525 17593999 17807133 18940606 19934477 20219100 19847154 19505781
39054 19505781 20313950 22535470 24482847 23949561 21075924 18617400 18735918 20511760
39046 20511760 21507589 21062294 20862662 22402068 25017943 26966130 27754231 28465106 29743706
39037 29743706 30472599 29286737 26904767 25742763 27081045 29709637 31741777 32637431
39029 32637431 32817047 32482097 31879284 31763303 32333377 32462926 31307494 29951439 29898957
39020 29898957 30538677 29992911 28212927 27124368 27487857 27735504 26634849 25171412 24643102
39011 24643102 24460881 23269540 21178371 19453590 18655684 18310966 17960734 17459801 16599610
39002 16599610 15415204 14602851 14739143 15234640 14845174 13202934 11270531 10277934 10574179
38993 10574179 11458957 11908928 11559858 10984712 10774233 10604940 9861615 8911983 8669167
38984 8669167 8893443 8294893 6670894 5468539 5560197 6007995 6034041 6546397 8103374
38975 8103374 8854117 6819027 3472580 2534972 5132354 8380978 9251505 7851475 6086355
38966 6086355 4900217 4154239 3953461 4525011 5301076 5391635 4844068 4568925 5079007
38957 5079007 5953713 6512129 6482109 5992117 5340866 4884290 4869434 5198424 5399713 4955020
38947 4955020 3812382 2626305 2279691 2982497 4014208 4533338 4384045 3882265 3217940
38938 3217940 2524439 2170815 2370220 2747579 2922636 3236755 4114295 4940564 4595478
38929 4595478 3134377 1889482 1641474 1694724 1217773 562351 568682 1272338 2054456 2573452
38919 2573452 2826645 2687501 2131420 1672751 1839731 2292472 2120867 1081430 -6356
38910 -6356 -271404 202011 654770 745489 999835 1981892 3197304 3336285 1905130 156923
38900 156923 -255402 684031 1493448 1323110 918670 1155890 1677555 1703954 1363037 1278608
38890 1278608 1405860 1298049 1185668 1712726 2688344 3150713 2842058 2699626 3494345
38881 3494345 4657474 4932914 3824151 2071826 954688 1274677 2725237 4103106
38873 4103106 4379052 3619548 2661226 2066652 1852288 2039877 2720114 3517438 3787944
38864 3787944 3570921 3545489 3727083 3148329 1468875 -6084 93689 1264477 1958796
38855 1958796 1926903 2312200 3452485 4123406 3454684 2235647 1465898 756164 -635769
38846 -635769 -1996676 -1873552 -324433 1008384 1245576 1388827 2579001 4304552 5149735
38837 5149735 4657224 3610102 2811692 2317335 1740957 788830 -425272 -1274067 -1101988
38828 -1101988 -173891 300717 -325094 -1019545 -276750 1793789 3497149 3628774 2584590
38819 2584590 1338869 387921 38935 637428 1807682 2348177 1718250 926744 1086683
38810 1086683 1801237 2040914 1954164 2416013 3176845 3100571 2251473 2019616 2759080 3030302
38800 3030302 2026904 1103750 1587894 2501784 2232564 1438624 2140863 4319395 5660770
38791 5660770 4922457 3473923 2827467 2542828 1695256 824951 931940 1622771 1828573
38782 1828573 1681993 2162822 3290151 4122365 4350105 4500387 4623030 4175335 3351809
38773 3351809 3143617 3680510 3779333 2742746 1503287 1225350 1704985 2037294 2101069
38764 2101069 2341862 2591070 2241655 1446283 1068872 1299041 1268654 501050 3752 1121190
38754 1121190 3532233 5224852 4738492 2837737 1416275 1161645 1184841 871208 896739
38745 896739 1838941 2842595 2742131 1833026 1279425 1214037 904522 645612 1725458
38736 1725458 4067586 5567979 4759700 2874062 2041582 2367575 2205152 880087 -297723
38727 -297723 109971 1828238 3318465 3571659 3026114 2731353 2865569 2544499 1350767
38718 1350767 383717 850987 2029163 2012125 489829 -810700 -825177 -536683 -831153
38709 -831153 -751956 706498 2529469 3103951 2608761 2244744 2043295 1348152 710365
38700 710365 1211966 2341527 2604119 1967304 1628624 1577394 702588 -616057 -539532 1060280
38690 1060280 1904119 767753 -586904 -283402 805716 716029 -573367 -1501060 -1307185
38681 -1307185 -484911 416633 1108071 1317491 1339520 2090590 3574319 4213654 2965855
38672 2965855 1186592 858144 1678385 1673956 363719 -554264 141610 1499126 1976400
38663 1976400 1549388 1417807 2230651 3346464 3721041 3077601 2016190 1049441 -51945
38654 -51945 -1486285 -2369257 -1526963 546205 1790649 1223904 254761 461399 1259724
38645 1259724 1103422 65086 -402762 196150 874493 777907 -71854 -1507919 -3282957
38636 -3282957 -4419079 -3906515 -2243408 -1049244 -986319 -1286409 -1453602 -1988768 -3009279
38627 -3009279 -3569400 -3069144 -2175902 -1611515 -1137025 -586921 -786469 -2236834 -3696780
38618 -3696780 -3482376 -1832186 -611498 -637404 -608883 772209 2609674 2760605 743546
38609 743546 -1285421 -945591 1491272 3429224 3113776 1530400 668074 835891 863079
38600 863079 483922 924386 2767359 4637012 4939453 4003679 3364667 3423578 3082439
38591 3082439 1720355 371847 378837 1537238 2299935 1647860 201747 -599046 -49547
38582 -49547 1261127 2200967 2177612 1573568 1281186 1756813 2489981 2630169 2210343 2246390
38572 2246390 3221352 4071622 3560039 2270302 1995023 3150711 4220592 4134996 3663110
38563 3663110 3612817 3215034 1732295 430476 1070254 3109597 4316562 3853611 2889442
38554 2889442 2281438 1654251 1015420 1284768 2552671 3522734 3460634 3143994 3106098 2607695
38544 2607695 1401026 845688 1828152 3001975 2796834 2000273 2390937 3646195 3797341
38535 3797341 2457296 1433057 1925274 3039614 3599116 3755965 4032734 4168473 3884637
38526 3884637 3737890 4200962 4661698 4292684 3330272 2576508 2126479 1585656 1222839
38517 1222839 1758604 2932905 3373258 2425994 1382174 2067871 4454407 6486890 6483905
38508 6483905 5038674 3979137 3877787 3552497 2161808 734154 769765 1957708 2528143
38499 2528143 1857418 1427523 2595654 4452805 5004866 3985566 3213526 4054860 5676941
38490 5676941 6377406 5792916 4919253 4406380 3890655 3075019 2524419 2875227 3784630
38481 3784630 4265563 3884058 3160772 2838129 3112332 3600127 3777527 3392796 2635208
38472 2635208 1957649 1662939 1701466 1899389 2197153 2540683 2760141 2758184 2622651 2371980
38462 2371980 1870590 1241546 994548 1347531 1780570 1772943 1624134 1896583 2397454 2561865
38452 2561865 2566341 2969647 3346368 2628352 1074997 436767 1431658 2468210 2062261
38443 2062261 1296014 2177209 4310658 5244769 4057359 2563754 2431440 2951186 2740227
38434 2740227 2117434 2217513 2715440 2247620 798393 -47564 577349 1734253 2364738
38425 2364738 2715696 3293507 3557934 2825032 1747593 1609720 2456041 3130253 3083840
38416 3083840 2932818 3043878 2761046 1585238 234936 -136548 759183 2276753 3513203
38407 3513203 3716813 2758079 1656464 1819527 3132356 3689757 2298531 349309 -24039
38398 -24039 1074531 1706131 1096451 466714 737823 1126567 661018 -295906 -886078 -1051420
38388 -1051420 -1096146 -812385 7777 811429 967337 800823 1118286 1968895 2586031 2373364
38378 2373364 1399421 151726 -688312 -508066 626300 1794050 2125920 1715876 1256805
38369 1256805 1066373 949458 757805 528458 189428 -387841 -1074464 -1538140 -1529865 -948201
38359 -948201 107875 1145715 1546461 1338041 1243213 1563229 1568896 624578 -569062 -689802
38349 -689802 485073 1891300 2616404 2718674 2561549 2133365 1353513 532005 136026
38340 136026 269258 524158 284953 -691117 -1826353 -2124800 -1319392 -282675 114332
38331 114332 118517 437330 905629 765390 75020 -296367 -199732 -557839 -1741521 -2687203
38321 -2687203 -2395376 -1435792 -1014150 -1205595 -1219166 -970065 -1097794 -1511553 -1261233 -147153
38311 -147153 799371 1023556 1437965 2759352 3893746 3356484 1655127 614904 532376
38302 532376 -164211 -2042401 -3290574 -2262861 37746 1432914 1513614 1507614 1832841
38293 1832841 1569660 327412 -969338 -1515789 -1613270 -1764891 -1738943 -1015919 451141
38284 451141 2167736 3310088 3134127 1842305 745928 692267 799924 -15810 -833717
38275 -833717 110741 2275801 3096209 1772252 409226 534308 902287 178312 -527887
38266 -527887 163850 1154264 753994 -157440 385435 1771221 1615215 -107675 -733008
38257 -733008 931305 2827757 2902366 1821791 1220618 1106583 508636 -558295 -1251283
38248 -1251283 -1288885 -1013254 -592144 -126986 -114507 -856802 -1626149 -1267838 293537 1747137
38238 1747137 1845597 859697 236773 826145 1899036 2302652 2100746 2158426 2350458 1610828
38228 1610828 66803 -523116 621075 1833818 1553083 901591 1814613 3675207 4102708
38219 4102708 2556248 822880 51275 -412415 -1029697 -1103298 -348784 430420 829859
38210 829859 1378249 2125589 2334286 2014792 2091719 2606072 2526449 1825171 1793913 2622946
38200 2622946 2724892 1440223 401192 946245 2018758 2070470 1412587 1157784 1290043
38191 1290043 1324488 1555568 2135917 2193119 1377191 1011532 2139217 3704482 4316866
38182 4316866 4472278 5150812 5557462 4516300 3042815 2997688 3822043 3249417 1112422
38173 1112422 -130380 984066 3015019 3983481 3799148 3513284 3591830 3812819 3949486
38164 3949486 3915072 3833295 4188975 5283751 6553663 7146057 7071926 7027894 7255264 7391220
38154 7391220 7277065 7146275 7227511 7805618 9239592 11237462 12730292 13247183 13708000
38145 13708000 15095688 17324165 20286104 24670968 30469211 36111081 40706425 45733964
38137 45733964 52855976 61867844 72845399 88042861 109018025 134936932 167710112
38130 167710112 214356843 275325551 330896865 350087334 319411703 257513061 196216796
38123 196216796 151886018 120549679 94758088 74440787 61379802 52775787 44795060
38116 44795060 37577649 32953628 30260797 27473818 24285847 21484043 18870654 15957739
38108 15957739 13421637 11965401 10795090 8918508 7041645 6547312 7274363 7836002
38100 7836002 7696018 7541946 7791910 7883832 7080633 5284716 3149953 1781087 1892391
38091 1892391 2845158 3148816 2398433 1839368 2286840 2592281 1489078 55683 463086
38082 463086 2535248 3594314 2168012 11575 -530110 327897 666007 -184236 -1153508
38073 -1153508 -1384626 -1027800 -165099 1452512 3220794 3665355 2374497 877165 696018
38064 696018 1358020 1338427 344006 -467357 -194707 946583 2269197 3087768 2699005
38055 2699005 1030663 -622377 -647147 824379 1926444 1483707 398881 115798 695653
38046 695653 1166934 1007924 445427 -195493 -693067 -861290 -834365 -983649 -1129538 -510804
38036 -510804 898503 1847607 1407510 361226 -18902 93442 -373366 -1361019 -1644411
38027 -1644411 -760579 343913 736943 436430 -215860 -979825 -1313348 -700071 308286
38018 308286 524547 -30306 24165 1161544 1897454 1007164 -408670 -481059 607481
38009 607481 988257 678 -910990 -434996 847879 1543899 1282218 691045 177742
38000 177742 -391991 -991095 -1157847 -610220 262641 798503 837709 856049 1246441 1670924
37990 1670924 1399230 226892 -1296853 -2559601 -3309392 -3275985 -2121851 -323073 598108
37981 598108 -292034 -1818609 -1955843 -549376 477712 -97782 -1176450 -1217717 -485339
37972 -485339 -209881 -426235 -163991 667328 1191554 1282935 1747937 2532260 2375873 923427
37962 923427 -324711 -191245 356285 -104584 -1017176 -789923 481592 1142053 693762
37953 693762 460899 1149880 1531459 448583 -1274654 -2107556 -1995167 -1967568 -2179566
37944 -2179566 -1695460 -121242 1620203 2280964 1394292 -554825 -2397856 -2819709 -1435244
37935 -1435244 521441 1239512 295441 -909033 -838813 518528 1886007 2153493 1351012
37926 1351012 484295 591773 1692004 2571549 1978204 129325 -1430835 -1668617 -1178136
37917 -1178136 -1052064 -1270530 -1061069 -529831 -763337 -2023283 -2908924 -2142366 -536979
37908 -536979 -106983 -1395717 -2794214 -2737070 -1561144 -619871 -379151 -240151 248043
37899 248043 925153 1549541 1944094 1714775 653455 -575706 -965763 -468103 23898
37890 23898 82005 225504 753852 1080212 740192 198976 -2903 -156699 -674258 -1111179
37880 -1111179 -802661 -70980 89959 -650459 -1655150 -2193267 -2030178 -1360140 -698387
37871 -698387 -571864 -817130 -613453 201880 473669 -695159 -2249986 -2300140 -701323
37862 -701323 769106 839200 64017 -497073 -646751 -611407 -376275 -136628 -497386 -1500183
37852 -1500183 -2219705 -2061186 -1744928 -2152147 -2784197 -2384914 -816458 682899 1140690
37843 1140690 905755 790496 785855 179425 -1181099 -2269926 -1938464 -490109 429832
37834 429832 -92921 -894843 -326201 1199409 1540597 -151113 -2140707 -2515241 -1644177
37825 -1644177 -1126574 -1220330 -826649 321058 1033121 507226 -454695 -711200 -417585
37816 -417585 -575284 -1344984 -1676943 -772040 659089 1086737 13569 -1375596 -1681334
37807 -1681334 -988002 -533790 -932676 -1549483 -1717786 -1664827 -1806686 -1944970 -1821230 -1803186
37797 -1803186 -2212134 -2472457 -1847743 -712029 -126805 -273251 -271323 355278 948460 768255
37787 768255 57766 -404452 -376678 -323010 -672802 -1215623 -1280893 -507286 619157 1224279
37777 1224279 1080901 772953 672437 391705 -279966 -594677 132010 1171555 1103056
37768 1103056 -254767 -1597369 -1778793 -777380 919155 2783576 3934127 3506045
37760 3506045 1858586 549511 560711 1204049 1204363 206563 -1176801 -2137636 -2124573 -1244430
37750 -1244430 -562993 -1163361 -2463241 -2447068 -275548 2260843 2816239 1267550 -577506
37741 -577506 -1388854 -1282796 -855373 -508751 -591424 -1088811 -1204478 -267294 951968 887674
37731 887674 -702934 -2265402 -2388943 -1333552 -231569 396378 716693 765917 322804
37722 322804 -512413 -1128334 -966310 -192067 308704 -187397 -1299838 -1837339 -1266395
37713 -1266395 -427770 -340240 -800725 -915034 -623149 -694247 -1302317 -1661923 -1291146 -730198
37703 -730198 -638682 -893356 -972424 -684706 -204501 148875 -15855 -792394 -1567039 -1591076
37693 -1591076 -1080217 -1028406 -1735724 -2313174 -1992685 -1182758 -780511 -1058917 -1637865 -1974665
37683 -1974665 -1564049 -316050 936056 1033056 -44196 -1064094 -1216027 -964008 -861859
37674 -861859 -710287 -555143 -1194518 -2603932 -3100313 -1574348 389278 376204 -1426037
37665 -1426037 -2480910 -1398301 582754 1693086 1541456 582657 -776840 -1915423
37657 -1915423 -2052749 -1257559 -531529 -420761 -377326 143356 843241 1212642 1139783 575186
37647 575186 -491655 -1408131 -1238384 -197067 317685 -383155 -1374725 -1619756 -1258815
37638 -1258815 -760923 3730 932264 1066762 -38831 -1237718 -1292775 -680233 -607910
37629 -607910 -931669 -524610 709655 1716627 2030856 2201479 2457351 2321882 1779276
37620 1779276 1577118 1994411 2378000 2320137 2317951 2759310 3124438 2820886 2153535 1816253
37610 1816253 1866195 1810362 1462194 1188600 1330197 1678491 1636324 907048 -39750 -454034
37600 -454034 -304443 -285851 -582283 -384279 683720 1447941 678767 -805868 -1030622
37591 -1030622 239543 1115189 416655 -716706 -772131 55402 801278 1496679 2576704
37582 2576704 3374688 2819939 1325002 499138 948166 1624364 1568274 1138844 1067297 1239917
37572 1239917 1076603 515074 -38580 -405912 -704418 -859122 -539893 328690 1257680
37563 1257680 1554588 1000530 137038 -232579 64880 303244 -286704 -1461415 -2111116
37554 -2111116 -1541723 -250125 808042 1368653 1811972 2175981 1958113 1127067 595538
37545 595538 1009121 1559450 999521 -323175 -699141 370741 1192737 370140 -928468
37536 -928468 -665311 870397 1413949 108965 -1381275 -1523295 -865424 -540069 -442160
37527 -442160 -66595 200279 48996 408561 1988848 3442245 2835105 632513 -628636
37518 -628636 278319 1917837 2562299 2317642 2215588 2513171 2773981 2697521 2071720 685123
37508 685123 -992357 -1794871 -1283071 -500380 -530088 -962226 -718543 131655 460979 -212183
37498 -212183 -1082707 -1175690 -428060 389982 402514 -551042 -1434314 -805256 1305039 2886920
37488 2886920 2268412 417965 -342536 398136 783441 -301985 -1663051 -1901497 -1408501
37479 -1408501 -1130458 -812669 22645 542455 -81419 -619106 796716 3463025 4594348
37470 4594348 3316949 1940991 2388347 3416804 2850008 945329 -315140 -283610 -72015
37461 -72015 -405517 -874687 -1259004 -1968107 -2906766 -3198925 -2423684 -1188882 -263401 18960
37451 18960 -537486 -1886302 -3219608 -3538171 -2917860 -2330801 -2194863 -2128340 -2088894 -2433157
37441 -2433157 -2733660 -2058436 -783060 -481810 -1392397 -1746267 -623855 316539 -515808
37432 -515808 -1837487 -1346753 658782 1761069 1065980 162043 346963 869989 485874
37423 485874 -751404 -1970127 -2733932 -3164032 -3418694 -3438848 -2887808 -1432619 492857
37414 492857 1612565 1176091 -64901 -988484 -1480139 -1672292 -833069 1295323 2859467
37405 2859467 1830449 -718689 -1696296 -457188 443902 -439737 -1216668 -156990 1169279
37396 1169279 484122 -1322315 -1512497 282568 1684569 1135815 -299116 -882910 -292219
37387 -292219 641232 1099358 760999 -187416 -1259618 -2132471 -2707412 -2642184 -1620987
37378 -1620987 -420686 -533181 -1950111 -2585894 -1093644 935711 1115054 -426624 -1680548
37369 -1680548 -1885743 -1912506 -1964664 -1204236 197163 752572 -76415 -1062210 -1228869 -1110301
37359 -1110301 -1363631 -1584300 -1265963 -746476 -476871 -318149 -85642 135869 538886
37350 538886 1409735 2181836 1893324 810087 207805 299565 19991 -749092 -685635 479196
37340 479196 1043434 139115 -536974 549932 2112847 2135135 1108337 836057 1159339
37331 1159339 515892 -856716 -1025869 342741 1336658 817271 -192127 -711041 -1216547
37322 -1216547 -1983610 -2022165 -895455 36480 -443446 -1518466 -1756547 -1316844 -1263365
37313 -1263365 -1530333 -1173511 -188650 461048 503820 664510 1203922 1374209 678821 -287222
37303 -287222 -724950 -662832 -614342 -684780 -490250 294123 1642974 3242924 4574529 5085023
37293 5085023 4556030 3309000 1961326 1024841 728532 1000408 1443124 1487972 889478
37284 889478 136119 122160 1184189 2557950 3079486 2495553 1807233 2096828 3212473
37275 3212473 3965713 3593068 2611718 2038219 2085293 2045528 1429922 790157 1107440 2517571
37265 2517571 4009454 4465642 3705287 2355198 1069180 253624 228530 989986 1865339
37256 1865339 2115438 2008467 2559563 3929334 4895708 4451913 3164165 2194149 1683568
37247 1683568 1122700 754433 1280966 2345368 2686713 1988853 1306492 1298056 1293918 717361
37237 717361 229374 578651 1319851 1718490 2064112 2831767 3222098 2101697 196780
37228 196780 -260962 1582310 3976233 4781548 3835845 2398239 1182101 -11010 -1187965
37219 -1187965 -1812239 -1605300 -952697 -349759 56105 258651 203963 14994 48522 486161
37209 486161 1099012 1594368 1934984 2078821 1683116 517486 -855936 -1264376 -56617
37200 -56617 2067478 3538364 3271076 1610654 37386 -150317 949736 2000641 1981578
37191 1981578 1367787 1308770 1855376 1896512 1038588 458216 1128849 2126379 1913500 735696
37181 735696 234012 819269 1104549 323521 -332164 317126 1526439 1960113 1899213 2571316
37171 2571316 3864335 4357041 3550597 2598703 2572100 3194595 3649716 3623604 3165297 2430335
37161 2430335 1978770 2465821 3552673 3900336 2767452 936859 -401139 -938631 -930110
37152 -930110 -478643 80993 -98028 -1232313 -2053924 -1223800 769148 2276193 2775340
37143 2775340 3128326 3552175 2926309 806136 -1153601 -965031 1094848 2748553 2426767
37134 2426767 850728 -157910 221565 1186031 1483500 925957 617544 1567523 3217195
37125 3217195 3836539 2565290 539855 -428627 119898 1116464 1455340 995230 269116
37116 269116 -81570 369728 1372399 1844513 927669 -706516 -1420486 -692948 285120
37107 285120 506416 577065 1395551 2332779 2054056 708959 -150234 158184 630142 352200
37097 352200 -204517 -314464 -298776 -738076 -1169384 -661949 708068 1938430 2423725
37088 2423725 2316024 1754252 678173 -575552 -1337122 -1377995 -940617 -32243 1457852
37079 1457852 2895286 3181641 2215110 1112673 564228 814 -974309 -1470123 -730032
37070 -730032 220853 -186810 -1619174 -2182520 -1168996 90225 423288 342457 628506
37061 628506 725613 -259555 -1795797 -2477200 -1978055 -1293964 -1128520 -1064437 -445704 737040
37051 737040 2007760 2810456 2669819 1573993 268866 -432483 -624663 -897567 -1043627
37042 -1043627 -220020 1402208 2342803 1775684 730621 491491 767220 594676 262529
37033 262529 846403 2183925 2888727 2459881 1904551 1881321 1600890 309116 -1223913
37024 -1223913 -1636903 -719389 604923 1519397 1802752 1541264 1105820 1095634 1655097
37015 1655097 2124237 1887863 1167547 420141 -495169 -1749730 -2618234 -2133078 -502124
37006 -502124 1022169 1600020 1344099 617486 -238137 -571657 106465 1207947 1597983
36997 1597983 1174361 926702 1294493 1617777 1512950 1525038 1845197 1656159 646013
36988 646013 45417 977308 2590768 3132002 2387835 1821575 2516811 4087588 5515391
36979 5515391 6093050 5596380 4400986 3441758 3371371 3852656 4228905 4481151 4774368
36970 4774368 4624260 3602311 2395174 1865887 1459410 115721 -1460273 -1372016 399164
36961 399164 1553009 851180 -25526 770443 2381612 2802959 2015391 1635838 2193509
36952 2193509 2661422 2394890 1835852 1357180 891994 711074 1175669 1659611 1087001
36943 1087001 -282453 -903104 -28354 1465760 2564141 3123924 3099951 2218596 1060761
36934 1060761 1078244 2567266 3749636 2970678 938388 -351836 -199960 493795 954026
36925 954026 1217783 1269984 751281 -253974 -1012459 -992454 -374833 362961 876481 981732
36915 981732 766675 654959 864917 872147 -8832 -1483796 -2333371 -1835007 -683479 -157060
36905 -157060 -556199 -798546 292250 2383273 3684871 2941508 1044444 -30872 288124
36896 288124 767961 522652 212660 499834 718703 227951 -116931 642332 1623276 1329131
36886 1329131 198649 -31098 800598 1138508 448022 -121817 -155708 -722696 -1902604
36877 -1902604 -1899332 -7919 1615610 992597 -566674 -554843 801118 1152929 -99077
36868 -99077 -1073628 -546188 443073 614161 268386 354489 1029956 1830836 2307442 2032584
36858 2032584 859438 -504587 -1054086 -845454 -876698 -1431648 -1622552 -902051 75737
36849 75737 575985 724686 792215 577548 192352 466313 1678275 2670758 2217194 740998
36839 740998 -252145 -68242 704143 1298013 1464870 1205631 615694 67560 -30252 240067
36829 240067 391732 177857 -107995 51316 914766 2161664 2965621 2694791 1670471
36820 1670471 859506 683802 626908 200912 -354317 -725175 -1195521 -2023955 -2649171 -2250303
36810 -2250303 -841941 779177 1932400 2377362 2063021 1180274 278710 -206043 -382070
36801 -382070 -476748 -342833 137000 610846 854805 1343896 2425774 3320279 2914594 1367116
36791 1367116 -41985 -563749 -510983 -186170 599026 1686856 2276713 1943765 1244664
36782 1244664 931193 1171850 1783831 2499307 2715926 1816263 210824 -692606 -146139
36773 -146139 944513 1274857 771257 268862 111734 -59543 -415371 -677514 -692354 -604809
36763 -604809 -479251 -277974 -147300 -208391 -170165 260771 648953 200629 -1022728 -1944578
36753 -1944578 -1825647 -1185438 -924600 -1012610 -709887 109768 618508 214210 -538198 -609974
36743 -609974 130580 820707 877501 811989 1405587 2376449 2434524 834336 -1449990 -2473706
36733 -2473706 -1306189 973613 2506145 2738191 2794005 3618238 4456908 3959185 2352825
36724 2352825 1283396 1358497 1222606 -185827 -1672886 -1355780 576680 2156840 2348530
36715 2348530 1941207 1757992 1527922 922797 338118 19434 -445653 -1100102 -1160438 -358934
36705 -358934 280979 -40684 -508639 51807 1196918 1403019 268025 -975218 -1077716
36696 -1077716 -10001 1339148 1906865 1025015 -935419 -2512210 -2452719 -1067035 237263
36687 237263 539787 -67224 -1116121 -2030646 -2073788 -1104750 -246816 -658653 -1673290
36678 -1673290 -1456693 265656 1526957 764166 -1084839 -2019437 -1551200 -790764 -622449
36669 -622449 -903775 -1158950 -1075135 -440717 553424 1009351 147398 -1468972 -2282839 -1582201
36659 -1582201 -399396 -194042 -1036450 -1573814 -695377 1163252 2498938 2323065 1059621
36650 1059621 -86344 -367289 66476 685215 1105267 1123036 662651 -145200 -1087419
36641 -1087419 -2112522 -3111741 -3463452 -2404996 -178598 1737039 2097588 1268805 536292
36632 536292 296759 -249058 -1526920 -2600542 -2351124 -1127321 -373990 -678817 -1066465
36623 -1066465 -614963 23642 -377473 -1496964 -1616487 -168621 1114217 490474 -1275742
36614 -1275742 -1996915 -1173318 -452802 -916756 -1552516 -1167528 -464600 -919867 -2316003
36605 -2316003 -2817740 -1448655 643615 1689293 1289476 485494 304252 728985 1034604
36596 1034604 780684 219692 -275965 -859687 -1892256 -3097729 -3607973 -3021782 -1941017
36587 -1941017 -1212245 -1089934 -1408940 -2025993 -2620097 -2530746 -1428364 84643 1072750
36578 1072750 1296053 1203542 1138433 1073913 990731 974838 925206 554783 -241308 -1162364
36568 -1162364 -1603428 -1071200 103469 563310 -748446 -2849023 -3336030 -1353418 1098727
36559 1098727 1736412 826825 127665 -58456 -864950 -2279568 -2723605 -1570587 -246965
36550 -246965 -115840 -782071 -1297505 -1636115 -1978743 -1792721 -840700 -140955 -637372 -1607567
36540 -1607567 -1658208 -800467 -269997 -561174 -856649 -402783 540907 1241410 1276159 740574
36530 740574 192085 245437 745144 676258 -517646 -1981972 -2573522 -2435066 -2448167 -2551230
36520 -2551230 -1918433 -706544 -202646 -954531 -2036487 -2639272 -3164855 -4038375 -4563184
36511 -4563184 -3982992 -2866287 -2264590 -2012212 -1147765 137431 352900 -1075728 -2550884
36502 -2550884 -2133154 -64935 1514208 1283564 216864 -17209 684446 1043056 454270
36493 454270 -256159 -326799 -261448 -851902 -1729648 -1820302 -897734 205156 772625 741427
36483 741427 158019 -944835 -1994314 -2118653 -1307976 -627851 -900795 -1776562 -2440442
36474 -2440442 -2613490 -2459696 -2122553 -1837982 -1981222 -2527965 -2960149 -3121258 -3539532
36465 -3539532 -4356696 -4653590 -3692028 -2270743 -1790623 -2256793 -2322246 -1283692 73580
36456 73580 836259 1127261 1431571 1619533 1345615 874159 757784 944728 867550 357266
36446 357266 -95726 -91092 99733 -75089 -711757 -1361202 -1604229 -1472546 -1225338 -934789
36436 -934789 -548259 -235111 -247858 -358733 72291 1135865 1903975 1455371 116007
36427 116007 -920876 -1061658 -736970 -444143 -207389 -173780 -844311 -2137573 -2882391
36418 -2882391 -2026357 -73660 1339529 1183704 -138429 -1510868 -2086602 -1657258 -622833
36409 -622833 349933 1010911 1767939 2848787 3523911 2910952 1414367 395981 268382
36400 268382 -15851 -1103713 -1972573 -1461181 -233990 60822 -809186 -1472235 -1124846
36391 -1124846 -506624 -387760 -432536 -272761 -501416 -1484645 -2078663 -975887 1035409
36382 1035409 1630479 -129466 -2707180 -4215286 -4388156 -3872981 -2825496 -1334109 -393185
36373 -393185 -1006216 -2522147 -3145425 -2204435 -782854 117289 784556 1564624 1665286
36364 1665286 430617 -932313 -461062 1778060 3456042 2949406 1326966 644146 1260859
36355 1260859 1902255 1712522 982574 77818 -1052923 -2101648 -2273079 -1450396 -666722
36346 -666722 -832574 -1610479 -2094486 -2007132 -1591185 -879633 98343 741006 422612 -442253
36336 -442253 -676688 219363 1509189 2149449 1714008 384613 -1301325 -2529372 -2672001
36327 -2672001 -1984815 -1393709 -1362537 -1420776 -1025925 -373697 6106 36140 49166 233215
36317 233215 504306 767476 1007448 1220587 1408753 1485480 1143660 147687 -1103239 -1686053
36307 -1686053 -1113393 57671 797177 578008 -331907 -1237393 -1518955 -1103236 -610892
36298 -610892 -708236 -1183931 -1111623 -130294 943533 1111911 352887 -586264 -1122889 -1142327
36288 -1142327 -746913 -176254 252218 451177 566397 515732 2870 -793258 -1185769 -996392
36278 -996392 -889299 -1204785 -1267205 -553464 253227 279530 -198768 -475836 -777111 -1645918
36268 -1645918 -2538345 -2479013 -1764578 -1481210 -1528876 -801061 630783 1274227 497139 -640430
36258 -640430 -1343449 -2136064 -3172583 -3241966 -1713111 -67932 -16508 -1091338 -1582280
36249 -1582280 -1088093 -648400 -853598 -1272159 -1523638 -1672229 -1649462 -1297587 -873951 -688830
36239 -688830 -521528 -222135 -463887 -1872129 -3719443 -4548640 -3921637 -2656056 -1636471
36230 -1636471 -1305182 -1842444 -2704926 -2488739 -647473 1077328 595581 -1407481 -2200983
36221 -2200983 -935389 274568 -257010 -1453296 -1657956 -1279900 -1664355 -2664667 -3065683
36212 -3065683 -2576944 -1799331 -821945 572225 1674862 1385794 -28661 -987250 -545434
36203 -545434 675704 1577511 1721491 1296711 706673 291858 -47019 -810435 -2004127
36194 -2004127 -2716895 -2333564 -1679636 -1946877 -2856364 -3072599 -2210569 -1122411 -284254
36185 -284254 614128 1297268 728678 -1077414 -2481259 -2322904 -1436699 -1125943 -1233171
36176 -1233171 -918045 -458915 -830630 -1932879 -2639915 -2509871 -2205883 -2128514 -1770897
36167 -1770897 -784617 213877 429980 -42059 -397594 -121350 449270 452657 -607597 -2161250
36157 -2161250 -2967207 -2524163 -1807322 -2085651 -3240472 -3956671 -3506577 -2552293 -2054386
36148 -2054386 -2177841 -2590395 -3086020 -3366987 -2799711 -1127834 817326 1771827 1362726
36139 1362726 300793 -683374 -1546191 -2452177 -3109059 -3012806 -2205177 -1396076 -1237120
36130 -1237120 -1696383 -2282585 -2668675 -2811368 -2595751 -1844766 -823148 -281512 -640072
36121 -640072 -1398342 -1703244 -1258341 -319549 865989 2049585 2667740 2292995 1393547
36112 1393547 923906 1030403 841818 -240372 -1705564 -2698461 -3021553 -3014942 -2984084 -3112683
36102 -3112683 -3383093 -3201819 -1782726 530939 2034946 1606236 357379 360206 2086741
36093 2086741 4307564 6427496 9487743 14297598 19705287 23689825 25582244 26262386
36085 26262386 26466005 25926861 24333712 22244437 20463838 18943937 16980285 14466391
36077 14466391 12340167 11474198 11490280 11135919 9736756 7848046 6430253 5785637 5501211
36068 5501211 5162175 4850735 4971831 5644405 6268391 5919739 4421613 2752052 1940475
36059 1940475 1848704 1718763 1599788 2094472 2714539 2012579 -23784 -1184885 153900
36050 153900 2564220 3403214 2316685 1177722 997234 895096 280912 77341 958966
36041 958966 1868665 1411780 -150602 -1276760 -965333 518461 2248214 3327541 3345715
36032 3345715 2655605 1963288 1468414 864109 235842 160580 641972 830902 305826 -163111
36022 -163111 273352 1358426 2258113 2618266 2494181 1920861 1253567 1281186 2206907 3052155
36012 3052155 2834018 1816215 856927 129406 -618386 -1109814 -918204 -440197 -440298 -824211
36002 -824211 -781264 81070 1629810 3904454 6870627 9699655 11442894 12415754 13885126
35993 13885126 16386064 19345615 22293640 25232434 27662055 28487840 27352380 25120221
35985 25120221 22688159 20223069 17853018 16028744 14687397 13052558 10913875 9260532
35977 9260532 8960106 9537518 9936679 9810409 9357080 8541178 7319823 6206319 5806460
35968 5806460 6014391 6217891 6024396 5368351 4334718 3333096 2941381 3080379 2934828
35959 2934828 2264073 2049039 2994468 4133224 4134324 3504998 3991617 5817964 7052989
35950 7052989 6203428 4160025 2794463 2611622 2773702 2773556 2907999 3268612 3339516 2831146
35940 2831146 2145238 1644097 1047275 73085 -707516 -341557 1198406 2758752 3252532
35931 3252532 2733585 1989539 1523711 1384458 1633205 2297429 2919573 2809166 1899111
35922 1899111 864065 259113 38357 67301 504380 1341730 2120426 2572228 3097500
35913 3097500 4050981 4884756 4635258 3143694 1268945 -48904 -490307 -222606 402741
35904 402741 949790 1125711 1076401 1227003 1763449 2445905 2908457 2951902 2614368 2183633
35894 2183633 2067349 2402692 2845124 2958543 2718977 2387893 2006092 1345070 353803
35885 353803 -618716 -1096550 -848466 -54564 784503 1251932 1447752 1787947 2247582 2205932
35875 2205932 1350332 295284 -194197 -220185 -366438 -599909 -341288 479504 1252099
35866 1252099 1626276 1862832 2111755 2100197 1783582 1579654 1606712 1358433 567697 -205435
35856 -205435 -346183 -36581 187611 289534 587542 1113145 1650282 2115372 2396605 2139852
35846 2139852 1258706 376609 151449 372465 348097 3271 -115693 133439 203364 -253507
35836 -253507 -813554 -856790 -325453 292152 496500 229558 -39677 207715 818297 1079909
35826 1079909 861590 1020637 1981449 2598130 1650371 46341 -79024 1505469 2694848
35817 2694848 2265252 1652860 2394478 3490323 3043800 1334594 248831 333474 509105
35808 509105 436562 1003382 2241823 2809236 2162240 1469834 1567576 1656241 1041764 616994
35798 616994 1283593 2156224 1848116 633478 -176793 -298763 -384513 -438505 41150 661525
35788 661525 536071 4700 314284 1468133 2049912 1544369 1147288 1543716 1473091 -303886
35778 -303886 -2777949 -3818084 -2836711 -1032025 554121 1839042 2686400 2513486 1387664
35769 1387664 542090 1060358 2465623 3228222 2551066 1198131 516244 983791 1924365
35760 1924365 2442329 2293722 1832586 1502718 1620314 2317032 3290833 3830192 3553927
35751 3553927 2986783 2898633 3212460 3212706 2780237 2586700 2854412 2804116 1885203 853043
35741 853043 846001 1796059 2570863 2522297 2078904 1743070 1307442 483024 -253630 -113980
35731 -113980 823790 1534120 1367430 950503 1286671 2299325 2998732 3005621 2973908 3227998
35721 3227998 3001121 1747606 347065 -20668 439290 736430 826653 1316409 1780408
35712 1780408 1089556 -501271 -1332437 -794430 -81280 116686 822218 2596348 3897127
35703 3897127 3183843 1348693 337077 370226 359914 273689 1046961 2496435 3283491
35694 3283491 2942315 2252791 1638596 932238 740569 2064221 4149540 4681793 2951703
35685 2951703 1120009 1258840 2614210 3095736 2273033 1376223 1077688 809098 55724
35676 55724 -848050 -1212277 -582265 937131 2382480 2444810 1015370 -295472 -67548
35667 -67548 979289 1014772 -253690 -1227349 -722355 624357 1600844 1962592 2090030
35658 2090030 1941810 1209053 130016 -609921 -718143 -529558 -435390 -488996 -619435 -906188
35648 -906188 -1482177 -2274803 -2934879 -3048955 -2506403 -1700745 -1254553 -1448993 -1999992 -2437385
35638 -2437385 -2524555 -2177769 -1221754 407061 2253081 3524170 3842280 3572734 3241769
35629 3241769 2838265 1924359 339705 -1384139 -2273160 -1581840 481665 2538081 2948047
35620 2948047 1410149 -525037 -1009572 109481 1297133 1243254 209445 -591393 -384330
35611 -384330 644055 1789413 2486077 2688603 2706844 2587669 1924683 650661 -358581
35602 -358581 -216056 646029 996029 597775 414550 885540 1204858 758557 133279 56013
35592 56013 355015 658523 1102523 1586392 1395976 471932 -15909 605393 1285734 916349
35582 916349 96258 -153046 -293049 -1155289 -1910703 -1194766 391368 1024487 465894
35573 465894 -39926 -317132 -1282055 -2444787 -1978301 226163 1938664 1729144 580108
35564 580108 -301217 -1023413 -1515768 -841523 787989 1483023 498538 -492310 -331993
35555 -331993 -339896 -1596780 -2533405 -1508635 128565 135354 -1002696 -1259322 -639888 -685662
35545 -685662 -1266507 -842014 474143 957242 274772 -226840 -249894 -877197 -1947725
35536 -1947725 -1794060 -170407 1064717 932452 622703 935789 805772 -435454 -1472434
35527 -1472434 -1095126 -47600 605330 1235984 2281479 2735424 1736920 361310 47410
35518 47410 259802 -512962 -2183276 -3197240 -2794421 -1685999 -813302 -614128 -1119536
35509 -1119536 -1724284 -1352157 183158 1614439 1926986 1698912 1636447 1001169 -818507
35500 -818507 -2261028 -1348634 1068106 2181695 1202250 68760 10027 -52623 -905691
35491 -905691 -1313607 -308644 768875 279583 -1100107 -1584187 -1030931 -637632 -631881
35482 -631881 -185629 725914 1255015 1467702 2425656 4125170 4925653 3728732 1543993
35473 1543993 126206 -23505 444505 984544 1386537 1311630 592258 -187070 -225810 376439
35463 376439 676237 127435 -766607 -1191135 -977473 -571152 -320386 -135446 149924 342050
35453 342050 66329 -596294 -938149 -378749 745021 1519935 1564032 1370266 1476190 1757355
35443 1757355 1750214 1270668 472983 -332383 -706639 -374905 238279 256164 -529160 -1313133
35433 -1313133 -1443197 -1261590 -1197537 -769361 537581 1927000 2015223 725318 -650520
35424 -650520 -1241604 -1367415 -1457120 -1318754 -774577 -109601 392343 605672 227111 -771561
35414 -771561 -1388255 -526127 1179325 1868740 1106973 462977 905380 1381161 960089
35405 960089 590510 1206373 1657683 504920 -1218911 -1213098 703813 2496768 2938070
35396 2938070 2750180 2776085 2907498 3013932 3222613 3041197 1821305 293935 -53540
35387 -53540 618883 581153 -544066 -967423 303228 1679088 1466076 384639 32893
35378 32893 309785 225356 136504 1058440 2369534 2346459 872912 -348889 -479849 -560635
35368 -560635 -1276611 -1444965 141861 2557788 3791045 3376330 2710444 2904572 3499873
35359 3499873 3572033 3133549 2801225 2674834 2363442 1889972 1720233 1857738 1773534 1491316
35349 1491316 1798625 2782168 3079721 1622865 -509763 -1233063 -138473 1238741 1669674
35340 1669674 1340578 665519 -436189 -1614874 -1896831 -1139852 -435251 -301496 230663
35331 230663 1738188 2863501 2021186 -194677 -1690049 -1429061 -133254 1050192 1410403
35322 1410403 693303 -553286 -1063111 -367199 312368 -147462 -805778 -36607 1714597
35313 1714597 2448564 1639124 701639 374281 -182424 -1196121 -1437595 -557383 -179317
35304 -179317 -1208331 -1880939 -424120 1724331 1653328 -740410 -2518346 -1716707 470169
35295 470169 1939592 2316849 2491968 2849087 3064009 2984006 2773088 2448910 1861604 984004
35285 984004 -54847 -993420 -1396176 -1009788 -273521 58654 -50623 51499 390352
35276 390352 -43226 -1709145 -3288431 -3082458 -1303710 94633 -152655 -1322632 -1951650
35267 -1951650 -1462749 -249893 1013635 1664442 1325812 451861 73805 508615 884070
35258 884070 503980 -75 246441 703699 81640 -1502915 -2386723 -1702726 -669557
35249 -669557 -859146 -2088799 -2941196 -2800865 -2365783 -2338894 -2543993 -2447524 -1848954 -837473
35239 -837473 371425 1259510 1138957 -74677 -1436033 -1776902 -942306 135364 661541
35230 661541 873517 1416841 2158420 2209875 1175749 -169764 -738358 -281584 626758
35221 626758 1415420 1912992 2177139 2374980 2688702 2987130 2803432 2008268 1216120 1059430
35211 1059430 1354586 1495969 1308916 898774 132857 -858035 -1131108 -59057 1287578
35202 1287578 1278311 170677 -146977 957642 1975071 1808874 1385572 1678708 1853416
35193 1853416 903107 -265082 -233188 418822 30807 -1237055 -1490185 -71114 1408329
35184 1408329 1350045 10458 -1339621 -1857455 -1344405 -112193 973073 1203741 999806
35175 999806 1267678 1747908 1170564 -686863 -2285549 -2163809 -564847 1153651 1852970
35166 1852970 1109399 -586721 -1815582 -1489903 -435938 -495110 -1725218 -2055231 -429284
35157 -429284 1392664 1376353 17271 -995071 -1590779 -2724641 -3781794 -2955934 -221960
35148 -221960 2160036 2565683 1733089 1004020 439033 -388848 -977219 -475735 933933
35139 933933 2197619 2619703 2312195 1715182 1161043 695000 75128 -752089 -1166947
35130 -1166947 -515848 671105 1025308 267351 -239208 466935 1382894 1069140 -119076
35121 -119076 -689205 -373437 -292382 -876144 -1171706 -521357 409770 801178 770496 736761
35111 736761 661822 511292 579303 788623 589296 129259 432674 1613164 2103838 857194
35101 857194 -753584 -756686 500245 1014197 213189 -561604 -551474 -539490 -960529 -939710
35091 -939710 32684 1024703 1136359 755988 504123 150327 -515815 -887668 -583703 -230692
35081 -230692 -261136 -42936 736284 1008431 -592 -1095200 -712665 590580 983323
35072 983323 185435 -320763 280590 1167081 1403885 1002388 323049 -308878 -297815 688063
35062 688063 1781023 1692997 512661 -432945 -525816 -400802 -495018 -461783 -282984 -579704
35052 -579704 -1384584 -1829329 -1472560 -795556 -84280 882565 1686650 1293332 -177855
35043 -177855 -1147834 -801158 -224257 -466500 -914318 -731517 -554472 -1290280 -2256632 -2085570
35033 -2085570 -810458 377111 915939 1088199 958113 464176 153394 445097 524313
35024 524313 -556701 -1929712 -1731377 43072 1206870 418201 -955871 -890348 534078
35015 534078 1532779 1112718 41256 -477358 -166155 411040 665126 399464 -270046
35006 -270046 -1046090 -1517871 -1393311 -856287 -521614 -752312 -1144182 -1071360 -618108 -358574
34996 -358574 -210041 622267 2185463 3152186 2406461 608833 -703751 -1069062 -1125100
34987 -1125100 -1077696 -453551 577655 960457 325117 -257120 206980 1188189 1562224
34978 1562224 1350121 1469398 2030192 2054915 1089238 53355 -87314 269695 107373
34969 107373 -524451 -567322 372104 1398176 1633772 1282469 932025 590316 87934 -202411
34959 -202411 107859 598253 596108 263899 284397 712471 1035809 1163707 1348857 1240570
34949 1240570 155927 -1565356 -2543873 -2025136 -746720 64613 -191214 -1382385 -2716646
34940 -2716646 -2918155 -1429359 522535 1278838 1163481 1969165 3828373 4556840 2931120
34931 2931120 731086 203216 1054963 1520442 1142529 791598 844318 1027766 1427833
34922 1427833 2133933 2438114 1764171 796243 380076 72555 -767237 -1342333 -680075
34913 -680075 228660 -326663 -1809295 -1966603 -288567 1302075 1498249 1186296 1401582
34904 1401582 1744063 1714575 1848577 2448269 2676392 2023079 1362202 1383228 1183186 -198611
34894 -198611 -1770051 -1683004 58927 1441618 1052761 -276514 -797505 -47250 853277
34885 853277 833871 186061 -51737 358263 625700 271584 -223127 -539296 -1263145 -2597883
34875 -2597883 -3280765 -2182151 -383172 -5308 -1166916 -1823624 -806051 656608 961799
34866 961799 229801 -357426 -193022 498164 1182507 1262519 580387 655 579474 1891431
34856 1891431 2288664 1205903 -10076 -162952 110069 -424398 -1659393 -2449866 -2237370
34847 -2237370 -1508367 -984048 -942109 -1117983 -1060632 -851573 -1213684 -2221964 -2422106 -607248
34837 -607248 1786570 1917452 -550277 -2709728 -2291002 -380953 781554 883573 915743
34828 915743 1003443 672445 297081 560295 1078273 999122 444140 136991 204465 473604
34818 473604 1203512 2288931 2548002 1244196 -334660 -320512 1181411 2405743 2371326
34809 2371326 1608732 829855 305513 304008 787904 899362 13867 -1018572 -1008596 -398710
34799 -398710 -562989 -1422616 -1482737 -276975 892250 932568 223857 -424247 -753771 -660655
34789 -660655 -51514 542382 316151 -558474 -1073252 -897325 -602197 -343163 272123 838658
34779 838658 323804 -930729 -1081473 454265 1673358 685897 -1487974 -2304880 -1092213
34770 -1092213 455041 790122 107050 -591937 -824274 -668113 -271953 163574 234363
34761 234363 -409734 -1582907 -2486915 -2362875 -1337331 -337174 101076 521993 1494133
34752 1494133 2301788 1689853 -168919 -1579743 -1480677 -667465 -407005 -815524 -1312264
34743 -1312264 -1804427 -2421630 -2607321 -1598180 251194 1527924 1355293 347982 -262716
34734 -262716 -54850 335524 214184 -252501 -283966 437701 1255267 1329259 705832 169381
34724 169381 108757 53960 -506973 -1304294 -1618251 -1216311 -625160 -460824 -682987 -680298
34714 -680298 -133558 427559 253155 -577831 -1315713 -1771463 -2525880 -3517274 -3454975 -1646572
34704 -1646572 346045 303266 -1614748 -2884056 -1885372 182312 1213914 886593 546327
34695 546327 1110877 2061868 2338905 1546338 225201 -723933 -822720 -298936 415329 1261367
34685 1261367 2295844 3038806 2698451 1195280 -515697 -1384296 -1237227 -684977 -345830
34676 -345830 -314986 -255446 60790 347883 179722 -242620 -240208 236272 392847 -55721
34666 -55721 -188117 668802 1633502 1536024 762692 447546 384945 -572241 -2258219 -3144738
34656 -3144738 -2703736 -2104143 -2162477 -2222711 -1641284 -856248 -273218 481832 1397330 1536348
34646 1536348 605368 -168640 251638 1205676 1531387 1223713 856761 367745 -413987
34637 -413987 -899731 -625716 -311532 -888031 -2076590 -2978278 -3403998 -3534856 -2987582
34628 -2987582 -1502760 -10281 342270 -102224 -22183 894733 1657650 1530783 795181
34619 795181 10764 -515887 -540610 35161 911964 1770408 2603035 3161784 2728404 1238255
34609 1238255 -76554 -194714 226651 66743 -324553 70080 803512 532220 -468615
34600 -468615 -409789 1066158 2022964 1137446 -224445 -58275 1379374 2154502 1476803
34591 1476803 514361 461833 958965 886323 111812 -276721 451865 1475696 1443701 424705
34581 424705 -199495 46407 -81867 -1390761 -2571745 -2014463 -314883 667880 570848
34572 570848 506558 748999 545076 147569 749650 1974367 1684692 -780946 -3146495
34563 -3146495 -3141505 -1243580 708376 1983358 2611486 2165170 746002 18318 1250544
34554 1250544 3079674 3194624 1721900 891634 1544671 2095217 1253838 -168712 -895281
34545 -895281 -1040998 -1375539 -1875675 -2046342 -1947328 -1966406 -2023577 -1780584 -1359617 -1205963
34535 -1205963 -1382280 -1505373 -1334755 -1064793 -1019476 -1257270 -1500372 -1396659 -855819 -77061
34525 -77061 759266 1593827 2177816 2075850 1341413 769985 897237 1099968 474841 -621989
34515 -621989 -893550 22654 1038537 1240608 1017042 1086823 1366735 1494877 1631777 1870388
34505 1870388 1560215 261623 -1135671 -1399705 -770723 -577298 -1129586 -1312099 -529081
34496 -529081 232407 -62666 -900846 -1025451 -206061 635473 675963 -148028 -1385522 -2248210
34486 -2248210 -1808952 150651 2474105 3476906 2632572 1037915 168333 503873 1338271
34477 1338271 1576487 733109 -577245 -1234148 -915858 -494428 -728626 -999757 -115225
34468 -115225 1843232 3408802 3573790 2874691 2311301 1946737 1142609 -272023 -1644893
34459 -1644893 -2187160 -1720559 -841023 -441733 -889912 -1633013 -1811429 -1186648 -219437
34450 -219437 537526 701036 26964 -1207825 -2024323 -1747609 -1004831 -786281 -765474 116078
34440 116078 1432521 1379464 -380890 -1765657 -1228468 -44237 -120761 -922541 -609236
34431 -609236 617348 650135 -1129177 -2779416 -2617256 -1315621 -427096 -292812 -400557
34422 -400557 -672549 -1235366 -1604444 -1203772 -366578 84410 73516 276766 904570 1245086
34412 1245086 721686 -99112 -74854 1021054 2051956 1825377 566367 -363764 -133885
34403 -133885 734909 1332504 1522411 1756226 2214876 2643943 2763564 2446555 1755738 1089646
34393 1089646 908598 1051494 857031 263850 43952 448491 518352 -435674 -1522141
34384 -1522141 -1545454 -895629 -850409 -1468104 -1612218 -872291 -62622 167177 -61389 -609455
34374 -609455 -1398354 -1782630 -1238424 -671107 -1468060 -3104399 -3444911 -1871117 -286463
34365 -286463 -226717 -769315 -496160 94113 -274615 -1298783 -1624659 -1025483 -416663 -123675
34355 -123675 349737 1046569 1456604 1643613 2190337 2926089 2883736 1785475 589188
34346 589188 213734 512556 863427 1098789 1424246 1873586 2238194 2300113 1934096 1189089
34336 1189089 363355 -216899 -525257 -724322 -790123 -600987 -423164 -869458 -2100789
34327 -2100789 -3327453 -3504604 -2559346 -1603778 -1677047 -2451072 -2593670 -1436883 210617
34318 210617 1139736 1101219 653960 180670 -232813 -296544 221263 841291 823543 246086
34308 246086 -173532 -261721 -435874 -589867 -128970 623408 342316 -1327730 -2821057
34299 -2821057 -2537020 -836659 731932 1474932 1834945 2177947 2362275 2299397 2069460
34290 2069460 1570493 733639 -14584 -101900 448980 1098162 1490309 1666245 1715906 1615007
34280 1615007 1343075 940182 546650 399161 486110 308648 -419352 -902451 -17480 1877292
34270 1877292 2971618 2351660 1248595 1172916 1810956 1829997 968378 69494 -468293
34261 -468293 -990795 -1539696 -1666476 -1275974 -674159 218470 1721554 3337396 3796403
34252 3796403 2584290 802527 30401 614952 1438534 1289543 192205 -794214 -1001207
34243 -1001207 -884223 -985342 -780587 464176 1998627 2126111 639496 -687823 -601691
34234 -601691 11063 -153079 -767288 -722875 3456 611443 829370 795791 315923 -550858
34224 -550858 -876077 -116992 688939 332248 -625382 -795542 -259322 -264513 -1011484 -1451423
34214 -1451423 -1120761 -517691 260014 1539532 2666610 2331109 652131 -650706 -648145
34205 -648145 -305752 -622774 -1035724 -490390 889342 1978444 1877651 545726 -1199702
34196 -1199702 -2128340 -1694367 -714253 -271006 -214324 235831 730990 97678 -1602577
34187 -1602577 -2859261 -2839357 -2279141 -1886012 -1333741 -419346 181100 64563 -154928
34178 -154928 52710 356852 476548 721195 1002925 544888 -631858 -1128979 -64713
34169 -64713 1457693 1818418 997340 180838 -96277 -371313 -1158224 -2209347 -2694961
34160 -2694961 -1818722 288544 2159276 2266506 935490 54847 641994 1824107 2564436
34151 2564436 2988631 3316740 2942871 1675399 690657 981988 1753996 1572539 365797
34142 365797 -849936 -1515337 -1655025 -1134996 -239 939716 965422 481210 285957
34133 285957 373437 409357 734729 1732441 2717630 2689059 1865518 1345079 1467481 1537672
34123 1537672 993885 -29982 -1085704 -1611660 -1126481 51556 780598 529384 169349
34114 169349 507797 904769 471706 -257776 -301546 -105757 -749458 -1802529 -1839278 -862312
34104 -862312 -321853 -683194 -838449 -202187 423273 558044 896307 1753592 2236252 1833664
34094 1833664 1465595 1969213 2729535 2843338 2602496 2706421 2855408 2312417 1283297
34085 1283297 632940 600088 717393 667625 389636 -286589 -1233942 -1606405 -799866 365107
34075 365107 442444 -667079 -1546256 -1231024 -359109 45309 -12629 -25336 -188852 -1018969
34065 -1018969 -2039042 -2018302 -768858 283403 -66747 -1113851 -1218383 -56438 1063878
34056 1063878 1048719 247015 -349973 -322165 127683 694331 1115458 1249517 1332463 1742786
34046 1742786 2304887 2344073 1629413 638250 -319119 -1424623 -2455041 -2547044 -1561509
34037 -1561509 -799240 -1399111 -2668915 -3038905 -2214808 -1333704 -1261987 -1738495 -2077730
34028 -2077730 -1855298 -967226 274384 1202300 1488938 1479973 1351357 584295 -930642
34019 -930642 -2010564 -1561252 -293475 222586 -221589 -597240 -607081 -884493 -1338584 -1073886
34009 -1073886 -198819 -12805 -920665 -1753694 -1768579 -1750849 -2332705 -2742051 -2297419 -1812808
33999 -1812808 -2248311 -3027667 -3016212 -2307009 -1692434 -1095658 12485 1131552 1195530
33990 1195530 369372 -11325 619456 1386983 1454100 1101314 982764 1169924 1334731 1227466
33980 1227466 662133 -349594 -1147303 -766516 783026 2084205 1748488 55547 -1347321
33971 -1347321 -1304285 -287091 370454 30323 -683993 -791797 -178034 318679 58295
33962 58295 -483765 -319132 653178 1395370 1086145 218191 -149954 115759 223453 -124679
33952 -124679 -216936 393325 918867 411809 -701952 -1087371 -294105 829875 1466969
33943 1466969 1624920 1518325 1179357 994608 1621460 2843940 3407407 2617229 1284672
33934 1284672 437492 -4064 -425041 -332997 814903 2241629 2624148 1909277 1168484
33925 1168484 926024 842286 825489 1126309 1368571 829400 -173694 -466797 133445 400655
33915 400655 -429163 -1485835 -1544118 -571610 565012 1191661 1133212 585159 89038 74679
33905 74679 221470 -75693 -560715 -349246 578057 1213858 1129435 1028050 1222761 869493
33895 869493 -468229 -1665600 -1519027 -494490 101772 -21364 -225621 -284636 -470483
33886 -470483 -701500 -722884 -853629 -1470114 -1962641 -1368563 -48251 420992 -670523
33877 -670523 -2124037 -2364090 -1340994 -320986 -163845 -451866 -351500 156726 322658
33868 322658 -171688 -579884 -47903 1145083 1932879 1893370 1555473 1251611 596017 -542676
33858 -542676 -1421550 -1392688 -867913 -688969 -1011416 -1359627 -1320397 -673135 630202 2037412
33848 2037412 2509892 1741446 748255 530241 696346 278979 -619473 -1082996 -944141
33839 -944141 -869414 -962818 -546548 446369 1052657 744516 295189 492449 825512 341046
33829 341046 -760025 -1391146 -1193703 -847827 -723909 -277518 756104 1472046 966629
33820 966629 -122908 -300070 686431 1468774 964719 -351044 -1456110 -2028505 -2051922
33811 -2051922 -1224903 213869 926025 47427 -1219111 -967447 788315 2263818 2429587
33802 2429587 1824137 943773 -385880 -1748259 -2027735 -1156677 -359973 -30717 906687
33793 906687 2665670 3505141 2304122 556650 139604 522859 117914 -796720 -756329
33784 -756329 19520 -140803 -1395777 -1943548 -888181 411986 492665 -333343 -981629
33775 -981629 -1135038 -947849 -299099 756600 1527455 1455350 871179 462890 472763 818553
33765 818553 1427631 1949504 1660745 295328 -1299689 -1925512 -1399930 -724397 -806860
33756 -806860 -1367729 -1424241 -753109 -349596 -1051616 -2113948 -1948474 -240101 1602798
33747 1602798 2359758 2381326 2533409 2733974 2408873 1659910 983634 365613 -351260 -653645
33737 -653645 25806 1179955 1734138 1466186 979440 533285 -38553 -412317 77236
33728 77236 1280891 2175835 2106898 1357875 502212 -86754 -183243 60129 -32746 -794960
33718 -794960 -1429560 -955132 341125 1388681 1961973 2619586 3229196 2974239 1912079
33709 1912079 1114772 965299 655707 -174519 -594823 147607 1362273 1844820 1283610
33700 1283610 164973 -959042 -1561974 -1250231 -383968 -6738 -643603 -1650748 -2091947
33691 -2091947 -1722539 -883642 -102781 -46565 -1087431 -2561879 -3223034 -2822059 -2462648
33682 -2462648 -2936780 -3530237 -3124561 -1819377 -726545 -573344 -1132252 -1720713 -1738886
33673 -1738886 -960795 245720 1112545 1158720 574525 -152901 -742490 -1167722 -1448835
33664 -1448835 -1470856 -945892 196238 1242294 1093506 -312750 -1629187 -1831487 -1574001
33655 -1574001 -1833665 -2046476 -1105445 364676 628104 -359061 -742517 277570 1161786
33646 1161786 434476 -1218510 -2172804 -1931189 -1092083 -294944 42533 -170151 -316238
33637 -316238 284561 1073999 817029 -261181 -461180 727614 1656800 1078096 -13313
33628 -13313 -246165 -14794 -355614 -1026198 -1235641 -1211961 -1526509 -1761800 -1324147 -801055
33618 -801055 -1080763 -1777845 -1860277 -1250611 -625722 -281593 -300306 -1043350 -2287831 -2719649
33608 -2719649 -1589130 -75375 306011 -187760 -382326 -220256 -324787 -342402 477613
33599 477613 1588634 1791557 1194923 883959 998318 784164 249744 133867 473291
33590 473291 764449 1236181 2316903 3134123 2330221 285491 -1157450 -1158421 -511974 24986
33580 24986 383858 323202 -319246 -596970 501424 2004409 1877194 110669 -1062058
33571 -1062058 -314070 1318593 2475841 3028333 3080330 2312920 1049797 363876 484982
33562 484982 576642 486579 1044348 2214740 2781671 2372698 1907996 1520400 159407 -1977775
33552 -1977775 -2891353 -1786802 -496662 -572905 -1025956 -484372 401591 513703 410696
33543 410696 932883 1243928 385841 -549791 -22314 1237843 1310372 71334 -1024181
33534 -1024181 -1458910 -1832343 -2046994 -1453934 -566430 -658022 -1721353 -2526820 -2561136 -2283093
33524 -2283093 -1711693 -518210 624905 587785 -303296 -597770 -29970 199041 -389666
33515 -389666 -769911 -163382 933994 1845251 2445616 2503427 1711070 734412 803431 1784544
33505 1784544 2035278 756097 -796872 -1103988 -216412 903757 1789040 2372076 2324822
33496 2324822 1368573 -180250 -1675026 -2592361 -2611692 -1862598 -1141693 -1126322 -1382734
33487 -1382734 -1052492 -408730 -492627 -1170053 -1078131 91345 831379 106490 -1037726
33478 -1037726 -1165614 -494976 -45802 197437 865686 1652661 1630024 806172 116261 -47711
33468 -47711 -239260 -850386 -1458162 -1431805 -643346 489427 1307884 1356499 835350 433873
33458 433873 482088 593369 389770 99498 53625 75368 -151880 -518781 -761749 -925860
33448 -925860 -1122511 -1192963 -1004514 -709367 -412820 -63027 94175 -345637 -992502 -700961
33438 -700961 840097 2366094 2603169 1805277 960436 329119 -225496 -275849 525467
33429 525467 1401849 1351727 677123 342355 228580 -532784 -1755204 -2270048 -1734804 -837864
33419 -837864 278225 2068063 3839388 3872731 2008937 375859 481275 1107368 407361
33410 407361 -1215232 -1930791 -1272117 -364283 149351 697418 1394579 1660795 1471688
33401 1471688 1621825 2279918 2437000 1435068 130550 -235306 303815 679968 264608
33392 264608 -654700 -1586969 -2222440 -2191814 -1286811 -111459 270999 -204842 -169381 1430999
33382 1430999 3583746 4178817 2659231 693474 -37091 297990 586433 561399 690070
33373 690070 940552 878946 711061 990895 1329025 680430 -795080 -1383812 44289
33364 44289 2468932 3974422 3836384 2695959 1388681 458174 309747 879487 1324139
33355 1324139 812107 -435154 -1461883 -1795195 -1748481 -1607790 -1165266 -199984 1006579
33346 1006579 1825847 1798761 991614 -60248 -832348 -1238126 -1399855 -1162100 -364324
33337 -364324 470150 534452 12932 19727 864358 1447659 1081808 736433 1325778 1857791
33327 1857791 967088 -445468 -197789 1668654 2574345 1141469 -770559 -866161 401780
33318 401780 946417 196981 -569125 -473475 19973 305943 384105 233996 -394490 -1221863
33308 -1221863 -1398442 -646652 290728 760720 1056555 1605306 1913100 1144168 -499386
33299 -499386 -1830731 -2216568 -2348630 -3116930 -4216976 -4427317 -3108208 -967156 662452
33290 662452 1007904 380924 -190980 62302 772361 739382 -475702 -1644045 -1354509
33281 -1354509 -142399 77068 -1179838 -2172025 -1585039 -497212 -519989 -1275386 -1388889
33272 -1388889 -1028954 -1395760 -2159176 -1693731 48687 1178978 895675 614633 1139429
33263 1139429 977086 -924011 -2709392 -2062820 211753 1410643 889643 286531 147909
33254 147909 -914045 -3215752 -4683539 -3778463 -1855073 -1078384 -1348537 -988292 371062
33245 371062 1373916 1133922 269861 -345883 -545006 -278076 703972 1979838 2261977
33236 2261977 955994 -685841 -914320 309950 1391642 1290917 626331 347428 311356
33227 311356 -119532 -764373 -886400 -514824 -532296 -1330452 -2173550 -2207035 -1504124 -754271
33217 -754271 -403557 -531519 -1188228 -2281380 -3220367 -3177861 -1944072 -411724 7964
33208 7964 -1297219 -3315413 -4197558 -3172833 -1410472 -532719 -590801 -282196 955885
33199 955885 2112122 2170689 1542287 1247475 1376931 1248514 750069 619773 1334828 2358754
33189 2358754 2728264 2097218 1037931 401107 436210 604826 350031 -129778 -195524 287871
33179 287871 819868 1058574 1180280 1342638 1329120 896224 59707 -970460 -1687683 -1370582
33169 -1370582 -60162 815097 -29695 -1667597 -1911804 -518783 352443 -477504 -1342189
33160 -1342189 -544611 769353 446606 -1291993 -2465799 -2449175 -2203105 -1920036 -854713
33151 -854713 525116 599149 -734289 -1559269 -839865 90934 -87598 -534862 180583
33142 180583 1616746 2059768 937194 -634800 -1420405 -1223560 -596715 -69422 299601
33133 299601 855473 1737068 2390712 2136877 1215274 674399 1108774 2020587 2469160 1879486
33123 1879486 403351 -885018 -549134 1460195 3009776 2117568 -122403 -652381 1377473
$$ [...]
##END NTUPLES=NMR SPECTRUM
##END=
