##TITLE=31Pdec_PR-III
 D2O, 124 sc
 1.10.2021
##JCAMPDX= 6.0         $$ Bruker NMR JCAMP-DX V2.0
##DATA TYPE= NMR SPECTRUM
##DATA CLASS= NTUPLES
##ORIGIN= UXNMR, Bruker Analytische Messtechnik GmbH
##OWNER= root
$$ XWIN-NMR		Version 3.5
$$ Fri Oct  1 13:40:09 2021 Russian Standard Time (UT+4h)  she@DPX200
##.OBSERVE FREQUENCY= 81.013821
##.OBSERVE NUCLEUS= ^31P
##.ACQUISITION MODE= SIMULTANEOUS
##.ACQUISITION SCHEME= undefined
##.AVERAGES= 24
##.DIGITISER RES= 16
##SPECTROMETER/DATA SYSTEM= spect
##.PULSE SEQUENCE= zgpg30
##.SOLVENT NAME= DMSO
##.SHIFT REFERENCE= (INTERNAL, DMSO, 0, 248.564)
##AUDIT TRAIL= $$ (NUMBER, WHEN, WHO, WHERE, WHAT)
$$ ##TITLE= Audit trail, XWIN-NMR		Version 3.5
$$ ##JCAMPDX= 5.01
$$ ##ORIGIN= Bruker BioSpin GmbH
$$ ##OWNER= she
$$ F:/spectra/data/she/nmr/P31/1/pdata/1/auditp.txt
$$ ##AUDIT TRAIL=  $$ (NUMBER, WHEN, WHO, WHERE, WHAT)
(   1,<2021-10-01 13:39:02.01 +0400>,<she>,<DPX200>,
      <created by zg, POWCHK disabled, PULCHK disabled
       configuration hash MD5:
       00 E9 B6 7A A2 85 ED C7 34 08 36 98 17 FE 4E 26
       data hash MD5: 32K
       26 BE E0 87 EC 6F F5 E4 11 41 EE 6D 11 ED 61 34>)
(   2,<2021-10-01 13:39:05.10 +0400>,<she>,<DPX200>,
      <Start of raw data processing
       efp BC_mod = 2 LB = 1 FT_mod = 6 PKNL = 1 PHC0 = -8862.878 PHC1 = 166.669 SI = 64K 
       data hash MD5: 64K
       95 73 57 90 33 1A 87 24 60 C8 BF F2 26 BC F7 D4>)
(   3,<2021-10-01 13:39:30.65 +0400>,<she>,<DPX200>,
      <pk PHC0 = 71.55602 PHC1 = -202.2 
       data hash MD5: 64K
       60 6A 58 71 4A 3C 42 F1 77 42 D9 F5 4D B4 D4 DF>)
(   4,<2021-10-01 13:39:34.73 +0400>,<she>,<DPX200>,
      <abs ABSG = 5 
       data hash MD5: 64K
       AF FA 01 B9 16 D7 18 2A 33 13 EC 6C FA 4F 5D F6>)
$$ ##END=
$$ 
$$ hash MD5
$$ 8A 7B C8 3A 83 5F 94 52 20 DE 18 87 9E CA 3B 2A
##$RELAX= 
##$RELAX= 
##$RELAX= 
##$RELAX= 
##$RELAX= 
##$RELAX= 
##$RELAX= 
##$RELAX= 
$$ Bruker specific parameters
$$ --------------------------
##$DU= <F:/spectra>
##$EXPNO= 1
##$NAME= <P31>
##$PROCNO= 1
##$TYPE= <nmr>
##$USER= <she>
##$AMP= (0..31)
100 100 100 100 100 100 100 100 100 100 100 100 100 100 100 100 100 100 
100 100 100 100 100 100 100 100 100 100 100 100 100 100 
##$AQSEQ= 0
##$AQ_mod= 1
##$AUNM= <au_zg>
##$AUTOPOS= <>
##$BF1= 81.014009
##$BF2= 200.13
##$BF3= 200.13
##$BF4= 200.13
##$BF5= 200.13
##$BF6= 200.13
##$BF7= 200.13
##$BF8= 200.13
##$BYTORDA= 1
##$CFDGTYP= 0
##$CFRGTYP= 5
##$CHEMSTR= <none>
##$CNST= (0..31)
1 1 145 1 1 1 1 1 1 1 1 1 1 1 1 1 1 1 1 1 1 1 1 1 1 1 1 1 1 1 1 1 
##$CPDPRG= <waltz16>
##$CPDPRG1= <>
##$CPDPRG2= <waltz16>
##$CPDPRG3= <>
##$CPDPRG4= <mlev>
##$CPDPRG5= <mlev>
##$CPDPRG6= <mlev>
##$CPDPRG7= <mlev>
##$CPDPRG8= <mlev>
##$CPDPRGB= <>
##$CPDPRGT= <>
##$D= (0..31)
0 1 0 0 0 0 0 0 0 0 0 0.03 2e-05 3e-06 0 0 0 0 0 0 0 0 0 0 0 0 0 0 0 0 
0 0 
##$DATE= 1633081141
##$DBL= (0..7)
120 120 120 11 120 120 24 19 
##$DBP= (0..7)
150 150 150 150 150 150 150 150 
##$DBP07= 0
##$DBPNAM0= <>
##$DBPNAM1= <>
##$DBPNAM2= <>
$$ [...]
##$SUBNAM3= <"">
##$SUBNAM4= <"">
##$SUBNAM5= <"">
##$SUBNAM6= <"">
##$SUBNAM7= <"">
##$SUBNAM8= <"">
##$SUBNAM9= <"">
##$SW= 501.771253377433
##$SWIBOX= (0..15)
0 1 3 0 0 0 0 0 0 0 0 0 0 0 0 0 
##$SW_h= 40650.406504065
##$TD= 32768
##$TD0= 1
##$TE= 0
##$TE2= 300
##$TE3= 300
##$TEG= 300
##$TL= (0..7)
0 120 53 12 22 120 120 120 
##$TP= (0..7)
150 150 150 150 150 150 150 150 
##$TP07= 0
##$TPNAME0= <>
##$TPNAME1= <>
##$TPNAME2= <>
##$TPNAME3= <>
##$TPNAME4= <>
##$TPNAME5= <>
##$TPNAME6= <>
##$TPNAME7= <>
##$TPOAL= (0..7)
0.5 0.5 0.5 0.5 0.5 0.5 0.5 0.5 
##$TPOFFS= (0..7)
0 0 0 0 0 0 0 0 
##$TUNHIN= 0
##$TUNHOUT= 0
##$TUNXOUT= 0
##$USERA1= <user>
##$USERA2= <user>
##$USERA3= <user>
##$USERA4= <user>
##$USERA5= <user>
##$V9= 5
##$VALIST= <valist>
##$VCLIST= <CCCCCCCCCCCCCCC>
##$VD= 0
##$VDLIST= <DDDDDDDDDDDDDDD>
##$VPLIST= <PPPPPPPPPPPPPPP>
##$VTLIST= <TTTTTTTTTTTTTTT>
##$WBST= 1024
##$WBSW= 4
##$XGAIN= (0..3)
0 0 0 0 
##$XL= 0
##$YL= 0
##$YMAX_a= 4095
##$YMIN_a= -3839
##$ZGOPTNS= <>
##$ZL1= 120
##$ZL2= 120
##$ZL3= 120
##$ZL4= 120
##$ABSF1= 248.5645
##$ABSF2= -253.2056
##$ABSG= 5
##$ABSL= 3
##$ALPHA= 0
##$AQORDER= 0
##$ASSFAC= 0
##$ASSFACI= 0
##$ASSFACX= 0
##$ASSWID= 0
##$AUNMP= <proc_1d>
##$AZFE= 0.1
##$AZFW= 0.5
##$BCFW= 0
##$BC_mod= 2
##$BYTORDP= 0
##$COROFFS= 0
##$CY= -3
##$DATMOD= 1
##$DC= 0
##$DFILT= <>
##$DTYPP= 0
##$F1P= 0
##$F2P= 0
##$FCOR= 1
##$FTSIZE= 65536
##$FT_mod= 6
##$GAMMA= 0
##$GB= 0
##$INTBC= 1
##$INTSCL= 5.30512e-09
##$ISEN= 30
##$LB= 1
##$LEV0= 0
##$LPBIN= 0
##$MAXI= 10000
##$MC2= 0
##$MEAN= 0
##$ME_mod= 0
##$MI= 50
##$NCOEF= 0
##$NC_proc= -7
##$NLEV= 6
##$NOISF1= 182.463
##$NOISF2= 159.3651
##$NSP= 0
##$NTH_PI= 0
##$NZP= 0
##$OFFSET= 248.5645
##$PC= 4
##$PHC0= -8791.322
##$PHC1= -35.53099
##$PH_mod= 1
##$PKNL= yes
##$PPARMOD= 0
##$PSCAL= 0
##$PSIGN= 0
##$REVERSE= no
##$SF= 81.014009
##$SI= 65536
##$SIGF1= 159.3651
##$SIGF2= -187.1042
##$SINO= 113.3802
##$SIOLD= 16384
##$SREGLST= <1H.CDCl3>
##$SSB= 0
##$STSI= 65536
##$STSR= 0
##$SW_p= 40650.406504065
##$SYMM= 0
##$S_DEV= 0
##$TDeff= 32768
##$TDoff= 0
##$TI= <>
##$TILT= no
##$TM1= 0
##$TM2= 0
##$TOPLEV= 0
##$USERP1= <user>
##$USERP2= <user>
##$USERP3= <user>
##$USERP4= <user>
##$USERP5= <user>
##$WDW= 1
##$XDIM= 65536
##$YMAX_p= 414021711
##$YMIN_p= -325270023
$$ End of Bruker specific parameters
$$ ---------------------------------
##NTUPLES= NMR SPECTRUM
##VAR_NAME=  FREQUENCY,     SPECTRUM/REAL,   SPECTRUM/IMAG
##SYMBOL=    X,             R,               I
##VAR_TYPE=  INDEPENDENT,   DEPENDENT,       DEPENDENT
##VAR_FORM=  AFFN,          ASDF,            ASDF
##VAR_DIM=   65536,         65536,           65536
##UNITS=     HZ,            ARBITRARY UNITS, ARBITRARY UNITS
##FACTOR=    0.620285442955139, 1,           1
##FIRST=     20137.2065510759, 0,            0
##LAST=      -20513.1999529892, 0,           0
##MIN=       -20513.1999529892, -325270023,  0
##MAX=       20137.2065510759, 414021711,    0
$$ Real data points
##PAGE= N=1
##DATA TABLE= (X++(R..R)), XYDATA
$$ [...]
$$ plain form
42324 -1081429 -1562741 26311 1423346 334316 -2488337 -4228313 -3722892 -2690533
42316 -2690533 -2899954 -3711797 -3547333 -2507453 -1850738 -1604929 -621821 1128424 2173400
42307 2173400 1770392 946890 809204 1207167 1702569 2542881 3770079 4372907 3369092
42298 3369092 1204983 -701408 -1474198 -1341625 -1049306 -1125641 -1503948 -1696114 -1479476
42289 -1479476 -1180754 -989664 -634615 -417554 -1574189 -4167691 -5519169 -2951786 2178122
42280 2178122 5689458 6016052 5656057 6399985 6261334 3184745 -799498 -2034049 -349531
42271 -349531 1173645 770761 -392108 -844593 -521448 230678 1102399 989848 -1198978
42262 -1198978 -4350628 -5592061 -3714134 -732656 655434 -93026 -1672275 -2700641
$$ packed form
42324a081429m81312J589052J397035j089030k822653j739976N05421J032359
42316b690533k09421q11843J64464J039880O56715K45809R83108J750245J044976
42307B173400m03008q23502j37686L97963M95402Q40312J227198O02828j003815
42298C369092k164109j906391p72790J32573K92319p6335l78307j92166K16638
42289a479476K98722J91090L55049K17061j156635k593502j351478K567383N129908
42280B178122L511336L26594l59995P43928j38651l076589l984243j234551J684518
42271c49531J523176m02884j162869m52485L23145P52126Q71721j12551k188826
42262a198978l151650j241433J877927K981478J388090p48460j579249j028366
$$ plain form
42254 -2700641 -2320886 -244759 2591789 4102462 2945817 174111 -1740714 -1402844
42246 -1402844 434448 1984421 2040677 646680 -1198881 -2301091 -2088131 -1029827 -254553
42237 -254553 -503417 -1302163 -1394124 -304074 807566 496517 -875949 -1360723 -10485
42228 -10485 1743772 1957526 578501 -859507 -1270523 -761235 141436 892910 809282
42219 809282 -339546 -1544784 -1274431 714896 2735073 2576861 -365487 -4065886 -5162851
42210 -5162851 -2293508 1718198 2459357 -639779 -3226618 -1674067 2115860 3772335
42202 3772335 2626834 1561115 1514513 177462 -3159159 -5349603 -4020686 -1426429
42194 -1426429 -973499 -2106200 -1835823 -23188 464043 -1215401 -2126200 -52605 2825268
$$ packed form
42254b700641L79755K076127K836548J510673j156645k771706j914825L37870
42246a402844J837292J549973N6256j393997j845561j102210K12960J058304P75274
42237b54553k48864p98746r1961J090050J111640l11049j372466m84774J350238
42228a0485J754257K13754j379025j438008m11016N09288R02671P51474q3628
42219H09282j148828j205238K70353J989327K020177j58212k942348l700399j096965
42210e162851K869343M011706P41159l099136k586839J552551L789927J656475
42202C772335j145501j065719m6602j337051l336621k190444J328917K594257
42194a426429M52930j132701K70377J812635M87231j679444r10799K073595K877873
$$ plain form
42185 2825268 2766680 -374877 -2962568 -2263361 459632 2018737 1215343 -315977 -660183
42176 -660183 130054 608910 -35827 -1232612 -2064719 -2405283 -2874920 -3982687 -5415703
42167 -5415703 -6074045 -4953181 -2234488 641450 2251264 2380557 1733571 875451 43553
42158 43553 -259657 641710 2626421 4402998 4539710 2852202 655952 -447078 -142201
42149 -142201 369741 -19230 -835343 -896219 -385565 -696668 -1984032 -2525852 -1392747
42140 -1392747 -160701 -612075 -2117183 -2943132 -2890283 -2686048 -1982430 -379223 535907
42131 535907 -911136 -3024529 -2428616 664890 2277738 522833 -1741215 -1532906 184364
42122 184364 1114036 1452348 2444997 3302845 2480020 610977 -502965 -706013 -777290
$$ packed form
42185B825268n8588l141557k587691O99207K722993J559105q03394j531320l44206
42176f60183P90237M78856o44737j196785q32107l40564m69637j107767j433016
42167e415703o58342J120864K718693K875938J609814J29293o46986q58120q31898
42158D3553l03210R01367J984711J776577J36712j687508k196250j103030L04877
42149a42201N11942l88971q16113o0876N10654l11103j287364n41820J133105
42140a392747J232046m51374j505108q25949N2849K04235P03618J603207R15130
42131E35907j447043k113393N95913L093506J612848j754905k264048K08309J717270
42122A84364R29672L38312R92649Q57848q22825j869043j113942k03048p1277
$$ plain form
42113 -777290 -27397 2651106 6061620 7743423 7305411 6216459 4841977 2590219 714538
42104 714538 1552834 4339562 5031611 1748784 -2297104 -3128678 -1072644 592305 351475
42095 351475 -561681 -840326 -310749 1126568 3384388 4792948 3008597 -1735231 -5899064
42086 -5899064 -6470120 -4467546 -3160801 -3561419 -3689847 -2354771 -1313989 -2325338 -3851125
42077 -3851125 -3034966 -260064 834012 -1796690 -5942229 -8102715 -7183515 -4282743
42069 -4282743 -791729 1790878 1866810 -502036 -2933262 -3501279 -3053356 -3100136 -2900306
42060 -2900306 -1036918 1319329 1732544 573842 585347 2234089 2729235 579495 -1790966
42051 -1790966 -1511804 917989 2947434 3313022 2442743 1077667 189087 1039509 3620042
$$ packed form
42113g77290P49893K678503L410514J681803m38012j088952j374482k251758j875681
42104G14538Q38296K786728O92049l282827m045888q31574K056034J664949k40830
42095C51475r13156k78645N29577J437317K257820J408560j784351m743828m163833
42086e899064n71056K002574J306745m00618j28428J335076J040782j011349j525787
42077c851125Q16159K774902J094076k630702m145539k160486R19200K900772
42069d282743L491014K582607P5932k368846k431226n68017M47923m6780J99830
42060b900306J863388K356247M13215j158702J1505J648742M95146k149740k370461
42051a790966K79162K429793K029445L65588q70279j365076q88580Q50422K580533
$$ plain form
42042 3620042 5870667 5920917 4412429 3364930 3482874 3795812 3280553 1711807 -409681
42033 -409681 -1744928 -784246 2193114 4657041 4614096 3088980 2477531 3264419 4061790
42024 4061790 4271291 4637451 5150361 4400625 1707064 -1509884 -3337790 -3537254 -3378584
42015 -3378584 -3780021 -4252256 -3765618 -2453519 -1966941 -3480100 -5615685 -5702459 -3400708
42006 -3400708 -1361709 -1322959 -1487044 367123 2951783 3453146 2330509 2635529 4612360
41997 4612360 4730656 1253002 -2612036 -3181410 -1243990 -22806 -327324 -727609 -1102781
41988 -1102781 -2579948 -4381651 -4171143 -2077825 -1285498 -3275087 -5098327 -3505485
41980 -3505485 24515 1057462 -1658101 -4536763 -4113544 -1377987 235822 -342177
$$ packed form
42042C620042K250625N0250j508488j047499J17944L12938n15259j568746k121488
42033d09681j335247R60682K977360K463927m2945j525116o11449P86888P97371
42024D061790K09501L66160N12910p49736k693561l216948j827906j99464J58670
42015c378584m01437m72235M86638J312099M86578j513159k135585q6774K301751
42006c400708K038999L8750j64085J854167K584660N01363j122637L05020J976831
41997D612360J18296l477654l865038n69374J937420J221184l04518m00285l75172
41988a102781j477167j801703K10508K093318P92327j989589j823240J592842
41980c505485L530000J032947k715563k878662M23219K735557J613809n77999
$$ plain form
41972 -342177 -1060469 -305360 1009416 1534776 1781881 2824781 3899429 3310442 1415853
41963 1415853 654870 2164444 4098611 4142226 2301541 242518 -881292 -821621 347303
41954 347303 1791873 1825964 -181434 -2426594 -2713196 -1346074 -433814 -806293 -1389172
41945 -1389172 -1346546 -957859 -429747 263764 345101 -890469 -2013663 -678999 2491993
41936 2491993 3803617 1481329 -1627151 -2053064 -274986 804022 112668 -1313171
41928 -1313171 -2888601 -4564561 -5230235 -3865542 -1976083 -2210185 -4529957 -6271037
41920 -6271037 -6180780 -5774388 -6104521 -5845994 -3843823 -1362999 -187240 -99589 123134
41911 123134 494215 291850 -163282 43134 596235 180791 -1368119 -2375619 -1300272
$$ packed form
41972c42177p18292P55109J314776N25360K47105J042900J074648n88987j894589
41963A415853p60983J509574J934167M3615j840685k059023j123810N9671J168924
41954C47303J444570L4091k007398k245160k86602J367122R12260l72479n82879
41945a389172M2626L88687N28112O93511Q1337j235570j123194J334664L170992
41936B491993J311624k322288l108480m25913J778078J079008o91354j425839
41928a313171j575430j675960o65674J364693J889459k34102k319772j741080
41920f271037R0257M06392l30133K58527K002171K480824J175759Q7651K22723
41911A23134L71081k02365m55132K06416N53101m15444j548910j007500J075347
$$ plain form
41902 -1300272 1169874 2521210 995932 -2368509 -4609454 -3906154 -1313628 885805
41894 885805 1751533 1792960 1451820 974872 1212582 2676963 3949444 2985365 165082
41885 165082 -1926623 -2079182 -1708250 -2016087 -2246259 -1769472 -1585167 -2268683 -2474192
41876 -2474192 -1172265 462783 1164111 1725903 3038325 3788657 2558080 693979 379118
41867 379118 996774 291778 -1670352 -2709624 -2247862 -1774404 -1693386 -796631 761100
41858 761100 958454 -800128 -2530873 -2777639 -2415845 -2261065 -1318452 1070183 3412487
41849 3412487 4118487 3743156 3569162 3438501 2677590 1866823 1852805 1973728 1106594 -176567
41839 -176567 -271247 992744 2165241 2360480 2200118 2427417 2731753 2311798 946557
$$ packed form
41902a300272K470146J351336j525278l364441k240945P03300K592526K199433
41894H85805Q65728M1427l41140m76948K37710J464381J272481r64079k820283
41885A65082k091705j52559L70932l07837k30172M76787J84305o83516k05509
41876b474192J301927J635048P01328N61792J312422P50332j230577j864101l14861
41867C79118O17656p04996j962130j039272M61762M73458Q1018Q96755J557731
41858G61100J97354j758582j730745k46766L61794J54780R42613K388635K342304
41849C412487P06000l75331j73994j30661p60911q10767j4018J20923q67134j283161
41839a76567r4680J263991J172497J95239j60362K27299L04336m19955j365241
$$ plain form
41830 946557 -701995 -1507816 -739679 1097567 2518446 2576542 1837634 1413846 1444395
41821 1444395 1183686 360564 -291911 -21078 835574 1043611 -95454 -1587732 -1577991
41812 -1577991 190437 1401818 -171951 -3303271 -4253224 -1554426 1777937 1946023
41804 1946023 -982863 -3661546 -3863720 -2424194 -974200 206541 1301391 1538035
41796 1538035 197730 -1645099 -2079740 -1157421 -1119655 -3013567 -4519162 -2853911 903506
41787 903506 2638244 543017 -2638773 -3635849 -2688625 -1905126 -1616708 -901079 -366896
41778 -366896 -1347338 -2802355 -2151906 566518 2316947 1531490 165040 201639 805598
41769 805598 564132 158678 697605 1272967 548778 -509652 89219 2071368 3119679
$$ packed form
41830I46557j648552q05821P68137J837246J420879N8096p38908m23788L0549
41821A444395k60709q23122o52475K70833Q56652K08037j139065j492278R741
41812a577991J768428J211381j573769l131320r49953K698798L332363J68086
41804A946023k928886k678683k02174J439526J449994J180741J094850K36644
41796A538035j340305j842829m34641R22319L7766j893912j505595J665251L757417
41787I03506J734738k095227l181790r97076R47224P83499K88418P15629N34183
41778c66896r80442j455017O50449K718424J750429p85457j366450L6599O03959
41769H05598k41466m05454N38927N75362p24189j058430N98871J982149J048311
$$ plain form
41760 3119679 2138884 375263 -743621 -1200196 -1448386 -1159610 351543 2823358 4631879
41751 4631879 4060991 1354946 -952803 -735766 1052066 1815170 1096184 783034 1415026
41742 1415026 997018 -1498424 -4138891 -5160458 -5565150 -6559510 -6839041 -4981342 -2403109
41733 -2403109 -1083451 -327737 1039495 1301736 -1336931 -4112658 -2612506 2216559
41725 2216559 4870069 3376290 1613076 2466382 3768087 3300980 3097149 5266249 7297012
41716 7297012 5738862 2068153 568306 1908170 3111151 3157139 4223693 6916954
41708 6916954 8220967 5793616 1531841 -1038421 -1099825 -430331 -200233 107367 889817
41699 889817 1279120 391041 -1148296 -1729134 -711746 709510 842272 -632439 -2478676
$$ packed form
41760C119679r80795j763621j118884m56575k48190K88776J511153K471815J808521
41751D631879n70888k706045k307749K17037J787832P63104p18986l13150O31992
41742A415026m18008k495442k640467j021567m04692r94360k79531J857699K578233
41733b403109J319658P55714J367232K62241k638667k775727J500152M829065
41725B216559K653510j493779j763214Q53306J301705m67107k03831K169100K030763
41716G297012j558150l670709j499847J339864J202981M5988J066554K693261
41708F916954J304013k427351m261775k570262o1404O69494K30098L07600P82450
41699H89817L89303q88079j539337n80838J017388J421256J32762j474711j846237
$$ plain form
41690 -2478676 -3342939 -2910344 -1842297 -1160091 -1563496 -2734683 -3468953 -3157991 -2772054
41681 -2772054 -3342757 -3885668 -2462180 603797 2403466 1021974 -2105992 -4221105
41673 -4221105 -4147869 -2338131 310138 2410535 2437934 731809 -141335 1298405 3040303
41664 3040303 2405084 26138 -1359372 -1148571 -1080160 -1564894 -889685 1415384 3242566
41655 3242566 3079719 2220451 2388082 3007150 2454822 700937 -870502 -1418731 -1183431
41646 -1183431 -761544 -751998 -1320348 -1419657 401655 3510913 4827115 2257580 -2540689
41637 -2540689 -6108205 -6801735 -5141243 -1986796 1533325 3307832 2026581 -586085
41629 -586085 -1647238 -1070165 -1172093 -2331983 -2075818 586606 2903978 2330532 336208
$$ packed form
41690b478676q64263M32595J068047O82206m03405j171187p34270L10962L85937
41681b772054n70703n42911J423488L065977J799669j381492l127966k115113
41673d221105P3236J809738K648269K100397K7399j706125q73144J439740J741898
41664C040303o35219k378946j385510K10801O8411m84734O75209K305069J827182
41655C242566j62847q59268J67631O19068n52328j753885j571439n48229K35300
41646a183431M21887R546n68350r9309J821312L109258J316202k569535m798269
41637b540689l567516o93530J660492L154447L520121J774507j281251k612666
41629e86085j061153N77073j01928j159890K56165K662424K317372n73446j994324
$$ plain form
41620 336208 -116400 897980 1069354 111359 108574 1632291 2354727 423013 -2857709
41611 -2857709 -4902624 -5020643 -4524372 -4548220 -4853004 -4448374 -2739857 -278077 1381749
41602 1381749 1012281 -865289 -2380179 -2309584 -1143095 -61291 389328 318102 -18889
41593 -18889 -226079 129238 840017 908532 -375291 -2457285 -4016357 -4208670 -3164004
41584 -3164004 -1617746 -428665 -169918 -738890 -1394767 -1406959 -693564 155427 388481
41575 388481 -249941 -1195960 -1608541 -1423771 -1441592 -2028432 -2418961 -2013213 -1579193 -1948498
41565 -1948498 -2125916 -401404 2726818 4529344 3390147 683354 -1223560 -1445644
41557 -1445644 -466698 1020770 2272793 2564496 1910404 991766 166278 -395142 204233
$$ packed form
41620C36208m52608J014380J71374r57995k785J523717P22436j931714l280722
41611b857709k044915j18019M96271k3848l04784M04630J708517K461780J659826
41602A381749l69468j877570j514890P0595J166489J081804M50619p1226l36991
41593a8889k07190L55317P10779O8515j283823k081994j559072j92313J044666
41584c164004J546258J189081K58747n68972o55877j2192P13395Q48991K33054
41575C88481o38422r46019m12581J84770j7821n86840l90529M05748M34020l69305
41565a948498j77418J724512L128222J802526j139197k706793j906914k22084
41557a445644R78946J487468J252023K91703o54092r18638q25488n61420N99375
$$ plain form
41548 204233 2489332 4585987 3840757 1068828 219116 2475456 3921637 1385192 -2486446
41539 -2486446 -3263513 -1305967 -289002 -931308 -741312 727016 1035004 -436721 -1249709
41530 -1249709 -351424 72450 -1400451 -2947902 -2738026 -1773079 -1664834 -1967489 -1510317
41521 -1510317 -392512 851160 2197573 3059700 2340152 685848 375085 1739327 2281638
41512 2281638 835394 -261294 827794 2095092 978896 -1455451 -2521547 -1980063
41504 -1980063 -1095444 340254 2663012 3782597 1770856 -1196460 -1388826 753481
41496 753481 1440482 -273359 -1305337 104433 1936808 2315367 2212017 2743572 2940287
41487 2940287 1985829 1072954 1230940 1458410 667358 -412267 -762484 -747291 -886474
$$ packed form
41548B04233K285099K096655p45230k771929q49712K256340J446181k536445l871638
41539b486446p77067J957546J016965o42306J89996J468328L07988j471725q12988
41530a249709Q98285M23874j472901j547451K09876R64947J08245l02655M57172
41521a510317J117805J243672J346413Q62127p19548j654304l10763J364242N42311
41512B281638j446244j096688J089088J267298j116196k434347j066096N41484
41504a980063Q84619J435698K322758J119585k011741k967316j92366K142307
41496G53481O87001j713841j031978J409770J832375L78559j03350N31555J96715
41487B940287r54458r12875J57986K27470p91052j079625l50217J5193j39183
$$ plain form
41478 -886474 -651738 241660 984476 1226623 1719505 2389998 1854932 104327 -604061
41469 -604061 842328 2348089 1875616 536366 139844 -120081 -1636084 -2891336 -1422584
41460 -1422584 1801516 3429385 2635741 1602134 1245916 -6142 -2611463 -4396176
41452 -4396176 -3938783 -2799789 -2788123 -3096102 -1924277 444758 1846457 813576 -2006201
41443 -2006201 -4378589 -4039060 -771759 2707132 3246203 1090176 -269023 1354389
41435 1354389 4248346 5887326 6778003 9237016 13326456 16225472 15692680 12519161
41427 12519161 9101470 6715965 4909103 2979946 1118713 -200869 -1300122 -2728247
41419 -2728247 -3596125 -2005251 1825842 4351336 2648927 -1323116 -3016640 -1507839
$$ packed form
41478h86474K34736Q93398P42816K42147M92882O70493n35066j750605p08388
41469f04061J446389J505761m72473j339250l96522k59925j516003j255252J468752
41460a422584L224100J627869p93644j033607l56218j252058k605321j784713
41452d396176M57393J138994J1666l07979J171825K369035J401699j032881k819777
41443b006201k372388L39529L267301L478891N39071k156027j359199J623412
41435A354389K893957J638980Q90677K459013M089440K899016n32792l173519
41427A2519161l417691k385505j806862j929157j861233j319582j099253j428125
41419b728247q67878J590874L831093K525494j702409l972043j693524J508801
$$ plain form
41411 -1507839 -289516 -1377925 -2219094 -347331 2070737 1457056 -1448592 -2613572
41403 -2613572 -614248 1851203 2360312 1673425 1533674 1984966 2100040 1799414 1674727
41394 1674727 1770063 1429430 119201 -1844881 -3222569 -2805203 -882524 746177 829422
41385 829422 99496 -49319 547655 1232301 1843116 2291376 1718189 -271175 -2158049
41376 -2158049 -2032487 -175734 1508191 2240841 2855219 3860534 4743703 5029950 4574146
41367 4574146 3226912 1636430 1449082 2812865 2867994 -622358 -5129220 -6170587 -3770926
41358 -3770926 -2291840 -3636782 -4810711 -3406248 -1406113 -1344280 -2153709 -1620749 -355888
41349 -355888 -405966 -1750026 -2835670 -3246836 -3559156 -3693416 -3350545 -3007321 -2940830 -2552617
$$ packed form
41411a507839J218323j088409q41169J871763K418068o13681k905648j164980
41403b613572J999324K465451N09109o86887j39751M51292J15074l00626j24687
41394A674727R5336l40633j310229j964082j377688M17366J922679J628701Q3245
41385H29422p29926j48815N96974O84646O10815M48260n73187j989364j886874
41376b158049J25562J856753J683925P32650O14378J005315Q83169K86247m55804
41367D574146j347234j590482j87348J363783N5129l490352m506862j041367K399661
41358c770926J479086j344942j173929J404463K000135O1833q09429N32960J264861
41349c55888n0078j344060j085644m11166l12320j34260L42871L43224O6491L88213
$$ plain form
41339 -2552617 -1960296 -2536810 -4430240 -5547531 -4683276 -3470905 -3260823 -2503243 155700
41330 155700 2482137 1632686 -1146267 -2224388 -854798 625226 1040998 1420033 2112335
41321 2112335 2078940 1187076 553703 480211 319200 255637 980588 1849959 1626042 754390
41311 754390 655457 1130113 799741 -251798 -687970 -466914 -792514 -1767369 -2347677 -2267364
41301 -2267364 -1827908 -468072 2028052 3765353 2967496 1124414 864913 1599500 812754
41292 812754 -1076734 -1262394 302103 710239 -587574 -745619 1266375 2723660 1811437
41283 1811437 213119 -538135 -1367315 -2495755 -1873018 937597 2846098 1718007 -414562
41274 -414562 -1136411 -1515505 -3366857 -5493111 -5791456 -4880200 -4590108 -4616219 -3425948
$$ packed form
41339b552617N92321n76514j893430j117291Q64255J212371K10082P57580K658943
41330A55700K326437q49451k778953j078121J369590J480024M15772L79035O92302
41321B112335l3395q91864o33373p3492j61011o3563P24951Q69371k23917q71652
41311G54390r8933M74656l30372j051539m36172K21056l25600r74855n80308Q0313
41301b267364M39456J359836K496124J737301p97857j843082k59501P34587p86746
41292H12754j889488j85660J564497M08136j297813j58045K011994J457285r12223
41283A811437j598318p51254q29180j128440O22737K810615J908501j128091k132569
41274d14562p21849l79094j851352k126254k98345R11256K90092k6111J190271
$$ plain form
41265 -3425948 -1004141 1641334 4143068 5864615 5180032 1913763 -1264925 -2125870
41257 -2125870 -1829061 -2418116 -3243621 -2374267 -20890 1907193 2476294 1960030 694252
41248 694252 -610796 -968815 -982399 -2574252 -5392143 -6141283 -3456540 -504991 -246136
41239 -246136 -1128589 -524831 583250 3079 -1324436 -1458840 -1537807 -3316624 -4738468
41230 -4738468 -2794028 769156 1645941 -151844 -731404 963130 2103522 1636599 1764859
41221 1764859 3098031 3248860 1498201 455134 1559482 2792416 2375642 1300562
41213 1300562 844092 817137 1365852 3185727 4975730 4237989 1659690 894037 2733034
41204 2733034 3653107 1925945 771359 2738320 5059836 4160021 1459353 696613 1933732
$$ packed form
41265c425948K421807K645475K501734J721547o84583l266269l178688q60945
41257b125870K96809n89055q25505Q69354K353377J928083N69101n16264j265778
41248F94252j305048l58019j3584j591853k817891p49140K684743K951549K58855
41239b46136q82453O03758J108081n80171j327515j34404p8967j778817j421844
41230d738468J944440L563184Q76785j797785n79560J694534J140392m66923J28260
41221A764859J333172J50829j750659j043067J104348J232934m16774j075080
41213A300562m56470k6955N48715J819875J790003p37741k578299p65653J838997
41204B733034R20073j727162j154586J966961K321516q99815k700668p62740J237119
$$ plain form
41195 1933732 2354014 1401098 1069095 1837939 1934696 527705 -1219304 -2271617 -2556116
41186 -2556116 -1844788 -32761 1594990 1511587 388146 417390 2077867 3468347 3216389
41177 3216389 2273409 2084582 2381831 1890406 534629 -160713 1007529 3185719 4244708
41168 4244708 3399101 2342786 2983519 4539517 4270015 1212334 -2281691 -3393497 -1997056
41159 -1997056 -89572 888098 997119 743172 421772 509137 1668878 3873236 5876307
41150 5876307 6097619 4298067 2147895 1561413 2467960 3047949 2335953 1369733 1201987
41141 1201987 1309617 1121555 1490400 2846192 3370893 1408798 -1385107 -2026730 -612237
41132 -612237 186475 -429286 -708635 -84159 -48614 -751909 -271240 1661320 2657860 1846231
$$ packed form
41195A933732M20282r52916l32003P68844R6757j406991j747009j052313k84499
41186b556116P11328J812027J627751q3403j123441K9244J660477J390480k51958
41177C216389r42980j88827K97249m91425j355777o95342J168242K178190J058989
41168D244708q45607j056315O40733J555998k69502l057681l494025j111806J396441
41159a997056J907484R77670J09021k53947l21400Q7365J159741K204358K003071
41150E876307K21312j799552k150172n86482R06547N79989p11996r66220j67746
41141A201987J07630j88062L68845J355792N24701j962095k793905o41623J414493
41132f12237P98712o15761k79349O24476L5545p03295M80669J932560R96540q11629
$$ plain form
41122 1846231 1621325 3307408 4379917 2512382 -516136 -1771998 -1447257 -1130510 -197090
41113 -197090 2420845 4596677 3159777 -1045481 -3916783 -3671571 -2310545 -1520596 -540466
41104 -540466 1217208 2484662 2348755 1852854 2128088 2752851 3135569 3846637 5172446
41095 5172446 5620975 3494719 -532223 -3687271 -4003910 -2322879 -1289521 -2536753
41087 -2536753 -4898579 -5639030 -3679911 -1122728 -840534 -2884925 -4382827 -3158831
41079 -3158831 -353023 1246313 705351 -293655 -51055 951520 1104713 168065 -510718
41070 -510718 -215947 117453 -220776 -158910 1421598 3239568 2798811 -24565 -2349832
41061 -2349832 -1747017 1033663 3403173 3867720 2868834 1533275 470296 -365841 -999297
$$ packed form
41122A846231k24906J686083J072509j867535l028518j255862L24741L16747R33420
41113a97090K617935K175832j436900m205258k871302K45212J361026P89949R80130
41104e40466J757674J267454j35907m95901K75234O24763L82718P11068J325809
41095E172446M48529k126256m026942l155048l16639J681031J033358j247232
41087b536753k361826p40451J959119K557183K82194k044391j497902J223996
41079c158831K805808J599336n40962r99006K42600J002575J53193r36648o78783
41070e10718K94771L33400l38229O1866J580508J817970m40757k823376k325267
41061b349832O02815K780680K369510M64547r98886j335559j062979q36137o33456
$$ plain form
41052 -999297 -791409 960226 3444319 4371692 2653616 138031 -768978 -355902 -644651
41043 -644651 -1912264 -2472183 -1657589 -650181 -252036 -29686 230961 331535 762951
41034 762951 1663732 1136943 -2357955 -6224596 -6074647 -2137885 729364 160657 -1117136
41025 -1117136 -1151790 -2145509 -5286895 -7076152 -4711416 -1168782 -562336 -1791970 -1462727
41016 -1462727 -158065 -566815 -1591188 32572 3452794 4583119 2837775 1750439
41008 1750439 2745060 3255923 1691841 -303470 -1480587 -2634089 -3528329 -2255267 904984
40999 904984 2746603 1907237 924101 1773307 2701716 1673416 22841 103341 1474567
40990 1474567 1970772 1125748 355381 608106 1399396 1570753 218904 -2260044 -3750768
$$ packed form
41052i99297K07888J751635K484093R27373j718076k515585r07009M13076k88749
41043f44651j267613n59919Q14594J007408L98145K22350K60647J00574M31416
41034G62951R00781n26789l494898l866641J49949L936762K867249n68707j277793
41025a117136l4654r93719l141386j789257K364736L542634O06446j229634L29243
41016a462727J304662m08750j024373J623760L420222J130325j745344j087336
41008A750439R94621N10863j564082j995311j177117j153502q94240J273062L160251
40999I04984J841619q39366r83136Q49206R28409j028300j650575Q0500J371226
40990A474567M96205q45024p70367K52725P91290J71357j351849k478948j490724
$$ plain form
40981 -3750768 -2418373 591386 2090144 782981 -1525221 -2861582 -3070052 -2495863
40973 -2495863 -1112641 278250 282713 -809765 -1196575 -649665 -870837 -2041790 -2079955
40964 -2079955 -567058 -91181 -1728819 -2494062 -29273 3072792 3018223 629220 -356648
40955 -356648 700067 1022225 -441317 -1368143 16134 2350156 3231307 1824399 -992465
40946 -992465 -3288546 -2905674 388730 3597771 3475386 873661 -220858 1709417 3716831
40937 3716831 2990790 913588 650780 2465759 3708528 2692684 500639 -1029497
40929 -1029497 -1485835 -1634828 -2018197 -2344611 -1888308 -309691 1664353 2536335 1576671
40920 1576671 55590 228642 2754414 5665974 6432750 4699929 2401671 1440275 2041651
$$ packed form
40981c750768J332395L009759J498758j307163k308202j336361k08470N74189
40973b495863J383222J390891M463j092478l86810N46910k21172j170953l8165
40964b079955J512897M75877j637638p65243K464789L102065n4569k389003r85868
40955c56648J056715L22158j463542r26826J384277K334022Q81151j406908k816864
40946i92465k296081L82872L294404L209041j22385k601725j094519J930275K007414
40937C716831p26041k077202k62808J814979J242769j015844k192045j530136
40929a029497m56338j48993l83369l26414M56303J578617J974044Q71982r59664
40920A576671j521081J73052K525772K911560P66776j732821k298258r61396O01376
$$ plain form
40911 2041651 3303858 4311852 4353948 3083293 1261935 558963 1631463 3004965 2947148
40902 2947148 1908455 1729478 2758820 3442352 2899263 2139568 2105005 2143199 1455181
40893 1455181 637408 410839 -46657 -1778423 -3737302 -3742739 -1716378 -98605 -509956
40884 -509956 -1623224 -1361654 82450 879702 430962 -184771 -550908 -1790731 -4291689
40875 -4291689 -6123950 -5297890 -2794009 -1539638 -2479540 -3427453 -2260838 349862 2299704
40866 2299704 2810353 2562333 1978232 914288 -190940 -253694 1049480 2615614 3039559
40857 3039559 2122972 1128712 1519078 3216142 4243299 2767725 -424877 -2388444 -1282146
40848 -1282146 1715386 4136806 4815498 4191389 3206463 2756925 3237005 3760683 2841185
$$ packed form
40911B041651J262207J007994M2096j270655j821358p02972J072500J373502n7817
40902B947148j038693j78977J029342O83532n43089p59695l4563L8194o88018
40893A455181q17773k26569m57496j731766j958879n437K026361J617773m11351
40884e09956j113268K61570J444104P97252m48740o15733l66137j239823k500958
40875d291689j832261Q26060K503881J254371r39902r47913J166615K610700J949842
40866B299704N10649k48020n84101j063944j105228o2754J303174J566134M23945
40857C039559r16587r94260L90366J697064J027157j475574l192602j963567J106298
40848a282146K997532K421420O78692o24109r84926m49538M80080N23678r19498
$$ plain form
40839 2841185 649769 -668061 35214 1057399 438929 -889590 -406099 2382912 5412999
40830 5412999 6673544 5934797 4394158 3701852 4543122 5349448 3824787 655895 -522483
40821 -522483 1587595 3481353 2216150 278570 1310947 3564146 2565505 -1306038
40813 -1306038 -3494594 -2876628 -2761799 -3965222 -3120545 506429 2607361 1009899 -276398
40804 -276398 2094224 4788046 3222372 -835345 -2228600 -339553 1084969 414703
40796 414703 -499815 -725678 -1461535 -2731123 -2635158 -486282 2077714 3439651 3277212
40787 3277212 1736840 -392398 -1115975 687665 2992097 2958906 1192346 873917 2748206
40778 2748206 4023948 2808073 714664 -115213 -151678 -1017944 -2602817 -3351407 -2541540
$$ packed form
40839B841185k191416j317830P03275J022185o18470j328519M83491K789011L030087
40830E412999J260545p38747j540639o92306Q41270Q06326j524661l168892j178378
40821e22483K110078J893758j265203j937580J032377K253199r98641l871543
40813a306038k188556O17966J14829j203423Q44677L626974K100932j597462j286297
40804b76398K370622K693822j565674m057717j393255J889047J424522o70266
40796D14703r14518k25863p35857j269588R5965K148876K563996J361937j62439
40787C277212j540372k129238p23577J803640K304432l3191j766560l18429J874289
40778B748206J275742j215875k093409q29877l6465q66266j584873p48590Q09867
$$ plain form
40769 -2541540 -904524 576081 1492626 1811266 1500665 484903 -1126764 -2783668 -3707869
40760 -3707869 -3581558 -2833987 -2175789 -2164573 -3044306 -4258283 -4311385 -2315265 345596
40751 345596 1397094 825503 715046 1581388 1324860 -1159041 -3996079 -5610515 -7211184
40742 -7211184 -9544760 -9819289 -5386234 1254845 5016241 4886743 4201103 4727085 4674459
40733 4674459 3091330 2137976 3344026 4823243 4293727 2508049 1590362 1776646 1935151
40724 1935151 2024528 2815206 3736806 3059509 483091 -1877991 -1889694 -195245 379991
40715 379991 -1462697 -3330131 -2062527 1505508 2943817 219747 -3144870 -2975865
40707 -2975865 -457660 -113278 -2878329 -4904968 -3466071 -535588 741102 305025
$$ packed form
40769b541540J637016J480605R16545L18640l10601j015762j611667j656904r24201
40760c707869J26311P47571O58198J1216q79733j213977n3102J996120K660861
40751C45596J051498n71591j10457Q66342k56528k483901k837038j614436j600669
40742g211184k333576k74529M433055O641079L761396j29498o85640N25982n2626
40733D674459j583129r53354J206050J479217n29516j785678r17687J86284J58505
40724A935151Q9377P90678R21600o77297k576418k361082j1703J694449N75236
40715C79991j842688j867434J267604L568035J438309k724070l364617J69005
40707b975865K518205L44382k765051k026639J438897K930483J276690m36077
$$ plain form
40699 305025 114338 814172 1421805 1220686 385980 -685946 -1654466 -2318196 -2934562
40690 -2934562 -3805288 -4344815 -3564629 -1686940 -40998 917063 1998779 3203898 2935963
40681 2935963 347685 -2895986 -4492083 -4200288 -3479062 -3229887 -3200152 -3140774 -3255042
40672 -3255042 -3540767 -3662385 -3606370 -3785521 -4319233 -4702496 -4444198 -3712987 -2936774 -1827404
40662 -1827404 527072 4048095 6714453 6428465 3793653 1581484 1068542 619089 -1212234
40653 -1212234 -3126306 -3336802 -2660706 -2946275 -3622064 -2713509 -767502 -561351 -2529212
40644 -2529212 -3515620 -1264534 2289297 3739010 2361812 -27942 -1907434 -2978536
40636 -2978536 -3160517 -2328167 -870042 535285 1619723 2432044 2801922 2403883 1255177
$$ packed form
40699C05025j90687O99834O07633k01119q34706j071926r68520o63730o16366
40690b934562q70726n39527P80186J877689J645942R58061J081716J205119k67935
40681B935963k588278l243671j596097K91795P21226K49175K9735N9378j14268
40672c255042k85725j21618N6015j79151n33712l83263K58298P31211P76213J109370
40662a827404K354476L521023K666358k85988k634812k212169n12942m49453j831323
40653a212234j914072k10496O76096k85569o75789R08555J946007K06151j967861
40644b529212r86408K251086L553831J449713j377198k389754j879492j071102
40636b978536j81981Q32350J458125J405327J084438Q12321L69878l98039j148706
$$ plain form
40627 1255177 -42250 -493789 573945 2538188 3545765 2287437 -390285 -2222052
40619 -2222052 -1732577 618008 2966627 3356557 1422438 -672907 -195531 2508458 3932151
40610 3932151 2122105 -562496 -1247285 -849047 -1766367 -3205447 -2470378 245484 2226587
40601 2226587 2705068 3013517 2827325 712715 -1659973 -785486 2538435 3472274 878352
40592 878352 -554229 1813246 3990822 2135162 -1006639 -923533 1406508 2197730 1682683
40583 1682683 2680123 4356623 3185090 -602347 -2842389 -1834946 -187599 299108
40575 299108 1193557 3630799 5685973 5332598 3322565 1471675 165240 -928173 -1277634
40566 -1277634 -116641 2148494 4065230 4383362 3156357 1958820 2397407 3834640
$$ packed form
40627A255177j297427m51539J067734J964243J007577j258328k677722j831767
40619b222052M89475K350585K348619L89930j934119k095345M77376K703989J423693
40610C932151j810046k684601o84789L98238r17320j439080P35069K715862J981103
40601B226587M78481L08449j86192k114610k372688Q74487L323921R33839k593922
40592H78352j432581K367475K177576j855660l141801Q3106K330041P91222n15047
40583A682683R97440J676500j171533l787437k240042J007443J647347M86707
40575B99108Q94449K437242K055174l53375k010033j850890j306435j093413l49461
40566a277634J160993K265135J916736L18132j227005j197537M38587J437233
$$ plain form
40558 3834640 3787035 1589656 -35273 1119238 2997968 2084812 -1286015 -3524601 -3066719
40549 -3066719 -1815037 -1351616 -915769 280903 1506092 2072222 2154029 1456947 -644228
40540 -644228 -3045601 -3336904 -1128204 1108521 1318764 91514 -994281 -1250558 -527703
40531 -527703 908081 1524389 -200629 -2930474 -3354404 -898930 1102991 435547 -504844
40522 -504844 1486322 5273569 6865740 4874565 1754576 -21812 -633755 -1447865 -2600613
40513 -2600613 -2851201 -1323476 1016968 1943465 564243 -1054394 -190287 2680028 4200676
40504 4200676 2780198 754325 731048 1885794 1845367 685995 611772 2304320 3860615
40495 3860615 3454304 1466949 -258182 -296136 1217408 2654385 2424528 902653 21859
$$ packed form
40558C834640m7605k197379j624929J154511J878730r13156l370827k238586M57882
40549c066719J251682M63421M35847J196672J225189N66130Q1807o97082k101175
40540f44228k401373k91303K208700K236725K10243j227250j085795k56277P22855
40531e27703J435784O16308j725018k729845m23930K455474K001921o67444r40391
40522e04844J991166L787247J592171j991175l119989j776388o11943q14110j152748
40513b600613k50588J527725K340444R26497j379222j618637Q64107K870315J520648
40504D200676j420478k025873k3277J154746m0427j159372p4223J692548J556295
40495C860615m06311j987355j725131l7954J513544J436977k29857j521875q80794
$$ plain form
40486 21859 420223 447706 -785232 -1070042 1919525 6337641 7695223 4705246 956374
40477 956374 31751 1292436 1855844 921720 191623 848824 2046112 2469110 2043685
40468 2043685 1564768 1354770 939010 -59698 -1141587 -1345632 -491739 236385 -671817
40459 -671817 -3290966 -5766275 -5929368 -3533251 -675860 279021 -876931 -2227521 -2112508
40450 -2112508 -735901 870801 2430235 3926406 4321141 2426475 -946851 -3274953
40442 -3274953 -3187001 -1774952 -594578 267871 1348372 2259219 2150474 1108872 251472
40433 251472 730553 2782616 4990368 4680347 695507 -4037725 -4935091 -1610462 1174902
40424 1174902 -30548 -2678539 -2588356 -468226 -183791 -2025080 -2367435 24332 2026181
$$ packed form
40486B1859L98364K7483j232938k84810K989567M418116J357582k989977l748872
40477I56374r24623J260685N63408r34124p30097O57201J197288M22998m25425
40468B043685m78917k09998m15760r98708j081889k04045Q53893P28124r08202
40459f71817k619149k475309j63093K396117K857391R54881j155952j350590J15013
40450b112508J376607J606702J559434J496171L94735j894666l373326k328102
40442c274953Q7952J412049J180374Q62449J080501R10847j08745j041602q57400
40433B51472M79081K052063K207752l10021l984840m733232q97366L324629K785364
40424A174902j205450k647991R0183K120130K84435j841289l42355K391767K001849
$$ plain form
40415 2026181 1636404 1148795 2720292 4432151 3670059 1588752 882264 1173867 247380
40406 247380 -1375681 -873696 2098931 4516688 4346178 2882722 1893491 1045112 -493254
40397 -493254 -1959486 -2165637 -1445299 -974571 -1036502 -1150414 -1177586 -1236271 -1189224 -1208835
40387 -1208835 -2154434 -4222062 -5740252 -4691257 -1415202 1421374 1933345 1211631 1772146
40378 1772146 4232112 6306632 5400299 1811958 -1348464 -1662217 -49182 875569 384638
40369 384638 21630 512969 395779 -1260182 -2613635 -1455188 1247221 2528105 1858228
40360 1858228 1972657 4679121 7953477 8556853 6196482 3552458 2850945 3816015 4775262
40351 4775262 4551918 3087735 1063460 -704590 -1849039 -2632960 -3414674 -4006019 -3789980
$$ packed form
40415B026181l89777m87609J571497J711859p62092k081307p06488K91603r26487
40406B47380j623061N01985K972627K417757j70510j463456r89231q48379j538366
40397d93254j466232k06151P20338M70728o1931j13912k7172n8685M7047j9611
40387a208835r45599k067628j518190J048995L276055K836576N11971p21714N60515
40378A772146K459966K074520r06333l588341l160422l13753J613035R24751m90931
40369C84638l63008M91339j17190j655961j353453J158447K702409J280884o69877
40360A858228J14429K706464L274356O03376k360371k644024p01513R65070R59247
40351D775262k23344j464183k024275j768050j144449p83921p81714n91345K16039
$$ plain form
40342 -3789980 -2425117 -268472 1832006 3090215 3286714 2806814 2070391 1057113 -288070
40333 -288070 -1402865 -1520152 -723538 167255 893524 2056180 3770949 4979233 4798955
40324 4798955 3831787 3308068 3444538 3445640 2748528 1527178 260242 -585479 -775060
40315 -775060 -727624 -1256581 -2402430 -3186546 -3083455 -2809381 -2818222 -2155419 -158631 1735110
40305 1735110 1713303 454111 197440 1268056 1810866 1132036 893383 2185643 3525296
40296 3525296 2988539 765567 -1575945 -3035621 -3337985 -2475919 -1208180 -794242 -1197335
40287 -1197335 -857225 692092 1553946 291862 -1481726 -1219237 1014959 3091625 3953133
40278 3953133 4097432 3695469 2515038 1312709 1058190 995967 -296746 -2090887 -2193117
$$ packed form
40342c789980J364863K156645K100478J258209J96499m79900p36423j013278j345183
40333b88070j114795j17287P96614Q90793P26269J162656J714769J208284j80278
40324D798955r67168n23719J36470J102o97112j221350j266936q45721j89581
40315g75060M7436n28957j145849p84116J03091K74074q841O62803J996788J893741
40305A735110k1807j259192k56671J070616N42810o78830k38653J292260J339653
40296C525296n36757k222972k341512j459676l02364Q62066J267739M13938m03093
40287a197335L40110J549317Q61854j262084j773588K62489K234196K076666Q61508
40278C953133J44299m01963j180431j202329k54519o2223j292713j794141j02230
$$ plain form
40269 -2193117 -583530 220246 -988206 -2419677 -2437482 -2020870 -2689610 -3971651 -4531776
40260 -4531776 -4218903 -3471311 -2174817 -670929 -457944 -2119360 -3739388 -3181942 -953971
40251 -953971 936507 1925657 2730090 3166386 2420003 1029964 378434 401074 -52361
40242 -52361 -713703 -122537 1392832 1419921 -980325 -3526331 -3748076 -2105569 -749533
40233 -749533 -503755 -553787 -279190 33990 23762 -114070 295716 1937401 4541234 6320596
40223 6320596 5480476 2686726 786346 1390902 3003710 3462702 2947346 3195799 4673794
40214 4673794 6069432 6172228 4971516 3156083 1541616 697597 337933 -419075 -1482294
40205 -1482294 -1404624 388498 2086238 1754168 169220 -503557 -108624 -240161 -939109
$$ packed form
40269b193117J609587Q03776j208452j431471j7805M16612o68740j282041n60125
40260d531776L12873P47592J296494J503888K12985j661416j620028N57446K227971
40251i53971J890478R89150Q04433M36296p46383j390039o51530K2640m53435
40242e2361o61342N91166J515369K7089k400246k546006k21745J642507J356036
40233g49533K45778n0032K74597L13180j0228j37832M09786J641685K603833J779362
40223F320596q40120k793750j900380O04556J612808M58992n15356K48453J477995
40214D673794J395638J02796j200712j815433j614467q44019l59664p57008j063219
40205a482294P7670J793122J697740l32070j584948o72777L94933j31537o98948
$$ plain form
40196 -939109 -409738 1495218 2209584 155149 -2647105 -3314284 -1842297 -387539 -81075
40187 -81075 -408317 -868935 -1320280 -1124621 183983 1493832 1143873 -434214 -791788
40178 -791788 1176166 3395086 3235556 1022920 -452749 381260 2104848 2559541 1635760
40169 1635760 788556 569475 251367 -111098 853010 3332277 4939862 3583565 675129
40160 675129 -675104 -69004 116209 -984483 -1368496 -20372 829699 -782713 -3180440
40151 -3180440 -3661820 -2685676 -2609522 -3514403 -3432572 -2139118 -1466449 -1798657 -1466815 -243485
40141 -243485 -262995 -2177400 -3360470 -1957462 -259098 -1388152 -4288230 -5019818 -2389478
40132 -2389478 598106 1109685 -145835 -738909 151282 1475093 2261374 2473205 2269123
$$ packed form
40196i39109N29371J904956P14366k054435k802254o67179J471987J454758L06464
40187h1075l27242m60618m51345J95659J308604J309849l49959j578087l57574
40178g91788J967954K218920j59530k212636j475669Q34009J723588M54693r23781
40169A635760q47204k19081l18108l62465R64108K479267J607585j356297k908436
40160F75129j350233O06100J85213j100692l84013J348124Q50071j612412k397727
40151c180440m81380R76144P6154r04881Q1831J293454O72669l32208L31842J223330
40141b43485j9510j914405j183070J403008J698364j129054k900078p31588K630340
40132b389478K987584N11579j255520n93074Q90191J323811P86281K11831k04082
$$ plain form
40123 2269123 1538864 470550 3662 1102740 3443707 5246364 4944149 2889138 763911
40114 763911 -593903 -1752583 -2864305 -2709562 -623136 1726663 2088492 675336 -219094
40105 -219094 419377 1137836 679480 118222 1106853 3080196 3758446 2168463 -164950
40096 -164950 -1258964 -886663 -208562 123622 599616 1623699 2509005 2313146 1315255
40087 1315255 812452 1319228 1790373 1129287 -213952 -903250 -481698 429842 1360598
40078 1360598 2318956 2949273 2516248 1011368 -663678 -1884017 -2736321 -3061030 -2283559
40069 -2283559 -720592 241253 123683 242653 1445335 2235159 896516 -1408072 -1829226
40060 -1829226 164969 2225541 2773713 2876424 3641103 4037681 2989588 1857118 2532919
$$ packed form
40123B269123p30259j068314m66888J099078K340967J802657l02215k055011k125227
40114G63911j357814j158680j111722J54743K086426K349799L61829j413156q94430
40105b19094O38471P18459m58356n61258R88631J973343O78250j589983k333413
40096a64950j094014L72301O78101L32184M75994J024083Q85306j95859r97891
40087A315255n02803N06776M71145o61086j343239o89298M21552R11540R30756
40078A360598R58358O30317m33025j504880j675046j220339q52304l24709P77471
40069b283559J562967R61845j17570J18970J202682P89824j338643k304588m21154
40060a829226J994195K060572N48172J02711P64679L96578j048093j132470O75801
$$ plain form
40051 2532919 3981864 3198358 -367020 -3622315 -3821859 -1916893 -669988 -729498 -327540
40042 -327540 1530046 3371040 3307725 1559392 -101962 -799560 -1168672 -1564494 -1120062
40033 -1120062 560116 1888485 1036499 -1153318 -1746224 381750 2796782 2645539 325963
40024 325963 -1335355 -824210 683976 1476223 1371551 1352606 2166134 3687797 5038601
40015 5038601 5147722 3761131 1905750 753997 196495 -605159 -1438149 -1111858 404617
40006 404617 1299472 264994 -1463214 -1619623 2745 1245101 487365 -1176122 -1334122
39997 -1334122 585489 2399312 1741338 -965169 -2906074 -2219529 53130 1803468
39989 1803468 2513367 2950189 3097536 2180367 624584 122183 1181873 2137488 1451677
$$ packed form
40051B532919J448945p83506l565378l255295j99544J904966J246905n9510M01958
40042c27540J857586J840994o3315j748333j661354o97598l69112l95822M44432
40033a120062J680178J328369q51986k189817n92906K127974K415032j51243k319576
40024C25963j661318N11145J508186P92247j04672j8945Q13528J521663J350804
40015E038601J09121j386591j855381j151753n57502q01654q32990L26291J516475
40006D04617Q94855j034478j728208j56409J622368J242356p57736j663487j58000
39997a334122J919611J813823o57974k706507j940905O86545K272659J750338
39989A803468P09899M36822J47347r17169j555783n02401J059690R55615o85811
$$ plain form
39980 1451677 -191886 -1040583 -513328 731591 2120009 3391802 4074539 3919467 3654976
39971 3654976 4331831 5949957 7427870 7865958 7290474 6279743 5398403 4996083 5210393
39962 5210393 6045655 7274646 8011686 6900959 3758166 835571 979643 4164489 7320691
39953 7320691 8213266 7851370 8011221 8120315 6441549 3224213 620949 -45136 811457
39944 811457 2423392 4195053 5126286 4553806 3511534 3694474 4931517 5287867 3933538
39935 3933538 2309052 1896914 2207624 1734693 -27958 -2169637 -3356651 -2896927 -1297614
39926 -1297614 177100 922509 1620076 2842336 3734535 3174886 1586323 227363 -680401
39917 -680401 -1481675 -1432518 295818 2264001 1971859 -248713 -1068070 1230692 4178987
$$ packed form
39980A451677j643563q48697N27255J244919J388418J271793O82737j55072k64491
39971C654976O76855J618126J477913M38088n75484j010731q81340m02320K14310
39962E210393Q35262J228991P37040j110727l142793k922595J44072L184846L156202
39953G320691Q92575l61896J59851J09094j678766l217336k603264o66085Q56593
39944H11457J611935J771661R31233n72480j042272J82940J237043L56350j354329
39935C933538j624486m12138L10710m72931j762651k141679j187014M59724J599313
39926a297614J474714P45409O97567J222260Q92199n59649j588563j358960r07764
39917f80401q01274M9157J728336J968183k92142k220572q19357K298762K948295
$$ plain form
39908 4178987 4360259 1493684 -1818593 -2935788 -926403 2905184 5399856 4172623
39900 4172623 745336 -748529 1169906 3519828 3452058 2132355 2164504 3430841 3972317
39891 3972317 3325256 2425323 1453928 252874 -161356 1094133 2836204 3458645 3529461
39882 3529461 4385884 5214929 4290499 2312858 1542083 2051018 1823805 356184 -865516
39873 -865516 -1411900 -2285762 -3086165 -2127604 36876 604529 -920524 -1457733 867371
39864 867371 3754841 4424121 3488159 2959727 2861976 2302823 1927236 2707982 3755289
39855 3755289 3693970 2998331 2844111 2889551 2271683 1539820 1519372 1594771 1255185 1747051
39845 1747051 3638688 4478417 2220759 -384402 1048156 5463597 6988465 3351690
$$ packed form
39908D178987J81272k866575l312277j117195K009385L831587K494672j227233
39900D172623l427287j493865J918435K349922o7770j319703L2149J266337N41476
39891C972317o47061q99933r71395j201054m14230J255489J742071O22441P0816
39882C529461Q56423Q29045r24430j977641p70775N08935k27213j467621j221700
39873h65516n46384q73862q00403R58561K164480N67653j525053n37209K325104
39864H67371K887470O69280r35962n28432r7751n59153l75587P80746J047307
39855C755289o1319o95639j54220M5440o17868p31863k0448P5399l39586M91866
39845A747051J891637Q39729k257658k605161J432558M415441J524868l636775
$$ plain form
39837 3351690 -724558 -445907 2558826 3525168 1521982 -316824 -20416 1140855 1455442
39828 1455442 860587 -98600 -1304850 -2401696 -2526390 -1444085 -80177 653582 980480
39819 980480 1702303 2867876 3543307 3019449 1915431 1566856 2213267 2522699 1578616
39810 1578616 618135 1461068 3472979 3841286 1375811 -1568770 -1986759 193868 2641949
39801 2641949 3745522 3720891 3216479 2505451 2129295 2924388 4869885 6717531 7237476
39792 7237476 6389204 5052438 4062914 3728648 3871578 4003072 3630648 2675330 1636967
39783 1636967 1249038 1833339 2926745 3680542 3763392 3678708 3990703 4560391 4946343 5222262
39773 5222262 5816537 6805477 7970984 9204277 10140292 9932419 8438503 7068976 7056727
$$ packed form
39837C351690m076248K78651L004733R66342k003186j838806K96408J161271L14587
39828A455442n94855r59187j206250j096846j24694J082305J363908P33759L26898
39819I80480P21823J165573O75431n23858j104018l48575O46411L09432r44083
39810A578616r60481Q42933K011911L68307k465475k944581m17989K180627K448081
39801B641949J103573k4631n04412p11028l76156P95093J945497J847646N19945
39792G237476q48272j336766r89524l34266J42930J31494l72424r55318j038363
39783A636967l87929N84301J093406P53797Q2850q4684L11995N69688L85952K75919
39773E222262N94275R88940J165507J233293R36015k07873j493916j369527j2249
$$ plain form
39764 7056727 7405765 6374236 4588901 4295895 5488240 5651314 4099311 3479735 5396554
39755 5396554 7513127 7338505 6266778 6915035 8609058 8940450 8226743 8672348 10047851
39746 10047851 10124768 9105375 9677200 12294423 14147179 13724742 12967605 13583097 14324331
39737 14324331 13591992 12156584 11562310 11917635 12731208 13935038 14770536 13765462 11224139
39728 11224139 9696337 10557814 12155118 12692291 12683905 12969803 12761583 11737634 11795169
39719 11795169 14269525 17300118 18447068 18236619 18619690 19603927 20164849 20978091 23204512
39710 23204512 25665123 26276645 25512975 25502192 26349838 26332873 25280125 24819515 25584199
39701 25584199 27032215 29648836 34182873 38834413 40560701 39534216 39136538 41038330
$$ packed form
39764G056727L49038j031529j785335k93006J192345J63074j552003o19576J916819
39755E396554K116573j74622j071727O48257J694023L31392p13707M45605J375503
39746A0047851P6917j019393N71825K617223J852756m22437p57137O15492P41234
39737A4324331p32339j435408n94274L55325Q13573J203830Q35498j005074k541323
39728A1224139j527802Q61477J597304N37173q386K85898k08220j023949N7535
39719A1795169K474356L030593J146950k10449L83071R84237N60922Q13242K226421
39710B3204512K460611O11522p63670j0783Q47646j6965j052748m60610P64684
39701B5584199J448016K616621M534037M651540J726288j026485l97678J901792
$$ plain form
39693 41038330 43511875 45336844 47934164 52255565 56762441 60388681 64777292 71400976
39685 71400976 78719045 84550129 89588294 96288058 105493530 116274517 128193265 141754305
39677 141754305 157046983 173470993 190638376 208721000 228310112 250242549 274574530
39670 274574530 299500907 322850141 345009263 368079346 390977334 407909339 414021711
39663 414021711 410797164 403195741 392767506 376842809 354247763 328389200 303450695
39656 303450695 279925746 255803503 230948404 208240419 190266953 176269963 163179466
39649 163179466 149107873 134846195 121986720 110895988 101308026 93666299 88286444
39642 88286444 83899817 78940342 73925887 70350794 67282254 61856055 53948584 47438762
$$ packed form
39693D1038330K473545J824969K597320M321401M506876L626240M388611O623684
39685G1400976P318069N831084N038165O699764R205472J0780987J1918748J3561040
39677A41754305J5292678J6424010J7167383J8082624J9589112K1932437K4331981
39670B74574530K4926377K3349234K2159122K3070083K2897988J6932005O112372
39663D14021711l224547p601423j0428235j5924697k2595046k5858563k4938505
39656C03450695k3524949k4122243k4855099k2707985j7973466j3996990j3090497
39649A63179466j4071593j4261678j2859475j1090732r587962p641727n379855
39642H8286444m386627m959475n014455l575093l068540n426199p907471o509822
$$ plain form
39634 47438762 45054042 44455028 41836231 37388085 34184727 32944574 31339431 28335174
39626 28335174 25950722 25846408 26698065 26347865 24882186 24069119 24607248 25172575 23945261
39617 23945261 20476108 16271740 13741429 14085912 15999652 16978551 16142499 15144168 15845163
39608 15845163 17695287 18320452 16695718 14761635 15132390 17667084 19494279 18639875
39600 18639875 16359075 15030899 14913568 14492829 13313945 12515565 12589698 12525002 11664196
39591 11664196 10826603 10913088 11635145 12168668 11991755 10866909 9262115 8736608 10147423
39582 10147423 11508789 9998906 6408670 4686694 6100416 7150003 5229515 3060820
39574 3060820 4351107 7599542 8167319 5128004 2085204 1662287 2889380 4161684
$$ packed form
39634D7438762k384720n99014k618797m448146l203358j240153j605143l004257
39626B8335174k384452j04314Q51657l50200j465679q13067N38129N65327j227314
39617B3945261l469153m204368k530311L44483J913740R78899q36052r98331P00995
39608A5845163J850124O25165j624734j934083L70755K534694J827195q54404
39600A8639875k280800j328176j17331m20739j178884p98380P4133o4696q60806
39591A1664196q37593Q6485P22057N33523j76913j124846j604794n25507J410815
39582A0147423J361366j509883l590236j721976J413722J049587j920488k168695
39574C060820J290287L248435N67777l039315l042800m22917J227093J272304
$$ plain form
39566 4161684 5311484 6053859 5406720 3749022 3069674 4145938 5517438 6089666 6620332
39557 6620332 7562132 7495723 5220687 1927065 -199442 -528907 30728 647589 978450
39548 978450 716915 -62639 -469445 316533 1818496 2604523 1933105 721175 686763
39539 686763 2418582 4389272 4413969 2291855 215714 -3814 802927 668196 -647915
39530 -647915 -1793367 -2298959 -3099148 -4443394 -4929408 -3328279 -411667 1710284 1672976
39521 1672976 47823 -1273394 -942690 430509 1125672 640445 205804 611421 900557
39512 900557 135166 -957904 -1359992 -1366671 -1327344 -333281 1872607 3171296 1706814
39503 1706814 -948043 -1956287 -1487969 -1769790 -2709738 -2065992 192470 1411367 579638
$$ packed form
39566D161684J149800P42375o47139j657698o79348J076264J371500N72228N30666
39557F620332R41800o6409k275036l293622k126507l29465N59635O16861L30861
39548I78450k61535p79554m06806P85978J501963P86027o71418j211930l4412
39539F86763J731819J970690K4697k122114k076141k19528Q06741j34731j316111
39530f47915j145452n05592q00189j344246m86014J601129K916612K121951l7308
39521A672976j625153j321217L30704J373199O95163m85227m34641M05617K89136
39512I00557p65391j093070m02088o679L9327R94063K205888J298689j464482
39503A706814k654857j008244M68318k81821r39948O43746K258462J218897q31729
$$ plain form
39494 579638 -401713 -494486 -982719 -2043615 -1523589 1064126 2677479 1216470 -969291
39485 -969291 -644532 1532588 2490194 1232234 -731414 -2032585 -2107161 -414814 2632454
39476 2632454 4816622 4307710 2119598 750718 1161173 2516533 3824179 4235975 2884284
39467 2884284 177931 -1721976 -1353742 131263 966433 1288943 1936537 2348514 1927887
39458 1927887 2019109 3806038 5371643 3937683 445911 -1306835 -91678 1335477
39450 1335477 754851 -537985 -370832 1152179 2562345 3225810 3198119 2331138 942938
39441 942938 313932 1164127 2319604 2078184 530635 -457868 476503 2559330 3620762
39432 3620762 2274888 -681092 -3074117 -3507157 -2387898 -865248 455083 1387994
$$ packed form
39494E79638r81351r2773m88233j060896N20026K587715J613353j461009k185761
39485i69291L24759K177120R57606j257960j963648j301171p4576J692347L047268
39476B632454K184168n08912k188112j368880M10455J355360J307646M11796j351691
39467B884284k706353j899907L68234J485005Q35170L22510O47594M11977m20627
39458A927887R1222J786929J565605j433960l491772j752746J215157J427155
39450A335477n80626j292836J67153J523011J410166O63465k7691q66981j388200
39441I42938o29006Q50195J155477k41420j547549r88503R34371K082827J061432
39432C620762j345874k955980k393025m33040J119259J522650J320331R32911
$$ plain form
39424 1387994 1755527 1903448 2765381 4373070 5061205 3390926 283975 -2039473 -2733930
39415 -2733930 -2610094 -2318364 -1880027 -1684751 -2146518 -2358323 -864510 1928619 3721243
39406 3721243 3145239 1214802 -446286 -1363391 -1635323 -1071006 157201 1037500 844522
39397 844522 128077 -38836 705443 1809866 2235182 1077330 -1279567 -2628791 -880213
39388 -880213 3115133 5972445 5483067 2632236 -523043 -3275048 -5537154 -6380260 -5059489
39379 -5059489 -2585128 -600697 733845 2247270 3739063 4184881 3690897 3442496 3606429
39370 3606429 3041057 1517494 522208 1019525 1920356 1968702 1915478 3201815 5169012
39361 5169012 5441478 3236248 774813 717479 3061901 5245669 4850822 1784330 -1790619
$$ packed form
39424A387994L67533J47921Q61933J607689O88135j670279l106951k323448o94457
39415b733930J23836K91730M38337J95276m61767k11805J493813K793129J792624
39406C721243n76004j930437j661088r17105k71932N64317J228207Q80299j92978
39397H44522p16445j66913P44279J104423M25316j157852k356897j349224J748578
39388h80213L995346K857312m89378k850831l155279k752005k262106q43106J320771
39379e059489K474361J984431J334542J513425J491793M45818m93984k48401J63933
39370C606429n65372j523563r95286M97317R00831M8346n3224J286337J967197
39361E169012K72466k205230k461435n7334K344422K183768l94847l066492l574949
$$ plain form
39352 -1790619 -3305418 -1903582 969711 3221704 4184689 4520067 4449483 3401351 1603556
39343 1603556 416135 206732 -579621 -2823525 -4551020 -3324322 71546 2637395
39335 2637395 3439060 4290978 5983764 6623494 4857922 2400528 1626422 2315307 2560140
39326 2560140 1684695 509681 -340839 -665733 93874 2162427 4325104 4972988 3992523
39317 3992523 2439850 856897 -701013 -1448902 -387572 1956730 3776697 4143421
39309 4143421 3673050 2902391 1384740 -1006270 -2922873 -2677319 -399321 1486242 400760
39300 400760 -3416286 -6431692 -5350109 -1184403 1630773 691170 -1608184 -1930209 -633724
39291 -633724 -336455 -1314713 -1355646 170925 1115192 -233 -1770564 -2107271 -787050
$$ packed form
39352a790619j514799J401836K873293K251993R62985L35378p0584j048132j797795
39343A603556j187421k09403p86353k243904j727495J226698L395868K565849
39335B637395Q01665Q51918J692786O39730j765572k457394p74106O88885K44833
39326B560140q75445j175014q50520l24894P59607K068553K162677O47884r80465
39317C992523j552673j582953j557910p47889J061330K344302J819967L66724
39309D143421m70371p70659j517651k391010j916603K45554K277998J885563j085482
39300D00760l817046l015406J081583M165706K815176r39603k299354l22025J296485
39291f33724K97269r78258m0933J526571R44267j115425j770331l36707J320221
$$ plain form
39282 -787050 1146905 3008822 4570492 5692565 6499562 6947764 6115764 3364611 271036
39273 271036 -533973 1084882 2441206 1984172 1315151 2012718 2764917 1674771 -386005
39264 -386005 -1156665 -585341 -566841 -1639041 -2309665 -1664486 -630702 -340898 -794949
39255 -794949 -1453042 -1930773 -1974850 -1851653 -2619872 -4676956 -6188449 -4697521 -610669
39246 -610669 2659915 2814814 1452080 1644741 3884597 5825598 5497460 3419829 1532932
39237 1532932 1063463 1813841 3006705 4263678 5557654 6374893 5597974 2882842 -220425
39228 -220425 -1597012 -1075594 -425729 -544281 -164261 1610615 2948240 1393991 -2308675
39219 -2308675 -4704070 -4141003 -2779697 -3241550 -4937189 -5126401 -2635005 934176 3251601
$$ packed form
39282g87050J933955J861917J561670J122073Q06997M48202q32000k751153l093575
39273B71036q05009J618855J356324m57034o69021O97567P52199j090146k060776
39264c86005p70660N71324J8500j072200o70624O45179J033784K89804m54051
39255g94949o58093m77731m4077J23197p68219k057084j511493J490928M086852
39246f10669L270584J54899j362734J92661K239856J941001l28138k077631j886897
39237A532932m69469P50378J192864J256973J293976Q17239p76919k715132l103267
39228b20425j376587N21418O49865j18552L80020J774876J337625j554249l702666
39219b308675k395395N63067J361306m61853j695639j89212K491396L569181K317425
$$ plain form
39210 3251601 3339432 1860839 344253 3906 591711 644721 -545956 -1784038 -1610627
39201 -1610627 -390535 448856 651872 1042821 1536032 1071819 -330496 -1254748 -1067256
39192 -1067256 -733366 -878659 -781181 -172402 -295162 -1849582 -3331786 -2970360 -1237664
39183 -1237664 115783 631218 1139864 1874620 2206682 1867318 1029597 -390952 -2136905
39174 -2136905 -2843299 -1511668 518236 732715 -1414030 -3969526 -5050609 -4468492 -2849726
39165 -2849726 -854637 425230 -42705 -1676686 -2517852 -1677516 -417335 -203087 -866568
39156 -866568 -1487972 -2034006 -3062108 -4443958 -5396619 -5505905 -4954460 -3872958 -2116164
39147 -2116164 173688 2089873 2349538 435619 -2552304 -4523306 -4187700 -2051476
$$ packed form
39210C251601Q7831j478593j516586l40347N87805N3010j190677j238082J73411
39201a610627J220092Q39391K03016L90949M93211m64213j402315r24252J87492
39192a067256L33890j45293R7478O08779j22760j554420j482204L61426J732696
39183a237664J353447N15435N08646P34756L32062l39364q37721j420549j745953
39174b136905p06394J331631K029904K14479k146745k555496j081083N82117J618766
39165b849726J995089J279867m67935j633981q41166Q40336J260181K14248o63481
39156h66568o21404n46034j028102j381850r52661j09286N51445J081502J756794
39147b116164K289852J916185K59665j913919k987923j971002L35606K136224
$$ plain form
39139 -2051476 438415 2194558 2774017 2276515 1544333 1616000 2287585 2125412 625865
39130 625865 -861931 -1326239 -1587338 -2085479 -1107347 2210252 4708249 2603907 -2530942
39121 -2530942 -5042403 -2764982 439329 633324 -1446387 -3179536 -3972887 -4029910 -2421901
39112 -2421901 652645 2268503 657033 -1413371 -507017 2102166 2730966 1491454
39104 1491454 1735933 3828523 4255381 1679152 -639381 -275905 446770 -1278955 -3634790
39095 -3634790 -2812428 953127 3509041 2484912 -95987 -1198896 -479076 120802 -1042753
39086 -1042753 -3811152 -6335646 -6362196 -3344158 480116 2036019 637382 -1656330
39078 -1656330 -2934827 -3338964 -3705278 -3943301 -3822612 -3964093 -4510838 -3943719 -1231315
$$ packed form
39139b051476K489891J756143N79459m97502p32182P1667O71585j62173j499547
39130F25865j487796m64308k61099m98141R78132L317599K497997k104342n134849
39121b530942k511461K277421L204311J93995k079711j733149p93351n7023J608009
39112b421901L074546J615858j611470k070404R06354K609183O28800j239512
39104A491454K44479K092590M26858k576229k318533L63476P22675j725725k355835
39095c634790Q22362L765555K555914j024129k580899j102909P19820N99878j163555
39086a042753k768399k524494k6550L018038L824274J555903j398637k293712
39078a656330j278497m04137l66314k38023J20689j41481n46745N67119K712404
$$ plain form
39069 -1231315 1551133 1260318 -1583870 -2755065 67176 4076929 5325518 3789962
39061 3789962 2205041 1472448 168039 -2015343 -3380241 -3150380 -2741455 -3248629 -3697470
39052 -3697470 -2860781 -1201552 92803 697347 749645 95811 -953106 -1173290 79425
39043 79425 1750501 2564315 2857482 3734211 4969746 5092196 3438144 1033413 -727081
39034 -727081 -1505147 -1846154 -2070684 -1835486 -899091 83781 294081 341361 1866174 4684935
39024 4684935 5737726 2747637 -2009090 -4067792 -2566357 -824589 -917012 -978293 812807
39015 812807 2785933 2628373 1184424 653658 834041 104774 -1141370 -1102973 130595
39006 130595 832604 817562 1475571 2680808 2593863 1023628 249711 1535087 3181703
$$ packed form
39069a231315K782448k90815k844188j171195K822241M009753J248589j535556
39061C789962j584921p32593j304409k183382j364898K29861M08925n07174m48841
39052c697470Q36689J659229J294355O04544N2298o53834j048917k20184J252715
39043G9425J671076Q13814K93167Q76729J235535J22450j654052k404731j760494
39034g27081p78066l41007k24530K35198R36395R82872K10300M7280J524813K818761
39024D684935J052791k990089m756727k058702J501435J741768r2423o1281J791100
39015H12807J973126j57560j443949n30766J80383p29267j246144L8397J233568
39006A30595P02009j5042O58009J205237q6945j570235p73917J285376J646616
$$ plain form
38997 3181703 3341036 2778293 3215342 4325479 4220500 2387786 554617 396638 1319518
38988 1319518 1238448 -455974 -1532791 392136 4049011 5276911 2396404 -1174866
38980 -1174866 -1367809 1293959 3306111 3462534 3248600 2864768 847348 -2063900 -2698187
38971 -2698187 -421610 1250387 -55844 -1927557 -1358727 300374 -103863 -2105254
38963 -2105254 -2539681 -891035 56763 -1096779 -2415511 -2076415 -955784 -582805 -719751
38954 -719751 -426922 87477 245632 661547 2333323 4680467 5691971 4136140 893304
38945 893304 -2016244 -3263411 -2979140 -2085662 -1211119 -347824 605702 1332678 1299496
38936 1299496 269711 -1501082 -3344155 -4391270 -4142063 -3045988 -2119619 -1766963 -1453528
$$ packed form
38997C181703J59333n62743M37049J110137j04979j832714j833169j57979R22880
38988A319518q1070j694422j076817J924927L656875J227900k880507l571270
38980a174866j92943K661768K012152J56423k13934l83832k017420k911248o34287
38971b698187K276577J671997j306231j871713N68830J659101m04237k001391
38963b105254m34427J648646R47798j153542j318732L39096J120631L72979j36946
38954g19751K92829N14399J58155M15915J671776K347144J011504j555831l242836
38945H93304k909548j247167K84271Q93478Q74543Q63295R53526P26976l3182
38936A299496j029785j770793j843073j047115K49207J096075R26369L52656L13435
$$ plain form
38927 -1453528 -758734 -50159 343883 897931 2091069 3369293 3665677 2580039 435308
38918 435308 -2285199 -4811980 -6029888 -5551356 -4441172 -3942844 -3952046 -3717419 -3374207
38909 -3374207 -3422709 -3251323 -1882085 51154 867527 375725 -5584 213232 7213
38900 7213 -768841 -638321 921194 2289773 2302675 1935145 1919296 969162 -1433997 -2599583
38890 -2599583 12049 4326997 5885413 3934199 1925645 1978868 2361587 1263766 -250523
38881 -250523 -632223 -466113 -759133 -759511 406910 1582183 1237277 90543 -64565 656296
38871 656296 445738 -1386107 -3520868 -4367979 -3449658 -1436665 107114 -351285 -2447985
38862 -2447985 -3682919 -2317123 269919 1490966 893623 -83717 -779019 -1631031 -2418554
$$ packed form
38927a453528O94794P08575L94042N54048J193138J278224K96384j085638k144731
38918D35308k720507k526781j217908M78532J110184M98328r202K34627L43212
38909c374207m8502J71386J369238J933239Q16373m91802l81309K18816k06019
38900G213p76054J30520J559515J368579J2902l67530j5849r50134k403159j165586
38890b599583K611632M314948J558416j951214k008554N3223L82719j097821j514289
38881b50523l81700J66110k93020l78J166421J175273l44906j146734j55108P20861
38871F56296k10558j831845k134761q47111R18321K012993J543779m58399k096700
38862b447985j234934J365796K587042J221047n97343r77340o95302q52012p87523
$$ plain form
38853 -2418554 -2442912 -2252914 -2983107 -4062270 -3855563 -2619176 -2330780 -3234147 -3175559
38844 -3175559 -1177203 889055 1388956 1284276 1869975 2361465 1663248 735741 1084264
38835 1084264 2280981 3077310 3746317 5042188 5782307 4029174 425788 -1983866 -1507419
38826 -1507419 458381 1717647 1645203 834691 -159321 -1008203 -1447745 -1534924 -1652705
38817 -1652705 -2139829 -3227422 -4947308 -6513641 -6468824 -4484485 -2402465 -2116937 -2886706
38808 -2886706 -2414925 -363167 1225014 1279962 1310136 2637969 3939563 3222329 1022521
38799 1022521 -281777 241982 1357661 2067153 2769809 3501147 2863347 103647 -2847125
38790 -2847125 -3204523 -981071 863066 267348 -1474737 -1990759 -1197969 -852082 -1502233
$$ packed form
38853b418554k4358J89998p30193j079163K06707J236387K88396r03367N8588
38844c175559J998356K066258M99901j04680N85699M91490o98217r27507L48523
38835A084264J196717P96329O69007J295871P40119j753133l603386k409654M76447
38826a507419J965800J259266p2444q10512r94012q48882m39542q7179j17781
38817a652705m87124j087593j719886j566333M4817J984339K082020K85528p69769
38808b886706M71781K051758J588181N4948L0174J327833J301594p17234k199808
38799A022521j304298N23759J115679P09492P02656P31338o37800k759700k950772
38790b847125l57398K223452J844137n95718j742085n16022P92790L45887o50151
$$ plain form
38781 -1502233 -1829892 -1072406 -265360 -354009 -515077 507138 2261663 2961572 1671830
38772 1671830 -689712 -2374742 -2356906 -1112773 -111238 -125391 -26904 1883905 5162292
38763 5162292 7056560 5726923 2477841 -113271 -1134283 -1233852 -757923 295006 1147145
38754 1147145 911187 152923 130251 630025 289030 -924891 -1426473 -551135 494579
38745 494579 889761 1524950 2926030 3558741 1912961 -860104 -2298261 -1991578 -1649542
38736 -1649542 -2030236 -1899519 -482339 1031933 1526041 1903367 3406937 5074322 4883318
38727 4883318 3090951 2294509 3718413 5351813 4856607 2834460 1681250 2108414 2484087
38718 2484087 1332836 -968178 -2993955 -3613120 -2513531 -450629 974972 742712
$$ packed form
38781a502233l27659P57486Q07046q8649j61068J022215J754525O99909j289742
38772A671830k361542j685030J7836J244133J001535j4153R8487J910809L278387
38763E162292J894268j329637l249082k591112j021012r9569M75929J052929Q52139
38754A147145k35958p58264k2672M99774l40995j213921n01582Q75338J045714
38745D94579L95182O35189J401080O32711j645780k773065j438157L06683L42036
38736a649542l80694J30717J417180J514272M94108L77326J503570J667385j91004
38727D883318j792367p96442J423904J633400m95206k022147j153210M27164L75673
38718B484087j151251k301014k025777o19165J099589K062902J425601k32260
$$ plain form
38710 742712 -345018 -660956 190069 1240563 1732467 1589180 623845 -1193080 -2715400
38701 -2715400 -2469271 -715479 782342 1139345 965238 674793 136650 103050 1667048
38692 1667048 3819087 4019932 1967802 104093 -680334 -2620908 -6390920 -8186392
38684 -8186392 -4865181 392929 1618707 -1941649 -5365340 -5201362 -3096009 -1805178
38676 -1805178 -1362077 -727868 -311446 -746361 -1019956 111480 1839985 2147053 472187
38667 472187 -1726330 -2871992 -2741215 -1989769 -973466 479348 2268232 3552667 3583975
38658 3583975 2790235 2297253 2358823 2140632 1223895 287349 -76551 -167778 -331508 -358505
38648 -358505 -194729 -155469 -88830 382342 600896 -381770 -1584990 -1011549 631945 143646
$$ packed form
38710G42712j087730l15938Q51025J050494M91904j43287r65335j816925j522320
38701b715400K46129J753792J497821L57003j74107k90445n38143l3600J563998
38692A667048K152039K00845k052130j863709p84427j940574l770012j795472
38684h186392L321211N258110J225778l560356l423691J63978K105353J290831
38676a805178M43101O34209M16422m34915k73595J131436J728505L07068j674866
38667D72187k198517j145662J30777P51446J016303J452814J788884J284435L1308
38658C583975p93740m92982O1570k18191r16737r36546l63900r1227j63730k6997
38648c58505J63776L9260O6639M71172K18554r82666j203220N73441J643494m88299
$$ plain form
38638 143646 -2862783 -4169641 -916954 3639244 4526337 1808615 -583480 -803763 -83655
38629 -83655 656432 1201744 214902 -2881059 -5023902 -2776697 1968785 3896971 1798561
38620 1798561 -258836 374356 1700321 1626690 1320773 2149184 2940650 2403931 1397694
38611 1397694 1013056 926752 1025657 2064164 3491375 3362097 1650253 872539 2168062
38602 2168062 3597644 3571760 2929296 2257425 461735 -2218003 -3087345 -1111802 868531
38593 868531 371891 -1194482 -1705212 -2015728 -3470701 -4367848 -2414335 1148401 3257359
38584 3257359 3495018 3688918 4149656 3451037 1441924 -254306 -643431 -254785 177349
38575 177349 414895 467843 722583 1635576 2590205 2290209 967106 511789 1633254
$$ packed form
38638A43646l006429j306858L252687M556198Q87093k717722k392095k20283P20108
38629h3655P40087N45312r86842l095961k142843K247205M745482J928186k098410
38620A798561k057397O33192J325965p3631l05917Q28411P91466n36719j006237
38611A397694l84638q6304R8905J038507J427211j29278j711844p77714J295523
38602B168062J429582k5884o42464o71871j795690k679738q69342J975543J980333
38593H68531m96640j566373n10730l10516j454973q97147J953513L562736K108958
38584C257359K37659J93900M60738o98619k009113j696230l89125L88646M32134
38575A77349K37546N2948K54740R12993R54629k99996j323103m55317J121465
$$ plain form
38566 1633254 2905536 3460011 4115671 4754649 3584698 663919 -1039249 -272977 118444
38557 118444 -1860433 -3471348 -1845498 684986 202661 -2329033 -3033511 -1844839 -2173572
38548 -2173572 -4625539 -6018093 -4763657 -2823268 -1781820 -901098 186664 392744
38540 392744 -271157 -112522 1257289 1921853 524379 -1990228 -4037465 -4880588 -4293911
38531 -4293911 -2679144 -1478763 -1611545 -1917616 -1125531 -402795 -1316790 -2264850 -317734
38522 -317734 3831843 6341803 5631240 3768395 2298045 526160 -1321302 -1126503 1433621
38513 1433621 3493419 2940155 995029 -526908 -1679219 -2567276 -1987626 102235 1304397
38504 1304397 227772 -922769 399838 2951616 3368609 960790 -1492910 -1371400
$$ packed form
38566A633254J272282N54475O55660O38978j169951k920779j703168P66272L91421
38557A18444j978877j610915J625850K530484m82325k531694p04478J188672l28733
38548b173572k451967j392554J254436J940389J041448Q80722J087762K06080
38540C92744o63901J58635J369811O64564j397474k514607k047237q43123N86677
38531d293911J614767J200381j32782l06071P92085P22736r13995r48060J947116
38522c17734M149577K509960p10563j862845j470350j771885j847462J94799K560124
38513A433621K059798n53264j945126j521937j152311q88057N79650K089861J202162
38504A304397j076625j150541J322607K551778M16993k407819k453700J21510
$$ plain form
38496 -1371400 1109126 3727388 4585528 3636385 2487808 2528449 3240381 3089611 1991713
38487 1991713 1642938 3117703 5342208 6413958 5509178 3235202 965101 -151986
38479 -151986 -368823 -1202010 -3123643 -4174300 -2440231 923172 3211173 3977805 4762848
38470 4762848 5480068 4198876 867541 -1763843 -1875177 -737760 -234697 -532699 -1119345
38461 -1119345 -1933360 -2532855 -2176398 -1465553 -1867915 -3138359 -3514425 -2797942 -2505720
38452 -2505720 -2580650 -1244315 1109093 1571635 -391930 -1618689 -721557 -739756 -3496217
38443 -3496217 -5433162 -3129305 421028 22615 -3450476 -4414663 -1318109 1345863
38435 1345863 227458 -2443801 -3145231 -2023941 -1416471 -1940297 -2263936 -1400031 376312
$$ packed form
38496a371400K480526K618262Q58140r49143j148577M0641P11932j50770j097898
38487A991713l48775J474765K224505J071750r04780k273976k270101j117087
38479a51986k16837q33187j921633j050657J734069L363403K288001P66632P85043
38470D762848P17220j281192l331335k631384j11334J137417N03063k98002n86646
38461a119345q14015n99495L56457P10845m02362j270444l76066P16483K92222
38452b505720p4930J336335K353408M62542j963565j226759Q97132j8199k756461
38443c496217j936945K303857L550333l98413l473091r64187L096554K663972
38435A345863j118405k671259p01430J121290O07470n23826l23639Q63905J776343
$$ plain form
38426 376312 2036052 2243082 200496 -3066234 -5031027 -4142570 -1593361 -49442 -883484
38417 -883484 -3048568 -4472433 -4142777 -2687333 -1180679 -20046 708403 554292 -599526
38408 -599526 -1696018 -1700825 -1301538 -1817462 -2708613 -2284248 -924926 -972498 -2699687 -3195298
38398 -3195298 -742193 2288821 2904421 1515130 147372 -1163414 -3192769 -4434083
38390 -4434083 -2763909 479382 1575949 -282223 -1881022 -817693 1288122 1630709
38382 1630709 214678 -541533 831621 3113639 3766370 1683131 -1241976 -1651763 1512871
38373 1512871 5324517 5993445 3247263 308111 -253538 832900 1212559 -109224 -2085067
38364 -2085067 -3190687 -3035718 -2504935 -2494209 -2781585 -2577387 -1877066 -1228373 -269226
$$ packed form
38426C76312J659740K07030k042586l266730j964793Q88457K549209J543919q34042
38417h83484k165084j423865L29656J455444J506654J160633P28449j54111j153818
38408e99526j096492m807L99287n15924q91151M24365J359322m7572j727189m95611
38398c195298K453105L031014O15600j389291j367758j310786k029355j241314
38390d434083J670174L243291J096567j858172j598799J063329K105815L42587
38382A630709j416031p56211J373154K282018O52731k083239k925107m09787L164634
38373A512871L811646O68928k746182k939152n61649J086438L79659j321783j975843
38364b085067j105620J54969N30783J0726k87376K04198P00321O48693R59147
$$ plain form
38355 -269226 1893743 4466504 5052160 2977535 676419 311408 822576 209366 -974140
38346 -974140 -863173 238854 402968 -585602 -1237151 -1451960 -2725072 -4898355 -5407940
38337 -5407940 -2855741 601021 1674423 -346710 -3146276 -3905343 -1877896 977321
38329 977321 1918500 422496 -1281732 -1293492 -496551 -666347 -1427273 -1097153 374996
38320 374996 1607638 2271762 2966105 3175664 2099146 1192957 2750909 5730019 6303327
38311 6303327 3435461 693401 1058886 2892451 3030975 1376242 -3697 -477665 -1015583
38302 -1015583 -1884707 -2449122 -2618380 -2661300 -2071505 -158097 2590535 4867038 5805157
38293 5805157 5101934 2799264 -87392 -1743317 -1519117 -821295 -964663 -1208124 -220368
$$ packed form
38355b69226K162969K572761N85656k074625k301116l65011N11168o13210j183506
38346i74140J10967J102027J64114r88570o51549k14809j273112k173283n09585
38337e407940K552199L456762J073402k021133k799566p59067K027447K855217
38329I77321R41179j496004j704228j1760P96941j69796p60926L30120J472149
38320C74996J232642O64124O94343K09559j076518r06189J557952K979110N73308
38311F303327k867866k742060L65485J833565J38524j654733j379939m73968n37918
38302a015583q69124n64415j69258m2920N89795J913408K748632K276503R38119
38293E805157p03223k302670k886656j655925K24200O97822j43368k43461R87756
$$ plain form
38284 -220368 1549847 2514222 2206235 1458841 969751 972824 1567129 2100756 1240666 -825525
38274 -825525 -1451790 1161377 4739772 5512373 3374679 1631564 1782655 1852865 597680
38265 597680 -37141 1480399 2988942 1666547 -1374637 -2449408 -502309 1800269
38257 1800269 2101704 934409 -260372 -1390993 -2730115 -3333564 -2225848 -505428
38249 -505428 -580503 -3106010 -5783021 -5742093 -2607628 1269535 3353031 3174958 2025429
38240 2025429 975414 -103155 -1478230 -2302281 -1297056 1319873 3427558 3080718
38232 3080718 692031 -1378423 -1357904 231254 1477035 1316577 508624 385118 1020676
38223 1020676 1107531 -296514 -2426488 -3696341 -3637790 -3285457 -3636472 -4405127 -4519173
$$ packed form
38284b20368J770215R64375l07987p47394m89090L073N94305N33627q60090k066191
38274h25525o26265K613167L578395P72601k137694j743115J51091P0210j255185
38265E97680o34821J517540J508543j322395l041184j074771J947099K302578
38257A800269L01435j167295j194781j130621j339122o03449J107716J720420
38249e05428p5075k525507k677011M0928L134465L877163K083496j78073j149529
38240B025429j050015j078569j375075q24051J005225K616929K107685l46840
38232C080718k388687k070454K0519J589158J245781j60458q07953j23506O35558
38223A020676Q6855j404045k129974j269853N8551L52333l51015p68655j14046
$$ plain form
38214 -4519173 -3297977 -918620 1714494 3308041 3046701 1547370 402840 432137 1044597
38205 1044597 1610659 2320108 2896475 1770870 -1828409 -5655540 -6261620 -3150540 427072
38196 427072 1180411 -960382 -3569735 -4418496 -2920664 -26941 2550966 3599059 3306595
38187 3306595 2517049 1282786 -862610 -3334132 -4572215 -3946377 -2321755 -519978
38179 -519978 1281597 2263292 978007 -2267775 -4630726 -3783843 -709648 1834063 2618964
38170 2618964 2325195 1568953 312762 -1092333 -1850266 -1817750 -1614768 -1580896 -1398635
38161 -1398635 -742824 261538 1118030 1173362 161509 -1166439 -1606739 -1073376 -788167
38152 -788167 -1451252 -2246700 -2329379 -2145790 -2311464 -2297186 -1489363 -640189 -865677 -1874044
$$ packed form
38214d519173J221196K379357K633114J593547k61340j499331j144530K9297O12460
38205A044597N66062P09449N76367j125605l599279l827131o06080L111080L577612
38196D27072P53339k140793k609353q48761J497832K893723K577907J048093k92464
38187C306595p89546j234263k145396k471522j238083O25838J624622J801777
38179e19978J801575R81695j285285l245782k362951Q46883L074195K543711P84901
38170B618964k93769p56242j256191j405095p57933L2516K02982L3872J82261
38161a398635O55811J004362Q56492N5332j011853j327948m40300N33363K85209
38152g88167o63085p95448q2679J83589j65674J4278Q07823Q49174k25488j008367
$$ plain form
38142 -1874044 -2543095 -2644363 -2563308 -1834832 368745 3328479 4849939 3644518 760182
38133 760182 -1652210 -2460208 -2283155 -2335882 -2588681 -1501814 1630362 4584916 4246515
38124 4246515 926022 -1537628 -910566 460944 -544009 -3064423 -3637713 -1093860
38116 -1093860 2235576 3567457 2162769 -570366 -2137540 -1175142 277209 -1458199
38108 -1458199 -6194837 -8745370 -5807703 -1224020 -624917 -3178465 -3556039 -712935
38100 -712935 1018856 -338796 -1422819 191088 1974520 1343332 245679 1570493
38092 1570493 4186071 4980951 3657577 2416957 2457095 3392468 4771917 5851564 5177909
38083 5177909 2631716 703240 1552979 3784626 4220845 2122936 -282118 -952138 -88096
$$ packed form
38142a874044o69051j01268Q1055P28476K203577K959734J521460j205421k884336
38133G60182k412392q07998J77053n2727k52799J086867L132176K954554l38401
38124D246515l320493k463650O27062J371510j004953k520414n73290K543853
38116a093860L329436J331881j404688k733135j567174R62398J452351j735408
38108a458199m736638k550533K937667M583683N99103k553548l77574K843104
38100g12935J731791j357652j084023J613907J783432o31188j097653J324814
38092A570493K615578P94880j323374j240620M0138R35373J379449J079647o73655
38083E177909k546193j928476Q49739K231647M36219k097909k405054o70020Q64042
$$ plain form
38074 -88096 584628 -498972 -3166033 -4904273 -3045504 1576509 4733501 3807781 982071
38065 982071 -169543 547390 851561 197027 197412 1308435 1812166 496725 -1640472
38056 -1640472 -2939251 -2895594 -1892298 -224513 1868567 3625121 3796193 1655970 -1733731
38047 -1733731 -3757699 -2769503 -219284 1006756 250008 -616104 -558004 -715690 -1661493
38038 -1661493 -1857815 -354124 1143344 753928 -790157 -1686711 -1717682 -1435710 -400461
38029 -400461 1532937 2625598 1350547 -1059356 -2388870 -2578558 -2825506 -2904875 -2038347
38020 -2038347 -1248689 -1920477 -2941270 -2372615 -1225683 -2155399 -4693009 -5363325 -2863547
38011 -2863547 217009 1401753 820509 -986224 -4294543 -7876190 -8676582 -5794692
$$ packed form
38074h8096O72724j083600k667061j738240J858769M622013L156992r25720k825710
38065I82071j151614P16933L04171o54534L85J111023N03731j315441k137197
38056a640472j298779M3657J003296J667785K093080J756554J71072k140223l389701
38047a733731k023968R88196K550219J226040p56748q66112N8100j57686r45803
38038a661493j96322J503691J497468l89416j544085q96554l0971K81972J035249
38029d00461J933398J092661j275051k409903j329514j89688k46948p9369Q66528
38020b038347P89658o71788j020793N68655J146932r29716k537610o70316K499778
38011b863547L080556J184744n81244j806733l308319l581647q00392K881890
$$ plain form
38003 -5794692 -2275798 -989083 -968406 104843 1896560 2376841 1327163 413944 536542
37994 536542 1145966 1668086 1907743 1513703 497217 -209218 17540 325164 -292692
37985 -292692 -1248329 -1336935 -731497 -403893 -176128 798530 1942534 1707123 294866
37976 294866 -105373 1460017 2993994 2248557 -68808 -1151422 492346 3669579 6112146
37967 6112146 6313216 4049709 371839 -2733178 -3684401 -2697761 -1236317 -136817 729040
37958 729040 1021269 -150843 -2216696 -2841718 -1087003 597702 -503638 -3363705 -4677364
37949 -4677364 -3608438 -2324066 -2015429 -1474854 -127191 637404 262196 211133 915032
37940 915032 495371 -1573319 -2548687 -715404 1240586 336050 -1698680 -1231197 1440928
$$ packed form
38003e794692L518894J286715K0677J073249J791717M80281j049678r13219J22598
37994E36542O09424N22120K39657l94040j016486p06435K26758L07624o17856
37985b92692r55637q8606O05438L27604K27765R74658J144004k35411j412257
37976B94866m00239J565390J533977p45437k317365j082614J643768L177233K442567
37967F112146K01070k263507l677870l105017r51223R86640J461444J099500Q65857
37958G29040K92229j172112k065853o25022J754715J684705j101340k860067j313659
37949d677364J068926J284372L08637N40575J347663P64595l75208n1063P03899
37940I15032m19661k068690r75368J833283J955990r04536k034730M67483K672125
$$ plain form
37931 1440928 3191560 3484299 4169696 4815558 3165858 177232 -351105 2137389 3933868
37922 3933868 3198810 2405527 3021569 2508952 -816914 -4169841 -4633180 -3543269 -3341289
37913 -3341289 -3347915 -2117692 -939240 -1197381 -1004845 1392091 3300879 1331714 -2395697
37904 -2395697 -2841835 201240 2107693 904389 -388596 495824 1830529 1773023 1280436
37895 1280436 1440390 1537055 1500087 2796638 4992521 4884413 1398778 -1865053 -1748319
37886 -1748319 -295307 -1218407 -4081036 -5669380 -5336812 -4978312 -4717815 -2819687 132606
37877 132606 955615 -1313529 -3619033 -3300343 -1593344 -1054429 -1763734 -2163353 -2069236
37868 -2069236 -2558560 -3617295 -3950515 -2972555 -1400215 117397 1544787 2482079 2007151
$$ packed form
37931A440928J750632K92739O85397O45862j649700k988626n28337K488494J796479
37922C933868p35058p93283O16042n12617l325866l352927m63339J089911K01980
37913c341289o626J230223J178452k58141J92536K396936J908788j969165l727411
37904b395697m46138L043075J906453j203304j292985Q84420J334705n7506m92587
37895A280436J59954R6665l6968J296551K195883j08108l485635l263831J16734
37886a748319J453012r23100k862629j588344L32568L58500K60497J898128K952293
37877A32606Q23009k269144k305504L18690J706999N38915p09305l99619R4117
37868b069236m89324j058735l33220R77960J572340J517612J427390R37292m74928
$$ plain form
37859 2007151 43945 -2142043 -3514290 -4532976 -6015316 -7371912 -7160705 -5252913
37851 -5252913 -3202486 -2118173 -1296713 315309 2327983 3742757 4808011 6376726
37843 6376726 7620457 6360199 2302849 -1833567 -3647531 -4041401 -5177494 -6571031
37835 -6571031 -5639212 -2065561 863258 354301 -2175751 -3054535 -1156223 887569 205223
37826 205223 -2902588 -5555634 -5562115 -3429803 -1313119 -598945 -897418 -1128146 -895966
37817 -895966 -505176 -190618 61310 266286 650684 1759417 3534594 4586727 3509546
37808 3509546 931984 -913262 -864816 149390 1051685 2010942 3097789 3193245 1808414
37799 1808414 805459 2234823 4903520 5260406 2013542 -1982860 -3241332 -1614247
$$ packed form
37859B007151j963206k185988j372247j018686j482340j356596K11207J907792
37851e252913K050427J084313Q21460J612022K012674J414774J065254J568715
37843F376726J243731j260258m057350m136416j813964l93870j136093j393537
37835f571031R31819L573651K928819n08957k530052q78784J898312K043792o82346
37826B05223l107811k653046o481K132312K116684P14174k98473k30728K32180
37817h95966L90790L14558K51928K04976L84398J108733J775177J052133j077181
37808C509546k577562j845246M8446J014206R02295R59257J086847R5456j384831
37799A808414j002955J429364K668697L56886l246864l996402j258472J627085
$$ plain form
37791 -1614247 303205 707712 179644 117930 878950 1804459 2343919 2541244 2586076 2441619
37781 2441619 2171371 2257204 3009840 3739757 3277366 1614349 309035 695138 2245399
37772 2245399 3361209 3290626 2516003 1680378 1046667 832560 1232857 2093700 3061267
37763 3061267 3820566 3786225 2206678 -673141 -3244978 -4305895 -4482226 -4731528 -4300924
37754 -4300924 -1897092 1670105 4023536 4242122 3359991 1951626 -401102 -2855033
37746 -2855033 -3103607 -612759 2003398 2210741 480809 -1234307 -2144836 -2230688 -980003
37737 -980003 1462109 3114397 2218242 -215955 -1662484 -1247811 -68153 959374 1787556
37728 1787556 2170383 1581587 161882 -1396544 -2649603 -3226873 -2619749 -1222164 -605105
$$ packed form
37791a614247J917452M04507n28068o1714P61020R25509N39460J97325M4832j44457
37781B441619k70248Q5833P52636P29917m62391j663017j305314L86103J550261
37772B245399J115810p0583p74623q35625o33711k14107M00297Q60843R67567
37763C061267P59299l4341j579547k879819k571837j060917j76331k49302M30604
37754d300924K403832L567197K353431K18586q82131j408365k352728k453931
37746b855033k48574K490848K616157K07343j729932j715116r10529q5852J250685
37737i80003K442112J652288q96155k434197j446529M14673J179658J027527Q28182
37728A787556L82827n88796j419705j558426j253059n77270O07124J397585O17059
$$ plain form
37719 -605105 -1404391 -2011092 -987457 418911 303155 -434434 618890 3144315 4154089
37710 4154089 2517918 529164 161379 414311 -290284 -1249580 -699684 1523031 4000203
37701 4000203 5414867 5153479 3255496 804206 -490729 -2178 1200789 1908559 1907343
37692 1907343 1145416 -718399 -2955662 -3375891 -767374 3100653 5271952 4840878 3234824
37683 3234824 1849251 775150 -278936 -1069979 -1185371 -698356 -148275 38301 189428
37674 189428 1346255 4025444 6969069 7948978 6190545 3272977 1235363 589322 662153
37665 662153 920531 1113292 871801 146387 -471332 -712990 -1319154 -2710709 -3520364
37656 -3520364 -1933591 1434913 3462006 2074646 -1021589 -2222963 -318256 2230519
$$ packed form
37719f05105p99286o06701J023635J406368j15756p37589J053324K525425J009774
37710D154089j636171j988754l67785K52932p04595r59296N49896K222715K477172
37701D000203J414664k61388j897983k451290j294935M88551J202967P07770j216
37692A907343p61927j863815k237263m20229K608517L868027K171299m31074j606054
37683C234824j385573j074101j054086p91043j15392M87015N50081J86576J51127
37674A89428J156827K679189K943625R79909j758433k917568k037614o46041P2831
37665F62153K58378J92761k41491p25414o17719k41658o06164j391555q09655
37656c520364J586773L368504K027093j387360l096235j201374J904707K548775
$$ plain form
37648 2230519 2605859 1187136 678467 2113000 3335786 2043479 -1078816 -3519592
37640 -3519592 -4256170 -4241746 -4094334 -3267840 -1698296 -450394 -99630 34205 345499
37631 345499 101104 -931202 -1391664 -159021 1699605 2160480 810555 -1037732 -2343119
37622 -2343119 -3264714 -4304228 -5495745 -6378410 -6156399 -4222317 -1175872 1150386 1517018
37613 1517018 766723 654372 1550812 2255120 1836723 615652 -664736 -1615166 -1929448
37604 -1929448 -1227003 342380 1838237 2351717 1937884 1490607 1734338 2408857 2466436
37595 2466436 1173871 -968694 -2590833 -2784961 -1922143 -1214982 -1712231 -3459962 -5090028
37586 -5090028 -4515771 -1051184 3081928 4548782 2675282 249174 -223569 213947 -1104091
$$ packed form
37648B230519L75340j418723n08669J434533J222786j292307l122295k440776
37640c519592p36578J4424J47412Q26494J569544J247902L50764J33835L11294
37631C45499k44395j032306m60462J232643J858626M60875j349925j848287j305387
37622b343119r21595j039514j191517q82665K22011J934082L046445K326258L66632
37613A517018p50295j12351Q96440P04308m18397j221071j280388r50430l14282
37604a929448P02445J569383J495857N13480m13833m47277K43731O74519N7579
37595B466436j292565k142565j622139j94128Q62818P07161m97249j747731j630066
37586e090028N74257L464587M133112J466854j873500k426108m72743M37516j318038
$$ plain form
37577 -1104091 -4140011 -5826459 -4292082 -1581746 -1030542 -2938024 -4327405 -2918486
37569 -2918486 6367 1437258 509243 -785305 -760527 -389862 -1477362 -3550275 -4276756
37560 -4276756 -2753970 -659185 222659 60561 -148070 -355865 -966563 -1515717 -1139807
37551 -1139807 92396 1359692 2261282 2860808 2798124 1328090 -1611359 -4885919 -6828733
37542 -6828733 -6372842 -3943076 -1409803 -533191 -1107995 -1347281 -464519 178382 -680309
37533 -680309 -1905361 -1428654 474793 1115438 -1065389 -4210715 -5122274 -2949328 12418
37524 12418 1030341 -248637 -1942350 -2424566 -1941150 -1639165 -1886283 -2330189 -2935255
37515 -2935255 -3706045 -3743937 -2200036 -259834 -338104 -2632865 -4293446 -3200581 -924412
$$ packed form
37577a104091l035920j686448J534377K710336N51204j907482j389381J408919
37569b918486K924853J430891r28015j294548K4778L70665j087500k072913p26481
37560d276756J522786K094785Q81844j62098k08631k07795o10698n49154L75910
37551a139807J232203J267296R01590N99526o2684j470034k939449l274560j942814
37542f828733M55891K429766K533273Q76612n74804k39286Q82762O42901q58691
37533f80309j225052M76707J903447O40645k180827l145326r11559K172946K961746
37524A2418J017923j278978j693713m82216M83416L01985k47118m43906o05066
37515b935255p70790l7892J543901J940202p8270k294761j660581J092865K276169
$$ plain form
37506 -924412 -252010 -1144214 -1368640 -404965 -157821 -1569560 -2849416 -2128660 -278435
37497 -278435 325607 -961212 -2399620 -2241084 -630168 1104068 2181369 2711752 2754578
37488 2754578 2067723 1035239 908549 2364462 4398805 5499078 5423082 4855082 3895997
37479 3895997 2315333 957588 1138177 2494967 3126529 2222211 922641 161750 -539392
37470 -539392 -1443790 -1588192 -406869 1172432 2182814 2678752 2601867 1386263 -418715
37461 -418715 -1128081 -580399 -655121 -1984959 -2754325 -2339481 -3059769 -5821936 -7157493
37452 -7157493 -4189171 10421 382917 -2514739 -3639708 -1357080 732699 -19769
37444 -19769 -2035703 -3312650 -4168869 -4739354 -3632602 -997277 384234 -844822 -2255887
$$ packed form
37506i24412O72402q92204k24426R63675K47144j411739j279856P20756J850225
37497b78435O04042j286819j438408J58536J610916J734236J077301N30383M2826
37488B754578o86855j032484j26690J455913K034343J100273p5996n68000r59085
37479C895997j580664j357745J80589J356790O31562r04318j299570p60891p01142
37470e39392r04398j44402J181323J579301J010382M95938p6885j215604j804978
37461d18715p09366N47682p4722j329838p69366M14844p20288k762167j335557
37452g157493K968322M199592L72496k897656j124969K282628K089779p52468
37444a9769k015934j276947q56219n70485J106752K635325J381511j229056j411065
$$ plain form
37435 -2255887 -1402988 526009 952795 -295348 -1501339 -1610101 -408458 2173920 5115156
37426 5115156 6157270 4405374 1852750 847428 1328149 1893078 2107613 2230624 2034310
37417 2034310 1472194 1348288 1953271 2252909 1672958 1286105 1908558 2541149 2188172
37408 2188172 1682524 2021951 2344734 1390877 -293340 -1407689 -1912470 -2203847 -1627151
37399 -1627151 149486 1521376 951794 -427641 -510819 416404 477343 -358153 -353583 758332
37389 758332 1353391 933032 1022043 2433533 3821423 3847639 3064027 2701603 2939556 3289973
37379 3289973 3693460 4368872 5132909 5415553 4713696 3055923 1397272 1192237 2871927
37370 2871927 5037625 5884570 5127934 3904386 3271068 3475520 4064695 3983668 2350375
$$ packed form
37435b255887Q52899J928997M26786j248143j205991j08762J201643K582378K941236
37426E115156J042114j751896k552624j005322M80721N64929K14535J23011j96314
37417B034310n62116j23906O04983K99638n79951l86853O22453O32591l52977
37408B188172n05648L39427L22783r53857j684217j114349n04781k91377N76696
37399a627151J776637J371890n69582j379435q3178R27223O0939q35496M570J111915
37389G58332N95059m20359Q9011J411490J387890K6216p83612l62424K37953L50417
37379C289973M03487O75412P64037K82644p01857j657773j658651k05035J679690
37370B871927K165698Q46945p56636j223548o33318K04452N89175q1027j633293
$$ plain form
37361 2350375 -102158 -1355139 -715467 201359 119871 -3656 700649 807654 -916294
37352 -916294 -2643081 -2160146 -927852 -1763503 -3508988 -2478334 858499 1583591 -2026079
37343 -2026079 -5312332 -4146443 -906172 -162694 -1656193 -1713252 347978 1629529 850942
37334 850942 200340 1550531 3832601 5025596 4604429 3199228 1442663 -138469 -1259888
37325 -1259888 -2310204 -3639248 -4360849 -3130785 -334072 1799243 1771382 507803 -87607
37316 -87607 490955 1024306 227450 -1718670 -3289698 -3299020 -2407539 -2397873 -3692635 -4499948
37306 -4499948 -3221082 -814980 534867 489163 607643 1481039 1680292 120732 -2096799
37297 -2096799 -3179931 -2890137 -2268053 -1920089 -1677685 -1460967 -1348794 -929549 394828
$$ packed form
37361B350375k452533j252981O39672R16826q1488j23527P04305J07005j723948
37352i16294j726787M82935J232294q35651j745485J030654L336833P25092l609670
37343b026079l286253J165889L240271P43478j493499n7059K061230J281551p78587
37334H50942o50602J350191K282070J192995m21167j405201j756565j581132j121419
37325a259888j050316j329044p21601J230064K796713K133315k7861j263579n95410
37316h7607N78562N33351p96856j946120j571028r322Q91481R666j294762q07313
37306d499948J278866K406102J349847m5704J18480Q73396J99253j559560k217531
37297b096799j083132K89794O22084L47964K42404K16718J12173M19245J324377
$$ plain form
37288 394828 2265388 3284587 2470322 398400 -1435255 -2155572 -2096058 -1972223 -1889682
37279 -1889682 -1421541 -499425 178873 -141820 -1265257 -1947696 -943283 1686681 4216919
37270 4216919 4551624 2385706 -103989 -487805 1010299 1913811 1097922 465365 1831355
37261 1831355 3570187 2642635 -518224 -1880627 695819 4292468 4908693 2763190
37253 2763190 1302943 1921286 2394818 766623 -1675387 -2475129 -1429392 -373946 -363185
37244 -363185 -647681 -397876 -133464 -872183 -2488727 -3580119 -2957245 -985787 702575
37235 702575 868403 -4277 -198694 1281548 3418366 4201634 3006112 1463980 1488501
37226 1488501 2769015 3172329 1776017 247809 229218 465991 -1494497 -4998287 -6138394
$$ packed form
37288C94828J870560J019199q14265k071922j833655p20317N9514J23835Q2541
37279a889682M68141R22116O78298l20693j123437o82439J004413K629964K530238
37270D216919L34705k165918k489695l83816J498104R03512q15889o32557J365990
37261A831355J738832r27552l160859j362403K576446L596649O16225k145503
37253B763190j460247O18343M73532j628195k442010p99742J045737J055446J0761
37244c63185k84496K49805K64412p38719j616544j091392O22874J971458J688362
37235G02575J65828q72680j94417J480242K136818P83268j195522j542132K4521
37226A488501J280514M03314j396312j528208j8591K36773j960488l503790j140107
$$ plain form
37217 -6138394 -2933334 1433729 2453289 971 -2119138 -1693953 -562436 -1240785
37209 -1240785 -3400760 -4827891 -4405102 -2954494 -1941314 -2175598 -3193945 -3479741 -2020768
37200 -2020768 91412 587915 -1119901 -3089508 -3289230 -1803124 -155376 401034 -534730
37191 -534730 -2338416 -3242559 -1830286 746346 1663852 252229 -1021368 -410242 579785
37182 579785 225515 -187023 1244677 3195484 2734879 -169251 -2713972 -3273619 -2590126
37173 -2590126 -1406241 231825 1444391 1068216 -154373 -431663 123952 39206 -251790
37164 -251790 1139566 3636421 4147613 1732154 -908843 -1630255 -1391945 -1433623 -1138172
37155 -1138172 -260616 -165518 -1075556 -1132756 -45195 -362323 -2831528 -3972456 -1326676
$$ packed form
37217f138394L205060M367063J019560k452318k120109M25185J131517o78349
37209a240785k159975j427131M22789J450608J013180k34284j018347k85796J458973
37200b020768K112180M96503j707816j969607j99722J486106J647748N56410r35764
37191e34730j803686r04143J412273K576632R17506j411623j273597O11126R90027
37182E79785l54270m12538J431700J950807m60605k904130k544721n59647O83493
37173b590126J183885J638066J212566l76175j222589k77290N55615q4746k90996
37164b51790J391356K496855N11192k415459k640997p21412K38310m1678K95451
37155a138172Q77556R5098r10038n7200J087561l17128k469205j140928K645780
$$ plain form
37146 -1326676 2138108 2574954 1332665 2142076 4483145 4669398 2293335 605801 823299
37137 823299 819932 -172092 -46187 1976331 3544967 3023790 1952901 2263077 3709252
37128 3709252 5197602 6095412 5327267 1997075 -1993050 -2888729 -126687 2341730 1441812
37119 1441812 -1050078 -1912594 -1125324 -468627 222566 2153477 4280799 4238957 2121566
37110 2121566 478374 498217 659215 -467894 -2220410 -3303495 -3507495 -3134956 -2079840
37101 -2079840 -438091 942959 1502860 1859892 2651668 3000204 1474938 -1345792 -2745589
37092 -2745589 -1203187 1264568 1607862 -73372 -958034 -127436 -79273 -2365942 -4293434
37083 -4293434 -2489034 1939298 4890474 5036899 4722734 5197462 4642015 2099412 97845
$$ packed form
37146a326676L464784M36846j242289Q09411K341069J86253k376063j687534K17498
37137H23299l367r92024J25905K022518J568636n21177j070889L10176J446175
37128C709252J488350Q97810p68145l330192l990125q95679K762042K468417q99918
37119A441812k491890q62516P87270O56697O91193J930911K127322m1842k117391
37110B121566j643192J9843J60998j127109j752516j083085k04000L72539J055116
37101b079840J641749J381050N59901L57032P91776L48536j525266k820730j399797
37092b745589J542402K467755L43294j681234q84662Q30598M8163k286669j927492
37083d293434J804400M428332K951176J46425l14165M74728n55447k542603k001567
$$ plain form
37074 97845 1112251 3557736 3832763 1287576 -1103984 -758031 1533543 2858976 1525533
37065 1525533 -1135904 -2167848 -294155 2478644 3201571 1454982 -663970 -1550532
37057 -1550532 -1388945 -673581 376846 653324 -1170890 -3937511 -4376154 -1599678 949836
37048 949836 -81857 -3415354 -5204153 -4257163 -2692503 -2072695 -1461096 342729 2450921
37039 2450921 2637726 -91114 -3958145 -5543965 -3106045 1154549 3219687 1836005
37031 1836005 -556301 -1856737 -3017226 -5341199 -7265323 -6272265 -2805635 211872
37023 211872 1223153 1182762 1158030 964237 374306 -120161 -212930 -186899 -99277 429264
37013 429264 1374528 2024027 1701890 397717 -1126075 -1640116 -529166 1099393 1343208
$$ packed form
37074I7845J014406K445485K75027k545187k391560L45953K291574J325433j333443
37065A525533k661437j031944J873693K772799P22927j746589k118952q86562
37057a550532J61587P15364J050427K76478j824214k766621m38643K776476K549514
37048I49836j031693l333497j788799R46990J564660O19808O11599J803825K108192
37039B450921J86805k728840l867031j585820K437920M260594K065138j383682
37031A836005k392306j300436j160489k323973j924124R93058L466630L017507
37023B11872J011281m0391k4732j93793n89931m94467r2769K6031Q7622N28541
37013D29264R45264O49499l22137j304173j523792n14041J110950J628559K43815
$$ plain form
37004 1343208 -6688 -1126682 -895631 -395557 -744863 -1233115 -1022666 -890126 -1455251
$$ packed form
37004A343208j349896j119994K31051N00074l49306m88252K10449J32540n65125
$$ [...]
##END NTUPLES=NMR SPECTRUM
##END=
