##TITLE=31Pdec_PR-II
 D2O, 124 sc
 1.10.2021
##JCAMPDX= 6.0         $$ Bruker NMR JCAMP-DX V2.0
##DATA TYPE= NMR SPECTRUM
##DATA CLASS= NTUPLES
##ORIGIN= UXNMR, Bruker Analytische Messtechnik GmbH
##OWNER= root
$$ XWIN-NMR		Version 3.5
$$ Fri Oct  1 13:14:55 2021 Russian Standard Time (UT+4h)  she@DPX200
##.OBSERVE FREQUENCY= 81.013821
##.OBSERVE NUCLEUS= ^31P
##.ACQUISITION MODE= SIMULTANEOUS
##.ACQUISITION SCHEME= undefined
##.AVERAGES= 124
##.DIGITISER RES= 16
##SPECTROMETER/DATA SYSTEM= spect
##.PULSE SEQUENCE= zgpg30
##.SOLVENT NAME= CDCl3
##.SHIFT REFERENCE= (INTERNAL, CDCl3, 0, 248.564)
##AUDIT TRAIL= $$ (NUMBER, WHEN, WHO, WHERE, WHAT)
$$ ##TITLE= Audit trail, XWIN-NMR		Version 3.5
$$ ##JCAMPDX= 5.01
$$ ##ORIGIN= Bruker BioSpin GmbH
$$ ##OWNER= she
$$ F:/spectra/data/she/nmr/P31/1/pdata/1/auditp.txt
$$ ##AUDIT TRAIL=  $$ (NUMBER, WHEN, WHO, WHERE, WHAT)
(   1,<2021-10-01 13:13:27.35 +0400>,<she>,<DPX200>,
      <continue with go, POWCHK disabled, PULCHK disabled
       configuration hash MD5:
       00 E9 B6 7A A2 85 ED C7 34 08 36 98 17 FE 4E 26
       data hash MD5: 32K
       CB 97 EF A8 0A 05 B0 15 D1 A0 9D 62 6F 52 F7 8F>)
(   2,<2021-10-01 13:14:05.78 +0400>,<she>,<DPX200>,
      <Start of raw data processing
       efp BC_mod = 2 LB = 1 FT_mod = 6 PKNL = 1 PHC0 = -8852.6 PHC1 = 112.669 SI = 64K 
       data hash MD5: 64K
       3C 57 C7 6B 4C 2D 47 98 E1 87 45 85 2D CB 0D 05>)
(   3,<2021-10-01 13:14:22.57 +0400>,<she>,<DPX200>,
      <pk PHC0 = -10.27784 PHC1 = 54.00001 
       data hash MD5: 64K
       C8 66 B5 4D 94 7C 98 ED A4 3C 63 C1 7A CC D8 7F>)
(   4,<2021-10-01 13:14:25.29 +0400>,<she>,<DPX200>,
      <abs ABSG = 5 
       data hash MD5: 64K
       16 34 D0 ED 07 56 45 46 42 66 EA EC 19 E6 86 D9>)
$$ ##END=
$$ 
$$ hash MD5
$$ 23 8E 64 6D 01 53 64 9D F2 90 FB 91 11 89 F3 09
##$RELAX= 
##$RELAX= 
##$RELAX= 
##$RELAX= 
##$RELAX= 
##$RELAX= 
##$RELAX= 
##$RELAX= 
$$ Bruker specific parameters
$$ --------------------------
##$DU= <F:/spectra>
##$EXPNO= 1
##$NAME= <P31>
##$PROCNO= 1
##$TYPE= <nmr>
##$USER= <she>
##$AMP= (0..31)
100 100 100 100 100 100 100 100 100 100 100 100 100 100 100 100 100 100 
100 100 100 100 100 100 100 100 100 100 100 100 100 100 
##$AQSEQ= 0
##$AQ_mod= 1
##$AUNM= <au_zg>
##$AUTOPOS= <>
##$BF1= 81.014009
##$BF2= 200.13
##$BF3= 200.13
##$BF4= 200.13
##$BF5= 200.13
##$BF6= 200.13
##$BF7= 200.13
##$BF8= 200.13
##$BYTORDA= 1
##$CFDGTYP= 0
##$CFRGTYP= 5
##$CHEMSTR= <none>
##$CNST= (0..31)
1 1 145 1 1 1 1 1 1 1 1 1 1 1 1 1 1 1 1 1 1 1 1 1 1 1 1 1 1 1 1 1 
##$CPDPRG= <waltz16>
##$CPDPRG1= <>
##$CPDPRG2= <waltz16>
##$CPDPRG3= <>
##$CPDPRG4= <mlev>
##$CPDPRG5= <mlev>
##$CPDPRG6= <mlev>
##$CPDPRG7= <mlev>
##$CPDPRG8= <mlev>
##$CPDPRGB= <>
##$CPDPRGT= <>
##$D= (0..31)
0 1 0 0 0 0 0 0 0 0 0 0.03 2e-05 3e-06 0 0 0 0 0 0 0 0 0 0 0 0 0 0 0 0 
0 0 
##$DATE= 1633079389
##$DBL= (0..7)
120 120 120 11 120 120 24 19 
##$DBP= (0..7)
150 150 150 150 150 150 150 150 
##$DBP07= 0
##$DBPNAM0= <>
##$DBPNAM1= <>
##$DBPNAM2= <>
$$ [...]
##$SUBNAM3= <"">
##$SUBNAM4= <"">
##$SUBNAM5= <"">
##$SUBNAM6= <"">
##$SUBNAM7= <"">
##$SUBNAM8= <"">
##$SUBNAM9= <"">
##$SW= 501.771253377433
##$SWIBOX= (0..15)
0 1 3 0 0 0 0 0 0 0 0 0 0 0 0 0 
##$SW_h= 40650.406504065
##$TD= 32768
##$TD0= 1
##$TE= 0
##$TE2= 300
##$TE3= 300
##$TEG= 300
##$TL= (0..7)
0 120 53 12 22 120 120 120 
##$TP= (0..7)
150 150 150 150 150 150 150 150 
##$TP07= 0
##$TPNAME0= <>
##$TPNAME1= <>
##$TPNAME2= <>
##$TPNAME3= <>
##$TPNAME4= <>
##$TPNAME5= <>
##$TPNAME6= <>
##$TPNAME7= <>
##$TPOAL= (0..7)
0.5 0.5 0.5 0.5 0.5 0.5 0.5 0.5 
##$TPOFFS= (0..7)
0 0 0 0 0 0 0 0 
##$TUNHIN= 0
##$TUNHOUT= 0
##$TUNXOUT= 0
##$USERA1= <user>
##$USERA2= <user>
##$USERA3= <user>
##$USERA4= <user>
##$USERA5= <user>
##$V9= 5
##$VALIST= <valist>
##$VCLIST= <CCCCCCCCCCCCCCC>
##$VD= 0
##$VDLIST= <DDDDDDDDDDDDDDD>
##$VPLIST= <PPPPPPPPPPPPPPP>
##$VTLIST= <TTTTTTTTTTTTTTT>
##$WBST= 1024
##$WBSW= 4
##$XGAIN= (0..3)
0 0 0 0 
##$XL= 0
##$YL= 0
##$YMAX_a= 2698
##$YMIN_a= -2511
##$ZGOPTNS= <>
##$ZL1= 120
##$ZL2= 120
##$ZL3= 120
##$ZL4= 120
##$ABSF1= 248.5645
##$ABSF2= -253.2056
##$ABSG= 5
##$ABSL= 3
##$ALPHA= 0
##$AQORDER= 0
##$ASSFAC= 0
##$ASSFACI= 0
##$ASSFACX= 0
##$ASSWID= 0
##$AUNMP= <proc_1d>
##$AZFE= 0.1
##$AZFW= 0.5
##$BCFW= 0
##$BC_mod= 2
##$BYTORDP= 0
##$COROFFS= 0
##$CY= -3
##$DATMOD= 1
##$DC= 0
##$DFILT= <>
##$DTYPP= 0
##$F1P= 0
##$F2P= 0
##$FCOR= 1
##$FTSIZE= 65536
##$FT_mod= 6
##$GAMMA= 0
##$GB= 0
##$INTBC= 1
##$INTSCL= 5.30512e-09
##$ISEN= 30
##$LB= 1
##$LEV0= 0
##$LPBIN= 0
##$MAXI= 10000
##$MC2= 0
##$MEAN= 0
##$ME_mod= 0
##$MI= 50
##$NCOEF= 0
##$NC_proc= -6
##$NLEV= 6
##$NOISF1= 182.463
##$NOISF2= 159.3651
##$NSP= 0
##$NTH_PI= 0
##$NZP= 0
##$OFFSET= 248.5645
##$PC= 4
##$PHC0= -8862.878
##$PHC1= 166.669
##$PH_mod= 1
##$PKNL= yes
##$PPARMOD= 0
##$PSCAL= 0
##$PSIGN= 0
##$REVERSE= no
##$SF= 81.014009
##$SI= 65536
##$SIGF1= 159.3651
##$SIGF2= -187.1042
##$SINO= 113.3802
##$SIOLD= 16384
##$SREGLST= <1H.CDCl3>
##$SSB= 0
##$STSI= 65536
##$STSR= 0
##$SW_p= 40650.406504065
##$SYMM= 0
##$S_DEV= 0
##$TDeff= 32768
##$TDoff= 0
##$TI= <>
##$TILT= no
##$TM1= 0
##$TM2= 0
##$TOPLEV= 0
##$USERP1= <user>
##$USERP2= <user>
##$USERP3= <user>
##$USERP4= <user>
##$USERP5= <user>
##$WDW= 1
##$XDIM= 65536
##$YMAX_p= 303815652
##$YMIN_p= -16767139
$$ End of Bruker specific parameters
$$ ---------------------------------
##NTUPLES= NMR SPECTRUM
##VAR_NAME=  FREQUENCY,     SPECTRUM/REAL,   SPECTRUM/IMAG
##SYMBOL=    X,             R,               I
##VAR_TYPE=  INDEPENDENT,   DEPENDENT,       DEPENDENT
##VAR_FORM=  AFFN,          ASDF,            ASDF
##VAR_DIM=   65536,         65536,           65536
##UNITS=     HZ,            ARBITRARY UNITS, ARBITRARY UNITS
##FACTOR=    0.620285442955139, 1,           1
##FIRST=     20137.2065510759, 0,            0
##LAST=      -20513.1999529892, 0,           0
##MIN=       -20513.1999529892, -16767139,   0
##MAX=       20137.2065510759, 303815652,    0
$$ Real data points
##PAGE= N=1
##DATA TABLE= (X++(R..R)), XYDATA
$$ [...]
13125a033031J674084J693811M75900j031641k392141k185176N93872L453098
13117A248776K629964q73550j854001R63733K230365j627562o014830m769961
13109h067066M14508K795877P52271q82514P19448K421445J029092j542549j615490
13100c974978O95977K110928J032175o29890m76157J069890J455916k42919j690222
13091f49280o17220J438401J214847r77769j477831P28610K172003O58508j154196
13082A336073n45512P20286J04592q79515K37320J822493R20642j134245r55979
13073A626155O93581L01600j839126k093437j93014K72823j420783j642282R71948
13064c322535K816877J455808m02789J19944J359979O46224j004144j298224q86820
$$ y = [-1033031, 641053, 2334864, 2810764, 1779123, -613018, -2798194, -2204322, 1248776, 3878740, 3005190, 1151189, 2114922, 4345287, 2717725, -3297105, -8067066, -7652558, -4856681, -4104410, -4986924, -4267476, -1846031, -816939, -2359488, -3974978, -3279001, -1168073, -135898, -765788, -1241945, -172055, 1283861, 1040942, -649280, -1266500, 171901, 1386748, 408979, -1068852, -340242, 1831761, 2490269, 1336073, 790561, 1510847, 1615439, 735924, 973244, 2795737, 3716379, 2582134, 1626155, 2319736, 2621336, 782210, -1311227, -1504241, -1231418, -2652201, -4294483, -3322535, -505658, 950150, 547361, 667305, 2027284, 2673508, 1669364, 371140, -515680]
13055e15680j402288j578651N84985L272313K751353n94923k264182k72317J913090
13046A893700O99845k348903l100467r07981R14225J89684j435220j558312l49377
13037f002806O41008J157310J741365J802210M97756j066098q70441R32662K155145
13028I88111J732762N76104n88229j746328k033266m86752J454562J275420m93121
13019F79263q82823M13296O20538o91971o02089J173143P03917k933840m440313
13010e960879m75348M072472L301168o14979j640812M34454J289552L65790O43073
13001A414491J704296L17994k636701k882939m46931K17685j641983j724749J262056
12992d416781K977438J068406q84761P4296J435011L38389j362688r11459M76728
$$ y = [-515680, -1917968, -3496619, -2911634, 360679, 3112032, 2517109, 252927, -19390, 1893700, 2593545, 244642, -2855825, -3763806, -2849581, -2659897, -4095117, -5653429, -6002806, -5361798, -4204488, -2463123, -660913, -163157, -1229255, -2099696, -1167034, 988111, 2720873, 3296977, 2708748, 962420, -1070846, -1557598, -103036, 1172384, 679263, -203560, 209736, 830274, 138303, -463786, 709357, 1413274, -1520566, -5960879, -6436227, -2363755, 937413, 322434, -1318378, -883924, 405628, 771418, 1414491, 3118787, 3436781, 800080, -2082859, -2529790, -2312105, -3954088, -5678837, -4416781, -1439343, -370937, -1255698, -1181402, 253609, 591998, -770690, -1682149, -1205421]
12983a205421K86160r00366j088926m29007j65226k07166p7150j67200k54295
12974d208597Q55562K663546K697105M56095j308227q86973l1485l09019m41668
12965e13661N51520R63575k64195j002928L85908J713812M17278k062452k459376
12956b270519l55115K043975L078940K291858k01386k835370l078626p92853J019134
12947a099962N49482m09729k31959k78030j417260j301375J458419L622136J842564
12938B734286j814005l045864j659897l95845L78781J963889L028627J243611
12930B433583j689995j814384N72892J220882j040613k521599q17322J837386
12922a819170K760920K330948J630817J77488k072175l392547k803877j496991
$$ y = [-1205421, -919261, -1819627, -2908553, -3337560, -3502786, -3709952, -3787102, -3954302, -4208597, -3353035, -689489, 2007616, 2463711, 1155484, 268511, 237026, -71993, -513661, 37859, 1001434, 737239, -265689, 120219, 1834031, 2251309, 188857, -2270519, -2625634, -581659, 2497281, 4789139, 4587753, 1752383, -1326243, -2119096, -1099962, -550480, -960209, -1192168, -1470198, -2887458, -4188833, -2730414, 891722, 2734286, 920281, -2125583, -3785480, -4181325, -3802544, -1838655, 1189972, 2433583, 743588, -1070796, -497904, 722978, -317635, -2839234, -3656556, -1819170, 941750, 3272698, 4903515, 5081003, 3008828, -383719, -3187596, -4684587]
12914d684587l97184J131484K875472K924800R40625m66925L20048J144144l45628
12905C442249k577402k450156k78578Q08195l16714j560125j178021R0894R70524
12896c049134J492665J932568J594640l4367j885372k330279j230116M0557N03949
12887b964889N95649J021666J362976N77547j242857k408621j436034R68827K391393
12878a134343J409595o40499j171969M84406K213750J849731k0908j080290o70219
12869A239254m56913j373082j863930n20329J204487J020843n14056q77650K93780
12860a847596P91955j88419o12764P53732J979763J074144p00961q82773L67533
12851G34614R44807L56575Q1452O62666P92652l40506j620285j619880m96087
$$ y = [-4684587, -5081771, -3950287, -1074815, 1849985, 2790610, 2323685, 2643733, 3787877, 3442249, 864847, -1585309, -1863887, -1055692, -1372406, -2932531, -4110552, -4019658, -3049134, -1556469, 376099, 1970739, 1936372, 51000, -2279279, -3509395, -3468838, -2964889, -2369240, -1347574, 15402, 592949, -649908, -3058529, -4494563, -3525736, -1134343, 275252, -365247, -1537216, -1052810, 1160940, 3010671, 2989763, 1909473, 1239254, 782341, -590741, -2454671, -2975000, -1770513, -749670, -1263726, -2141376, -1847596, -1055641, -1244060, -1856824, -1103092, 876671, 1950815, 1249854, 367081, 734614, 1679421, 2035996, 2117448, 2780114, 3572766, 3232260, 1611975, -7905, -503992]
12842e03992L83707P1601j080585j839792j333676k3152Q84382J060313J254036
12833a127158J579195R44278q66673j954647p70962J242428J509376J52513l71780
12824C36570P10921J433530N31360o41971p93783q67048j739614j890659J08657
12815b812037K335422J874917l25658n11475J803058K650869r8477k969326k089026
12806a41733Q61321J567981j74323r96829j03748l6481j243291q78723J702371
12797E56545K946522Q04831j751836j681623m86910o29168r81174K15638J131628
12788A24453l53617j928743n24289J616192K89674k895259k543435J299145K748973
12779b166906l25947k947275j220850K087552K912883J635417L92236p65197j808408
$$ y = [-503992, -120285, -48684, -1129269, -2969061, -4302737, -4325889, -3441507, -2381194, -1127158, 452037, 1396315, 529642, -1425005, -2195967, -953539, 555837, 708350, 336570, 1047491, 2481021, 3012381, 2370410, 1576627, 709579, -1030035, -2920694, -2812037, -476615, 1398302, 1072644, 561169, 2364227, 5015096, 4916619, 1947293, -141733, 719588, 2287569, 2113246, 1116417, 1012669, 976188, -267103, -1145826, 556545, 3503067, 4307898, 2556062, 874439, 387529, -241639, -1222813, -1007175, 124453, -229164, -2157907, -2682196, -1066004, -776330, -3671589, -6215024, -4915879, -2166906, -2492853, -5440128, -6660978, -4573426, -1660543, -25126, 367110, -398087, -2206495]
12770b206495j011168J396350J805771j067836k935718k88834L613801L562833
12762B868704J90698j831591j084211m816K04294M85571O39885m30044j613775
12753e75285p22412J489897K082212N83226n67775k57833m2389r12045j711586
12744f33990j392679m60712K80518M84985k88411j962970k870325j230357K248604
12735e825337M802590M526192J774243j573218l137979j669985R76920J187729
12727A061155j505594l067506o51643K917270L348800J119435k23997Q2409J07093
12718C187422l97343j94498k8598j334379k419391p38162J770278Q79774k678977
12709a953874l801428j157643J101889P51589N10795J840963J863287o40753j875531
$$ y = [-2206495, -3217663, -1821313, -15542, -1083378, -4019096, -4307930, -694129, 2868704, 3059402, 1227811, 143600, 138784, 343078, 828649, 1468534, 1038490, -575285, -1297697, 192200, 2274412, 2857638, 2289863, 2032030, 1989641, 1077596, -633990, -2026669, -2487381, -2206863, -1721878, -2010289, -3973259, -6843584, -8073941, -5825337, -1022747, 3503445, 5277688, 3704470, 566491, -1103494, -126574, 1061155, -444439, -3511945, -4163588, -1246318, 2102482, 3221917, 2997920, 3080329, 3187422, 2790079, 2595581, 2566983, 1232604, -1186787, -1924949, -154671, 725103, -1953874, -5755302, -6912945, -5811056, -5059467, -4548672, -2707709, -844422, -1485175, -3360706]
12700c360706N73886L059810J862094o58089o81603K99457j157647l415475k161211
12691e639484J900509L729577J741225n59996q68622q63638j776733j817132J69523
12682c984771K083555J733177N7610o79457K3068J154048J863339J571509m4327
12673C777751j908607j847898N89548K843636K330438k46379k084747k031959
12665A421783j405162j345953j246269l23779P84975J080519Q26128P97819N84735
12656A174796o94577k203671j959032m8959R42847n9034n22420J586673L700946
12647A917569K019414k227416l970158j691023P41575O32329L08780K009430L107804
12638B848304L65215l912306m567724j054105K235984K628484J862921J765695
$$ y = [-3360706, -2786820, 272990, 2135084, 1476995, 795392, 1094849, -62798, -3478273, -5639484, -3738975, -9398, 1731827, 1171831, 303209, -560429, -2337162, -4154294, -3984771, -1901216, -168039, -110429, -789886, -766818, 387230, 2250569, 3822078, 3777751, 1869144, 21246, 610794, 3454430, 5784868, 5538489, 3453742, 1421783, 16621, -1329332, -2575601, -2899380, -2114405, -1033886, -207758, 590061, 1174796, 480219, -1723452, -3682484, -3731443, -2788596, -2847630, -3370050, -1783377, 1917569, 3936983, 1709567, -2260591, -3951614, -3210039, -2577710, -2268930, -259500, 2848304, 3213519, -698787, -5266511, -6320616, -4084632, -1456148, 406773, 2172468]
12630B172468J345583l47176j758771j259448K06464P98437M59014K20228J72278
12621B009077k15319o54213l66520O54054J615302J636557J41292k373327l680990
12612a234087j728007J994815L127792R3210l067728j996928J615344K414246
12604A218657o95265l099608j568800J229943J397310k88728l58802J428064J917600
12595A180371j20627j994969j213130J065852K130183J452269O43576O71569P82514
12586D597608L2885j259528j858474r79652P58197J701055P69358j205590k183922
12577C71937j145237P94509J679597P32029j076401k071646j389891J94907J002256
12568i07940L94274l69321K7116Q06137K17484j417048j756288l3571J493064
$$ y = [2172468, 3518051, 3170875, 1412104, 152656, 359120, 1157557, 1616571, 1836799, 2009077, 1793758, 1139545, 773025, 1427079, 3042381, 4678938, 4820230, 2446903, -1234087, -2962094, -967279, 2160513, 2253723, -814005, -2810933, -1195589, 1218657, 523392, -2576216, -4145016, -2915073, -1517763, -1806491, -2165293, -737229, 1180371, 1059744, -935225, -2148355, -1082503, 1047680, 2499949, 3143525, 3815094, 4597608, 4630493, 3370965, 1512491, 532839, 1291036, 2992091, 3761449, 2555859, 371937, -773300, 21209, 1700806, 2432835, 1356434, -715212, -2105103, -1910196, -907940, -513666, -882987, -855871, -49734, 167750, -1249298, -3005586, -3039157, -1546093]
12559a546093R17293l82884p9534J285379J245622n24044j698024r52299K97633
12550a436951N02518J72255K48601Q5299j158993k253167j181687J532980K893423
12541e95722J387890q86944j252036j44343J18845n77255N1788K480142L772940
12532D355305J799738j244842j940688n55862J18702l32262J30499J475699J049182
12523D855471j609815l238427j775015N99805J308502R44813O83803m05924k424982
12514a061769k457426P26145K891905J76863l807041k608453K748769M733609
12506A342602O82827l554941k932875K16140J719550J885874K388896J780718
12498C528791j101898l056801j013531K170058J679148j520086k384657j3156
$$ y = [-1546093, -628800, -1011684, -1091218, 194161, 1439783, 915739, -782285, -1734584, -1436951, -934433, -762178, -513577, -428278, -1587271, -3840438, -5022125, -3489145, -595722, 792168, -94776, -1346812, -1491155, -1372310, -1949565, -1897777, 582365, 4355305, 6155043, 4910201, 2969513, 2413651, 2532353, 2200091, 2330590, 3806289, 4855471, 3245656, 7229, -1767786, -1167981, 140521, 1085334, 1769137, 1363213, -1061769, -3519195, -2793050, 98855, 275718, -3531323, -6139776, -3391007, 1342602, 2025429, -1529512, -4462387, -4246247, -2526697, -640823, 1748073, 3528791, 2426893, -629908, -1643439, 526619, 2205767, 685681, -1698976, -1712132]
12490a712132J521808L60015p60440j73509l1558j483127j801037Q63653L583940
12481C67613K811691k37932j697648p03033L16997r4813q80744p89061J70109
12472g36821J427322K179728J374554r49415k781887k264997j73084J319056J544035
12463I38491J168850J30872j757123k852667j309301J496085K254455O43621l45407
12454C67876M44776O09958j034249j866620r5596J586788L04492j982452j657614
12445c322641O22166J496932P86363J091163K325569J589119j325858l001051
12437B61762j815980O093Q56487J882788L122045K008583j748604l880932j398035
12428g05793K609514L460410J296888o91160j839193l439058m404134k328003
$$ y = [-1712132, -190324, 169691, -590749, -764258, -795816, -2278943, -4079980, -3216327, 367613, 3179304, 2941372, 1243724, 540691, 857688, 762875, -117869, -906930, -736821, 690501, 2870229, 4244783, 3295368, 513481, -1751516, -1924600, -605544, 938491, 2107341, 2238213, 481090, -2371577, -3680878, -2184793, 69662, 713283, 367876, 812652, 1422610, 388361, -1478259, -1573855, 12933, 317425, -1665027, -3322641, -2700475, -1203543, -417180, 673983, 2999552, 4588671, 3262813, 261762, -1554218, -1548125, -691638, 1191150, 4313195, 6321778, 4573174, 692242, -705793, 1903721, 5364131, 6661019, 5969859, 4130666, 691608, -3712526, -6040529]
12420f040529J631959L387951J814487J47344O42970J345039k25982k876515l405406
12411c578682j072431J533804J810454J27321q86355K41195J867240J548778k60666
12402A330658p79788O62912J402769j32257j580836n11281J393474J129008n98425
12393B316234q19767M55529M77404j168091j766561j84306J306578Q60091m70530
12384A006581j215497j545016j553709k18534K282181L514961J916159p69856
12376C417270j910774j385267q34907p22954r9033J174697J756563P61408o72573
12367A484430n78701J147800K102606L10921k668238l291149q93771J225514O33289
12358e27299q05441l14981J312634J520989N02582N02804J649355J899836O13046
$$ y = [-6040529, -4408570, -1020619, 793868, 941212, 1584182, 2929221, 2703239, -173276, -3578682, -4651113, -3117309, -1306855, -1179534, -2065889, -1824694, 42546, 1591324, 1330658, 550870, 1213782, 2616551, 2484294, 903458, 392177, 1785651, 2914659, 2316234, 1496467, 1951996, 2429400, 1261309, -505252, -689558, 617020, 1477111, 1006581, -208916, -1753932, -3307641, -3526175, -1243994, 2270967, 4187126, 3417270, 1506496, 121229, -713678, -1436632, -1535665, -360968, 1395595, 2157003, 1484430, 905729, 2053529, 4156135, 4467056, 1798818, -1492331, -2386102, -1160588, -527299, -1332740, -1647721, -335087, 1185902, 1688484, 2191288, 3840643, 5740479, 6353525]
12349F353525r87867k379374l631389l463799q98611J809732J733931J81390P42574
12340e39888K879740K542772n86518k126745n20411L11021j806597l092116l70441
12331c309183L118074K852633L3188j233019o39470p34034j535754r41846Q08658
12322a580753J437523O35474N7236p465n90908j328662r48672R1605L68476K44293
12312a621853J018660K011716J394698n47171j695033j223270l6118J224812K187476
12303B713917J736027l27454j672689m57664J207934K92696j745655q63121K622387
12294C506378L799032O81731k715054k671035r40902r16802k026027j433609Q37733
12285a878555K093036J322879K36695J09874K05594k67903o71040k35970M77229
$$ y = [6353525, 5365658, 2986284, -645105, -4108904, -5007515, -3197783, -1463852, -1282462, -539888, 2339852, 4882624, 4296106, 2169361, 1648950, 1959971, 153374, -2938742, -3309183, -191109, 2661524, 2694712, 1461693, 822223, 88189, -1447565, -2389411, -1580753, -143230, 492244, 549480, 542015, -48893, -1377555, -2326227, -2234622, -1866146, -1621853, -603193, 1408523, 2803221, 2256050, 561017, -662253, -698371, 526441, 2713917, 4449944, 4122490, 2449801, 1992137, 3200071, 3492767, 1747112, 883991, 3506378, 7305410, 7987141, 5272087, 2601052, 1660150, 743348, -1282679, -2716288, -1878555, 214481, 1537360, 1774055, 1883929, 2089523, 1821620, 1150580, 914610, 1391839]
12276A391839M18839l12786o07076j7670M85937j09506j179060j024759P28385
12267b25857K231792J607408o02381k113397j672275j46644J013056J291721Q52948
12258B236371j92472j492332j947032n45453J976941L093815J116989k252671
12250A994156l344024j052034J515166J199310r13808j563026m73552k45233j380055
12241d263100j251521J004801K389832Q97198r35863k32062J357772O34630j454696
12232a853009j372836Q51439J523385n43644j969633j28485K906830L592301J624958
12223D631306n66325j383960j178750p32747l16429k0811O7491Q0683K49190N10840
12213A340488L95364n77202k105906k809558j508929R65439K319782J692154P19935
$$ y = [1391839, 1810678, 1497892, 890816, 873146, 1359083, 1249577, 70517, -954242, -225857, 2005935, 3613343, 3010962, 897565, -774710, -921354, 91702, 1383423, 2236371, 2043899, 551567, -1395465, -1940918, 36023, 3129838, 4246827, 1994156, -1349868, -2401902, -886736, 312574, -601234, -2164260, -2637812, -2883045, -4263100, -5514621, -4509820, -2119988, -1222790, -2158653, -2390715, -1032943, -398313, -1853009, -3225845, -2374406, -851021, -1394665, -3364298, -3492783, -585953, 3006348, 4631306, 4064981, 2681021, 1502271, 769524, 453095, 432284, 499775, 580458, 829648, 1340488, 1735852, 1158650, -947256, -3756814, -5265743, -4300304, -1980522, -288368, 431567]
12204D31567Q46928J101525O1515j371124j235841L28031J372266J107715N04049
12195C146631K43844J00150J18349M19728Q7175j603650l054302j892957J217583
12186a217449K862050J463103q69280j777690j409716o67388P00714K531095K962242
12177D577681R24089j573752j816971j5727J444273J441419O56410n74671k392844
12168B669907l525535j992769J519300L406026J736594q47704q38512J035334
12160C162641J145149j222525k695664j202323P06872L9357j697731r46228J945435
12151g65017K991709O74579j914200j923184m08929M07360N73005R14323O18413
12142A168059r95818k122880q11908J520545J833236K7130j107497k94836O88423
$$ y = [431567, 1278495, 2380020, 2441535, 1070411, -165430, 162601, 1534867, 2642582, 3146631, 3390475, 3490625, 3608974, 4028702, 4115877, 2512227, -542075, -2435032, -1217449, 1644601, 3107704, 2238424, 460734, -948982, -1616370, -915656, 1615439, 4577681, 5501770, 3928018, 2111047, 2095320, 3539593, 4981012, 5637422, 5062751, 2669907, -855628, -2848397, -1329097, 2076929, 3813523, 2965819, 2127307, 3162641, 4307790, 3085265, 389601, -812722, -105850, -66493, -1764224, -2710452, -765017, 2226692, 2901271, 987071, -936113, -1345042, -937682, -364677, 549646, 1168059, 172241, -1950639, -2762547, -1242002, 591234, 618364, -489133, -783969, -95546]
12133i5546K54670o94840n96659N03171J536774J998746J955759J263612k87111
12124E838576k162196k969087j686637O58168J272364j101997l631515k433054
12116f215378J585162K976054p15507m881897m039631O20355L529653K652993
12108d488196Q15996J27706k80213p92408m8621J718940J926692j32705j565201
12099b718010l04738J562577J168673p12664j158631M59093K018543J964727R72783
12090C252353L26704J47878l03775j183859j475439k59716J488571J530115m38739
12081C084093j664791r3657K145680J575740j274268k628455j323443j61780p58586
12072a099467r57282Q51992K392166J175717j205222j588695j26509O09401J73223
$$ y = [-95546, 159124, -535716, -1132375, -629204, 907570, 2906316, 4862075, 6125687, 5838576, 3676380, 707293, -979344, -321176, 951188, -150809, -3782324, -6215378, -4630216, -1654162, -2369669, -7251566, -11291197, -10670842, -7141189, -4488196, -3672200, -3544494, -3824707, -4617115, -4665736, -2946796, -1020104, -1152809, -2718010, -3022748, -1460171, -291498, -1004162, -2162793, -1703700, 314843, 2279570, 3252353, 3579057, 3726935, 3423160, 2239301, 763862, 504146, 1992717, 3522832, 3084093, 1419302, 1325645, 3471325, 5047065, 3772797, 1144342, -179101, -340881, -1099467, -2056749, -1204757, 1187409, 2363126, 1157904, -430791, -557300, 52101, 225324]
12063B25324M86958J867437K037465k44917l007687l603862j866480K75689J260905
12054b569168J021173L09300j54716L1976Q58018J762193J801020M43628j543747
12045A959677k436286j366243M31489R17813k80693j477609j053467P78478K455888
12036g0953K643163J250535m63922q16949N67275K011577J563049n77992k297272
12027C808511k152199p39220M64318N42485n86004k159241k678426j201201J163035
12018c537942K119861Q96516r00919j451681p17733J75234O12921Q70093J315648
12009f18002J763730J524730J40612j742483k645225j869551l65748N74889Q68478
12000b368570J170111J588072J765706J582621R44463l15051j562579j583361
$$ y = [225324, 712282, 2579719, 4617184, 4372267, 1364580, -2239282, -4105762, -3830073, -2569168, -1547995, -1238695, -1393411, -1361435, -503417, 1258776, 3059796, 3503424, 1959677, -476609, -1842852, -1411363, -493550, -774243, -2251852, -3305319, -2526841, -70953, 2572210, 3822745, 3358823, 2541874, 3109149, 5120726, 6683775, 6105783, 3808511, 1656312, 917092, 1381410, 1923895, 1337891, -821350, -3499776, -4700977, -3537942, -1418081, -521565, -1422484, -2874165, -3591898, -3416664, -2803743, -1933650, -618002, 1145728, 2670458, 2811070, 1068587, -1576638, -3446189, -3811937, -3237048, -2368570, -1198459, 389613, 2155319, 3737940, 4682403, 4367352, 2804773, 1221412]
11992A221412n85337m16232j564850j935241l90575P83471m07721j737751j02237
11983e135061K953199L300156Q38522n59986M73894J094214l66110j756489j182681
11974c40342J36198N67918L08045k78247j346377j759092j04099J800091N72983
11965d42922k643788k663289J506260M244267J934816j331674o60127J896197
11957A839740J570197j007178j726505m10858l38410j767511j661914M98209J774109
11948a230121R29903Q4905N67707R82771L01522l70544q4606N14326Q06839J038961
11938C541663J035710R4318j455412k329383k065977j204782M665J389917J839165
11929H49884M32047j699000k402661j132159Q72620K325035K417963P73071j450129
$$ y = [1221412, 636075, 219843, -1345007, -3280248, -3670823, -2887352, -3295073, -5032824, -5135061, -2181862, 1118294, 1956816, 1396830, 1870724, 2964938, 2598828, 842339, -340342, -204144, 363774, 671819, 393572, -952805, -2711897, -2815996, -1015905, -442922, -3086710, -5749999, -4243739, 528, 1935344, 603670, -56457, 1839740, 3409937, 2402759, 676254, 265396, -73014, -1840525, -3502439, -3004230, -1230121, -300218, -215313, 352394, 1335165, 1636687, 1266143, 1181537, 1695863, 2502702, 3541663, 4577373, 4671691, 3216279, 886896, -1179081, -2383863, -2379198, -989281, 849884, 1281931, -417069, -2819730, -3951889, -3079269, -754234, 1663729, 2436800, 986671]
11920I86671j794047J90845J528277M4413j916253j095526J183384J093536j249316
11911a028016j886853N36090K753984K054390k59596j666030j546579m36258J104393
11902c74475J904967R29422o82960o80427P98866J351158K18466q01272p68221
11893A895524q09154j243443p49246O17693Q39273l94001p39354N49787Q98285
11884H65364r60256k066346N6925K622886J283485l010809m753942j272158L802175
11875c432676N162797J923929j917066k257522O76619K907335J641647j332932
11867C372131k298410o86825P09009K83239n00835m08331o31957k049500k729545
11858d941024n09752L316566N076211K984429j028016l406986k243830R42210
$$ y = [986671, -807376, -616531, 911746, 956159, -960094, -2055620, -872236, 221300, -1028016, -2914869, -2378779, 375205, 2429595, 2169999, 503969, -1042610, -1478868, -374475, 1530492, 2459914, 1776954, 1096527, 1895393, 3246551, 3465017, 2663745, 1895524, 1086370, -157073, -906319, -288626, 550647, 156646, -582708, -32921, 865364, -94892, -2161238, -2104313, 518573, 1802058, -1208751, -5962693, -7234851, -3432676, 1730121, 3654050, 1736984, -520538, 156081, 3063416, 4705063, 3372131, 1073721, 386896, 1095905, 1379144, 878309, 469978, -161979, -2211479, -4941024, -5450776, -2134210, 2942001, 5926430, 4898414, 1491428, -752402, 189808]
11850A89808K465311M03711k928059l812726j917823r6628J53114Q2077M66279
11841d994936L69312k02111J63006J157276P68007n82651q5280J904509J370772
11832a32096j977255k525010K081195N303235J141126n548073n597614O84920
11824f569572M490763J991190j493988j280510O01265J063538Q49838J002489
11816F55013J82967j562278j392599J152919K366647N87085o78340R42227K225077
11807D478718J91505k240163j222707J363609J479882j16140q4082R18161j97831
11798D570952k529128k346265J73610J173159j77350p59328N22906J249622N26727
11789B404905K51520N23099q56113l127926k466947J041582K150191j044751l172727
$$ y = [189808, 2655119, 3058830, 130771, -3681955, -5599778, -5696406, -5543292, -5461215, -4994936, -4625624, -4827735, -4664729, -3507453, -2739446, -3322097, -3407377, -1502868, -132096, -2109351, -4634361, -2553166, 2750069, 3891195, -1656878, -7254492, -6569572, -2078809, -87619, -1581607, -2862117, -2260852, -1197314, -347476, 655013, 837980, -724298, -2116897, -963978, 1402669, 1989754, 1311414, 2253641, 4478718, 4670223, 2430060, 1207353, 2570962, 4050844, 3934704, 3850622, 4768783, 4570952, 2041824, -304441, -130831, 1042328, 864978, 105650, 628556, 1878178, 2404905, 2656425, 3179524, 2323411, -804515, -3271462, -2229880, -79689, -1124440, -4297167]
11780d297167j24406L893005L019641j005064k318998l73714O75012r3159J20479
11771e04371J259110K26217k393053k072184J743763L684660Q77507k299315j244572
11762g22238J915446K475328L73206j203062j488749j796023j631838J45242J669769
11753b62919K42048k521018k275778J314586L802060K499119k80808j590712j605210
11744f78632j422477o39404P50267R97508m82078j285269M22698K654859K490770
11735B808242M09083r57908q53226l48424L94389J671219J965681m41660l837368
11726H10028m429519j662249R94737J221158O30355J175449J844784R60851o03647
11717I41947r23823k15384k05203j164366j572361m03532J620671K794050J762121
$$ y = [-4297167, -4421573, -528568, 2491073, 1486009, -832989, -1206703, -531691, -624850, -504371, 754739, 980956, -1412097, -3484281, -1740518, 1944142, 2821649, 522334, -722238, 1193208, 3668536, 4041742, 2838680, 1349931, -446092, -2077930, -1932688, -262919, -20871, -2541889, -4817667, -3503081, 298979, 2798098, 2517290, 926578, -678632, -2101109, -2740513, -1990246, -992738, -1474816, -2760085, -2337387, 317472, 2808242, 3217325, 2259417, 1406191, 1057767, 1452156, 3123375, 5089056, 4647396, 810028, -3619491, -5281740, -4287003, -3065845, -2435490, -1260041, 584743, 1545594, 941947, 18124, -197260, -402463, -1566829, -3139190, -3542722, -1922051, 871999, 2634120]
11708B634120j107627l217956k044673J323143K829990P82447j728612j510982
11700b040150J46119L39849l33609N81482K160120J149312k021343l086275o56768
11691c761263J489964N85915r49022j58751J420064R66191l12068O49350K979099
11682B909479K735863q01352l757900l166593n11900J286515J643334J565041
11674A902487J297036N58629j47252j62841L8614m26196j208085j043891L08502
11665A117003J531171J474119N94657M6849o0355m67817j029771o11305P36348
11656C330899J010549r79113l281073l163711j015150M67746N72291J169078K742253
11647H53769L050973J039563r14140o92702J55745p82616k620306k674553p82428
$$ y = [2634120, 1526493, -1691463, -3736136, -2412993, 416997, 1199444, -529168, -2040150, -1894031, -1554182, -1887791, -1306309, 853811, 2003123, -18220, -3104495, -3761263, -2271299, -1685384, -2634406, -2793157, -1373093, -406902, -718970, -69620, 2909479, 5645342, 4843990, 1086090, -2080503, -2592403, -1305888, 337446, 1902487, 3199523, 3758152, 3610900, 3448059, 3486673, 3060477, 1852392, 808501, 1117003, 2648174, 4122293, 4716950, 4763799, 4703444, 4235627, 3205856, 2594551, 3330899, 4341448, 3362335, 81262, -3082449, -4097599, -3629853, -3057562, -1888484, 853769, 3904742, 4944305, 4030165, 3337463, 3493208, 2710592, 90286, -2584267, -3366695]
11638c366695P41862O60748j96444q44223p82561M93190K370391K492765j64201
11629A404832k591696j232418K458189L473314L41722k898198k679121m46152
11621b169528M28291n07178j214107o79969J76825L91722K12528N76969J849163
11612i35284K933705K077652o27505k364357q49237K156476K752493O9224k830011
11603B383156l260230j631522M39386K042510K267683K93727k545173l147256
11595c157719o23910K074465K020044q560j288545r62983l11197l92527j084632
11586c735564j715730j435204K92110K609129L536539K180799j31665j524475
11578G5939j416207l00005R96028J281690k59031k485190k862008n66404K168169
$$ y = [-3366695, -2624833, -1964085, -2160529, -3004752, -3787313, -3294123, -923732, 1569033, 1404832, -1186864, -2419282, 38907, 3512221, 3853943, 955745, -1723376, -2169528, -1741237, -2248415, -3462522, -4142491, -3965666, -3573944, -3361416, -2784447, -935284, 1998421, 4076073, 3448568, 1084211, 234974, 2391450, 5143943, 5213167, 2383156, -877074, -2508596, -2069210, -26700, 2240983, 2534710, -10463, -3157719, -3781629, -1707164, 312880, 304320, -984225, -1947208, -2258405, -2650932, -3735564, -5451294, -6886498, -6594388, -3985259, -448720, 1732079, 1600414, 75939, -1340268, -1640273, -644245, 637445, 378414, -2106776, -4968784, -5535188, -3367019]
11569c367019K690129Q36645j473037k389565j289203R52811K249730J147147
11561f42362j116324j767583j15984J606905J496492K43243n38675m14699K89345
11552i59642J254612J628083M15957j704842k624497j607371j28464O88209J376461
11543a661494K112473J730830p0055j661267j822372j192275n01038L62462P03971
11534a998765p43654k815401k325220R25732K973681J642445P256R99642K259182
11525I24898M26612k515940k193879Q03013J828489l08485j930795q43457P41012
11516c068532P58958M92365J330260J856653N90950r63708o38682P84491R40701
11507B083456j59183l00711R43808J195082p36223k286143q63216J498724O75878
$$ y = [-3367019, -676890, 159755, -1313282, -3702847, -4992050, -4039239, -1789509, -642362, -1758686, -3526269, -3642253, -2035348, -538856, -295613, -834288, -1248987, -959642, 294970, 1923053, 2339010, 634168, -1990329, -3597700, -3726164, -3037955, -1661494, 450979, 2181809, 2111754, 450487, -1371885, -2564160, -3065198, -2702736, -1998765, -2742419, -5557820, -7883040, -6957308, -3983627, -2341182, -2333926, -1334284, 924898, 1351510, -1164430, -3358309, -2555296, -726807, -1035292, -2966087, -3809544, -3068532, -2309574, -1817209, -486949, 1369704, 1960654, 996946, 358264, 1142755, 2083456, 1924273, 1623562, 2567370, 3762452, 3026229, 740086, -123130, 1375594, 2051472]
11498B051472k686646l206829Q70279M013290J640361k273528j399715K354466
11490A363150J920438k602115l455519J689163N112954J384120l748565k761556
11482a097930J802366K247539j923798m366824k254095R68638K260635K158801
11474b04668J516353L73504P204J568002K984229J409498j877891l185797k116896
11465D73538j151120n23768J494311L737201K886033o34732k533676j238219L4161
11456B543729j040742k411867j542782O23765J407271j15912k441537l021645
11448e999720m87070L100379L623206N12822j475009Q27853L416631J136308l595981
11439A059419m305233q00142J107880m94497j532774j88391M04998p53452k19924
$$ y = [2051472, -635174, -3842003, -2971724, 1041566, 2681927, 408399, -991316, 1363150, 3283588, 681473, -2774046, -1084883, 4028071, 5412191, 1663626, -1097930, 704436, 2951975, 1028177, -3338647, -5592742, -4624104, -2363469, -204668, 1311685, 1685189, 1692393, 3260395, 6244624, 7654122, 5776231, 2590434, 473538, -677582, -1201350, 292961, 4030162, 6916195, 6281463, 3747787, 2509568, 2543729, 1502987, -908880, -2451662, -1827897, -420626, -536538, -2978075, -5999720, -6486790, -3386411, 236795, 749617, -725392, 102461, 3519092, 4655400, 1059419, -3245814, -4045956, -2938076, -3432573, -4965347, -5153738, -4748740, -5502192, -5722116]
11430e722116K615347L111215l30223k284616R83705M783407L178828j878446
11422D457101m170482k435671m92497m84197r92599o37180L74731J511250K083719
11413g85825J275401k32466n13024L70791J05193j494938j471499Q76542J753210
11404a16615r51846l392624j642268J855646K379737M56772J14945J716881J919100
11395B339728k02509j956787j732918o38467N03783J949046K772248J471531q55455
11386C650200j289347M57019J450957J08058j512534j057556Q28300J868193J148670
11377E651960m51965j700700j870905q74446O52535J633326J358698R0534j119139
11368C369898j329554o61047j08528j14030j7993L80309j26820k048493l322536
$$ y = [-5722116, -3106769, 4446, -325777, -2610393, -1626688, 3156719, 6335547, 4457101, 286619, -2149052, -2641549, -3125746, -4118345, -4755525, -4380794, -2869544, -785825, 489576, 257110, -255914, 114877, 220070, -1274868, -2746367, -1869825, -116615, -1068461, -4461085, -6103353, -4247707, -1867970, -1411198, -1296253, 420628, 2339728, 2137219, 180432, -1552486, -2190953, -1687170, 261876, 3034124, 4505655, 3650200, 2360853, 2817872, 4268829, 4376887, 2864353, 1806797, 2635097, 4503290, 5651960, 5199995, 3499295, 1628390, 753944, 1406479, 3039805, 4398503, 4489037, 3369898, 2040344, 1379297, 1270769, 1156739, 1138746, 1519055, 1392235, -656258, -3978794]
11359c978794j847291R60676J944008R93639P51803J678032J299026r27912j997937
11350a124750j59080K192179K282180N48202j296412k720064l147940j497449
11342d923134J104086J401196j050880k381480k10324K542641K455435P22477
11334c39983J83655N19708J20536k09445O04681P29561j376939k983214r00884
11325c652324K624555K733571n29249k423770p97294J510262J824200J038893
11317B328844R34789J321436J022655l20345k038136k774550j433220J017126
11309E8599J854539J86152j459806r02047M78361N98031L38844J336185K323184
11300D812042J187269j123952k249698k224408k154921j139872J519853L110239
$$ y = [-3978794, -5826085, -4865409, -2921401, -1927762, -1175959, 502073, 1801099, 873187, -1124750, -1283830, 908349, 3190529, 3738731, 2442319, -277745, -3425685, -4923134, -3819048, -2417852, -3468732, -5850212, -6060536, -3517895, -1062460, -339983, -156328, 363380, 483916, 274471, 879152, 1608713, 231774, -2751440, -3652324, -1027769, 1705802, 1176553, -1247217, -2044511, -534249, 1289951, 2328844, 3263633, 4585069, 5607724, 5287379, 3249243, 474693, -958527, 58599, 1913138, 2099290, 639484, -262563, 215798, 813829, 1152673, 2488858, 4812042, 5999311, 4875359, 2625661, 401253, -1753668, -2893540, -1373687, 1736552]
11292A736552J074804j985613j817174N84570J001762m56705n6605J945024J245274
11283C271889k344706l572579l64032K667409J937133J58451N77824J393533M0259
11274C765181j565478p20270P21854m23190k678527k042975J341159L164498J131804
11265B694056k474870m374780l582064j068426J570991K898678K597360J651464
11257h7591Q30667j35130j122831r56876N09544J367515M27818o53944p5542R65624
11247A069254M08718q07174k25674J513042J172485j645294l142452q60023K411331
11238a05787K584639N0611j399412l67358O84891r719o62390P55291K733915K395509
11228F660190J64580q36848R1405J5363k643253m933737l451150N69590L058335
$$ y = [1736552, 2811356, 825743, -991431, -406861, 594901, 138196, 81591, 2026615, 3271889, 927183, -2645396, -3009428, -342019, 1595114, 1753565, 2331389, 3724922, 3765181, 2199703, 1479433, 2201287, 1778097, -900430, -2943405, -1602246, 1562252, 2694056, 219186, -4155594, -7737658, -8806084, -7235093, -4336415, -1739055, -87591, 743076, 607946, -514885, -1471761, -962217, 405298, 833116, 179172, 103630, 1069254, 1477972, 670798, 445124, 1958166, 3130651, 1485357, -1657095, -2517118, -105787, 2478852, 2529463, 1130051, 762693, 1447584, 1437865, 775475, 1530766, 4264681, 6660190, 6824770, 5987922, 6079327, 6094690, 3451437, -1482300, -4933450, -4363860, -1305525]
11219a305525K708485J682568J257124J17811k356644m033674k856731Q8350J975722
11210b722514J639022K51207n86133k26550J008654K119025J993123N13076j100262
11201B888648j665544j448198j457894j630527p88774J334538L060424K600263
11193B892936M00985j370094j517695q60878m76304k48981K32793O43859P07570
11184D04191P93886P04659o53890k946332l495156q80292K156594K230891L44578
11175a340871n7283J089410R03227o56527m94934J515982J494779j610559l379854
11166b536630r40228K193375J916063j51337m15997L99545l64034j635547o41618
11157b176408J459626J285287p40767j191142L02287P65172n79775j245853k74788
$$ y = [-1305525, 1402960, 3085528, 4342652, 4460463, 2103819, -1929855, -4786586, -4698236, -2722514, -1083492, -832285, -1418418, -1644968, -636314, 1482711, 3475834, 3988910, 2888648, 1223104, -225094, -1682988, -3313515, -4102289, -2767751, 292673, 2892936, 3293921, 1923827, 406132, -454746, -931050, -1180031, -947238, -303379, 404191, 1198077, 1902736, 1248846, -1697486, -5192642, -6072934, -3916340, -1685449, -1340871, -1398154, -308744, 594483, -62044, -556978, 959004, 2453783, 843224, -2536630, -3476858, -1283483, 632580, 481243, 65246, 464791, 100757, -1534790, -2176408, -716782, 568505, -172262, -1363404, -1061117, -295945, -875720, -2121573, -2396361]
11148b396361K26831q81811j847444j040397R16362K543728K725094P66924k343338
11139a330412l468189q58967K738591L431955J402270m77388j567432k853630
11131b983202k988616o9431L443515L130544j41102j069436J483296K709795P9536
11122C594899k570843j630966Q35030J305302J02239o93390r81635j339724j159727
11113b538815n73323j025123j833937k2394M002647N011838O53078l666331k141064
11104b133424K664009L724237q6296l229169k187816N34246J556748J109938Q68061
11095B820534O90027m55044k182776l005734k197496m52135J002427J620819J861174
11086b98204K104156J644666j45156j873958j236215J492217L130715J746536
$$ y = [-2396361, -2169530, -3051341, -4898785, -5939182, -5022820, -2479092, 246002, 1012926, -1330412, -4798601, -5657568, -2918977, 512978, 1915248, 1437860, -129572, -2983202, -5971818, -6041249, -2597734, 532810, 391708, -677728, 805568, 3515363, 3594899, 1024056, -606910, 228120, 1533422, 1635661, 942271, -39364, -1379088, -2538815, -3112138, -4137261, -5971198, -5993592, -1990945, 3020893, 3673971, 7640, -2133424, 530585, 4254822, 4168526, 939357, -1248459, -714213, 842535, 1952473, 2820534, 3510561, 3055517, 872741, -2132993, -4330489, -4782624, -3780197, -2159378, -298204, 1805952, 3450618, 3305462, 1431504, 195289, 1687506, 4818221, 6564757]
11078F564757q57172k052345j744785j176546l69879R88446J614119J66272k037075
11069A095792k332518n95528M08539j003076k868737k074641J368296L840818
11061b161055K442562r72210j752695J181185L267071O25412l682348l435184
11053d487262J612739N008684K750078j484187k455236o45389P535j262655j778989
11044b734682m05940R83831Q52575n4219l79331J66524J003818J295629N05264
11035A233469p36433q91753M55818J663153J106726o92962j995280j902539n84481
11026b344282J358202K704770K081866j55795j718939j235529n773K72292n0802
11017I06010O5554J71360m93622r50896R8103J635904J423898o08003k148942
$$ y = [6564757, 5707585, 3655240, 1910455, 733909, 364030, 1352476, 2966595, 3132867, 1095792, -1236726, -1832254, -1423715, -2426791, -5295528, -7370169, -6001873, -2161055, 281507, -690703, -2443398, -1262213, 2004858, 2630270, -1052078, -4487262, -2874523, 2134161, 4884239, 3400052, 944816, 299427, 306962, -955693, -2734682, -3140622, -2156791, -1304216, -1358435, -1737766, -1571242, -567424, 728205, 1233469, 497036, -394717, 61101, 1724254, 2830980, 2138018, 142738, -1759801, -2344282, -986080, 1718690, 3800556, 3644761, 1925822, 690293, 684520, 956812, 906010, 971564, 1142924, 649302, -301594, -203491, 1432413, 2856311, 2248308, 99366]
11008I9366j675165r3183R06653O85660l55966j424818j654123o27893J060300
10999c079169K150542J795836L45826p72043k78856J295666J767244J72971j321690
10990B076327k71360J955327J712810j257429l042644j438211Q16777N97760j009387
10981A39970j378750q67107j284976j886876o95553J364070J562610J71391K99381
10972b575840K560803L597798J236835j939661k231691J4665J252469j56930j929659
10963a71211j236584J431069K878320J324978j307597j906609j34175J480584
10955B358775J161542j34938p53986n73124k32663K76810Q86246N65757j237584
10946B316835l118921l198443j521410L22387J375198J783416J639201P83592
$$ y = [99366, -1575799, -1668982, -762329, -76669, -432635, -1857453, -3511576, -4139469, -3079169, -928627, 867209, 1213035, 440992, 162136, 1457802, 3225046, 3398017, 2076327, 1804967, 3760294, 5473104, 4215675, 1173031, -265180, 551597, 1149357, 139970, -1238780, -2105887, -3390863, -5277739, -5973292, -4609222, -3046612, -2875221, -2575840, -15037, 3582761, 4819596, 2879935, 648244, 662909, 1915378, 1758448, -171211, -1407795, 23274, 2901594, 4226572, 2918975, 1012366, 878191, 2358775, 3520317, 3385379, 2631393, 2058269, 1825606, 2102416, 2988662, 3554419, 2316835, -802086, -4000529, -5521939, -5199552, -3824354, -2040938, -401737, 381855]
10938C81855m28005j282959j493065j114804k40748M96256M8560j295010j322645
10929f250565J265900M174324L787452J12943k717976j693560J085595J210825
10921I74938k065153m587756k562682K360076M884877K670434r07101j548445
10913g80812L53849J106898m97922j927528j428000m32729k76181L49614K410004
10904a122807L530481J123358k890124l909061r88659J805916J077330j535034
10896b908600k137743J40277K626490L008084J750587M97238k66381r94713j503780
10887B11459j005224L52295J177479N16794r35236j730004j133941N38846K226070
10878B18538K518214Q77507j191957j550025m06378q6465j160163j275548P12187
$$ y = [381855, -46150, -1329109, -2822174, -3936978, -4177726, -3681470, -3632910, -4927920, -6250565, -4984665, -810341, 2977111, 3090054, 372078, -1321482, -235887, 974938, -1090215, -5677971, -8240653, -5880577, -995700, 1674734, 767633, -780812, -426963, 679935, 182013, -1745515, -3173515, -3606244, -3882425, -3532811, -1122807, 2407674, 3531032, 640908, -3268153, -4256812, -2450896, -1373566, -2908600, -5046343, -4906066, -2279576, 728508, 2479095, 2976333, 2709952, 1715239, 211459, -793765, -441470, 736009, 1252803, 317567, -1412437, -2546378, -2007532, 218538, 2736752, 3614259, 2422302, 872277, 465899, 379434, -780729, -2056277, -1344090]
10869a344090K252318J177170m16906K87512J747364P16925j762640j946899l7331
10860F73423J48618j828640k033347P65045K624005J175731m01885P81581K176282
10851D080813L41071l054204m022603k369901q51749k12853Q62255K123643J890726
10842a212802K46946j002353j161974q89533j86345J373936K817307K457613L10901
10833B753696j857947k629433j824353j4297J601746J671799K45952j008186j021364
10824b082387m97741j30575N02545J207996N76145j320010j912492J68764K544778
10815i42977K509192R51818L19420O08278L10271k88703M6253N58588l35374j748732
10805A988034j427620L00015Q61271l58866j212894m94002L99737K05270k76359
$$ y = [-1344090, 908228, 2085398, 1668492, 1956004, 3703368, 4420293, 2657653, 710754, 673423, 822041, -1006599, -3039946, -2274901, 349104, 1524835, 1122950, 1904531, 4080813, 4421884, 1367680, -2654923, -5024824, -5876573, -6089426, -5227171, -3103528, -1212802, -965856, -1968209, -3130183, -4019716, -4206061, -2832125, -14818, 2442795, 2753696, 895749, -1733684, -3558037, -3572334, -1970588, -298789, -52837, -1061023, -2082387, -2580128, -2710703, -2208158, -1000162, -424017, -1744027, -3656519, -3487755, -942977, 1566215, 2518033, 2837453, 3445731, 3756002, 3467299, 3513552, 4072140, 3736766, 1988034, 560414, 860429, 1721700, 1362834, 149940, -344062, 55675, 260945, -15414]
10796a5414l3196K99747l39166j558465j915173o98232J175070J889231N90666
10787f04932j237620j092687J201344K638421Q49191k255947k608768O03920L714900
10778A207822L207919r0130k458518j919726p0318O04846j52531q95523j166237
10769a732396j748187k222661p81477K296792L541613J031860j956709j306459
10761b877624J650014K250557r3399j339138L02922J809962P34085j360942k420826
10752a344389k680679k173960L33349L765599M255247Q86337j967895r57120J377639
10743A494128J297638l00862o30160k85896j334022k609694j501554J176088K280282
10734d14052J183310j20541o34922o94538J20011J967197K739713N76304k446904
$$ y = [-15414, -48610, 251137, -88029, -1646494, -3561667, -4259899, -3084829, -1195598, -604932, -1842552, -2935239, -1733895, 904526, 1753717, -502230, -3110998, -2507078, 1207822, 4415741, 4325611, 1867093, -52633, -122951, 481895, 329364, -566159, -1732396, -3480583, -5703244, -6484721, -4187929, -646316, 385544, -1571165, -2877624, -1227610, 1022947, 929548, -409590, -106668, 1703294, 2437379, 1076437, -1344389, -4025068, -6199028, -5865679, -2100080, 2155167, 3041504, 1073609, 116489, 1494128, 2791766, 2490904, 1860744, 1574848, 240826, -2368868, -3870422, -2694334, -414052, 769258, 648717, 13795, -680743, -560732, 1406465, 4146178, 4722482, 2275578]
10725B275578k589298J08876J959966R93846r20398j510828r59685o76043j041166
10716b359152j105451J07355K003044K319699j04347k716546j864462J711795
10708b008065L262191Q65684j894366j845936o97331q49221q27907J283129L307677
10699E95855K310674j70921p59205M2202n89374k157601j617216J016350K351693
10690A022457Q20903j561712k660643k279348q61353J062294K255222J918792
10682b83388J072905R60605J071412N54333P5521K39641m5082j414142k268848
10673c7043j513211p99616j427107j534030N33146K624683K110594L85390J74709
10664E17515O13195o76203k491635j724646J089147K464582J493184L82846j5516
$$ y = [2275578, -313720, -204844, 1755122, 2748968, 1828570, 317742, -641943, -1317986, -2359152, -3464603, -3357248, -1354204, 965495, 861148, -1855398, -3719860, -2008065, 1254126, 2119810, 225444, -1620492, -2317823, -3167044, -3994951, -2711822, 595855, 2906529, 2735608, 1976403, 2018605, 1429231, -728370, -2345586, -1329236, 1022457, 1843360, 281648, -2378995, -4658343, -5519696, -4457402, -2202180, -283388, 789517, 1750122, 2821534, 3375867, 3451388, 3691029, 3645947, 2231805, -37043, -1550254, -2349870, -3776977, -5311007, -4777861, -2153178, -42584, 342806, 517515, 1130710, 454507, -2037128, -3761774, -2672627, -208045, 1285139, 1667985, 1652469]
10655A652469r83583k345598k160767m43850L29420p77606j517333J63833L085981
10646b997034M219004K257499p43150j531676J76372Q70995j613792l873304j661680
10637d896766K517093K324030j992506l229600J051122M252704J751862j656643
10629A21296p01265J283310p62983l830812k133464K369513L285610N17933o33527
10620d84389R55197J490415m7400p26047L24866R90746P79430R07478O95811j049201
10610C836906k443293j312771K32121q34987k616650j354608J688288K202916
10602f02078J7556j331860p10010K37066J156867K366456K071392p86316l052821
10593f33748j665246J021369J098800n50570p85600O8497J42093K52626J163255
$$ y = [1652469, 668886, -1676712, -3837479, -4281329, -3951909, -4729515, -6246848, -6083015, -2997034, 1221970, 3479469, 2736319, 1204643, 1381015, 2252010, 638218, -3235086, -4896766, -2379673, -55643, -2048149, -5277749, -4226627, 26077, 1777939, 121296, -579969, 703341, -59642, -3890454, -6023918, -3654405, -368795, 149138, -484389, 470808, 1961223, 1913823, 1187776, 1512642, 2503388, 3282818, 4190296, 4886107, 3836906, 1393613, 80842, 312963, -522024, -3138674, -4493282, -2804994, -602078, -584522, -1916382, -2626392, -2389326, -1232459, 1133997, 3205389, 2419073, -633748, -2298994, -1277625, -178825, -729395, -1514995, -1446498, -1304405, -1051779, 111476]
10584A11476N86357j943108k008748K185086M730582R98568m029848l729945k60077
10575c359657R21886Q26783K437505K712780j183841l802295p8122L994350Q02020
10566C271409m749731l216521K634776K885940j939128k810714J148374K397768
10558c77827l66859j209357N76690K43370j378928N17213L624422J808238k501360
10549I35602k138816J156803L97345k496788n96020L376228J726189k351022k00910
10540a91389M477263J345290o017189m859108L365861N012875j178276k979285
10532a023958J559232J445817m489881m684648K395621M901435M63854m9799M659758
10523E177431L045037n282340o293683K104001M823083k726974o322970K53306
$$ y = [111476, 697833, -1245275, -3254023, -1068937, 3661645, 4660213, 630365, -3099580, -3359657, -2437771, -1610988, 826517, 3539297, 2355456, -1446839, -1524961, 2469389, 3271409, -1478322, -4694843, -2060067, 825873, -1113255, -3923969, -2775595, -377827, -744686, -1954043, -1377353, -1133983, -2512911, -1995698, 1628724, 3436962, 935602, -1203214, -46411, 350934, -2145854, -2741874, 634354, 2360543, 9521, -191389, 4285874, 5631164, -386025, -5245133, -1879272, 3133603, 1955327, -1023958, 535274, 1981091, -2508790, -7193438, -4797817, 103618, 567472, 517673, 5177431, 8222468, 2940128, -3353555, -1249554, 3573529, 846555, -5476415, -5223109]
10515e223109M738178P99393j643397J456344P59605m275650j786104O801085
10507A626345N454186n205545o021312M265561M959836o101345o422557O628234
10499h16597Q038359n209541m848232J1642746R604682j4333050j5313220J5304111
10491D069258K0821092j4914613j1683702P7012934J48946401P9564282p8934459
10484B24881193j50796176p8762573J3650337J8802618k0123263j8858277J1574714
10477C68573J3635937q138091j0078010N892977N495299q974075p824209P019831
10469b601768Q361991m032062o450860L107818N422551j245798j514933M072707
10461E119646J356523p042169n618040L891075N651121q40637j942386L072978
$$ y = [-5223109, -484931, 314462, -1328935, 127409, 887014, -3388636, -5174740, 1626345, 7080531, 1874986, -4146326, 119235, 5079071, -1022274, -7444831, -816597, 7221762, 2012221, -2836011, 8806735, 18411417, 4078367, -11234853, 4069258, 24890350, 9975737, -1707965, 75304969, 224251370, 303815652, 224881193, 74085017, -4677556, 8972781, 27775399, 7652136, -11206141, 368573, 14004510, 5866419, -4211591, 1681386, 7176685, -1797390, -9621599, -2601768, 5760223, 1728161, -4722699, -1614881, 3807670, 2561872, 1046939, 5119646, 6476169, -566000, -6184040, -2292965, 3358156, 2517519, 575133, 3648111]
10453C648111K328526m066049m488732J100949J618818l203320l011269K406876
10445c666090L081111j458075j840630K582871L097343j067947j907965J467544
10437B88162K106407m75971l47050J783725P3546l603392k479328J515428R83887
10428a54586k513342j373211L137069L132627r03774j563415J048599M05644k719228
10419a503617j703571K253599J862958k087085k093997J585737J628753j944082
10411b001305j871143K128299K941541J5777J29866L566859L009215k336358m562106
10402A020645j102988J346677n80392k027289l30610N35525j162280j587078L82856
10393c504934Q06463j030399q15896K255401L603595J601368k88537p62466j931269
$$ y = [3648111, 5976637, 1910588, -2578144, -1477195, 141623, -3061697, -6072966, -3666090, -584979, -2043054, -3883684, -1300813, 1796530, 728583, -1179382, 288162, 2394569, 1918598, 1571548, 3355273, 3428819, -174573, -2653901, -1138473, -154586, -2667928, -4041139, -904070, 2228557, 1324783, -238632, 809967, 1215611, -1503617, -3207188, -953589, 909369, -1177716, -3271713, -1685976, -57223, -2001305, -3872448, -1744149, 1197392, 1213169, 1343035, 4909894, 7919109, 5582751, 1020645, -82343, 1264334, 683942, -1343347, -1673957, -1138432, -2300712, -3887790, -3504934, -2698471, -3728870, -4544766, -2289365, 1314230, 2915598, 2627061, 1864595, -66674]
10384f6674k809563j09488L994387L702470l38463j780084K65139L19234k545112
10375F31846k880010N81930K410831N73151m45026J099845J128585j499857k269496
10366f68201N3545O37339k109221l137526j57434K033982N35846m89419J929755
10357a371334L723217J126673k689221l275381j560878l46085P28207K476788
10349a188014L055761J436412o5659J03450R9967j243179j941637r04872j24867
10340g72638m72129K33807K494408K961193j81551l663114l804947j357996P96232
10331c766735J650340J580513O52924o69005j326888j193453p72129M08287K379971
10322a056175K710589k58388l178040j544179K808673L626105j95483k871963
$$ y = [-66674, -2876237, -2985725, 1008662, 4711132, 4372669, 2592585, 2857724, 3176958, 631846, -2248164, -1666234, 744597, 1317748, 872722, 1972567, 3101152, 1601295, -668201, -614656, 22683, -2086538, -5224064, -5381498, -3347516, -2811670, -3301089, -1371334, 2351883, 3478556, 789335, -2486046, -4046924, -4393009, -3664802, -1188014, 1867747, 3304159, 3238500, 3341950, 3441917, 2198738, 257101, -647771, -772638, -1244767, -1010960, 1483448, 4444641, 4263090, 599976, -3204971, -4562967, -3766735, -2116395, -535882, 117042, -551963, -1878851, -3072304, -3844433, -3436146, -1056175, 1654414, 1396026, -1782014, -3326193, -517520, 3108585, 2913102, 41139]
10314D1139p07258K886982L354905J039547j125960j949483j737448r19760o16870
10305B65794j849555l265097k439826J89931J767605J470547J180024J680227
10297a000350J702008Q68269K04693k79874j301583j948769q79734P70379R81727
10288h83234L66849O90022J265151N43466l57241K84995J072411M8665j216899
10279A814185o55410j88302k046924l485995j069213K617196L014215J470857
10271A470609J969156K969597O49843k420699j013514K370148Q41782m231893
10263B605029m556398R86341M323126J584192j934107k283786k203005l189175
10255d667783j988629J648853K804377L69553n48074J628851J805254j750877
$$ y = [41139, -666119, 2220863, 5575768, 6615315, 5489355, 3539872, 1802424, 882664, 265794, -1583761, -4848858, -7288684, -7098753, -5331148, -3860601, -2680577, -1000350, 701658, 1569927, 1774620, 1494746, 193163, -1755606, -2635340, -1864961, -883234, -516385, 173637, 1438788, 1982254, 1625013, 1910008, 2982419, 3031084, 1814185, 1158775, 970473, -1076451, -4562446, -5631659, -3014463, -248, 1470609, 3439765, 6409362, 7059205, 4638506, 3624992, 5995140, 6836922, 2605029, -1951369, -965028, 3358098, 4942290, 3008183, 724397, -1478608, -4667783, -6656412, -5007559, -2203182, -1833629, -2381703, -752852, 1052402, -698475]
10247f98475l481793o48852J785561P46200L37798K769231L289035l16697k339302
10238A442706N58857K590565p52482m132416j842799K099169J577327j061179
10230D79748o46816J003578k70801k122989l59429K379998J337734j222431k13238
10221C65354K657416J979599j723662l564649k778457j986775p38671K537949
10213c251896M709850J865918k978339l620029l27671J467017L70324l58524Q6047
10204b037303m05085j224351J14347K239927J525650j256350j995945j48881J251490
10195a936501J354917J455157O92162k061730l658933o47537L715684L479973
10187B393192k32373j041217J877549K872779j09637k628491k020859q89481o93738
$$ y = [-698475, -4180268, -4829120, -3043559, -2297359, -1959561, 809670, 4098705, 3782008, 1442706, 2001563, 4592128, 3839646, -292770, -2135569, -36400, 1540927, 479748, -167068, 836510, 565709, -1557280, -1916709, 463289, 1801023, 578592, 365354, 3022770, 5002369, 3278707, -285942, -3064399, -5051174, -5789845, -3251896, 1457954, 3323872, 345533, -3274496, -3602167, -2135150, -1764826, -2123350, -2037303, -2442388, -3666739, -3552392, -1312465, 213185, -1043165, -3039110, -3187991, -1936501, -581584, 873573, 1565735, -495995, -4154928, -4802465, -1086781, 2393192, 2160819, 1119602, 2997151, 5869930, 5760293, 3131802, 1110943, 221462, -472276]
10178d72276P65557L352305L175946k37761k039869k20107Q25190j703001l741557
10169b95573j407630K215040K263651l46084j599580j113527j102708j231995
10161b618406M15878K722905K546576j40706j959827j049704P51941J053950j01836
10152A620771j102431j075428m94777j08106N8256M16781P66241L28971p60375
10143c50097j090750n8578Q73528M05430l95860j8285O50120j08039j403710q29581
10133b325822J428667K583190J407908l94711j232168j357081j211169n95124
10125a696310M6530j47175o15935n7782R80103P67235k98806k8312J567132J889814
10115B406494K06368q83489J16016R00838p75514l230144l392377j312660M40271
$$ y = [-472276, 293281, 3645586, 6821532, 6583771, 4543902, 4323795, 5148985, 3445984, -295573, -1703203, 511837, 2775488, 2429404, 829824, -283703, -1386411, -2618406, -2202528, 520377, 3066953, 2926247, 966420, -83284, 668657, 1722607, 1620771, 518340, -557088, -1051865, -1159971, -1101715, -684934, 81307, 410278, -350097, -1440847, -1499425, -625897, -220467, -616327, -634612, 15508, -92531, -1496241, -2325822, -897155, 1686035, 3093943, 2699232, 1467064, 109983, -1101186, -1696310, -1649780, -1796955, -2412890, -2470672, -1490569, -723334, -1022140, -1050452, 516680, 2406494, 2612862, 1729373, 1845389, 2746227, 1970713, -1259431, -4651808, -5964468, -5524197]
10106e524197O42175K80105K69845M28651N29712P70132J114594J190933Q66565
10097E68515L42898j69844n15910o18124o15986o04173k97063M35029Q84475K88598
10087c01585p91071r72587k4944Q00041O28793J4737k73627m39774r73251j506076
10077c839344j109331M30507K024024K155690N60280j134515j131830K07991R40341
10068h96187N99904Q37388K116381K053874q68141l830869k943075R43263K956603
10059I69141P38956k816803l957468k386931q5193J730098K820016K839960J801241
10050A653017O68027J89522j07788p65095j121639m15716M87969p4885j994545
10041a481133k912715j037144K205672L411640J259551j712859k224903k90276
$$ y = [-5524197, -4882022, -4601917, -4332072, -3903421, -3373709, -2603577, -1488983, -298050, 568515, 911413, 741569, 225659, -392465, -1008451, -1612624, -1909687, -1474658, -590183, -301585, -1092656, -2065243, -2090187, -1290146, -661353, -646616, -920243, -1360017, -2333268, -3839344, -4948675, -4518168, -2494144, -338454, 221826, -912689, -2044519, -1836528, -896187, -296283, 541105, 2657486, 4711360, 3843219, 12350, -2930725, -1987462, 969141, 1708097, -1108706, -5066174, -7453105, -7538298, -5808200, -2988184, -148224, 1653017, 2321044, 2510566, 2402778, 1637683, 516044, 100328, 588297, 513412, -1481133, -4393848, -5430992, -3225320, 186320, 1445871, -266988, -2491891, -2782167]
10033b782167J286214R14858k55120q39075r48417p64183K86486J756056J798267
10024D52919N5000j209247n19316N15876K64662n7500Q87629J477565J4960j526847
10014C55701m63669J703661J597893k52592o41270K61123o75012l209970l372923
10005d697058k86537K052863J450889P49591J998216K382843o16444m158895m143737
9996e268269j337786N38726N42082N08145J021061J018433M41725K33703L35914
9987a966266L3121m44715n12689m33587m61387j43973L49214J23043k41719Q26832
9977b872126K083039J29376m033061m072716K222395P572486M953807j570710
9969D412490k993120P92199J925775j864417m083196j074149K178682J142504
$$ y = [-2782167, -1495953, -581095, -836215, -1675290, -2623707, -3387890, -3101404, -1345348, 452919, 507919, -701328, -1220644, -704768, -440106, -497606, 390023, 1867588, 1882548, 355701, -107968, 1595693, 3193586, 2940994, 2299724, 2560847, 1885835, -1324135, -4697058, -4983595, -2930732, -1479843, -730252, 1267964, 3650807, 3034363, -1124532, -5268269, -6606055, -6067329, -5525247, -5017102, -3996041, -2977608, -2535883, -2302180, -1966266, -1933145, -2377860, -2890549, -3324136, -3785523, -3929496, -3580282, -3457239, -3698958, -2872126, -789087, -659711, -4692772, -8765488, -6543093, 1029393, 5983200, 4412490, 1419370, 2211569, 4137344, 2272927, -1810269, -2884418, -705736, 436768]
9961D36768j108312l58926J474102P35156j273790j300845j1287J75454r8993
9952a330673P43834J178902n89753k347312j192180J170722J290716m789M36405
9943f44128J879546R55664j850239k484467N934K094130J395816p28903k505438
9934a882085l556104l117135m54911K590872L201123J805547J054345R82471m85058
9925A39065k549899k105494M13284J033637r57741j565254R55800K911395J306429
9916d18778j472570j877636k36242J056210J049554k30691k554250m052009k415063
9907a1151475J033179K238219O38314N1865J867935K487686j20670k527085j607048
9898g089080N35985P74958j94720m30616j28499L48263J632260K339370j20412
$$ y = [436768, -671544, -1030470, 443632, 1178788, -95002, -1395847, -1407134, -1231680, -1330673, -586839, 592063, 2310, -2345002, -3537182, -2366460, -1075744, -1080533, -644128, 1235418, 2191082, 340843, -2143624, -2137690, -43560, 1352256, 623353, -1882085, -5438189, -8555324, -9010235, -6419363, -3218240, -1412693, -358348, 624123, 139065, -2410834, -4516328, -4103044, -3069407, -4027148, -5592402, -4636602, -1725207, -418778, -1891348, -3768984, -4005226, -2949016, -1899462, -2130153, -4684403, -8736412, -11151475, -10118296, -7880077, -7241763, -7189898, -5321963, -2834277, -2954947, -5482032, -7089080, -6553095, -5778137, -5972857, -6403473, -6531972, -6183709, -4551449, -2212079, -2332491]
9889b332491l725269k996565J665595L128883q42554l518202j036524J098431
9881h558696q89279j763315J332999J522719l409378j304160J4834611K8016536
9873B9782037J7411129q580852k0805641r805555L762684K281083o375439p545536
9865A23910k465920k41848p65796J254628M168416L032172n95926j957269j275955
9856A276412j089768l71460K050772L234987J277526m49182M15611M93981k376052
9847D462827l834775o68063K556027J045497k038482j725872K17573j34417j274943
9838a394628l75054L25485j528118k308142J249348M739582K963913q30212p55596
9829B086578J421553M66354k174501j532182J188400J224896n44676m5764J329838
$$ y = [-2332491, -6057760, -9054325, -7388730, -4259847, -5102401, -8620603, -9657127, -8558696, -9447975, -11211290, -9878291, -8355572, -11764950, -13069110, 1765501, 29782037, 47193166, 38612314, 17806673, 8001118, 11763802, 14044885, 7669446, 123910, -2342010, -2583858, -3349654, -2095026, 2073390, 5105562, 4509636, 2552367, 1276412, 186644, -184816, 1865956, 5100943, 6378469, 5929287, 6344898, 6838879, 4462827, 628052, -40011, 2516016, 3561513, 1523031, -202841, 14732, -119685, -1394628, -1769682, -1444197, -2972315, -5280457, -4031109, 708473, 3672386, 2842174, 2086578, 3508131, 3974485, 1799984, 267802, 1456202, 2681098, 2136422, 2090658, 3420496]
9820C420496l43520k818941j397458J383102j80719l641256j995277L116648L425071
9811I68146j254484k387097K182613M521378O46527l106811j794084L77826r65595
9802h11581k638815q04167J877922J603890k01359p70886p56646q87762P04369
9793b685035L844038M349463O48463k774629k299531m20144l69001p29828N36619
9784A00415J663120R02987K11172J017137Q34113j795655l500876j595920R64738
9775a198769P02361n58839J63485J152956k90342j888653q5015L038665K668155
9766C704004o95662k094369j56416J396723L63256r12092j42097J280033Q85668
9757C629048j132358k287265r23999J618750K051567p97076l335983j178282L954982
$$ y = [3420496, 3076976, 258035, -1139423, 243679, 62960, -3578296, -5573573, -2456925, 968146, -286338, -2673435, -490822, 4030556, 4677083, 1570272, -223812, 154014, -811581, -3450396, -4254563, -2376641, -772751, -974110, -1744996, -2501642, -3389404, -2685035, 1159003, 5508466, 6156929, 3382300, 1082769, 662625, 293624, -436204, 100415, 1763535, 2666522, 2877694, 3894831, 4728944, 2933289, -567587, -2163507, -1198769, -496408, -1055247, -891762, 261194, -29148, -1917801, -2002816, 1035849, 3704004, 3008342, 913973, 757557, 2154280, 2517536, 1605444, 1463347, 2743380, 3629048, 2496690, 209425, -714574, 904176, 2955743, 2158667, -1177316, -2355598, 1599384]
9748A599384N171965M4133n007316l491137J802714L260729l36873l094333j703658
9739a754392L73346l51330j924027j090539J035116J198144l18145k30728K074405
9730i88150L147273P66548k344110k356370q526P06031j103284j905346L14239
9721c771695K562373J716785l16854M3078J883645J494193r54439j410703J208647
9712B455030K969739J049930k170337l107571j814710o51819n95103r51287j010802
9703c826930l99556Q85925J927672J767769J102727J326466J984712J472333N7656
9694F298774n74937n89336j464291k259725m56116K900984L321323l88692l730541
9685C057443k950206k8521J189936L40542p17940j417133j834444j083516Q56089
$$ y = [1599384, 6771349, 6815482, 1808166, -1682971, 119743, 3380472, 3043599, -50734, -1754392, -1381046, -1732376, -3656403, -4746942, -3711826, -2513682, -2831827, -3062555, -988150, 2159123, 2925671, 581561, -1774809, -1783335, -1077304, -2180588, -4085934, -3771695, -1209322, 507463, 190609, 233687, 2117332, 3611525, 2657086, 1246383, 2455030, 5424769, 6474699, 4304362, 1196791, -617919, -1269738, -1864841, -2816128, -3826930, -4226486, -3340561, -1412889, 354880, 1457607, 2784073, 4768785, 6241118, 6298774, 5723837, 5134501, 3670210, 1410485, 954369, 3855353, 7176676, 6787984, 3057443, 107237, 78716, 1268652, 1609194, 891254, -525879, -2360323, -3443839, -2587750]
9676b587750J809074L75076j673973k053994j070863k27606J70238L08243l0703
9667d982258j37405J361769L503591L220603K39924j590511l3649J932422R77066
9658D491552j406314j867568n48286Q0241m24750o85664m28698k33085J91527
9649h31045J025781J237212M95538J70841N41353l62806k930476l980123j357546
9640e991271K330263L530599K512134J342073J20373j425731j628561J52409J166528
9631B108816l58390j624813j55798J234769n98684k607383j57713M412020M759938
9622G012762O53394j967412o60931P87009j00084r52575j17923K95410q67625
9613D082025j274658L20937J528543O93790l43900j80409n09614k303377l081113
$$ y = [-2587750, -778676, -403600, -2077573, -4131567, -5202430, -5430036, -5259798, -4951555, -4982258, -5119663, -3757894, -254303, 2966300, 3206224, 1615713, 1582064, 3514486, 4491552, 3085238, 1217670, 669384, 749625, 324875, -360789, -789487, -1022572, -831045, 194736, 1431948, 1927486, 2098327, 2639680, 2276874, -653602, -4633725, -5991271, -3661008, -130409, 2381725, 3723798, 3844171, 2418440, 789879, 942288, 2108816, 1750426, 125613, -30185, 1204584, 605900, -2001483, -2159196, 2252824, 7012762, 7666156, 5698744, 5037813, 5824822, 5724738, 4772163, 4654240, 4949650, 4082025, 2807367, 3128304, 4656847, 5350637, 5006737, 4826328, 4316714, 2013337, -1067776]
9604a067776r25164J895872K275587O94448m49210o63274q09200o53998L36302
9595F33587J181949P54677j66383k19248K48615Q6811m69290l79649J67542M1505
9585A880116q96193j536924j060326J86779J204294J246849M91826o0395J67754
9576A623780L66287m94587j778126j778161k32266J164591J031123j54624j038733
9567a290716q14501M17556J612129J292556n89104j734002k25431K210679K034980
9558B914146r51248k993478j688879P85593J217611k00715j012135l78439M84695
9549a822849Q22697J057939J241187O68827p09596j833912j866360j100180k39107
9540c781354M87080J080463J218137N67106n07856j170824j168072j031980r04729
$$ y = [-1067776, -1992940, -97068, 2178519, 2872967, 2423757, 1760483, 951283, 297285, 633587, 1815536, 2570213, 2403830, 2184582, 2433197, 2520008, 2050718, 1671069, 1838611, 1880116, 983923, -553001, -1613327, -1426548, -222254, 1024595, 1516421, 1456026, 1623780, 1990067, 1495480, -282646, -2060807, -2293073, -1128482, -97359, -251983, -1290716, -2105217, -1687661, -75532, 1217024, 627920, -1106082, -1331513, 879166, 2914146, 1962898, -1030580, -2719459, -1933866, -716255, -916970, -1929105, -2307544, -1822849, -1000152, 57787, 1298974, 1967801, 1258205, -575707, -2442067, -3542247, -3781354, -3294274, -2213811, -995674, -428568, -936424, -2107248, -3275320, -4307300, -5212029]
9531e212029j5828J753703K648384J096142j375794j558767P48544K028205J67536
9522B80096k333662k301469o04660l772j69646J337077L885214L769396M3210
9513C901784l335420k802738K21458K034217J692139R64698P40791J89018q63507
9504B742440j136473p5619Q41403N9281j662343k042572l31102J572326J526433
9495A493774j73023j390318r06611N00049J503723J567795P86740m37870j309334
9486A634925j189856m18743K11606N63480P86152N26426p2568L60646K013948
9477D416016K085055j320773m659659k977002J879494K923480j106056l291635
9469b051080K11022L560139R80448l346314k370446J843059J956517j858350k522785
$$ y = [-5212029, -5227857, -3474154, -825770, 270372, -1105422, -2664189, -1915645, 112560, 280096, -2053566, -4355035, -4959695, -4963467, -5133113, -3796036, 89178, 3858574, 3901784, 566364, -2236374, -2014916, 19301, 1711440, 2676138, 3416929, 3605947, 2742440, 1605967, 1530348, 2371751, 2431032, 768689, -1273883, -1604985, -32659, 1493774, 1320751, -69567, -976178, -476129, 1027594, 2595389, 3382129, 2944259, 1634925, 445069, 26326, 237932, 801412, 1587564, 2113990, 2041422, 2402068, 4416016, 6501071, 5180298, 520639, -2456363, -576869, 2346611, 1240555, -2051080, -1840058, 1720081, 2700529, -645785, -3016231, -1173172, 783345, -1075005, -3597790]
9460c597790J440049L556828O98323k189831j300543J24132j088346k050283K93912
9451d113549L076483K543090N69170P93707J948242N55487k389050k863560l66587
9442b46567J791542J767513O32436o07136j666615j443354N81394K085157N85260
9433C479630k185362k213361P13754K548342R22068j923345k935145j879356o2865
9424c535640J806517L014017K374992R8794j526580r24907N74605Q28919l4447
9415B676270m01088j71088p58712k100557j958286O77940L217742K459547q33002
9406B808766k670245j288660O13243K04050j303890j036105P18622J107717n19997
9397a366499j640677o18724J152774J941049J869510J375991K7782j675578j717471
$$ y = [-3597790, -2157741, 1399087, 2097410, -92421, -1392964, -1268832, -2357178, -4407461, -4113549, -1037066, 1506024, 2075194, 2868901, 4817143, 5372630, 2983580, 120020, -246567, 1544975, 3312488, 3944924, 3337788, 1671173, 227819, 809213, 2894370, 3479630, 1294268, -919093, -205339, 2343003, 3265071, 1341726, -1593419, -3472775, -3535640, -1729123, 1284894, 3659886, 3758680, 2232100, 1307193, 1881798, 2710717, 2676270, 2275182, 2104094, 1345382, -755175, -2713461, -2035521, 1182221, 3641768, 2808766, 138521, -1150139, -536896, -332846, -1636736, -2672841, -1954219, -846502, -1366499, -3007176, -3625900, -2473126, -532077, 1337433, 2713424, 2741206, 1065628, -651843]
9388f51843L15657J612403q4708k751407k750689j15879J691571R45965k84588
9379b073518J92653J403616J047577p75610j510037K85335K729397K842034L73535
9370D514982j913278k003814j083953j079065j342577j16104J681452J343151
9362G94q23467j155316J564674L413906R89958l024010l445870m7309K488535
9353c8105J517068n92751j035841n22767r13746j633661r59098O27262J022784
9344b528855J5360k63613J101601J931937J15579k708981k863203J34856K447994
9335b617325J141564j482858r96510K728730M982134K421068k602854n124374
9327a550425l357164J3031J421912M8234j840688j490952J192145L181343J823298
$$ y = [-651843, -336186, 1276217, 1191509, -1559898, -4310587, -4426466, -2734895, -1788930, -2073518, -1880865, -477249, 570328, -205282, -1715319, -1429984, 1299413, 4141447, 4514982, 2601704, 597890, -486063, -1565128, -2907705, -3023809, -1342357, 794, -822673, -1977989, -413315, 3000591, 3990549, 966539, -2479331, -2526640, -38105, 1478963, 886212, -149629, -672396, -1586142, -3219803, -4178901, -3551639, -2528855, -2513495, -2777108, -1675507, 256430, 372009, -2336972, -5200175, -5065319, -2617325, -1475761, -2958619, -3955129, -1226399, 3755735, 6176803, 3573949, -1550425, -4907589, -4894558, -3472646, -3424412, -5265100, -6756052, -5563907, -2382564, -559266]
9318e59266j494882k807039q36059J364617R67827o98908o59652J067989J931940
9309a723433J073434L23241Q91388J555947R92515m4748k20467o7q28880k369178
9299c50248k340613K75903L157916L121689K39139k140092j771994k12544q5741
9290a06585j260995j610660n28960N68932Q03037N90928M0227j030882j491181
9281d026139K4329K184154K071888j55625j028759O67012J758121J31530j483541
9272A42970l05408J409648K95307j827928p43590K595624K951142q15771l728771
9263b6777k244688J075146K423784J973749J583748R09108r29677k418024j736345
9254F10024r587N35869J63916M33166P82411l95077k088318j577423J023448K438469
$$ y = [-559266, -2054148, -4861187, -5697246, -4332629, -3364802, -4063710, -4723362, -3655373, -1723433, -649999, -326758, 564630, 2120577, 3113092, 3068344, 2847877, 2847810, 2018930, -350248, -2690861, -2414958, 742958, 3864647, 4103786, 1963694, 191700, -20844, -106585, -1367580, -2978240, -3507200, -2938268, -2135231, -1544303, -1504076, -2534958, -4026139, -4001810, -1817656, 254232, 98607, -930152, -263140, 1494981, 1626511, 142970, -162438, 1247210, 1542517, -285411, -1029001, 1566623, 4517765, 3701994, -26777, -2271465, -1196319, 1227465, 3201214, 4784962, 5694070, 4764393, 2346369, 610024, 600437, 1136306, 1300222, 1733388, 2515799, 2120722, 32404, -1545019, -521571, 1916898]
9244A916898J063216q35853q75672P5026p4307j204282j568722o89919K05434
9235a988181K50586p270L06839J070755J153646l13437k484320l053821q71235
9226e936438K081456K805106J257122K43334J061968J741837P03276m71984N2309
9217C537986J016296L20360j211612j464699j001251j823146l117081k240739
9209e983886L49210J408148M34584M18037K148669K548702M72626p10857Q60569
9200A945802J690956j008460l720662k076978J604019K087229J5367L46814L204856
9191D088943L317036q69726m123199k438584J432188L053231K236215J000263
9183G696367l82439k040136k345464l79025J708697J537586k15054j530685j956647
$$ y = [1916898, 2980114, 2144261, 1268589, 1343615, 1269308, 65026, -1503696, -2193615, -1988181, -1737595, -1744865, -1438026, -367271, 786375, 472938, -2011382, -5065203, -5936438, -3854982, -1049876, 207246, 450580, 1512548, 3254385, 3957661, 3485677, 3537986, 4554282, 4874642, 3663030, 2198331, 1197080, -626066, -3743147, -5983886, -5634676, -4226528, -3791944, -3373907, -1225238, 1323464, 1796090, 1085233, 1945802, 3636758, 2628298, -1092364, -3169342, -1565323, 521906, 537273, 884087, 4088943, 7405979, 6536253, 2413054, -25530, 1406658, 4459889, 6696104, 7696367, 7313928, 5273792, 2928328, 2549303, 4258000, 5795586, 5580532, 4049847, 2093200]
9174B093200j800013p23262P66181P82163q63260j547218Q44J261008K84512n80596
9164c26441J220091L446712K391081q68994k095044m53971J048087Q71319K21638
9155E454478n18377k136797l385775j895731J280349K348797O53836m66723M14667
9146A748724P22633p57880j247489P60841K126885M00915j449879N0732K464590
9137D820072J066287l052742m098957m38507L009152K313495j87296m01259J324199
9128D354444J664960j36950j541147r17566L47357L93012n04807q83488m40209
9119B335606j58191m91964o35949J01933J045318R71100j75194j145973r75330
9110H71356p6680M00676j36935j245836j961842j749581j087550q13184o72100
$$ y = [2093200, 293187, -430075, 336106, 1118269, 255009, -1292209, -1291365, -30357, 254155, -326441, 893650, 4340362, 6731443, 5862449, 3767405, 3313434, 4361521, 5232840, 5454478, 4936101, 2799304, -586471, -2482202, -1201853, 1146944, 1800780, 1334057, 1748724, 2471357, 1713477, 465988, 1226829, 3353714, 3754629, 2304750, 2355482, 4820072, 5886359, 2833617, -1265340, -1703847, 1305305, 3618800, 3431504, 3030245, 4354444, 6019404, 5882454, 4341307, 3423741, 3771098, 4164110, 3659303, 2775815, 2335606, 2177415, 1685451, 1049502, 1151435, 2196753, 3167853, 2992659, 1846686, 871356, 794676, 1195352, 1058417, -187419, -2149261, -3898842, -4986392, -5799576, -6471676]
9101f471676O40213L162383M455788K488116q77100j707004N57112K241086R24608
9092E413526j161770j110717P2005k19146j405441r46992P98116R41454q91884
9083A489151j833830o55560L84530k80973j073465o16386j35211m56180O3549
9074c114375K014667K614813K49870j678935L17120L468652K464675j886332l485050
9065I65105m22723K271196Q46681j688824j162927J199930J588631j93871j335455
9056B067743q46756j09691J79601L87196J29242j016818j676866k84259J974527
9047H03919K375992M73753j664964k643862k728669j967234J9948K194864K540222
9038e96031R06004o28096p51132l66079m89307o05870K4632R56102J365217J153652
$$ y = [-6471676, -5831463, -2669080, 1786708, 4274824, 3397724, 1690720, 2247832, 4488918, 5413526, 4251756, 3141039, 3213044, 2993898, 1588457, 641465, 1439581, 2381035, 1489151, -344679, -1000239, -615709, -896682, -1970147, -2586533, -2721744, -3177924, -3114375, -1099708, 1515105, 1764975, 86040, 403160, 3871812, 6336487, 4450155, 965105, 542382, 2813578, 3660259, 1971435, 808508, 2008438, 3597069, 3403198, 2067743, 1220987, 1111296, 1290897, 1678093, 1807335, 790517, -886349, -1170608, 803919, 3179911, 3653664, 1988700, -655162, -3383831, -5351065, -5331117, -3136253, -596031, 309973, -318123, -1069255, -1435334, -1924641, -2530511, -2505879, -1549777, -184560, 969092]
9028I69092N55017l87250j397755j851817j482280n74002N67231J595452J818836
9019a87476R55439j3460Q5199Q54069Q64576j85694j150758j181084n00418M53246
9009f361J339060J488766N32855o86378j166195j339728j992579k061790K12533
9000c679817L833909N184336K487251j764795l892154l063088j242162l50716
8992b487236o08526j027612p11747J63381N75591J05194l85328j74929R7102k32440
8982d686550l12819Q10236K186184K289523J491954J054088O03508p64526j769224
8973I02374n73907J344243O71601k215353l116204l25031K702104K568449M14343
8964B372619q40010q06891q79374j379855j619862j261391j94074J391787K091891
$$ y = [969092, 1524109, 1136859, -260896, -2112713, -3594993, -4168995, -3601764, -2006312, -187476, 767963, 754503, 839702, 1693771, 2558347, 2372653, 1221895, 40811, -459607, -6361, 1332699, 2821465, 3354320, 2667942, 1501747, 162019, -1830560, -3892350, -3679817, 154092, 5338428, 7825679, 6060884, 2168730, -894358, -2136520, -2487236, -3095762, -4123374, -4835121, -4671740, -4096149, -3990955, -4376283, -4551212, -4454110, -4686550, -4999369, -4189133, -2002949, 286574, 1778528, 2832616, 3436124, 2671598, 902374, 328467, 1672710, 2344311, 128958, -2987246, -3312277, -610173, 1958276, 2372619, 1532609, 725718, -153656, -1533511, -3153373, -4414764, -4608838, -3217051, -1125160]
8955a125160O21038j411652r41835J599812K298807k6011j642943n0794J871636
8946A192898R55565q93897l99262J242637P92373j114591j308937J56532L92527
8937A015845r25774j163615K88746Q90421n41842j794382q04891J432967K524549
8928I22024J382362j180566l095448k466139J52083J607181K4025k280500j976897
8919f911875M48252J911926J724020J836564K480580J400141j868303m339234
8911c317929l585897q93326R96967J337304J200771J304325J340320Q36749l9917
8902h20633l87465M68776J595714J074407j138917k443202j188992N85024K11362
8893b043926j321067j023229J175501K443984J618305M62063J94021j10550j046396
$$ y = [-1125160, -504122, -1915774, -2857609, -1257797, 1041010, 1014999, -627944, -678738, 1192898, 2148463, 1254566, 855304, 2097941, 2890314, 1775723, 466786, 623318, 1015845, 90071, -1073544, -784798, 105623, -436219, -2230601, -3035492, -1602525, 922024, 2304386, 1123820, -1971628, -4437767, -4285684, -2678503, -2654478, -4934978, -6911875, -6463623, -4551697, -2827677, -991113, 1489467, 2889608, 1021305, -3317929, -6903826, -7797152, -6800185, -5462881, -4262110, -2957785, -1617465, -780716, -820633, -1208098, -739322, 856392, 1930799, 791882, -1651320, -2840312, -2255288, -2043926, -3364993, -4388222, -3212721, -768737, 849568, 1311631, 1505652, 1395102, 348706]
8884C48706j603616j208324o77269l79743L85171J509640J690770O31917l13888
8875C83364l40868k02309n00068p54078o28423l65113K47438J505611K316318
8866A661872J236264q25797j302430J97546J152411p9823k066796k805501k234423
8857e066677j190124J34038J473415J903689J138866J52680k65048l38173k65968
8848b323302K02795Q01385Q51954N76280P51542J075620O91829J61077O51174
8839C440354J264606j06959k980003m205965k354818N85916K544376L430373L123095
8830D740975Q30147k163810k579314O1064J978392P76217p58854N27276K598853
8821F010946J404614k446859m468618k921902p02631n17641j522607j530952j25070
$$ y = [348706, -1254910, -2463234, -3140503, -3520246, -3135075, -1625435, 65335, 697252, 383364, 42496, -159813, -659881, -1413959, -2042382, -2407495, -2160057, -654446, 1661872, 2898136, 2072339, 769909, 967455, 2119866, 2040043, -26753, -2832254, -5066677, -6256801, -6122763, -4649348, -2745659, -1606793, -1454113, -1719161, -2057334, -2323302, -2120507, -1319122, -467168, 109112, 860654, 1936274, 2628103, 2789180, 3440354, 4704960, 4598001, 1617998, -2587967, -4942785, -4356869, -1812493, 1617880, 4740975, 5571122, 3407312, 827998, 889062, 2867454, 3643671, 2884817, 3412093, 6010946, 7415560, 4968701, 500083, -2421819, -3124450, -3642091, -5164698, -6695650, -6820720]
8812f820720J438394J979092J374538N51450N61096J206073J197054J98260m72992
8803A212245q5836P8288j029088k047275j185818Q10314J775361J279335N18575
8794A326101j33731j103382j697850p71245Q11289R17161l77275n55122J356871
8785b27183K915285J720623j049602k319345j283593l8291k44452q73573q5630
8776a485761J591677J493932j341674l923784k577788J906000M600879K638367
8768B901848j085118k042972r4090J178698J19426j145215o93475L77880M20211
8759f2807R2051P31254J512505P14850r34969r17740Q53034J208188j479945m000749
8749b284328k393225J938065L554515O08967k368608j016633K548140L057183
$$ y = [-6820720, -5382326, -3403234, -2028696, -1477246, -916150, 289923, 1486977, 1685237, 1212245, 1126409, 1204697, 175609, -1871666, -3057484, -2247170, -471809, 807526, 1326101, 1192370, 88988, -1608862, -2380107, -1568818, -651657, -1028932, -1584054, -227183, 2688102, 4408725, 3359123, 1039778, -243815, -282106, -526558, -1400131, -1485761, 105916, 1599848, 258174, -3665610, -6243398, -4337398, 263481, 2901848, 1816730, -226242, -320332, 858366, 977792, -167423, -860898, -483018, -62807, 29244, 760498, 2273003, 2987853, 2052884, 1135144, 1988178, 3196366, 1716421, -2284328, -4677553, -2739488, 815027, 1423994, -944614, -1961247, 586893, 3644076]
8741C644076j15202k383380r22556J619221J550132p55748k188266j421452O8497
8732i04678O19578K38390J8900P00657J744179J648344k35470k275690k134899
8723e80689M6806J512745M78128j599340k143458n67600J628684K748799K026077
8714C550152j35761k250971k870468k045811q74134K34083J364893J555564j54282
8705a626735k022162r54911K620698M467183K551781n2670l81516p0010j480821
8696C050837k747942j020775J842268J802876o18345j336846K06224L70679j906282
8687c57306l040934r71267J460150J491022N66749Q17181J144401q42j009464
8678I9690J87436K063646J694457n33346j761300j150944l90192l73308k74515
$$ y = [3644076, 3528874, 1145494, 222938, 1842159, 3392291, 2636543, 448277, -973175, -904678, -285100, -46710, -27810, 672847, 2417026, 4065370, 3829900, 1554210, -580689, -533883, 978862, 1456990, -142350, -2285808, -2853408, -1224724, 1524075, 3550152, 3414391, 1163420, -1707048, -3752859, -4626993, -4392910, -3028017, -1472453, -1626735, -3648897, -4603808, -1983110, 2484073, 5035854, 4983184, 4601668, 4531658, 3050837, 302895, -717880, 1124388, 2927264, 2308919, 972073, 1178297, 1548976, -357306, -3398240, -4369507, -2909357, -1418335, -851586, -34405, 1109996, 1109154, 99690, 287126, 2350772, 4045229, 3511883, 1750583, 599639, 209447, -163861, -438376]
8669d38376L70622J092298J643695J653558k4949l181019m517556j285669L848684
8660h38712N200616J589075k174906k177256j01546O02480j97560n85662k66263
8651A050266o8561L01434J157185J012933j196806l298509k434254L22124J228906
8642a925282m34476j369457M86612K927204L007491J000511q27170j411422j171722
8633B82289n98805j44943l86053r97596o82889P42296J515602N15413o94476j37939
8623e87101J385049J444783l12286j743209j427601l71770j11080o44296q87352
8614c254863j50418J376242K846292L087929J477812j003573k207353j032029
8606A140039J017406J252813r87765l255212k865417l74686J196428O39866Q2504
$$ y = [-438376, -67754, 1024544, 2668239, 4321797, 4296848, 1115829, -3401727, -4687396, -838712, 4361904, 5950979, 3776073, 1598817, 1497271, 2099751, 1902191, 1316529, 1050266, 981705, 1283139, 2440324, 3453257, 2256451, -1042058, -3476312, -3154188, -1925282, -2359758, -3729215, -3242603, -315399, 2692092, 3692603, 2865433, 1454011, 282289, -316516, -461459, -847512, -1845108, -2527997, -1785701, -270099, 245314, -449162, -587101, 797948, 2242731, 1930445, 187236, -1240365, -1612135, -1723215, -2367511, -3254863, -3405281, -2029039, 817253, 3905182, 5382994, 4379421, 2172068, 1140039, 2157445, 3410258, 2422493, -832719, -3698136, -4072822, -2876394, -2236528, -2154024]
8597b154024J277053K608286J924233L78894L02946O89038j105880l772164l082676
8588b934294Q26677K460195o84832l799099k093344K016933L340489J846792J166612
8579B146129J851971J501064k0169o71587n67043j360799k148698q38675J138691
8570A030884O39923j212884n09812K048847J515343k556347m277677p18749L104247
8561i36225K089436j404415k236497m09557N61587N8519J45915R60107R36998
8552b34132L94881P45676J031545p87596l551002l758089r34060J325072N41173
8543e226532j248139p02728K146616M178521L369546J159193K72745J058262J218617
8534F226101o19393k655273k563089r77250j34486j15764O11587J497508L81017
$$ y = [-2154024, -876971, 1731315, 3655548, 4034442, 4337388, 5026426, 3920546, 148382, -2934294, -2107617, 352578, -332254, -4131353, -6224697, -4207764, -867275, 979517, 2146129, 3998100, 5499164, 5478995, 4807408, 4240365, 2879566, 730868, -107807, 1030884, 1670807, 457923, -51889, 1996958, 3512301, 955954, -3321723, -4040472, -936225, 1153211, -251204, -2487701, -2897258, -2335671, -2277152, -2131237, -1171130, -234132, 160749, 906425, 1937970, 1150374, -2400628, -6158717, -7092777, -5767705, -5226532, -6474671, -7177399, -5030783, -852262, 2517284, 3676477, 3949222, 5007484, 6226101, 5606708, 2951435, 388346, -588904, -723390, -839154, -227567, 1269941, 1650958]
8525A650958k125674k609352k12965J794196J285122K50812N09442M14868j341024
8516c83617k362959n53262J659449J071188r06269q69600O68596O20774q65922
8507a921622q21711Q88113J173641o34513j260304J101661L579448K752271o40165
8498D216819l059199k588975m42933R48305L18788j370348j844340j18K675830
8489a146171L867242L090056J567510O6264j672566l502037m211241k624605J059434
8480c506114M809556N688056K478593k159524l756896j165936J997971K120515
8472F506221j01835j636083j444776p43766m45871n70374j106451j534438o30779
8463a708152J468888K415725P84683j454539j712449m45203K53068P9235m2864
$$ y = [1650958, -474716, -3084068, -3297033, -1502837, -217715, 33097, 542539, 957407, -383617, -2746576, -3299838, -1640389, -569201, -1475470, -2345070, -1676474, -1055700, -1921622, -2743333, -1855220, -681579, -1316092, -2576396, -1474735, 2104713, 4856984, 4216819, 1157620, -1431355, -1874288, -925983, -607195, -1977543, -3821883, -3822001, -1146171, 2721071, 5811127, 7378637, 7444901, 5772335, 2270298, -1940943, -4565548, -3506114, 1303442, 6991498, 9470091, 7310567, 3553671, 2387735, 4385706, 6506221, 6404386, 4768303, 3323527, 2579761, 2133890, 1563516, 457065, -1077373, -1708152, -239264, 2176461, 2961144, 1506605, -205844, -651047, -397979, -318744, -361608]
8454c61608l82561j421909j856125n16313J015439P17505l11017J69350J405657
8445a541582J133982n3163J45222J143302L68825j723181k055184l11981O43297
8436b250463M0160J86462J468664J265981p54223j144227J355544K927473O38568
8427C733939k676525k842876m00372J293416J354908J121134O65322p17908j869073
8418c38035j065847P97677J337608M02286r0807M19189N85417r2864m78201J8897
8408A495320N79192O36889O24367P39249N29439j7372l75499o10218j151722j386320
8398A063325k38350J505457J454186q98271k866104k210979l76958n6175q93301
8389c517170l47150J782974K857372J735651L97335J50830m75659k114516k161483
$$ y = [-361608, -744169, -2166078, -4022203, -4538516, -3523077, -2805572, -3116589, -2947239, -1541582, -407600, -460763, -315541, 827761, 1196586, -526595, -2581779, -2893760, -2250463, -2210303, -2023841, -555177, 710804, -43419, -1187646, 167898, 3095371, 3733939, 1057414, -1785462, -2185834, -892418, 462490, 1583624, 2248946, 1531038, -338035, -1403882, -606205, 731403, 1133689, 1042882, 1462071, 2047488, 1954624, 1476423, 1495320, 2074512, 2711401, 3335768, 4075017, 4604456, 4587084, 4211585, 3601367, 2449645, 1063325, 824975, 2330432, 3784618, 2886347, 20243, -2190736, -2567694, -2623869, -3517170, -3864320, -2081346, 776026, 2511677, 2909012, 3059842, 2584183, 469667, -1691816]
8380a691816Q92950L578905J980935j909201l067840j228414l96047j245956k55726
8371c342210K878200L551628K00483k357718r09945P36583j221597l561134j651303
8362e677013K319528L075261R04711k1135M91670n91152k463297j294907K266055
8353i90279L267931O35619j202206Q3088J514617P77754k63984r9533m29064j980358
8343A313585k086529O97437L416828L011058O20949r14195j029804o73707k25410
8334D130212j66139j279078k504622j357269J857833L271985R00573k120443k142995
8325E90057j47952M91535p43762j466361l40605J457869K215288J417866j12831
8316C361104r33754l86194M65063K34020o85203r14782n31666o37843r29552k24542
$$ y = [-1691816, -798866, 2780039, 4760974, 2851773, -216067, -1444481, -1840528, -3086484, -3342210, -464010, 3087618, 3288101, 930383, 20438, 757021, -464576, -4025710, -5677013, -3357485, -282224, 622487, 601352, 1093022, 501870, -1961427, -3256334, -990279, 2277652, 2913271, 1711065, 1794153, 3308770, 4086524, 3822540, 3723007, 3293943, 1313585, -772944, -75507, 3341321, 6352379, 6973328, 6059133, 5029329, 4355622, 4130212, 3964073, 2684995, 180373, -1176896, 680937, 3952922, 4853495, 2733052, 590057, 442105, 933640, 189878, -1276483, -1617088, -159219, 2056069, 3473935, 3361104, 2427350, 2041156, 2506219, 2740239, 2055036, 1140254, 608588, -29255, -958807, -1183349]
8306a183349Q78458O91633m24190p05556n34116j744735l412777k490582P59249
8297h165965K316748O06476j095649j23903J778124K169209J619766J363828O71046
8288A139680r33396j781393p73992N94639Q98379Q84765J221960Q98319m26919
8279A722042j170648m68188N15345R59713J215443P18244j348496k931927j094529
8270a883001K311227K253151j168593k196103R14763K609568l32636k969629p76009
8261a237262K501381J578995j338389j031683J620008J985816j14046j221893
8253B742927p38731n09477k38309J012287J215611j183786k990640j142141J200231
8244f32028k42878k801905j122018L102598L589394p686k170179j227990p80129
$$ y = [-1183349, -304891, 386742, -37448, -743004, -1277120, -3021855, -6434632, -8925214, -8165965, -5849217, -5242741, -6338390, -6462293, -4684169, -2514960, -895194, 468634, 1139680, 206284, -1575109, -2349101, -1754462, -856083, 28682, 1250642, 2148961, 1722042, 551394, 83206, 598551, 1558264, 2773707, 3491951, 2143455, -788472, -1883001, 428226, 2681377, 1512784, -683319, 231444, 2841012, 2508376, -461253, -1237262, 1264119, 2843114, 1504725, 473042, 2093050, 4078866, 3964820, 2742927, 2004196, 1494719, 1256410, 2268697, 3484308, 2300522, -690118, -1832259, -632028, -874906, -3676811, -4798829, -1696231, 1893163, 1885477, -284702, -1512692, -2292821]
8235b292821j546857j15450L303510L824568L19331k297544j230387M14389J29562
8226E08301j39938R01032R86263p75751j528494M5729J127867N807r98188l26925
8216a94297l3537j265260j710246k42806N78745n60235r72322Q65507J992065
8207a542386J96465j702420n06805K138747K840718J525709P26j472908k847782
8198a369936k457544J84353K346930J821555J57487m74859p44963j648434j556937
8189c742348Q99365L494944L213584M33747k294058l529779k826942j5173L073560
8180a293100L109133j928k015791n71801J112362p6306j723366l81175K032404
8171A90432J431739j357655k043038J22588J796737J218842k9723m71968j21663
$$ y = [-2292821, -3839678, -3955128, -651618, 3172950, 3492281, 1194737, -35650, 378739, 508301, 368363, 1269395, 2255658, 1479907, -48587, -2858, 1125009, 1130816, 132628, -194297, -227834, -1493094, -3203340, -3446146, -2867401, -3427636, -4399958, -3534451, -1542386, -1345921, -3048341, -3555146, -1416399, 1424319, 2950028, 2950754, 1477846, -1369936, -3827480, -3643127, -1296197, 525358, 682845, 207986, -536977, -2185411, -3742348, -2842983, 651961, 3865545, 4299292, 2005234, -1524545, -4351487, -4366660, -1293100, 1816033, 1814105, -201686, -773487, 338875, 262569, -1460797, -1841972, 190432, 1622171, 264516, -1778522, -1655934, 140803, 1359645, 1329922, 857954, 736291]
8162G36291J032546K546092K402002l25322k883346k361510l46409k19960j341736
8153g61352m64832K074130K565160J87886j720340j192479j49057n33182j649504
8144a643570k256615k132836r94637J160797K512321J390174l73147L15904K442426
8135D20817K048157j004310k272064R3546K238726Q09001k026010k516344p83683
8126b992164O72465J131225J311391R84696k93548j553517j707380j212194q91480
8117d550506o04130k97013n08662p14064N50406K686713K839388K98921j767463
8108b066410j027132N09466K31571p11742R545J447926J181892k51702n27261
8099a203847J78012j30866j174595q09846Q73033J534404O37549M8293L86164
$$ y = [736291, 1768837, 4314929, 6716931, 6391609, 3508263, 1146753, 800344, 580384, -761352, -1226184, 847946, 3413106, 3600992, 1880652, 688173, 539116, 5934, -1643570, -3900185, -6033021, -7027658, -5866861, -3354540, -1964366, -2337513, -2021609, 420817, 2468974, 1464664, -807400, -713854, 1524872, 2333873, 307863, -2208481, -2992164, -2319699, -1188474, 122917, 1107613, 814065, -739452, -2446832, -3659026, -4550506, -5154636, -5451649, -5960311, -6674375, -6123969, -3437256, -597868, -298947, -2066410, -3093542, -2584076, -2352505, -3064247, -3054702, -1606776, -424884, -676586, -1203847, -1025835, -1156701, -2331296, -3141142, -2268109, -733705, -96156, -47863, 338301]
8090C38301J80076p86943n83611J368289K729411J528831j125063k774673k357430
8081a482812m81279J407340J663256r3735j926535j716766k21792J48521o53983
8072c357785l26999J627255K898729K169501P80120k92981j803734l311467k446173
8063d063534R03156L015232J510173q90408o97272R59750O99441j472216k600071
8054b635749j557772Q4647J183919J927995K158450J464958M69630j48350r73350
8045A974378k122436j748838J092898L713026L037955J64056j638697j940372
8037B531970k355606k218068K89127L381865L039537o36535l063676j819526O53972
8028a96940J678528J412209M93746j131402k147486q74113R40976o0669k611089
$$ y = [338301, 518377, -268566, -852177, 516112, 3245523, 4774354, 3649291, 874618, -1482812, -1964091, -556751, 1106505, 1012770, -913765, -2630531, -2852323, -2703802, -3357785, -3684784, -2057529, 841200, 3010701, 3790821, 3497840, 1694106, -1617361, -4063534, -3160378, -145146, 1365027, 474619, -222653, 737097, 1436538, -35678, -2635749, -4193521, -4108874, -2924955, -996960, 1161490, 2626448, 3096078, 2947728, 1974378, -148058, -1896896, -803998, 2909028, 5946983, 6111039, 4472342, 2531970, 176364, -2041704, -1752577, 1629288, 4668825, 4032290, 968614, -850912, -196940, 1481588, 2893797, 3387543, 2256141, 108655, -765458, 175518, 114849, -2496240]
8019b496240j844651K317082M080092J222219j128421M04971J499207j635322
8011B418937m536451j783300L125193L031439j214799k609427L38228K045069
8003H14889k31143k582953j788765O4789L53334Q7306R60702K134515K059829
7994A872503P25886j132070k671586k426197K45612L181520L586226J876323N64965
7985E823182J08142q03431j714723j066362K66200J67565o05275J54882J285172
7976C615352j52691k851052k431231J080983K841325J198265L8443J380965J763492
7967F483851j148927l907043k820448L95922K103971J949512J237165j77164k010847
7958B105992k034851K57583J680523J60293j764464j355554j83229q10041k189207
$$ y = [-2496240, -4340891, -2023809, 2056283, 3278502, 2150081, 2555052, 4054259, 2418937, -2117514, -3900814, -775621, 2255818, 1041019, -1568408, -1230180, 814889, 583746, -1999207, -3787972, -3723183, -3369849, -3282543, -2321841, -187326, 1872503, 2598389, 1466319, -1205267, -3631464, -3385852, -204332, 3381894, 5258217, 5823182, 5931324, 5127893, 3413170, 2346808, 2613008, 2780573, 2175298, 2330180, 3615352, 3462661, 611609, -1819622, -738639, 2102686, 3300951, 3339394, 4720359, 6483851, 5334924, 1427881, -1392567, -996645, 1107326, 3056838, 4294003, 4116839, 2105992, 71141, 328724, 2009247, 2169540, 405076, -950478, -1133707, -1943748, -4132955]
7949d132955j989584o66028K53232J202927K623360K814292R74428o00414m77788
7940A470p69587k484523k331459J498932M536241K394046j740310k060116N23326
7931d31980P48029j588315j876422P20986K127806P75482m67653k89474o92781
7922i74322j948024j588764M72032J193911j49516q81128j31213R2702j71032
7913d085354J490323M159760L592964l61160k519047q57802J02321k417549m195700
7904e091244j475175K110724J622076q81042l37386K443113K485321o94531k475654
7895b293798o80513J725553J873172N31446l79918m64887j93448R1513M8736k36108
7885B1748l1342N63813J28158j537472k166028m68709J160495J45861j938369
$$ y = [-4132955, -6122539, -6788567, -6535335, -5332408, -2709048, 105244, 1079672, 479258, 1470, -768117, -3252640, -5584099, -4085167, 451074, 2845120, 1104810, -955306, -431980, 316049, -1272266, -3148688, -2427702, -299896, 475586, 7933, -281541, -974322, -2922346, -4511110, -4039078, -2845167, -2994683, -3875811, -4007024, -3914322, -4085354, -2595031, 1564729, 5157693, 4796533, 2277486, 1419684, 1522005, -895544, -5091244, -6566419, -4455695, -2833619, -3714661, -4052047, -1608934, 876387, 181856, -2293798, -2974311, -1248758, 624414, 1155860, 775942, 311055, 117607, 209120, 257856, 21748, -9594, 554219, 682377, -855095, -3021123, -3489832, -2329337, -2183476, -4121845]
7876d121845j815989K88756J550658J412543J543772J691292n3966k769268k807510
7867e081557O19520L665839L071846J50214j872353j900397q88606J29806N09595
7858a596093P4869l20664L09247J302058J127378n1475o93566o39845r20335q36293
7848b244719J369597M277150L603604j395029n380078l609815J504460L738756
7840A863926J151884k480583l398208j838752k26086J72861M2489O34589K059997
7831b017883K832801J632370n47553j396911o26351l03415j219090j404152L54492
7822b695692K072325J714018M89597N08001J173569P79301o4628K13943P70999
7813D961433k33696j826872j408976Q19021K169129J853913J406264Q97916j195220
$$ y = [-4121845, -5937834, -5649078, -4098420, -2685877, -1142105, 549187, 495221, -2274047, -5081557, -4462037, -796198, 2275648, 2425862, 553509, -1346888, -2235494, -2105688, -1596093, -1521224, -1841888, -1532641, -230583, 896795, 845320, 151754, -488091, -1408426, -2244719, -875122, 3402028, 7005632, 5610603, 230525, -3379290, -1874830, 1863926, 3015810, 535227, -2862981, -4701733, -4927819, -4754958, -4712469, -4077880, -2017883, 814918, 2447288, 1899735, 502824, -123527, -426942, -1646032, -3050184, -2695692, -623367, 1090651, 1580248, 2088249, 3261818, 4041119, 3976491, 4190434, 4961433, 4727737, 2900865, 1491889, 2310910, 4480039, 6333952, 7740216, 8638132, 7442912]
7804G442912l895899l716594j06047K852009K026365o87552j838066j016988J89099
$$ y = [7442912, 3547013, -169581, -275628, 2576381, 4602746, 3915194, 2077128, 1060140, 1249239]
$$ [...]
##END NTUPLES=NMR SPECTRUM
##END=
