##TITLE=31Pdec_PR-I
 D2O, 24 sc
 1.10.2021
##JCAMPDX= 6.0         $$ Bruker NMR JCAMP-DX V2.0
##DATA TYPE= NMR SPECTRUM
##DATA CLASS= NTUPLES
##ORIGIN= UXNMR, Bruker Analytische Messtechnik GmbH
##OWNER= root
$$ XWIN-NMR		Version 3.5
$$ Fri Oct  1 13:02:35 2021 Russian Standard Time (UT+4h)  she@DPX200
##.OBSERVE FREQUENCY= 81.013821
##.OBSERVE NUCLEUS= ^31P
##.ACQUISITION MODE= SIMULTANEOUS
##.ACQUISITION SCHEME= undefined
##.AVERAGES= 24
##.DIGITISER RES= 16
##SPECTROMETER/DATA SYSTEM= spect
##.PULSE SEQUENCE= zgpg30
##.SOLVENT NAME= CDCl3
##.SHIFT REFERENCE= (INTERNAL, CDCl3, 0, 248.564)
##AUDIT TRAIL= $$ (NUMBER, WHEN, WHO, WHERE, WHAT)
$$ ##TITLE= Audit trail, XWIN-NMR		Version 3.5
$$ ##JCAMPDX= 5.01
$$ ##ORIGIN= Bruker BioSpin GmbH
$$ ##OWNER= she
$$ F:/spectra/data/she/nmr/P31/1/pdata/1/auditp.txt
$$ ##AUDIT TRAIL=  $$ (NUMBER, WHEN, WHO, WHERE, WHAT)
(   1,<2021-10-01 13:01:22.93 +0400>,<she>,<DPX200>,
      <created by zg, POWCHK disabled, PULCHK disabled
       configuration hash MD5:
       00 E9 B6 7A A2 85 ED C7 34 08 36 98 17 FE 4E 26
       data hash MD5: 32K
       35 B0 26 33 72 FB 82 75 60 88 95 44 7E 08 8A EE>)
(   2,<2021-10-01 13:01:25.51 +0400>,<she>,<DPX200>,
      <Start of raw data processing
       efp BC_mod = 2 LB = 1 FT_mod = 6 PKNL = 1 PHC0 = -8809.096 PHC1 = 29.46903 SI = 64K 
       data hash MD5: 64K
       85 52 D8 6A 2F 04 F1 59 DA F4 33 0C 7A 16 5F 07>)
(   3,<2021-10-01 13:01:55.62 +0400>,<she>,<DPX200>,
      <pk PHC0 = -43.50413 PHC1 = 83.19998 
       data hash MD5: 64K
       8D 7D 57 25 01 32 7A 1E 41 E9 1E F3 7E D9 B2 97>)
(   4,<2021-10-01 13:01:59.48 +0400>,<she>,<DPX200>,
      <abs ABSG = 5 
       data hash MD5: 64K
       A6 8A DE 88 CD 33 56 BA 26 DE A3 A1 91 DF 39 58>)
$$ ##END=
$$ 
$$ hash MD5
$$ 7E 9D B9 A3 FD 43 34 85 0E F6 0F A4 D4 58 8B B5
##$RELAX= 
##$RELAX= 
##$RELAX= 
##$RELAX= 
##$RELAX= 
##$RELAX= 
##$RELAX= 
##$RELAX= 
$$ Bruker specific parameters
$$ --------------------------
##$DU= <F:/spectra>
##$EXPNO= 1
##$NAME= <P31>
##$PROCNO= 1
##$TYPE= <nmr>
##$USER= <she>
##$AMP= (0..31)
100 100 100 100 100 100 100 100 100 100 100 100 100 100 100 100 100 100 
100 100 100 100 100 100 100 100 100 100 100 100 100 100 
##$AQSEQ= 0
##$AQ_mod= 1
##$AUNM= <au_zg>
##$AUTOPOS= <>
##$BF1= 81.014009
##$BF2= 200.13
##$BF3= 200.13
##$BF4= 200.13
##$BF5= 200.13
##$BF6= 200.13
##$BF7= 200.13
##$BF8= 200.13
##$BYTORDA= 1
##$CFDGTYP= 0
##$CFRGTYP= 5
##$CHEMSTR= <none>
##$CNST= (0..31)
1 1 145 1 1 1 1 1 1 1 1 1 1 1 1 1 1 1 1 1 1 1 1 1 1 1 1 1 1 1 1 1 
##$CPDPRG= <waltz16>
##$CPDPRG1= <>
##$CPDPRG2= <waltz16>
##$CPDPRG3= <>
##$CPDPRG4= <mlev>
##$CPDPRG5= <mlev>
##$CPDPRG6= <mlev>
##$CPDPRG7= <mlev>
##$CPDPRG8= <mlev>
##$CPDPRGB= <>
##$CPDPRGT= <>
##$D= (0..31)
0 1 0 0 0 0 0 0 0 0 0 0.03 2e-05 3e-06 0 0 0 0 0 0 0 0 0 0 0 0 0 0 0 0 
0 0 
##$DATE= 1633078882
##$DBL= (0..7)
120 120 120 11 120 120 24 19 
##$DBP= (0..7)
150 150 150 150 150 150 150 150 
##$DBP07= 0
##$DBPNAM0= <>
##$DBPNAM1= <>
##$DBPNAM2= <>
$$ [...]
##$SUBNAM3= <"">
##$SUBNAM4= <"">
##$SUBNAM5= <"">
##$SUBNAM6= <"">
##$SUBNAM7= <"">
##$SUBNAM8= <"">
##$SUBNAM9= <"">
##$SW= 501.771253377433
##$SWIBOX= (0..15)
0 1 3 0 0 0 0 0 0 0 0 0 0 0 0 0 
##$SW_h= 40650.406504065
##$TD= 32768
##$TD0= 1
##$TE= 0
##$TE2= 300
##$TE3= 300
##$TEG= 300
##$TL= (0..7)
0 120 53 12 22 120 120 120 
##$TP= (0..7)
150 150 150 150 150 150 150 150 
##$TP07= 0
##$TPNAME0= <>
##$TPNAME1= <>
##$TPNAME2= <>
##$TPNAME3= <>
##$TPNAME4= <>
##$TPNAME5= <>
##$TPNAME6= <>
##$TPNAME7= <>
##$TPOAL= (0..7)
0.5 0.5 0.5 0.5 0.5 0.5 0.5 0.5 
##$TPOFFS= (0..7)
0 0 0 0 0 0 0 0 
##$TUNHIN= 0
##$TUNHOUT= 0
##$TUNXOUT= 0
##$USERA1= <user>
##$USERA2= <user>
##$USERA3= <user>
##$USERA4= <user>
##$USERA5= <user>
##$V9= 5
##$VALIST= <valist>
##$VCLIST= <CCCCCCCCCCCCCCC>
##$VD= 0
##$VDLIST= <DDDDDDDDDDDDDDD>
##$VPLIST= <PPPPPPPPPPPPPPP>
##$VTLIST= <TTTTTTTTTTTTTTT>
##$WBST= 1024
##$WBSW= 4
##$XGAIN= (0..3)
0 0 0 0 
##$XL= 0
##$YL= 0
##$YMAX_a= 22482
##$YMIN_a= -22470
##$ZGOPTNS= <>
##$ZL1= 120
##$ZL2= 120
##$ZL3= 120
##$ZL4= 120
##$ABSF1= 248.5645
##$ABSF2= -253.2056
##$ABSG= 5
##$ABSL= 3
##$ALPHA= 0
##$AQORDER= 0
##$ASSFAC= 0
##$ASSFACI= 0
##$ASSFACX= 0
##$ASSWID= 0
##$AUNMP= <proc_1d>
##$AZFE= 0.1
##$AZFW= 0.5
##$BCFW= 0
##$BC_mod= 2
##$BYTORDP= 0
##$COROFFS= 0
##$CY= -3
##$DATMOD= 1
##$DC= 0
##$DFILT= <>
##$DTYPP= 0
##$F1P= 0
##$F2P= 0
##$FCOR= 1
##$FTSIZE= 65536
##$FT_mod= 6
##$GAMMA= 0
##$GB= 0
##$INTBC= 1
##$INTSCL= 5.30512e-09
##$ISEN= 30
##$LB= 1
##$LEV0= 0
##$LPBIN= 0
##$MAXI= 10000
##$MC2= 0
##$MEAN= 0
##$ME_mod= 0
##$MI= 50
##$NCOEF= 0
##$NC_proc= -3
##$NLEV= 6
##$NOISF1= 182.463
##$NOISF2= 159.3651
##$NSP= 0
##$NTH_PI= 0
##$NZP= 0
##$OFFSET= 248.5645
##$PC= 4
##$PHC0= -8852.6
##$PHC1= 112.669
##$PH_mod= 1
##$PKNL= yes
##$PPARMOD= 0
##$PSCAL= 0
##$PSIGN= 0
##$REVERSE= no
##$SF= 81.014009
##$SI= 65536
##$SIGF1= 159.3651
##$SIGF2= -187.1042
##$SINO= 113.3802
##$SIOLD= 16384
##$SREGLST= <1H.CDCl3>
##$SSB= 0
##$STSI= 65536
##$STSR= 0
##$SW_p= 40650.406504065
##$SYMM= 0
##$S_DEV= 0
##$TDeff= 32768
##$TDoff= 0
##$TI= <>
##$TILT= no
##$TM1= 0
##$TM2= 0
##$TOPLEV= 0
##$USERP1= <user>
##$USERP2= <user>
##$USERP3= <user>
##$USERP4= <user>
##$USERP5= <user>
##$WDW= 1
##$XDIM= 65536
##$YMAX_p= 301673726
##$YMIN_p= -21199249
$$ End of Bruker specific parameters
$$ ---------------------------------
##NTUPLES= NMR SPECTRUM
##VAR_NAME=  FREQUENCY,     SPECTRUM/REAL,   SPECTRUM/IMAG
##SYMBOL=    X,             R,               I
##VAR_TYPE=  INDEPENDENT,   DEPENDENT,       DEPENDENT
##VAR_FORM=  AFFN,          ASDF,            ASDF
##VAR_DIM=   65536,         65536,           65536
##UNITS=     HZ,            ARBITRARY UNITS, ARBITRARY UNITS
##FACTOR=    0.620285442955139, 1,           1
##FIRST=     20137.2065510759, 0,            0
##LAST=      -20513.1999529892, 0,           0
##MIN=       -20513.1999529892, -21199249,   0
##MAX=       20137.2065510759, 301673726,    0
$$ Real data points
##PAGE= N=1
##DATA TABLE= (X++(R..R)), XYDATA
$$ [...]
36463B17065R1167j40652k05944m0161J01843M6142n2327l672J06288R2425k1656
36452A90518q3079o8227n8210n2686K16O1585O0791K8363J6735k2712j15796j21858
36440a64360P2587K90985K43759n0849k63527j94242Q309J17895J06628N9553
36430B26738M6p2012r7068l6834M2709O4021M4234L5707L5381K3975J8839J5821
36418C01557m0485j45044j74997n3561R5772R1619m5057j17912m0148N9010N4114
36407a5132K842J3240N0800J3982o9286p7799o176K4858j5250p448R6076J53291
36395A63998N0903r3103j00937r886P899o0009n8085N8334J41609R0524j0965
36384A80282n8966p0893q0673m3551N2775J09413N7379k7351m7712k0599O217
$$ y = [217065, 308232, 167580, -38364, -78525, 23318, 69460, 17133, 13461, 119749, 212174, 190518, 107439, 39212, -18998, -71684, -71468, -9883, 50908, 79271, 96006, 73294, -42502, -164360, -91773, 199212, 442971, 392122, 128595, -65647, -57338, 60557, 167185, 226738, 226784, 154772, 57704, 20870, 63579, 127600, 171834, 207541, 242922, 266897, 285736, 301557, 261072, 116028, -58969, -112530, -16758, 74861, 29804, -88108, -128256, -69246, -15132, -12290, 950, 51750, 65732, -3554, -81353, -87529, -62671, -77921, -85369, 10707, 163998, 214901, 121798, 20861, 10975, 18874, -41135, -99220, -40886, 100723, 191247, 180282, 121316, 50423, -30250, -73801, -21026, 88387, 145766, 118415, 70703, 50104, 56321]
36373E6321N3451J12740P3848j00921k33925j40810Q5694J81920O4766j00518
36363E2566j63555j36615p1648K5906J13245J02861J1659j8400O8461J32652M5844
36352A62976r5602r8697M1825J34905O5849o0027r1534l2330K0894N2787J07509
36341B08555J31075P272k10265k74274o7696J85917K00129J5425r0495k3651L5155
36330A17147l2635j05545o0390K9183M9320K2853P952j9251n8948k4814Q3968
36319H840J14102O462o4960K1150R4240l1216k06240j61045M7055J18672q022
36308f0962r3370k1163M0531j9504n5918N0205J56178Q9425o1738q3434M3153
36297a6597J34379P0855o9352j38352q7101P075M0963R32l0626N196N9985O0208
$$ y = [56321, 109772, 222512, 296360, 195439, -38486, -179296, -93602, 88318, 153084, 52566, -110989, -247604, -319252, -293346, -180101, -77240, -65581, -83981, -15520, 117132, 162976, 67374, -31323, 10502, 145407, 211256, 151229, 59695, 27365, 48259, 101046, 208555, 339630, 346902, 136637, -137637, -205333, -19416, 180713, 196138, 105643, 81992, 117147, 84512, -21033, -81423, -52240, -2920, 19933, 27885, 8634, -50314, -75128, 8840, 122942, 129404, 64444, 85594, 179834, 148618, -57622, -218667, -171612, -52940, -60962, -154332, -175495, -134964, -154468, -210386, -160181, -4003, 85422, 23684, -59750, -16597, 117782, 188637, 119285, -19067, -106168, -99093, -58130, -57198, -87824, -82628, -22643, 37565]
36285C7565K1951O096M932k9660p8535p7716k3290L7881Q5246J03173M7404n7764
36273G7283p4936M9140J38119K7082j42527j12080P1234J10630o5100j93298j05663
36262b20116L7767N8357K2993L8301K7472q9108j84115j03864P9595J82718J63124
36251A3124R6389J3332p8195j06930k8541P4356J06331Q8043O6794J0540r3917
36240A61326j57289j27114q8909j02767p5472O0484J81775J53930M3128k3892
36230B5200o9418j39474j21455O7770K38346J55134p5264j46155l1582p91j43404
36219b41093k16236n4167J64637K09746J13803L1002k0988r0491j14130j3585
36209b31502J15244R9887n1947j49958q0441N5382R4386J7836m9547j2096Q1555
$$ y = [37565, 59516, 65612, 70544, 40884, -37651, -115367, -138657, -100776, -15530, 87643, 135047, 77283, 2347, 51487, 189606, 216688, 74161, -37919, 33315, 143945, 78845, -114453, -220116, -182349, -123992, -100999, -62698, -35226, -124334, -308449, -412313, -332718, -150000, 13124, 109513, 122845, 44650, -62280, -90821, -16465, 89866, 177909, 244703, 255243, 161326, 4037, -123077, -211986, -314753, -390225, -329741, -147966, 5964, 49092, 25200, -44218, -183692, -305147, -237377, 969, 156103, 80839, -65316, -96898, -97689, -241093, -457329, -511496, -346859, -137113, -23310, 7692, -13296, -103787, -217917, -231502, -116258, -16371, -68318, -218276, -298717, -243335, -148949, -131113, -180660, -192756, -111201]
36198a11201J13670N3815j4938k5911j0195j2510o146L6136N5047j3507j13491
36187d9231j27284l4374P7117J30338J08311K3222p1282q4449o844L2208n5033
36176e7301j43048n7023J42564K23978J13613l1059q2596p7807n9062J5027J28607
36165A15893J58644N9517m7288n2617J540L1927K6769j7395j24777k31827k02758
36154b82372m0057P4093M0942j1662M1011J17077R4281K1868L544O984l7557p2432
36142d4280k5760K5100j1172n2205R751Q0097J2514j00954n1495J20468J55950
36131A18014j6814j68055j14318M2767J07020M0588n5190q0023k505J07412J09436
36120H8332l1168j42031o9303O9265O9939j153O6391J95237R3794k01390k80794
$$ y = [-111201, 2469, 56284, 41346, 15435, 5240, -7270, -13416, 22720, 77767, 64260, -49231, -176515, -210889, -133772, -3434, 104877, 128099, 56817, -27632, -34476, -2268, -57301, -200349, -257372, -114808, 109170, 222783, 191724, 109128, 31321, -27741, -12714, 115893, 274537, 334054, 286766, 234149, 235689, 267616, 294385, 276990, 152213, -79614, -282372, -322429, -248336, -207394, -219056, -178045, -60968, 33313, 55181, 58725, 65709, 28152, -44280, -70040, -44940, -56112, -108317, -98566, -18469, -5955, -106909, -158404, -37936, 118014, 101200, -66855, -181173, -138406, -31386, 9202, -45988, -126011, -128516, -21104, 88332, 57164, -84867, -154170, -84905, -14966, -16119, 50272, 245509, 339303, 137913, -142881]
36109a42881n190K25563Q8809j65079j60812n31j0482j48702j26085M8461J12659
36098b84270M6370N9908J32305L4355j74756j59403R7067J91451l4942j92842
36088b84757K9936L44295L07727r760j94486j22965l7207q4781j41078q5522K1499
36077b57099P3152M2616m0513j09032p4195O5961J81611J73024R9577M9067q418
36066A95751j10878j74000j23727m2508k2782K230J05290J74988Q6593n6357p6885
36055d2285j1596m484k5151L6857R7109M585j26529n4947J46576J53410p9152
36044I4393k16250o7109J39067J42235Q415p3474q4140p8191k3459P7813R8234
36033A7534j4565j16714r0744j5319J6165N1479J14959R5502l6262j00420K0024
$$ y = [-142881, -148071, 77492, 166301, 1222, -159590, -160121, -170603, -319305, -445390, -396929, -284270, -237900, -177992, -45687, -11332, -186088, -345491, -248424, -56973, -91915, -284757, -254821, 89474, 397201, 387441, 192955, 69990, 32783, -51998, -193076, -278598, -257099, -183947, -141331, -181844, -290876, -365071, -299110, -117499, 55525, 155102, 204169, 195751, 84873, -89127, -212854, -255362, -278144, -275914, -170624, 4364, 90957, 34600, -42285, -53881, -58365, -83516, -46659, 50450, 55035, -71494, -126441, 20135, 173545, 94393, -121857, -188966, -49899, 92336, 100751, 27277, -56863, -135054, -158513, -80700, 17534, 2969, -113745, -204489, -219808, -203643, -152164, -37205, 58297, 22035, -78385, -58361]
36022e8361J65769J47309K4998m5924o7284r4211o6822L2448L8912j29230k43605
36011b96001q3010J78413K09042K2835q3180j0682N9516L2433J1233L3529M29
36000G4557q9678j03289j4260N0498L9080K4226J3396n1817r8830Q668J79710
35989C2261J56107p5341k16601j01568P1695Q2231j425j5873J9557J0813r603
35978d7747J8757L2096l2434q7960m3554J7680k7590j31466j54961p1207N2916
35967d75470J81511K72074K21159J8169j40102p9463P7707P5213q5781j50590
35957h5573j4177J19725O4288p4936r5892j9089j7754j01087q1579J12728K77878
35946H4532J96953n1361j93732j21659O910K8743k1608l0357J0408L7296L9391
$$ y = [-58361, 107408, 254717, 279715, 233791, 166507, 72296, 5474, 37922, 76834, -52396, -296001, -379011, -200598, 8444, 31279, -51901, -62583, -3067, 29366, 40599, 74128, 74557, -15121, -118410, -132670, -82172, -43092, -18866, -5470, -57287, -156117, -147449, 32261, 188368, 113027, -103574, -205142, -133447, -51216, -52641, -68514, -48957, -38144, -47747, -28990, 3106, -29328, -117288, -160842, -143162, -170752, -302218, -457179, -528386, -475470, -293959, -21885, 199274, 217443, 77341, -2122, 75585, 150798, 65017, -85573, -99750, 19975, 84263, 9327, -86565, -105654, -123408, -224495, -306074, -193346, 84532, 281485, 230124, 36392, -85267, -78357, -49614, -71222, -101579, -91171, -53875, -14484]
35935a4484M0160K5888r116j2168L6440N4677j3502q0307m5560L2490L7283r284
35923D2517p046L1131K1461j1156J9127P3459M3438m1360o2121l5231o8203j16712
35911a10696l6037J22628J37529k1179j25383n7459K2897j6785o8152r447Q1338
35900h0746Q9713M5994Q286n0105j14873q4730L1697P4508J250k5268O3201J04963
35888F3890J8138k9017N8362R4891l9098j35158k2637Q4830m9293k30941j45245
35877c31278Q3270R0024j04430j45630L4596J31375K4273m2019O7630J45474L8431
35866h284q5020n3854K4320O50n1322j0660O1963O0837K5738K4191L685p4235
35854h1991j02207Q66J13384P8571n0271r7683k8476L5010K0592j0020J0797M6186
$$ y = [-14484, 25676, 51564, 42448, 30280, 66720, 121397, 107895, 27588, -17972, 14518, 51801, 42517, 35471, 66602, 88063, 76907, 96034, 169493, 212931, 171571, 109450, 74219, 6016, -110696, -146733, -24105, 113424, 92245, -33138, -90597, -67700, -84485, -152637, -162084, -80746, 8967, 54961, 63247, 13142, -101731, -186461, -154764, -80256, -79006, -104274, -41073, 63890, 82028, 53011, 111373, 206264, 167166, 32008, 9371, 94201, 44908, -186033, -331278, -248008, -157984, -262414, -408044, -373448, -242073, -217800, -259819, -192189, -46715, -8284, -93304, -147158, -122838, -122188, -173510, -184170, -122207, -61370, -35632, -11441, -7756, -81991, -184198, -183332, -69948, 8623, -41648, -139331, -167807, -132797, -112205, -122225, -111428, -65242]
35842f5242J1065r4608j48896m5313J34165J76586K5034j10818m9849Q2373N9697
35831b5806o8420o1946J03406K03398J38654M3379j6013j34847k76263k14211
35821c08669P0153K42992Q7831j45651j21413P9855J34773j2514j34780j21704
35811b29127q2049p3604j3569J14725J92764J52282O1058p483m7597n0330L679
35800B0749O7654O8710K9529L1905O3351K8163q1540j51541j05629L838Q4813
35789F0002R5322L7472m7251p3103O224J04480Q9290k9209r7100k9294P3367O7901
35777B58101m2342j24788q9428R480M7478j6985r0669o7804K4131O5310K1785
35766e731j4066J4679M0302M683k8973P620N7286L6563j6315j6572J4840P547
$$ y = [-65242, -54177, -148785, -297681, -342994, -208829, -32243, -7209, -118027, -167876, -85503, -25806, -94226, -156172, -52766, 150632, 289286, 332665, 316652, 181805, -94458, -308669, -238516, 4476, 92307, -53344, -174757, -94902, 39871, 27357, -107423, -229127, -311176, -384780, -398349, -283624, -90860, 61422, 122480, 114997, 67400, 17070, 20749, 88403, 157113, 186642, 218547, 281898, 310061, 228521, 76980, -28649, -24811, 60002, 155324, 192796, 145545, 72442, 78666, 183146, 272436, 243227, 146127, 116833, 190200, 258101, 215759, 90971, 1543, 11023, 58501, 41516, -49153, -116957, -92826, -27516, -5731, -19797, -5118, 35184, 39867, 10894, 18514, 75800, 112363, 96048, 79476, 94316, 101863]
35754A01863j2818J8359N4743P031p5680o5928J7791L1351m2534n6211M4511J12887
35742A35365L4507r5679j33952q8787m7252j7417L0533N8468K6352n295L1463
35731g1694P0669J725j29687j53583j7248J32641J46315M5914m6528o9162l9190
35720a29828K3153R9735J30252N6540p4446j29146n0429N6122N8685k1439n1365
35709c2166R363N2595j387p4790n4321L5828Q3338O1655L9457L5762q539r4982
35697E1813j23966m3860N1960N4433n149j8550K5237L0743m6169j23410j02619
35686b49537N871J01245J02234J9455n5575k7391J00723J97658J34289l9947j24067
35675A64958j8928J26346J16021j0470m5819N5812J03168k1564j62015j31453
$$ y = [101863, 89045, 107404, 162147, 169178, 93498, 27570, 45361, 76712, 34178, -22033, 22478, 135365, 169872, 74193, -59759, -148546, -195798, -213215, -182682, -124214, -97862, -103157, -71694, -1025, 700, -128987, -282570, -299818, -167177, -20862, 25052, -21476, -90638, -129828, -106675, -6940, 123312, 179852, 105406, -23740, -74169, -18047, 40638, 19199, -32166, -22803, 29792, 28405, -46385, -100706, -64878, 18460, 80115, 119572, 155334, 146795, 51813, -72153, -116013, -64053, -9620, -14769, -33319, -8082, 22661, -23508, -146918, -249537, -243666, -142421, -40187, -20732, -76307, -103698, -2975, 194683, 328972, 289025, 164958, 146030, 272376, 388397, 377927, 332108, 387920, 491088, 469524, 307509, 176056]
35665A76056j0258j0729j34973j84170p8906M7843R2043J00049J01001L1606q3756
35654D5806q5357N8354J30964j6197j96797j52802M5076J12950m679q3514k467
35643a48663R3436P3202J9925L8649O4034N476o7529m6901J3440j5089j12510
35632h2530j37239n0390L6714M5672K9535N5494R7849J00596O7357L1488n598
35621A88948n0096p4844n9416l4881l0044p373P3441J50886J14570k9348j39902
35610A01941j21002l2379K3904L6458L7352J2975m2938o4824j4602K4826j9278
35599e7567n9361J2116J01439M1410r8012q2719Q4011J21005p3455k15179o8951
35588b95263J65328J59334l9152j11587K7336J45394R2158o812n805M2013J0612
$$ y = [176056, 165798, 155069, 20096, -164074, -242980, -195137, -103094, -3045, 97956, 129562, 45806, -39551, 18803, 149767, 133570, -63227, -216029, -170953, -58003, -62682, -146196, -148663, -55227, 17975, 37900, 76549, 140583, 146059, 78530, 31629, 45069, 29980, -82530, -219769, -270159, -233445, -187773, -158238, -102744, -4895, 95701, 163058, 194546, 188948, 138852, 64008, 4592, -30289, -60333, -67706, 5735, 156621, 271191, 241843, 101941, -19061, -51440, -27536, 8922, 46274, 59249, 16311, -48513, -63115, -38289, -57567, -116928, -104812, -3373, 38037, -59975, -142694, -58683, 62322, -11133, -226312, -295263, -129935, 29399, -9753, -121340, -94004, 51390, 143548, 136736, 130931, 172944, 183556]
35577A83556j08063k15174k10100n8671J54182K51848J51302p993m0982K3736
35567A23641J6171q4082j21427k9869O6458N5332k1347o6006l3539P0348J68423
35556A44103J15183j13891k79371j44908J40164J98464k1544j66776l5238J29328
35546c4486O9171p8703n8802P2670R4096J3238J019M7090n350j35405j47883J037
35534a62308J30753J10732L531q2609j02058k8390J17534J94065P5981j28662
35524A28569j84072n8322M7724K1942k8790k2773m2866j21811j08239Q3175K58985
35513b6478J89872m2038j51030m9492O6547L3271p3693j04438n1576l628J8338
35502a94345O2059J23157J28576M7992n1312q6505n1469j668J8365L111l1205
$$ y = [183556, 75493, -139681, -349781, -408452, -254270, -2422, 148880, 140887, 99905, 123641, 139812, 55730, -65697, -95566, -29108, 26224, 4877, -61129, -94668, -24320, 144103, 259286, 145395, -133976, -278884, -138720, 59744, 38200, -128576, -163814, -34486, 34685, -44018, -102820, -30150, 63946, 77184, 78203, 125293, 119943, -15462, -163345, -162308, -31555, 79177, 82708, 99, -101959, -130349, -12815, 181250, 257231, 128569, -55503, -113825, -66101, -44159, -72949, -95722, -138588, -260399, -368638, -285463, -26478, 163394, 121356, -29674, -79166, -12619, 20652, -53041, -157479, -209055, -212683, -194345, -132286, -9129, 119447, 167439, 116127, 29622, -21847, -23515, -5150, -2039, -33244]
35491c3244n7259m7137n024K6578K5817L0986P2359R3784K1993r4248j15505j0013
35479i0913Q1924M3545n1233o0953M045J1640p0084j18257m8151N8336Q2227L7411
35467a20463J8576L0180j6497j28370j66187k8662J67114J99292K7392j44535
35457a62160j27539K6921J31585J10679L9408r352l2253k4605L2899J00011R7009
35446A82603K5961k3225j3040m608l0669k9273L9626J05639Q4378j0498j10334
35435B16560j75895j85729j18147o537O0143N2713M3367P3936P3054j5485j09426
35424i1446r5909J430O5960N0272L60l7596m4744q929L6262M847j11878j67051
35412c98422l3267J82485K39843P8703j03364j15839J572P7540M1862k1058j5212
$$ y = [-33244, -90503, -137640, -142664, -116086, -90269, -59283, 13076, 106860, 128853, 34605, -80900, -90913, -8989, 34556, -16677, -77630, -73585, -61945, -132029, -250286, -298437, -240101, -157874, -120463, -101887, -71707, -88204, -216574, -382761, -411423, -244309, -45017, -17625, -162160, -289699, -262778, -131193, -20514, 18894, 9542, -22711, -47316, -14417, 85594, 182603, 208564, 185339, 172299, 167691, 137022, 107749, 147375, 253014, 337392, 326894, 216560, 40665, -145064, -263211, -269748, -209605, -156892, -113525, -39589, 33465, 17980, -91446, -187355, -185925, -119965, -69693, -69333, -106929, -151673, -160602, -124340, -119493, -231371, -398422, -431689, -249204, -9361, 69342, -34022, -149861, -148289, -70749, -28887, -49945, -65157]
35401f5157M2676N7243j5648j06338j15548l8704L6201M6312J2908k0038l8608
35390b04701l3494R089O5483Q6924P1773N7022L3940l1939q9373l7586R4290J46872
35378A68300O7482m034L0044O4292j3408j11878q3036L1695O9990j0082j09297
35367A00068j47892j13480j2031J03294J24064K8079n1477j6874L6525j0866r3720
35356e4310q6910k6447j6838k1999M4395J13700P1085j2305P036P2370K5678p7813
35344C7642l7886J28349J82872M4664j02804j20434p0789k1367N3154J13128M6215
35333B52744j12835j85581j31645r0823r5814j2459J58384K05814N3290r2712
35323e1637p4973n887p337N335R9826J39651K9599p6438l2921L9988j2120q6290
$$ y = [-65157, -22481, 34762, 19114, -87224, -202772, -241476, -205275, -158963, -146055, -166093, -204701, -238195, -229106, -163623, -76699, -4926, 52096, 86036, 54097, -35276, -72862, 21428, 168300, 235782, 231748, 261792, 326084, 312676, 200798, 117762, 149457, 219447, 209365, 100068, -47824, -161304, -173335, -70041, 54023, 82102, 30625, 13751, 50276, 39410, -54310, -141220, -167667, -184505, -206504, -162109, -48409, 22676, 10371, 17407, 89777, 115455, 37642, -244, 128105, 310977, 355641, 252837, 132403, 61614, 40247, 93401, 206529, 252744, 139909, -45672, -177317, -268140, -363954, -376413, -218029, -12215, 41075, -51637, -126610, -132497, -139834, -134499, -34673, 104978, 134577, 58139, 25218, 65206, 53086, -33204]
35311c3204j8187J01502Q2886k5478l8942K2755j2007j28412j25699M2049J75865
35300D3128J26068j7259q2838k8039N7939P3275K940o2132l5194K3819j8574j22746
35288c9613p8914J46113K70104Q3218k05201k43481k8307J42356J17718K1177
35278A85170l0379o2808q9125n5543J8166L6191n704j7006J3887R673l1867l5332
35266f4677m979p614j1120O1626J29186L6515j38328j25785J11844K62066J04797
35255C53531j59566k10167m6864Q7521R2848P7320J00035Q5227K104o5563p2769
35244B43657p8157j02610p1856J9655L0904j08405k14611o8877K29999L46412
35234B26111J65452n2384o8131N503m9269j69233j36512K4281Q5214J4925J5209
$$ y = [-33204, -51391, 50111, 132997, 107519, 68577, 91332, 79325, -49087, -174786, -132737, 43128, 169196, 151937, 69099, 41060, 98999, 172274, 175214, 113082, 77888, 101707, 83133, -39613, -118527, 27586, 297690, 380908, 175707, -67774, -96081, 46275, 163993, 185170, 154791, 91983, 2858, -52685, -34519, 1672, -4032, -21038, -7151, 2522, -29345, -64677, -69656, -77270, -88390, -26764, 102422, 138937, 609, -125176, -13332, 248734, 353531, 193965, -16202, -63066, 24455, 117303, 194623, 294658, 379885, 381989, 316426, 243657, 165500, 62890, -8966, 10689, 41593, -66812, -281423, -350300, -120301, 226111, 391563, 339179, 271048, 276551, 227282, 58049, -78463, -54182, 31032, 45957, 61166]
35223F1166J28884J43844j2587j07761M435J25862O4486l0376M5601J59314N6250
35212F39118j86903k61675r8033P6730J09868O7266J8678n3579j14048p4735L3665
35201A56352Q1457M3562J3418K3564K0700m145k6750q4358j81857j74657L9262
35190i3452K77795K73241O5527o5646k5288K7155J5318L5928Q3875J2631j54020
35179D53064j80108J673J53026J04057m906m659L3261j5803r1953q6929l8844
35168C21879k1266l76M5100K8043o9130q9743N4972J96017J41413l2878j12359
35157D61672n4371J2976J6742p125k6001l1819l3N8078O0949k5469j02851o7469
35145B95279M4216J16884R4893O92j01172j15272J606J32591J10808k9157q1445
$$ y = [61166, 190050, 333894, 321307, 213546, 217981, 343843, 408329, 377953, 423554, 582868, 639118, 452215, 190540, 92507, 169237, 279105, 346371, 365049, 311470, 197422, 122687, 156352, 237809, 281371, 294789, 318353, 339053, 334908, 308158, 223800, 41943, -132714, -93452, 184343, 457584, 523111, 457465, 432177, 459332, 474650, 510578, 594453, 607084, 453064, 272956, 274629, 427655, 531712, 526806, 522147, 555408, 539605, 447652, 360723, 321879, 300613, 300237, 345337, 373380, 304250, 214507, 269479, 465496, 606909, 574031, 461672, 407301, 420277, 437019, 429894, 403893, 372074, 372041, 430119, 491068, 465599, 362748, 295279, 339495, 456379, 551272, 551964, 450792, 335520, 337126, 469717, 580525, 551368, 469923]
35134D69923M025M0681n9922j14923J3680J58052J08395m9980r8205l5231k1087
35123D15408p6106q3215k3568J7335L4068Q4566J24076N3491q3648j31292m4925
35112B86190O2332Q9726M0353l6252q2894n0228L1560N3011j7739p0180l8241
35101B67638k2558r4551j25337P096J71850J64885L2727j7909M3868P3404L3072
35090E34185J8702K6669m8802j75332j83204m3102P6239P3328L3792L5246K7180
35079C74901k9374p3815o4198l9332j7940K3268M5421k1221j16783r5968K9676
35068A4635P6938k2462j04282k8741J09974J39019L9785p9728j38376j15515k4704
35057a33457O7353P8805K7426J8015P3237Q9262J2579o2570m6902R832K4095J3284
$$ y = [469923, 473948, 514629, 454707, 339784, 353464, 511516, 619911, 569931, 471726, 436495, 415408, 339302, 256087, 232519, 249854, 283922, 368488, 492564, 546055, 462407, 331115, 286190, 348522, 438248, 478601, 442349, 359455, 309227, 340787, 393798, 376059, 305879, 267638, 245080, 150529, 25192, 32288, 204138, 369023, 401750, 383841, 427709, 501113, 534185, 552887, 579556, 530754, 355422, 172218, 129116, 205355, 278683, 312475, 347721, 374901, 345527, 271712, 207514, 168182, 150242, 173510, 218931, 197710, 80927, -15041, 14635, 91573, 69111, -35171, -63912, 46062, 185081, 224866, 145138, 6762, -108753, -133457, -66104, 12701, 40127, 58142, 131379, 220641, 233220, 170650, 123748, 133580, 157675, 170959]
35045A70959K8773M3263Q654m0000l8316m566r067o1121r9581p7924n475P8308
35033f093J28927J11584K5749q3731j49268j22140j9269O5549N0947j1715Q019
35022a441J03785R7080q1289k17585j02435J22073J42541n7029j79964p4819P3666
35011a75417Q0620K3155M3640J14067J42442J31909R3590k8471k02050k45159
35001b1674q1461R6016Q8496k4295m9491N860M785m2864j6084O0875L9940p9641
34989a9538j23223j4711J09885J15056L8145j2205r690m62k2360p5699j16664
34978a31466p5362N2906J52162J11324j0454n0162L1044J00576N0198p0632j47813
34967A2321j33953n2935M2656Q5451L9838l5770m1552K8746P7486M3186k8621
$$ y = [170959, 199732, 242995, 251649, 211649, 173333, 168767, 159700, 98579, -1002, -78926, -84401, -6093, 122834, 234418, 260167, 176436, 27168, -94972, -114241, -48692, 2255, -9460, -1441, 102344, 199424, 118135, -99450, -201885, -79812, 62729, 5700, -174264, -249083, -175417, -94797, -71642, -28002, 86065, 228507, 360416, 454006, 425535, 223485, -21674, -103135, -7119, 81377, 57082, 7591, 13451, 18236, -24628, -40712, 20163, 60103, -19538, -142761, -157472, -47587, 67469, 105614, 93409, 83719, 83257, 60897, -14802, -131466, -206828, -153922, -1760, 109564, 99110, 48948, 79992, 180568, 230766, 160134, 12321, -121632, -174567, -131911, -46460, -6622, -42392, -83944, -55198, 22288, 65474, 36853]
34956C6853p0972o4793m386J04715J81993J20015m7565j39273o5320L7170J2067
34945A00504p9833p5611K0584O1952J7102N930N8673M0024j04309k03392j00525
34934b58901R3168J49600M4505n0090m6885k2408j6816L8879J34342J13219p9207
34923I9406k33145j30807J24118K21986O4012j21769j12440K3943O4452n0217
34913e0461j52180q0286J12494K22018J36193l2487r0599j0979M7111j8728j04459
34902b2363p8029j658k4178j10990p7358R9038K02918R8844n5651m8415P5127
34891E7285J10681J7104n6988m0223l1072q7584j05607o03J24350J18582O477
34880A12402o5107n2721m2862o1923j8001J15926J98894J05177p9019j60936r2668
$$ y = [36853, -34119, -98912, -103298, 1417, 183410, 303425, 255860, 116587, 51267, 88437, 100504, 20671, -54940, -34356, 27596, 44698, 50628, 109301, 149325, 45016, -158376, -258901, -165733, -16133, 28372, -21718, -68603, -91011, -107827, -68948, 65394, 178613, 99406, -133739, -264546, -140428, 81558, 145570, 23801, -88639, -64696, -244, -50461, -202641, -282927, -170433, 51585, 187778, 155291, 64692, 53713, 100824, 82096, -22363, -100392, -102050, -126228, -237218, -314576, -215538, -12620, 86224, 30573, -17842, 57285, 167966, 185070, 128082, 87859, 56787, -30797, -136404, -137007, -12657, 105925, 112402, 47295, -5426, -48288, -110211, -128212, -12286, 186608, 291785, 212766, 51830, -40838]
34869d0838J205J9471j4157m2460n0966l5596M596K6125r825m1702K1940J28609
34857c3598J24127l174q9060o0927m8531j27861j58257l5235Q4465K6472q9514
34846d11093l9375J19710J44907K3310k2482O4579R4437K247k0475J10396J72855
34835B39016n805k32079k16217L645J43528Q1313l9195o6643j2153L6845K9656
34824c8089l3143j04623j13403m5111K4352L2530J8585M3469P8473N3238k7920
34813a11642r4168j01170n5029K1117R0386J08946P5316L4915P472l2758p9383
34802a35998p4334k437P5056J15007J27511Q9627m6960k09726k19589m7044R4879
34791b34008M2255p7632n9665N2646O5807k1989k0597J22928K26972J56185P943
$$ y = [-40838, -39633, -20162, -34319, -76779, -127745, -163341, -158745, -132620, -142445, -184147, -162207, -33598, 90529, 87355, -1705, -62632, -111163, -239024, -397281, -432516, -348051, -321579, -411093, -450468, -330758, -185851, -162541, -185023, -120444, -26007, -23760, -44235, 66161, 239016, 233211, 1132, -215085, -211440, -67912, 13401, -25794, -92437, -104590, -67745, -38089, -71232, -175855, -289258, -334369, -310017, -277487, -258902, -215433, -136960, -83722, -111642, -205810, -306980, -362009, -340892, -250506, -141560, -66244, -31329, -23857, -56615, -135998, -210332, -212769, -137713, -22706, 104805, 194432, 147472, -62254, -281843, -328887, -234008, -191753, -269385, -329050, -276404, -210597, -232586, -253183, -130255, 96717, 252902, 260845]
34780B60845o3067n4899n1810n8777j9446N5352Q1799K0597o7653j01952p9261
34769g8272o0200o3201k6329P9089J46420N2524j26714j61565J4573J75713J04910
34758E6948r3330j44889Q6J16602M7337q6495q6124M1494J10110J6525j20628
34747a42364j09406O8882K19786J69858j2299j12675o1839J476k6008o1939j0161
34736g6689O6853P4724O2925J16366J66099Q8234o6504j28295o6893j2784k3487
34725B00549j2010O1867R9249K5171q7322j25512p4193O633N9049M7035k1603
34714A78913p0447l3169L3416J1666r3097j46116q2730J0880N5354Q2080J12798
34703E9548P0988p7002j97857j44983K2923J12635N9894j1120l60K7058k4582
$$ y = [260845, 197778, 142879, 91069, 32292, 12846, 68198, 149997, 170594, 102941, 989, -78272, -138472, -201673, -228002, -148913, -2493, 50031, -76683, -238248, -223675, -47962, 56948, -36382, -181271, -181185, -64583, -17246, -103741, -189865, -148371, -38261, -21736, -142364, -251770, -182888, 36898, 206756, 194457, 81782, 19943, 21419, -4589, -66528, -76689, -9836, 64888, 127813, 244179, 410278, 498512, 432008, 303713, 236820, 224036, 200549, 188539, 250406, 349655, 374826, 287504, 161992, 87799, 94432, 153481, 200516, 178913, 108466, 75297, 108713, 120379, 27282, -118834, -201564, -190684, -135330, -53250, 59548, 130536, 53534, -144323, -289306, -266383, -153748, -93854, -104974, -105334, -78276, -102858]
34692a02858j00876n9909J05829K16749J21916r6618k12899j31559J2929N3145
34682a94151K152K402J07306K03989J65931J9847q4671n8551J6979k641j22786
34671E5806j81071n9543J39082K09773J00380n0891j09725o6000K5756R8256O6681
34660B28504q3887j99065j08171J02886J63906Q971j31217j06802o2055j22280
34650c09210j31209O2006K70976K20855j7635j44109p7477J1030M0484Q4201J23675
34639A33587M8303r0355j09301j117N9559L3385N5095J24030O6162j17961j77930
34628B3457j3257J36053O0058j11664j53491p7568k5757r276L8604Q5562O3687
34617A6408Q191j6829k9827m7063q987Q6500J13958J8403n7603M607R0701L7913
$$ y = [-102858, -203734, -263643, -157814, 58935, 180851, 84233, -128666, -260225, -247296, -194151, -191999, -189597, -82291, 121698, 287629, 307476, 222805, 164254, 181233, 178592, 55806, -125265, -184808, -45726, 164047, 264427, 213536, 103811, 37811, 63567, 161823, 228504, 144617, -54448, -162619, -59733, 104173, 113144, -18073, -124875, -186930, -309210, -440419, -378413, -107437, 113418, 95783, -48326, -125803, -114773, -74289, 9912, 133587, 181890, 91535, -17766, -18883, 40676, 74061, 129156, 253186, 319348, 201387, 23457, 10200, 146253, 206311, 94647, -58844, -136412, -162169, -171445, -132841, -47279, 16408, 24599, 7770, -22057, -69120, -78107, 8393, 122351, 140754, 83151, 87758, 178459, 216372]
34605B16372r6462j41404q5882m7050m0214J4378R5530R0181l785n3492Q653R2753
34593D9578Q7066j0277j14949j43993p5035L3020Q7097N6851l082l6813l3250
34582a03787J3804R4261J18864k094j82660k14143n3957R8683R3951K1810O186
34571a09082J047n6966p6135J8924J01904M3037m6648n20R8152N5870p9241q8536
34559a38194M1978J03180J3464q5762j05379j12792j15060l616J96034K62352
34549E6205Q9874j36378k06815j50475r8165n0375N1037J44181J20749J1818n4244
34538b22588m0265j5690j1076J8565Q6160J32272J12810N5500P287k2350m2849
34527E7776m6258k1453J0481P983l3740o0889k4894M5245P7039N6841L9217M4350
$$ y = [216372, 119910, -21494, -107376, -154426, -194640, -180262, -84732, 5449, 1664, -51828, -43175, 49578, 136644, 126367, 11418, -132575, -207610, -174590, -87493, -30642, -33724, -70537, -103787, -89983, 4278, 123142, 121048, -61612, -275755, -329712, -231029, -137078, -115268, -109082, -108035, -165001, -241136, -222212, -120308, -77271, -123919, -124439, -26287, 29583, -49658, -138194, -96216, 6964, 20428, -65334, -170713, -283505, -398565, -402181, -206147, 56205, 146079, 9701, -197114, -347589, -445754, -496129, -445092, -300911, -180162, -168344, -222588, -262853, -278543, -289619, -271054, -184894, -52622, 60188, 115688, 122975, 100625, 57776, 11518, -9935, 546, 8529, -25211, -86100, -110994, -65749, 11290, 68131, 107348, 151698]
34515A51698K2051m6752r2936o4779j9167l1080p3570p3184l0976K832K4132M6371
34503a85360K7347o0243j25691n9609Q2024J29125L5132p0127q2913m5689k1937
34492c77941K0440J21647K17666K07209Q7208m6975j11557r6744l9367K3718P4144
34481G9448J03448R7205M3162l7775r5156j05591j00699j13116j21850q2268R644
34470c23548J06009J44398R7694J7746N836P6783R2635n2823k19200j70607N0666
34459a74411J34539l3434j74415m5576J76691J88486L5955o219R4517J17945m1
34448C14037q4376o0666o5202j53845j81106o4189P0166J03883Q5681P7206L7862
34437G9451l8077n2669K3683P4154K2643n4747q4977j03989j28849r2026R813
$$ y = [151698, 173749, 126997, 34061, -30718, -49885, -80965, -154535, -227719, -258695, -255863, -231731, -185360, -158013, -218256, -343947, -403556, -321532, -192407, -157275, -227402, -310315, -356004, -377941, -357501, -235854, -18188, 189021, 276229, 229254, 117697, 20953, -18414, 5304, 79448, 182896, 280101, 323263, 285488, 190332, 84741, -15958, -129074, -250924, -333192, -323548, -217539, -73141, 24553, 42299, 48135, 124918, 217553, 164730, -54470, -225077, -174411, -39872, -73306, -247721, -293297, -116606, 71880, 107835, 101616, 196133, 314078, 314037, 229661, 168995, 103793, -50052, -231158, -295347, -225181, -121298, -35617, 41589, 79451, 41374, -11295, 12388, 86542, 109185, 54438, -30539, -134528, -263377, -355403, -345590]
34426c45590O5619L4968J8821O4901Q1361L1649J9968P6967O6647o1318j33580
34415g9587k7185J14134J15229L4219q03l2565j27421j61268j4356J57572J28380
34404A06349k3568l7712R8966J49999L6648n9381l2941o671o4096q7101J7785
34393I8277J35130J21866K0286m3800n6693p9529j02667o7654R555M7079J8708
34382A00558j1685J1907N2877K4544q6611j71165j13734M6899J46996J09444L5345
34371A45375K9887M0338k9903j31967j35404l6070M2206L8037R555j657l2963
34360f2566r7534j27959p1098L1209R5404Q7802M4164K3922M3359M7559j3017
34349A245p8527m2683N9865O7895l8219n8009J01699K05612K4745k51183k37717
$$ y = [-345590, -279971, -245003, -226182, -161281, -79920, -48271, -28303, 48664, 115311, 53993, -79587, -106772, 7362, 122591, 156810, 156007, 123442, -3979, -165247, -179603, -22031, 106349, 82781, 45069, 144035, 294034, 330682, 271301, 238360, 231689, 167593, 80492, 98277, 233407, 355273, 375559, 331759, 275066, 195537, 92870, 25216, 34771, 81850, 100558, 88873, 100780, 153657, 178201, 91590, -79575, -193309, -146410, 586, 110030, 145375, 175262, 215600, 185697, 53730, -81674, -117744, -75538, -37501, -27946, -29603, -62566, -160100, -288059, -359157, -327948, -232544, -144742, -100578, -76656, -33297, 14262, 1245, -77282, -119965, -60100, 7795, -30424, -88433, 13266, 218878, 243623, -7560, -245277]
34338b45277P1940K89117K00225K0958j3151R099q2275k12471k13214j21716q7778
34327c84543r7364k2050J18946J63994O3099n3642p3932k5970J7375L7523M0886
34316b15678K0685j3471k1603K2436R3376J24306N5585q9766j80602j01554P6900
34305b29386J49260M4032o9134k4359J02828J29169L9023l6000m8601o0018n9270
34294f2456L3682J56624J08884j41528l36778k53657q051J30105J15205J12611
34284a45359J64628J16902p8589k13015j03830J26613K17429J18283J240k2765
34274A81537j7576n3608r6432j02727q7768n1613L1681J06957O6353n2246n8596
34263a34038J00213K16136J28701j6049j4261M6308m5748k15634j87129M5047
$$ y = [-245277, -173337, 115780, 316005, 336963, 323812, 332911, 250636, 38165, -175049, -296765, -384543, -481907, -503957, -385011, -221017, -157918, -211560, -285492, -311462, -294087, -256564, -215678, -194993, -208464, -230067, -207631, -114255, 10051, 65636, -24130, -204732, -306286, -229386, -80126, -36094, -105228, -129587, -26759, 102410, 141433, 105433, 56832, -3186, -62456, -28774, 127850, 236734, 95206, -241572, -495229, -503280, -373175, -257970, -145359, 19269, 136171, 57582, -155433, -259263, -132650, 84779, 203062, 204302, 181537, 163961, 110353, 13921, -88806, -176574, -228187, -196506, -89549, -23196, -75442, -134038, -33825, 182311, 311012, 294963, 280702, 327010, 281262, 65628, -121501, -76454]
34253g6454J69951M7712q8285m2981M0314j3034q2239N474J24711N3484j24067
34242A4586j44498j0318K9389p7190j02751M3473J44563M9174o7211j845J39392
34231A6764J33197O472l7685K7389K8642r2216j74925j01566K7129O5194L0967
34220g0638L2280P4903O9410p213o7801m3181K2547L8960p627l8688R309R0220
34208A02481R2947j2314j13112q5175M0703J11710N2520n0913r1873p4874n0221
34197g8121r595N7103P5740j3995j19530r6105L2764J04552O3928J4659J0018
34186D1418j8561p2302l4582R0092J02904o7468j79009k8591J93681J76363k6606
34175A77339j01877J2063P3121j7537q1147k9469j1460q1255o3490Q8201J30080
$$ y = [-76454, 93497, 141209, 52924, 9943, 50257, 37223, -45016, -39542, 85169, 138653, 14586, -129912, -140230, -110841, -188031, -290782, -247309, -102746, -53572, -120783, -122628, 16764, 149961, 156433, 118748, 146137, 174779, 82563, -92362, -193928, -166799, -101605, -70638, -38358, 36545, 105955, 98742, 30941, -12240, 10307, 49267, 41640, 2952, 12261, 102481, 195428, 183114, 70002, -15173, 25530, 137240, 189760, 138847, 46974, -27900, -78121, -87716, -30613, 45127, 31132, -88398, -184503, -151739, -47187, 16741, 31400, 41418, 22857, -49445, -84027, 6065, 108969, 41501, -137508, -166099, 27582, 203945, 177339, 75462, 87525, 160646, 143109, 61962, 32493, 21033, -60222, -123712, -35511, 94569]
34164I4569n7353k03482o8709J44057J24357l1116j7848J29526J12044q7635j63822
34153b5412q808J26146P5957M614O2321J17740K2399j11153j08105k1110j2512
34142A22077q0590r7124l0591L2156L0546k3833r2344j16315n1695L7847K3629
34131b46237q3941j04667M2613J84286J41340K513k5409N9997Q3698r964q9154
34120d4925n9840J8481O6493Q2369O7414j0142j20547j53646o5199L9967M4146
34109a35429k2876l7909L2674Q8902N0124j8468L768J00841J13098l5938j94664
34098e5877j68369M470J00653K6645p4171o1301K0507P3934J04693J29871P5464
34087A76519q2011j87161r6978P8462J12780r597r5436m9222K1472K3220P774
$$ y = [94569, 37216, -166266, -234975, -90918, 33439, 2323, -15525, 114001, 226045, 138410, -25412, -34220, 91926, 167883, 172497, 234818, 352558, 374957, 263804, 155699, 134589, 122077, 41487, -55637, -86228, -54072, -23526, -47359, -139703, -256018, -307713, -269866, -246237, -330178, -434845, -392232, -207946, -66606, -64093, -89502, -29505, 54193, 44229, -44925, -104765, -86284, -19791, 62578, 129992, 119850, -697, -154343, -219542, -179575, -135429, -158305, -196214, -163540, -74638, -24514, -42982, -39214, 61627, 174725, 138787, -55877, -224246, -219776, -119123, -92478, -166649, -227950, -207443, -133509, -28816, 101055, 176519, 94508, -92653, -189631, -111169, 1611, -7986, -103422, -152644, -131172, -107952, -100178]
34076a00178K9908L7631j4233o5595m9976J676K8827L5388M9996N5475J8597n0310
34064b2794j05456j04646l8081M0579L7033n8920j08184J0506J97534K38084J05134
34053A90789r087R683N1520L318o4919n2640j4758m7850j06816r1465k9461j6307
34041a77993l7805q284O0764Q3134N6762N1016N9627J9392l7651j3838O5135N9572
34029A79831n2659j23130p3068j9073n9340r0115J6475J66428J57762j2657j38163
34018d7709r6580J0318M5739J5267j4477m5184r2003r4335k947J03935J17055
34007a00921O8497P0646J06021M5033j04363j49966o408J37095Q6991n3312m9522
33996D9791Q3418J06152n2327j74983r8824M2514M8792m4257o1211K4877Q2284
$$ y = [-100178, -70270, -32639, -46872, -112467, -162443, -160767, -131940, -96552, -46556, 8919, 27516, -22794, -128250, -232896, -270977, -230398, -193365, -252285, -360469, -349963, -152429, 85655, 190789, 181702, 191385, 242905, 246223, 181304, 128664, 113906, 66056, -40760, -132225, -161686, -177993, -215798, -224082, -163318, -80184, -23422, 27594, 87221, 106613, 68962, 55124, 120259, 179831, 127172, 4042, -69026, -88099, -147439, -237554, -221079, -54651, 103111, 90454, -47709, -144289, -133971, -88232, -72965, -87442, -132626, -224629, -318964, -321911, -217976, -100921, -32424, 38222, 144243, 189276, 84913, -65053, -71461, 65634, 152625, 99313, 49791, 133209, 239361, 187034, 12051, -86773, -44259, 4533, -39724, -100935, -76058, 6226]
33985F226M6967r088k6925l4472n4446n5829k8655j4154k4816j0721N3966J11237
33973d0710R1346O680o4989o7830j0007O2840J07432J02131N2191j1888n0231
33962A76965m5839k5455l0325n8764o7033m3713l6009o1861n4874K7216R5917
33951a23775M9259m3122k4985Q1796Q1359p9519j91232q6243J04332J48835L6969
33940d6326o5476q0831n6822j4260N4637Q1767M93j00725p9662K6160N0810k6677
33928b56912n8842O005M1471k4859q9219n7595J5835O0520J02072J51645J35353
33917B5474L9824j4849L3907O2827l7866j60793j39239j2488M6298Q193P450R6910
33905d4352J61329J05740j0816q1470q6524o7790m8280l5082m6861q2609r4021
$$ y = [6226, 53193, 44105, 17180, -17292, -71738, -127567, -156222, -170376, -195192, -205913, -151947, -40710, 50636, 57316, -7673, -75503, -85510, -22670, 84762, 186893, 239084, 227196, 176965, 131126, 105671, 75346, 16582, -50451, -94164, -130173, -192034, -246908, -219692, -123775, -74516, -117638, -142623, -60827, 20532, -58987, -250219, -336462, -232130, -83295, -46326, -111802, -192633, -249455, -263715, -209078, -127311, -126818, -227543, -307205, -281045, -230235, -256912, -315754, -309749, -268278, -293137, -382356, -439951, -424116, -363596, -261524, -109879, 25474, 65298, 50449, 84356, 147183, 109317, -51476, -190715, -203203, -156905, -148712, -141262, -44352, 116977, 222717, 211901, 130431, 43907, -23883, -72163, -107245, -154106, -236715, -330736]
33894c30736l5418P1151J51410J54316R2450J3461m3532n7342k1103L7891N3704
33883H6252p998p6504m7608N1857P0602l8432j13266k1932J05208O1959q8296
33872a8158q7425J03058K18847R7430p5957o9100M8247M5105j12681k40621k02314
33861b93569l6786J32422J88284P8601r9746j44183R948J73001J54725L1577j112
33850A93162N7407N5257k4816n5726k2492m7624j38432j43597k3667N3687j5605
33839a12446r9989n2448O2801J03218P2784O3021P1926L6476k3717m1402l1896
33828D8328n2585p1365j4114Q0617R9607M4563L0644P0496K7527j34585k18116
33817h8983o2198J65507J62225n9471j61293K0770K16225J26878j16808j71281
$$ y = [-330736, -366154, -295003, -143593, 10723, 103173, 116634, 73102, 15760, -5343, 32548, 86252, 78254, 1750, -45858, 5999, 76601, 38169, -75097, -97029, 8179, 70138, -18158, -105583, -2525, 216322, 313752, 237795, 168695, 216942, 262047, 149366, -91255, -293569, -330355, -197933, -9649, 68952, -30794, -174977, -165029, 7972, 162697, 194274, 193162, 250569, 305826, 281010, 225284, 202792, 155168, 16736, -126861, -150528, -96841, -112446, -212435, -264883, -202082, -98864, -26080, 36941, 108867, 145343, 121626, 80224, 48328, -4257, -75622, -89736, -9119, 90488, 135051, 165695, 236191, 263718, 129133, -88983, -151181, 14326, 176551, 117080, -44213, -23443, 192782, 319660, 202852, 31571]
33807C1571k0311L5406r6351j52217J3494J59694O4612r6527n6883Q9823O9768
33796D2079r5248j45296l0374N1908L5829N6909J30035J01605k6182n9873J7798
33785G9190j1130j75916j94784M1435K16932Q0491j28497o7355J54129J79650
33775A74145j0606j18717l5293N5115M2603J4308M343n4692j10159l1686R5425
33764B4786M0699j56712j87299J7970J37198j3797j58724k2047K01906J77130
33754F1110j7889n7053N9956L4325j68599k18582K9275K66849J97076l4693j04641
33743D7134J5310J05147P3784K2174N36m6850j06835q7055j838K0752m7785r1793
33731i7319o3143n7033j08788j00338K4486J27060R7060M4429R1153J25705j61
$$ y = [31571, 11260, 46666, -49685, -201902, -188408, -28714, 35898, -60629, -117512, -27689, 42079, -53169, -198465, -228839, -176931, -141102, -84193, 45842, 147447, 121265, 61392, 79190, 68060, -107856, -302640, -261205, -44273, 36218, -92279, -159634, -5505, 174145, 163539, 44822, 9529, 64644, 107247, 121555, 125898, 71206, -38953, -70639, 24786, 65485, -91227, -278526, -260556, -123358, -137155, -295879, -317926, -116020, 61110, 43221, -13832, 46124, 80449, -88150, -306732, -277457, -10608, 186468, 151775, 47134, 62444, 167591, 241375, 263549, 264085, 217235, 110400, 23345, 21507, 42259, -5526, -97319, -160462, -217495, -326283, -426621, -402135, -275075, -178015, -133586, -42433, 83272, 83111]
33720H3111j49255o8958J65203K06670k1871j82117m7503J37157N2887j86267
33710a0943k26078k1439J35885Q9404M744M6609J32846J09112j8480j30979j51233
33699d0552p6108L9145Q0335k7342j78918j74236R549J68532J55860O1583J8339
33688C6187r034r4465j49789m8079J28743J70327M5723n8490k3814N1550M0800
33677H9659k8207o1052n0524m3167l1801J8826Q4080J01542N6486j5249q1311
33666C9282j17034r1543r523O3972P8560O3662N8764K9623n7093j24055p2121
33655a37506M4533P8585K7352L7615J30818J24145o0731k06720j09815P8538O9348
33644G6162j05058j52308j3415M3391j01651j84173J7840K95230L06250P7004
$$ y = [83111, -66144, -135102, 30101, 236771, 214900, 32783, -14720, 122437, 175324, -10943, -237021, -258460, -122575, -33171, -28427, 18182, 151028, 260140, 241660, 110681, -40552, -116660, -77515, 2820, -24522, -203440, -377676, -368127, -199595, -43735, 17848, 36187, 27153, -67312, -217101, -265180, -136437, 33890, 79613, 21123, -2691, 48859, 89659, 61452, 400, -50124, -93291, -125092, -106266, -22186, 79356, 135842, 120593, 39282, -77752, -169295, -178818, -114846, -36286, 27376, 86140, 115763, 58670, -65385, -137506, -92973, -14388, 12964, 50579, 181397, 305542, 244811, 38091, -71724, 6814, 76162, -28896, -181204, -194619, -151228, -252879, -437052, -419212, -123982, 182268, 259272]
33634B59272q5184o6079l2296q2079r8685N162J30563J56974R2177m173r8579
33623A77073j34984n3111Q9799J47145P9786l183l3481o3202j10465r3190O377
33612H564P1274L8628O452M5028N7181l7195j21761n7224P7703J00196j46p7244
33600A11456o3862j5050M1061J15132J41529L6240j23396j54518l5667M9495j0160
33589I2260r0848l9922Q5582J12077J0237o5007J1779J75671K56743J83897N9829
33578G92298K9860J16261K27023L02241L63609M04529L40632J39029q9790k17939
33568B407753k51457k69500k84412k64762k29853k06104j52035m9488r83q8575
33558F10584j97167j51906Q898Q6040K3127m3099l7770m0746r0154j01782m7384
$$ y = [259272, 174088, 108009, 75713, -6366, -105051, -99889, 30674, 187648, 279825, 275652, 177073, 42089, -11022, 78777, 225922, 305708, 302525, 269044, 205842, 95377, 2187, 8564, 79838, 118466, 124918, 169946, 227127, 189932, 68171, 10947, 88650, 188846, 188700, 111456, 47594, 32544, 73605, 188737, 330266, 366506, 243110, 88592, 52925, 102420, 92260, 1412, -38510, 47072, 159149, 169386, 104379, 116158, 291829, 548572, 732469, 792298, 822158, 938419, 1165442, 1467683, 1831292, 2235821, 2576453, 2715482, 2625692, 2407753, 2156296, 1886796, 1602384, 1337622, 1107769, 901665, 749630, 700142, 699159, 610584, 413417, 261511, 270409, 356449, 379576, 336477, 298707, 257961, 167807, 66025, 18641]
33547A8641k0335m7720k0949R8872J81620J31361K7557l0472n9660q3407n6342
33536A39166M860m313p0370l3507J16212J50255k2317j39659J4994K29593J78300
33525E63214o2272j58746o1018j9503j09757j24017K2619J25323L4451j10682
33515I9612j18325j695J09893J45143R4761p241n9724j714N1284l9672j67148
33504A05174j04162R8423J39840m7360j63551j8052J72842J50664j351o7120n1349
33493B13998o9675q1403J96Q2652M0657l7068K515R5623Q3084M607M309L5308
33481C74803n2221j90218j64081J5065J10676M9051J1211Q5017J15723M773j03265
33470B56534p2600J072k0450p8333l8189O9555R8684J1317q2091p7931J2637R1935
$$ y = [18641, -1694, -49414, -70363, 28509, 210129, 341490, 369047, 338575, 278915, 195508, 139166, 144026, 139713, 69343, 35836, 152048, 302303, 279986, 140327, 155321, 384914, 563214, 500942, 342196, 281178, 261675, 151918, 27901, 50520, 175843, 210294, 99612, -18713, -20408, 89485, 234628, 329389, 322148, 262424, 260710, 311994, 272322, 105174, 1012, 99435, 239275, 191915, 28364, 10312, 183154, 333818, 332467, 265347, 213998, 144323, 62920, 63116, 145768, 186425, 149357, 151872, 247495, 330579, 335186, 339495, 374803, 322582, 132364, -31717, -16652, 94024, 143075, 154286, 239303, 355026, 359799, 256534, 183934, 185006, 164556, 86223, 48034, 117589, 216273, 227590, 145499, 67568, 80205, 172140]
33458A72140P1602k8991p9319L659J13922Q3822n8214j08358J0234J32694J05368
33447D18559n077n2522k4805j616q233k6509o3202j03452q2008J225L2143m2903
33435D1600r5665m705J25758J02394n7001j39548m4935R1269J11443L0751l8816
33424A22545n1860m3983m3339l2173J8987J01566J48595Q7318n4718j34239n1164
33413F7535J00279J28060o312j26810p1609R5312J70352O8669q1814j11508j2492
33402B19662P4295M9829k9823n2343k246M5074M6278K4831n556n7110r5268n2242
33390A65381M9371Q9685K7565k0618L4569R2466J0410j53141j94719m7882J29039
33379A82126J62378N0562p9070j09630j3096J29822J77577P1189p4037j04120
$$ y = [172140, 243742, 214751, 135432, 139091, 253013, 336835, 278621, 170263, 180497, 313191, 418559, 413482, 360960, 336155, 334539, 326306, 299797, 236595, 133143, 51135, 52360, 84503, 41600, -54065, -58770, 66988, 169382, 112381, -27167, -72102, 19167, 130610, 161361, 122545, 70685, 26702, -16637, -48810, -29823, 71743, 220338, 307656, 252938, 118699, 67535, 167814, 295874, 289562, 162752, 91143, 186455, 356807, 425476, 343662, 232154, 219662, 293957, 343786, 313963, 261620, 259374, 304448, 350726, 375557, 370001, 312891, 217623, 165381, 214752, 304437, 332002, 311384, 345953, 438419, 448829, 295688, 100969, 53087, 182126, 344504, 395066, 315996, 206366, 193270, 323092, 500669, 571858, 497821, 393701]
33369C93701l2396P189n944M0834J50407J45565n5224k56298k30905l2158J07738
33358B32509J02582N6314L9305J9077J279M1502R1249K2813j36333j80395k8284
33347B61618J25391R2887k8189k9020Q0337J22366O2562M1570J07189J34942N8195
33336A029848j9485j6517l158m2945o5087j7584q50r2454j60780m6373J49615
33325G14230J76271J0635r9729j2372J03232M1320j26107j69773m0544Q8492R3410
33314G79065N1557Q0408J46561J28776J5949o5614l3362L3519J7270n7012n9622
33303A037495M0999J27747J15374O6650O0872N7199L53k9300P3627K27357K38218
33292B016591Q9120k4806Q812O3654L289r1316o5131M7219P3154k1688p4841L3304
$$ y = [393701, 361305, 368494, 362550, 403384, 553791, 699356, 644132, 387834, 156929, 124771, 232509, 335091, 391405, 430710, 449787, 451066, 492568, 583817, 606630, 470297, 289902, 261618, 387009, 479896, 451707, 422687, 503024, 625390, 687952, 729522, 836711, 971653, 1029848, 1010363, 993846, 990688, 947743, 882656, 865072, 864222, 771768, 610988, 564615, 714230, 890501, 901136, 801407, 789035, 892267, 933587, 807480, 637707, 597163, 685655, 779065, 830622, 911030, 1057591, 1186367, 1202316, 1136702, 1103340, 1136859, 1154129, 1097117, 1037495, 1078494, 1206241, 1321615, 1388265, 1449137, 1506336, 1506689, 1477389, 1551016, 1778373, 2016591, 2105711, 2080905, 2089717, 2153371, 2156660, 2065344, 2000213, 2047432, 2120586, 2098898, 2024057, 2057361]
33280B057361K10422K81505K04614Q7058K8933K6623L5786O5138J50939K54645
33270C403024K65354J52620N8104J39022L33061L96974K26492L2267R1632L79367
33260E477917N79176M77516K24343J28998K84452N13830O51881P21163P89967
33251I849243Q21979P97974Q60056J134778J474291J611519J578709J715119K186876
33242B2030544K763380L212895L666803M378743N340021O401052P614657R180147
33234F4588242J1166708J3560409J6481763K0122333K4573078K9736245L4741007
33227B14969785L6880059L2007773J7816109k631958k1760553l2991521l5323477
33220B08966217l2352051k7849888k3314878j8974772j5230773j2462838j0444492
$$ y = [2057361, 2267783, 2549288, 2753902, 2840960, 2869893, 2896516, 2932302, 2997440, 3148379, 3403024, 3668378, 3820998, 3879102, 4018124, 4351185, 4748159, 4974651, 5006918, 5098550, 5477917, 6057093, 6534609, 6758952, 6887950, 7172402, 7686232, 8338113, 9059276, 9849243, 10671222, 11469196, 12329252, 13464030, 14938321, 16549840, 18128549, 19843668, 22030544, 24793924, 28006819, 31673622, 36052365, 41392386, 47793438, 55408095, 64588242, 75754950, 89315359, 105797122, 125919455, 150492533, 180228778, 214969785, 251849844, 283857617, 301673726, 299041768, 277281215, 244289694, 208966217, 176614166, 148764278, 125449400, 106474628, 91243855, 78781017, 68336525]
33213F8336525q744013p309588o233485n342837m442078l652393l143431k787295
33205B6681405k403886k093323j984646j885861j556224j151474j009117j099140
33197A3497734j077322q41315o49388o53518o73274n47152m07521m29948n25665
33188G692631m86632l09632j84783k17953l21406l66570l24636k45875j88498
33179E046646j87462k29691k44317j75596q0736q6151k09609k99764k25355o5150
33169C242815m087p4498j35419j11711r5127j49590j73547p2246N7014N9577m1212
33158B501969r9846q4395r4177j63930k02588j36314J111J20210J31727q145k07147
33147A758475k59280r2785P9656L0347j38452j41086M4799J44785J8998j45378
$$ y = [68336525, 59592512, 52282924, 46049439, 40706602, 36264524, 32612131, 29468700, 26681405, 24277519, 22184196, 20199550, 18313689, 16757465, 15605991, 14596874, 13497734, 12420412, 11579097, 10929709, 10276191, 9602917, 9055765, 8648244, 8218296, 7692631, 7205999, 6896367, 6711584, 6493631, 6172225, 5805655, 5481019, 5235144, 5046646, 4859184, 4629493, 4385176, 4209580, 4128844, 4042693, 3833084, 3533320, 3307965, 3242815, 3238728, 3164230, 3028811, 2917100, 2821973, 2672383, 2498836, 2426590, 2483604, 2543181, 2501969, 2402123, 2317728, 2223551, 2059621, 1857033, 1720719, 1721830, 1842040, 1973767, 1965622, 1758475, 1499195, 1406410, 1486066, 1516413, 1377961, 1236875, 1281674, 1426459, 1445457, 1300079]
33137A300079j51610n7259n374m779j1095m6029j02340q8443Q110N4966q484m9257
33125H38485L4251J26243Q2648l9172r9539r6590j05088j08967n5139K2963P6670
33114F76765J32273J81908J18518p1320j97608j28760j5864m9061j37446q2047
33104D27358N8071O7186l8159l9371Q7916J29822J9350m5787M4615J30216P9026
33093I20243J3920O7503J19496r883k39296l13146j50872O4593J31791L6655q5696
33082E55308j04013L41J21538J26805k775j43169j59246m3332Q9533J17212J9296
33071E77498r6061q4712O6784J86732J03002j27192k62950j71200J6953Q2489
33061B91343j9202j29275q5855R1267K19151J54952k5817j05448l572J05328L6090
$$ y = [1300079, 1148469, 1091210, 1085836, 1081057, 1069962, 1023933, 921593, 833150, 841260, 896226, 887742, 838485, 872736, 998979, 1081627, 1042455, 942916, 846326, 741238, 632271, 577132, 600095, 676765, 809038, 990946, 1109464, 1038144, 840536, 711776, 695912, 646851, 509405, 427358, 485429, 552615, 514456, 475085, 563001, 692823, 712173, 666386, 711001, 841217, 920243, 934163, 1001666, 1121162, 1111279, 871983, 558837, 407965, 472558, 604349, 641004, 555308, 451295, 451636, 573174, 699979, 697204, 554035, 394789, 351457, 440990, 558202, 577498, 481437, 396725, 463509, 650241, 753243, 626051, 363101, 191901, 208854, 291343, 272141, 142866, 57011, 148278, 367429, 522381, 496564, 391116, 387544, 492872, 528962]
33050E28962j31519j65193k2227J00061O8217j5295j1698M2596L6215k2045m0702
33039C67372r973L2k4548k2178K6468N6085J5958n4657q5257o7229m7448m6406
33027A08219l0197K1334O1285L7331j8595l2176j0460k8841p6071l3173J27317
33016A25973K44910J85837M6195m591J2595l3578j10862o3538Q2181J05072n6932
33005E33262j75725p5470R4699R1430p0523j75694j18956J1067R6639Q9035r007
32994B90757j24134j24280J7821J26971M1810j18911r1220J40777K90263J61759
32984F11613q5290j75205p3352L7736M2715q683m7738p0115o3084Q215R5877P5408
32972C48097o3899j40458j2827J75791J41878j46792l76432k54928J30015M15145
$$ y = [528962, 397443, 232250, 210023, 310084, 378301, 363006, 351308, 393904, 430119, 408074, 367372, 357399, 357431, 332883, 310705, 337173, 393258, 409216, 354559, 269302, 202073, 154625, 108219, 78022, 99356, 160641, 197972, 179377, 147201, 136741, 107900, 31829, -1344, 125973, 370883, 556720, 602915, 598324, 610919, 577341, 466479, 402941, 485122, 590194, 533262, 357537, 282067, 376766, 468196, 397673, 221979, 103023, 114090, 210729, 299764, 290757, 166623, 42343, 60164, 187135, 228945, 110034, 18814, 159591, 449854, 611613, 526323, 351118, 277766, 315502, 358217, 349534, 301796, 231681, 168597, 176812, 272689, 348097, 284198, 143740, 130913, 306704, 448582, 301790, -74642, -329570, -199555, 215590]
32962B15590L65363Q1140j65036k06996r4596R273J1357k7856j878P0395N7373
32951C14129q0660k00074j59136r847R3098J04944R4681Q7904M3004l1842o6131
32940A90070l8530L87J4858L753m1121r5335o6491O8120J42415K726k06002j87457
32928b12607N8121J99398P0954p4150J8567J87843J22176j27951k22831n8885
32918c9365R6543L9363p8691k3130J53456J99489L5819j38775j23241L0572J07382
32907B59422J5525j10904j12281j6163L2301m45m174P2045J20372M1973r2388
32896B05283j41510q3748j5967p018l5333m8428k2682K1013L1928q532l4673K5161
32884a14506J14602J01219j2936o8148Q797Q6435M5789l6420m6378k6091n0071
$$ y = [215590, 580953, 662093, 497057, 290061, 195465, 204738, 216095, 188239, 186361, 256756, 314129, 233469, 33395, -125741, -135588, -42490, 62454, 157135, 245039, 288043, 256201, 190070, 151540, 151927, 166785, 170538, 129417, 34082, -32409, 35711, 178126, 180852, -25150, -212607, -154486, 44912, 115866, 41716, 60283, 248126, 370302, 242351, 19520, -39365, 57178, 96541, 17850, -5280, 148176, 347665, 383484, 244709, 121468, 152040, 259422, 274947, 164043, 51762, 35599, 67900, 67455, 63281, 135326, 255698, 297671, 205283, 63773, -19975, -35942, -42960, -78293, -126721, -149403, -128390, -96462, -104994, -139667, -114506, 96, 101315, 88379, 20231, 29028, 115463, 161252, 124832, 78454, 52363, 2292]
32873B292m9025N0950J33698O0908n9049j9424J28451J37840l0792j47623q4596
32862A23630J7378J8862k6789m2605o2263r2277n0288N1503O7156k7714n7412
32851h0819M9118J06369r170j22969n8787M9228M360q3749Q856J99181K13535
32840B75153M6844m9653j2616l2580j47647j46157K2845J00454m9229j78772n8952
32829b30310J35549J21850k8964m7783O2186O1375q0337j24432J9895J36951O4694
32818I0674n0899j7889Q7190O4229p1457j04680N1008K14303J73255m0595j91855
32807B03284j28609L9487Q9613k3642j17741m9780P5539O9614n0896r9690k0655
32796a3476L1538m9283j50865j22099Q394J01036R6738L6749k8292n1150J3327
$$ y = [2292, -46733, 4217, 137915, 198823, 139774, 120350, 248801, 386641, 355849, 208226, 123630, 141008, 159870, 133081, 90476, 28213, -64064, -114352, -62849, 4307, -23407, -80819, -31701, 74668, 65498, -57471, -116258, -67030, -62670, -146419, -137563, 61618, 275153, 321997, 272344, 259728, 227148, 79501, -66656, -43811, 56643, 7414, -171358, -230310, -94761, 27089, -1875, -49658, 12528, 73903, -6434, -130866, -110971, 25980, 90674, 39775, 21886, 109076, 173305, 101848, -2832, 48176, 262479, 435734, 395139, 203284, 74675, 114162, 203775, 180133, 62392, 12612, 88151, 157765, 106869, 7179, -13476, 18062, -31221, -182086, -304185, -295791, -194755, -98017, -61268, -89560, -140710, -127383]
32785a27383J23721J44390K7990p8311l5359O4142L7769q2876r1488N7208J59075
32774A98878O3141j13364j64439n8003P9046J37856R4948j6717j13220j02089
32764F037j886M4282m1166j34271p0453J07641J91563Q7504p2170j28184r0625
32753a01728o3466n8860l587R1431R8870l1950j48547p4414J29480K21173J04589
32742A62991n1721q2776n2095p8328q5330O1087K49901K22831j7204j62955n3368
32731A13033Q3319n409k00919k09313j3832J28637R0287J5870L9919Q4886L0255
32720A56733p8884j09448l4429N3970P6535L4774k4168n1438k2125M0807P6993
32709A19320M7659k3532p7853p4220j1631P5452J33343J21110M0619o7986j53170
$$ y = [-127383, -3662, 140728, 168718, 90407, 55048, 119190, 156959, 74083, -17405, 39803, 198878, 262019, 148655, -15784, -73787, 5259, 143115, 238063, 221346, 108126, 6037, 4151, 48433, 7267, -127004, -197457, -89816, 101747, 189251, 117081, -11103, -101728, -165194, -224054, -227641, -136210, -37340, -69290, -217837, -292251, -162771, 58402, 162991, 111270, 28494, -23601, -101929, -187259, -126172, 123729, 346560, 329356, 166401, 113033, 196352, 190943, -9976, -219289, -233121, -104484, -14197, 1673, 41592, 126478, 156733, 77849, -31599, -66028, -12058, 64477, 99251, 75083, 23645, 1520, 42327, 119320, 166979, 143447, 65594, -8626, -20257, 55195, 188538, 309648, 350267, 282281, 129111]
32698A29111j66672p9588P7258K01284J96672P7899l9785o8276l5040k4834o3125
32687B04904r6691q3689n6352o4371q5364n0322L6075P0366m667q6659l3473J24604
32675a25639J97088Q0870r7535j40982j6449J34023J75980J10345L1291O686J3933
32664C69611j2745p8323j05313m9018J4464n956o2606l9680M0074L5194o3565
32653D2137q1011O1183J85018J16182m2202p6076M594R300j02855j58073n3610
32642i5413Q3313R2288k092n4799j297Q1440Q1730j7214j08427p7011M3228R1038
32630A16784r72r6268n3634N8873Q0676P400m1677m2874o3404p6546J446R7857
32618a2339M6015j07797j15639P3036J85520M1609j52669j33455J0835K5446o5350
$$ y = [129111, -37561, -117149, -39891, 161393, 358065, 435964, 396179, 327903, 292863, 268029, 204904, 108213, 24524, -31828, -96199, -181563, -231885, -195810, -125444, -130111, -216770, -250243, -125639, 71449, 152319, 54784, -86198, -102647, 31376, 207356, 317701, 348992, 355678, 369611, 356866, 278543, 173230, 124212, 138676, 132720, 70114, 30434, 70508, 105702, 42137, -38874, 22309, 207327, 323509, 281307, 205231, 209825, 219125, 116270, -41803, -95413, -12100, 80188, 78096, 23297, 22000, 103440, 185170, 167956, 59529, -17482, 25746, 116784, 115812, 19544, -34090, 24783, 105459, 112859, 71182, 28308, -35096, -111642, -110196, -12339, 33676, -74121, -189760, -116724, 68796, 110405, -42264, -175719, -164884, -139438, -204788]
32607b04788j6950J85589K61720P1417j60496j78105m0481K7676j6693k7858N5880
32596d3089J20690P4082r778p627P2378J07856L0158r5118j58821j25772m2082
32585g7123L2466O5783N6246L3247L8536P3551Q5511M3385p41J6364N6846J9092
32573D43163j07144k00875j58696k8796M5547r771j19548j36427M62J76728K05845
32562A10488M9392j18120j21905l245O9404M7205K4167M3197M0282m767k1723
32551A14375M437o923o9361p5623J7182R1859N2390l2774o6902o9599p3911j8485
32539a33335J18571K04823J31040l763m7242k8737n9562r9686l7766O6662N3403
32528A64408n8238r0298k720N7309K0198j4801O893P441l6688k8549M9306O7634
$$ y = [-204788, -221738, -36149, 225571, 296988, 136492, -41613, -82094, -54418, -71111, -98969, -43089, 77601, 151683, 141905, 134278, 206656, 314512, 344670, 249552, 90731, -35041, -77123, -44657, 21126, 77372, 110619, 149155, 222706, 308217, 351602, 350861, 367225, 424071, 443163, 336019, 135144, -23552, -52348, -6801, -16572, -136120, -272547, -272085, -95357, 110488, 159880, 41760, -80145, -83390, -13986, 33219, 57386, 100583, 140865, 136098, 114375, 118812, 111889, 42528, -33095, -15913, 75946, 128336, 95562, 28660, -40939, -114850, -133335, -14764, 190059, 321099, 317336, 270094, 241357, 181795, 82109, 44343, 111005, 164408, 106170, 15872, 13152, 70461, 90659, 75858, 82751, 90192, 53504, 24955, 74261, 141895]
32516A41895k1527p9994j7600N2197K1219k3545K4889Q3102K2599r3889j08445
32505I01j6228N7591O2624L9746q063r5651j51900r7510P675M5931L0118N1525
32493g3241Q3042K3607p8323n5160R7087J70247N1842r6518p5771P4743J63004
32482B84559J10532N883n7187q0330j03235j20395q0710L8712J65272J75506M7524
32471C86131p7235o1167M1731O9524q532o9789m6007l550K625M104J1285j9874
32459B29246o6583l8265M7743N3886m5889j01901m5040q365o8608q0875M9803
32448g4848J40581J3708j67563j30128P0053J51026O3293J3200O3142N4457m8531
32437A48390p9250l176j334j11470j09218R6522K54018J55536l7419q3922l1899
$$ y = [141895, 120368, 40374, 22774, 74971, 96190, 72645, 97534, 180636, 203235, 109346, 901, -15327, 42264, 104888, 144634, 136571, 40920, -110980, -208490, -200815, -154884, -124766, -73241, 9801, 33408, -44915, -100075, -2988, 167259, 219101, 122583, 46812, 121555, 284559, 395091, 400974, 343787, 263457, 160222, 39827, -40883, -2171, 163101, 338607, 386131, 308896, 247729, 289460, 358984, 350452, 280663, 234656, 231106, 233731, 237835, 249120, 229246, 162663, 124398, 172141, 226027, 180138, 78237, 33197, 24832, -43776, -124651, -74848, 65733, 79441, -88122, -218250, -148197, 2829, 66122, 79322, 142464, 196921, 148390, 69140, 65964, 64630, -46840, -156058, -59536, 194482, 350018, 312599, 228677, 196778]
32426A96778l8614m8930M4960J06792l9243k32069j66550R3877J69633n0472k35175
32415a99013j19926J22506J84458N7322l4652J8014J19475J49298Q5469k0880
32405C62071r7473r6181l6474J9301M3850N0699L5067q760k3765M4190J16326
32394D08851N2603j18819j92832p3733P2542N5959o6727r4140K1624J27592J00317
32383B93237q309p8858p8769n8364n3031n4066n6496o9078o3216J7621J42938
32372f6391J60504r174j87635j21467J35292K36014L0260j91900j25116R4290
32362d5323J28094k4617p1967N5770J11260k0517j37010q4832R225J4804J4058
32351e1055P3912P5254l5242p8738M6262J29813j1442j78974q3918J72420K45556
$$ y = [196778, 158164, 109234, 154194, 260986, 221743, -10326, -176876, -82999, 86634, 36162, -199013, -318939, -196433, -11975, 45347, 10695, 28709, 148184, 297482, 382951, 362071, 264598, 168417, 131943, 151244, 195094, 245793, 280860, 272100, 248335, 292525, 408851, 461454, 342635, 149803, 76070, 148612, 204571, 137844, 43704, 65328, 192920, 293237, 284928, 206070, 127301, 68937, 15906, -38160, -94656, -163734, -226950, -209329, -66391, 94113, 84939, -102696, -224163, -88871, 147143, 177403, -14497, -139613, -45323, 82771, 58154, -13813, 41957, 153217, 132700, -4310, -89142, -79917, -65113, -51055, 22857, 98111, 62869, -15869, 30393, 160206, 148764, -30210, -114128, 58292, 303848]
32340C03848P0440j00195j24126j02977r8487m1113M0070k197j47825j74887q174
32329c85623J42656J10277J2147K5703J13919J35607P8614K1114k3709p0969o7129
32318I2607J9405Q4415J5382j15241j32967j9112N7392j3482j26957j16317J5104
32307b39771J02039M3613o0368m7866P5990J40279N2632o1429l8434Q4779J31217
32296A82681M3190n3925n5347j6187l6632j01097j03197P534J50823J82997M4982
32285B45822j42269j76399j6303J37632R3876o7222j16566j4794N5870K365m2537
32274d0525L0618J10083N0606p7657r6140J068M5316m0739j25409n7214J24990
32263g5003K35379J60045j6563j12907o0349K2580r928j31822j73527m8491J25198
$$ y = [303848, 374288, 274093, 149967, 46990, -51497, -92610, -52540, -54737, -202562, -377449, -385623, -242967, -132690, -120543, -94840, 19079, 154686, 233300, 254414, 230705, 159736, 92607, 112012, 196427, 211809, 96568, -36399, -55511, 1881, -11601, -138558, -254875, -239771, -137732, -94119, -154487, -202353, -126363, 13916, 66548, 5119, -33315, 51464, 182681, 225871, 171946, 116599, 100412, 63780, -37317, -140514, -132980, 17843, 200840, 245822, 103553, -72846, -89149, 48483, 142359, 75137, -41429, -56223, -353, 2012, -40525, -9907, 100176, 150782, 73125, -23015, -21947, 23369, -17370, -142779, -199993, -75003, 160376, 320421, 303858, 190951, 130602, 153182, 143254, 11432, -162095, -210586, -85388]
32252h5388J65771L9077j14685j40680k4959J01904J08149Q151n9594j7198M6041
32241B6589Q539r7902j32152m5632O4464J00591O7334K3080J3630N5302J08454
32230A92297Q5399l1590j18485o5055M4702M9659l5489o2245j3251j1125o3989
32219b9172m4362M3521L9068n8713l5817J49838K21985K0061k03085j73047k5660
32208i5383l1053j09493j1152J72511J21952j31244j92238O7161K87443J80625
32198B59129n5444j00114O924J3140j14439j78406p3403J03427K15170J99888
32188B75872P1800p0735j00824k5406k637r7494j46058r624J62055J26567p0113
32177A13403j44380L751J52755R7715p3655j46933p4710K2835N6923M1741J4169
$$ y = [-85388, 80383, 119460, 4775, -135905, -160864, -58960, 49189, 57340, -2254, -19452, 26589, 35128, -62774, -194926, -240558, -176094, -75503, -8169, 14911, 28541, 83843, 192297, 277696, 246106, 127621, 62566, 107268, 156927, 121438, 59193, 45942, 34817, -29172, -73534, -30013, 9055, -49658, -85475, 64363, 286348, 306409, 103324, -69723, -95383, -126436, -235929, -247081, -74570, 47382, -83862, -276100, -208939, 78504, 259129, 203685, 103571, 110495, 123635, 9196, -169210, -242613, -139186, 75984, 275872, 347672, 276937, 176113, 150707, 148070, 50576, -95482, -105106, 56949, 183516, 113403, -30977, -27226, 125529, 223244, 149589, 2656, -72054, -49219, 7704, 49445, 63614]
32166F3614o621M320N3248Q4570L8346m6421o0666K2819R4920M8091q3598j75045
32154C7577j63863r1978j7871L6917N5045J8842l5499l2171L3527O4529k325q9868
32142a87138q2671J0464P9981P2080L2443O626j1495k3942l163N4012J04837J10790
32130A62824O8227n718p0880o8196R110P1411L8503l4409l3321L2411M4742k8682
32118A86022q9708p8838m8515k9090K9485J18791J25431J4847q0029o4296l4479
32107D9621q7920j17903J0561J80450J47649q4369k38308j40537O6065J48553
32097f6138O7862m5186p9497k0384Q3827J52557J18005l296j11558j22251l7363
32086f3422P5753J30216O4843q2904j64014o8668J13736J83396Q2659m8814q5134
$$ y = [63614, 56993, 61313, 114561, 199131, 237477, 191056, 130390, 153209, 248129, 296220, 212622, 37577, -126286, -218264, -236135, -199218, -144173, -125331, -160830, -193001, -159474, -94945, -97270, -187138, -269809, -259345, -179364, -107284, -74841, -68215, -79710, -103652, -106815, -52803, 52034, 162824, 231051, 225333, 154453, 86257, 95367, 166778, 205281, 170872, 137551, 169962, 214704, 186022, 96314, 17476, -31039, -60129, -30644, 88147, 213578, 228425, 148396, 84100, 49621, -38299, -156202, -145641, 34809, 182458, 98089, -140219, -280756, -214691, -66138, 1724, -43462, -122959, -143343, -59516, 93041, 211046, 207750, 96192, -26059, -63422, 12331, 142547, 207390, 124486, -39528, -108196, 5540, 188936, 271595, 222781, 137647]
32075A37647n7419m5499m6961k3228J6139M3332N4450L6896k2021o1500M135J17085
32063A53056R9391p2393j73405m6352J38199J27748k5323o7400K8107K4690j55054
32052C1264k61313j03839J30828J53179j105o2144L7913Q8965k2960j23992m5616
32041a78820R6045R5479m131J929J11433R7621r4929j97651j4546K38134K22786
32030C73350k1676j54582n3555N1115j611o3767O197P4748l655q5092K4602J89490
32018C35564J22402j31214k21340k0211J88539J35868p8760j94764j46926n4995
32008f5837j356K1592K8830L2812N5427O9400N207j17470j67145q7461N610R832
31996b10559J684Q6729J89832J57753R460q4465n2267L653q758m6870l1633K8578
$$ y = [137647, 80228, 34729, -12232, -35460, -19321, 24011, 78461, 115357, 93336, 31836, 35971, 153056, 252447, 180054, 6649, -39703, 98496, 226244, 200921, 133521, 161628, 186318, 31264, -230049, -333888, -203060, -49881, -50986, -113130, -75217, 13748, -9212, -133204, -178820, -82775, 12704, 8573, 10502, 121935, 219556, 124627, -73024, -87570, 150564, 373350, 351674, 197092, 143537, 194652, 193041, 129274, 135471, 210219, 206564, 121472, 146074, 335564, 457966, 326752, 105412, 85201, 273740, 409608, 330848, 136084, -10842, -65837, -67193, -45601, -16771, 16041, 71468, 140868, 146075, 28605, -138540, -226001, -220391, -210559, -208875, -122146, 67686, 225439, 234899, 150434, 98167, 101820, 93062, 46192, 14559, 43137]
31984D3137O1075K3079n4349q9994k7654Q5357J28001N3823l9056m3629P768J3645
31972A61203k9435l8204M187K2184j9791o1651m8151l426K3656K5967K3804K9828
31960I0171M4268N1885K5872l1246o7538m5362j720O472r466O40L0982K5831k8666
31947I2123q2365q5604k7007P1726J47418J18992j0950j13046p1600N8936J22921
31936B21544O6120j9617l7947J3558P5853Q1869k791j20601j44839m5792K9145
31925A16502m1133j37925n9102J51757K31464O5071j60775k17093q2411J10923
31915b2722K21646J48860r2556k89647k04235R6935K69426J43025n1302m1804
31905A77626R3489R4755o8705j88484j43081j5608Q7474J43296J33911K5956j33219
$$ y = [43137, 104212, 127291, 72942, -17052, -44706, 40651, 168652, 222475, 183419, 139790, 147558, 161203, 131768, 93564, 97751, 119935, 100144, 38493, -9658, -13084, 10572, 36539, 60343, 90171, 134439, 186324, 212196, 180950, 113412, 68050, 66330, 72802, 63336, 63976, 94958, 120789, 92123, 9758, -75846, -102853, -31127, 116291, 235283, 224333, 111287, 39687, 98623, 221544, 287664, 268047, 230100, 243658, 319511, 401380, 398589, 277988, 133149, 87357, 116502, 75369, -62556, -121658, 30099, 261563, 326634, 165859, -51234, -133645, -22722, 198924, 347784, 255228, -34419, -238654, -141719, 127707, 270732, 219430, 177626, 271115, 365870, 297165, 108681, -34400, -50008, 37466, 180762, 314673, 340629, 207410]
31894B07410k12100j30346N5134K01941J92326L6679r8408m3944J40316J97566
31884E46574J7112j83146j46851O6537J89706J25713K4550K0817Q2460J18932
31874H62404Q3982k9818j64864j85176l0257J43710J33802j9927q9043O846J10248
31863H21907R4428K8937K2467P4198J49181K43643L02637K24807L3809r2431n0266
31852A853317N8554J04938J05825J23000J23399O4651J2998M7505J28077J73032
31842B795296J87646K02831J71948O1027l0066J3564J23106J15897m5475j98908
31832C396866k01073q6826J4502K8591l2429j16805j71269j70597j33650r3368
31822B433942n7569k4474j7183o0924j33056j71827j37895n4824K064l8690j65344
$$ y = [207410, -4690, -135036, -79902, 122039, 314365, 351044, 252636, 208692, 349008, 546574, 563686, 380540, 233689, 300226, 489932, 615645, 640195, 661012, 743472, 862404, 946386, 916568, 751704, 566528, 536271, 679981, 813783, 793856, 704813, 711659, 821907, 916335, 945272, 967739, 1041937, 1191118, 1434761, 1737398, 1962205, 1996014, 1903583, 1853317, 1911871, 2016809, 2122634, 2245634, 2369033, 2433684, 2446682, 2494187, 2622264, 2795296, 2982942, 3185773, 3357721, 3418748, 3388682, 3402246, 3525352, 3641249, 3595774, 3396866, 3195793, 3108967, 3123469, 3152060, 3119631, 3002826, 2831557, 2660960, 2527310, 2433942, 2376373, 2351899, 2334716, 2273792, 2140736, 1968909, 1831014, 1776190, 1778254, 1739564, 1574220]
31811A574220k63924k34484j24285o4199o8437j9063J07571J49173L787j65158
31801H95201j41339J3298M8148q3077j49574j5269J34033P0744j23710j77254
31791D71201k7511R6134J2864j56589j74991k1843R8479N6223m1157l5784M9785
31780C26811P6344J3494l4728j2117J9041P227j8812m4766r9322j36100m2309
31769E4763J42413J80727l7723k69687k17142N1131K09534J41927L2863N942l4076
31758B60672j28401j19749O4756K16377J31797o6879j12036K3159J30754Q6466
31748D86916m2532j62671k27920j73091K3678K03349J50294r8305k45650j13026
31738a98958J29463K05778Q0682n2876m6646O2066J42450J10323q785j03953q8375
$$ y = [1574220, 1310296, 1075812, 951527, 887328, 818891, 799828, 907399, 1056572, 1060359, 895201, 753862, 767160, 815308, 732231, 582657, 567388, 701421, 772165, 648455, 471201, 443690, 539824, 552688, 396099, 221108, 199265, 297744, 353967, 312810, 277026, 326811, 403155, 416649, 381921, 369804, 388845, 396072, 377260, 332494, 233172, 97072, 54763, 197176, 377903, 340180, 70493, -146649, -95518, 114016, 255943, 288806, 294748, 260672, 132271, 12522, 77278, 293655, 425452, 358573, 246537, 269696, 400450, 486916, 444384, 281713, 53793, -119298, -95620, 107729, 258023, 159718, -85932, -198958, -69495, 136283, 216965, 164089, 117443, 179509, 321959, 432282, 423497, 319544, 231169]
31727B31169q973M480p6452j26415m9203P2801R5156R276p4748r6577q9886q0448
31715a89820m6497J2308N2523N3412M5376N7417Q0828Q9027N8971j3979q7824
31704A11742r2510k4127K3271j4920o6397l2518M3905M4401k2587l3984L1046
31693c2678M8509l3956r5256l4827O6949Q4071L0218k598j482j2927l3513l0045
31681d7535j4402l975K9452P8851N3062p4798j57077n9945J09904J43391M3936
31670A00864J061O6296Q3422j8390q9810k0499O3192M782j24799j41358k5339
31659a00578P4631O4979m424m8743l2166L8938J16191J22795M2084l7802l7088
31648A98817K471o705o3212j06743j26375j35389r5471J0542Q4376L9142k2923
$$ y = [231169, 222196, 226676, 150224, 23809, -25394, 47407, 142563, 151839, 77091, -19486, -109372, -189820, -236317, -224009, -171486, -118074, -72698, -15281, 65547, 154574, 213545, 199566, 111742, 19232, -4895, 18376, 3456, -62941, -95459, -51554, -7153, -29740, -63724, -32678, 15831, -18125, -113381, -148208, -81259, 2812, 33030, 30432, 28950, 16023, -17490, -47535, -61937, -65912, -36460, 42391, 95453, 20655, -136422, -196367, -86463, 56928, 100864, 101925, 168221, 251643, 233253, 143443, 122944, 186136, 190918, 66119, -75239, -100578, -25947, 39032, 34608, -14135, -46301, -7363, 108828, 231623, 273707, 235905, 198817, 201288, 194583, 131371, 24628, -101747, -237136, -332607, -322065, -237689, -198547, -221470]
31637b21470N9304K15371K00179k1836j81311r6354N9517M8858o0369m7251P1380
31626B6018P8851n9774j35069m2932N9425L1767l9307l0590J2440J0543K2016
31615f6612J03034J40900K9862j02751p4263L9203K5023q5992o2118J03314J38669
31604A88269m5072j68030l1547J41383O8213j29824j38393L9027J22863K6064
31594G2953o2878m7757m2573q3623l8700J07690J63369M5303o6644l2992K7111
31583D1259j3129m5030N9844J78861J19903n9719j49430j02163l1996K2269J00249
31572A20918J40603L2973j61902k50115j67403k9725O6086J14520R5589l121o4956
31561a06533M0708K06710J78698n7422k12643j05752Q6994J18538P258p0934o2233
$$ y = [-221470, -162166, 53205, 253384, 231548, 50237, -46117, 13400, 62258, 1889, -45362, 26018, 104869, 45095, -89974, -132906, -73481, -41714, -81021, -111611, -99171, -88628, -66612, 36422, 177322, 207184, 104433, 30170, 69373, 94396, 8404, -53714, 49600, 188269, 143197, -24833, -56380, 85003, 153216, 23392, -115001, -75974, 46889, 72953, 10075, -37682, -80255, -163878, -202578, -94888, 68481, 113784, 47140, 14148, 41259, 28130, -16900, 42944, 221805, 341708, 281989, 132559, 30396, -1600, 20669, 120918, 261521, 294494, 132592, -117523, -284926, -314651, -248565, -134045, -38456, -41577, -106533, -65825, 140885, 319583, 262161, 49518, -56234, 30760, 149298, 156556, 85622, 23389]
31550B3389k9972P012N4000M7001n3377j40125q6172N7558J30161Q1436o513o9690
31538A4708r7540o0917N0543J45890J27546M5712J8360K6096m5011j64193j57604
31527i6410L430J07542K14j79229j95365m2624Q2569P6434L2719N4374J03876
31516e2470R3715K8642k1332m1774q0698j34436j10514L9095J97240J89679J8840
31505A25987j13603o9793L7889K5003p9824q4271N4494J46510N3365j02636j24067
31494a30946k0327L7130j8179p5124l6041N0284Q6960O7824N6536P5726P7531
31483A71374J7328p7733j25512p3541L5542R7664N8076k6500n3844P830Q8583
31472A19267R2559o549j31963j59662l7345J36545J88891N6449j36897k18402
$$ y = [23389, -6583, 429, 54429, 101430, 48053, -92072, -178244, -120686, 9475, 90911, 84398, 14708, -82832, -143749, -93206, 52684, 180230, 225942, 244302, 270398, 225387, 61194, -96410, -92980, 14562, 14776, -164453, -359818, -402442, -319873, -243439, -210720, -156346, -52470, 41245, 69887, 48555, 6781, -73917, -208353, -318867, -279772, -82532, 107147, 125987, 12384, -57409, -19520, 5483, -74341, -158612, -104118, 42392, 95757, -6879, -130946, -151273, -114143, -132322, -207446, -243487, -193203, -106243, -38419, 18117, 93843, 171374, 188702, 110969, -14543, -88084, -52542, 45122, 103198, 76698, 22854, 30684, 119267, 211826, 205277, 73314, -86348, -123693, 12852, 201743, 258192, 121295, -97107]
31462i7107j46053j1181R3098J38362J21058L9754p2236j46665j36186m8180P0230
31451a95106J52876J44566N8594j6089j8828j975m1790r5379n1166Q0874J50431
31440A67008P4145m9651r2565o2293l8473l0718k950K0555j5202q8601j22658
31429b41403r8241n6636l084R3293J96999K02067O8241j05580j82747j22971K729
31418b47333Q6325O0027m8827j23594p1324N3814J02030K8034l6471L2852J66331
31407A864J92203P8920k8785k5199J9481o645q2951j13960r7677j06279j17543
31396b86571j8276J81316K84579J62899m0700r9148q590N6032L5963L7266Q8077
31385C92847O7063o2930j51579r8082j5146k4859n4006L776O6110L27j25093j43621
$$ y = [-97107, -243160, -254341, -161243, -22881, 98177, 137931, 65695, -80970, -217156, -265336, -195106, -42230, 102336, 160930, 144841, 126013, 124038, 82248, -13131, -64297, 16577, 167008, 241153, 191502, 98937, 36644, -1829, -32547, -35497, -14942, -30144, -118745, -241403, -339644, -396280, -399364, -306071, -109072, 92995, 161236, 55656, -127091, -250062, -247333, -161008, -100981, -149808, -273402, -344726, -290912, -188882, -160848, -197319, -164467, 1864, 194067, 272987, 244202, 219003, 238484, 231839, 148888, 34928, -62749, -169028, -286571, -304847, -123531, 161048, 323947, 283247, 184099, 175509, 231541, 267504, 304770, 392847, 459910, 396980, 245401, 147319, 132173, 107314, 53308, 57084, 123194, 123521, -1572, -145193]
31373a45193o9184m5169o6145K897J40216J57861K0315o9849J3162J33764J30426
31362B03101M3666j2453l5547n7585l3123N1235Q4025q690j18923j15692m1824
31351d1810p559M716O5317J20950P5957j8634m3592k6348q1179j68311j28692
31340b49185L2643J15387L1694n3760J2103J34069J26682j1269j24787j34282
31330a20705r7282o7111k1702M9796R1890O2695P947j514K4680J5057m2071o3013
31318a61333Q955J00492R6889O967m6146m66O6908O1961p754p4431r6066o1219
31306a05243J8955Q2610O0844q291l898Q6219J12362j4258j62595j64093n0538
31295a47926L1815N5274Q9720J15377M9845o1236p4500J5903N2870l4039j18876
$$ y = [-145193, -214377, -259546, -325691, -322794, -182578, -24717, -4402, -74251, -61089, 72675, 203101, 246767, 234314, 198767, 141182, 108059, 159294, 243319, 234629, 115706, 14, -41810, -49369, -44653, 20664, 141614, 217571, 198937, 155345, 128997, 47818, -120493, -249185, -216542, -101155, -69461, -123221, -111118, 22951, 149633, 138364, 13577, -120705, -217987, -285098, -306800, -257004, -165114, -102419, -94472, -95986, -71306, -56249, -98320, -161333, -152378, -51886, 45003, 51970, 5824, 5358, 72266, 134227, 126473, 52042, -44024, -105243, -86288, -3678, 57166, 48875, 44977, 131196, 243558, 229300, 66705, -97388, -147926, -116111, -60837, 28883, 144260, 194105, 132869, 58369, 74272, 127142, 93103, -25773]
31284b5773q4634N365K9251r586j9094K8558P1679O0253J8391K102K0070J7700
31272A14282l6470p1498j579J07459R3119l6873o8425P6643J62305N84j97462
31261A42085j21142J28864J86732J1148p6392L7359P7741j03206k45842j35409
31251i8062K4977k1905j47538q9180Q6004J18360K683m7627J2664L6318o858O96
31239a29468O6095O9887K323k9467k0323n6395j01796m2262O6555N4411m9864
31228a70304l2956J32604K09447P1705r7879j04152l553O1440Q3935R8483M9423
31217B98193p9063j49235n4501R7659J39963P6319J1781m1793j22750j64490o6668
31206e4585J10117J83077Q3868o6479j27333q4614j6384J0346p785j7451L0227
$$ y = [-25773, -110407, -105042, -75791, -85377, -104471, -75913, -4234, 56019, 74410, 76512, 96582, 114282, 77812, 6314, 4735, 112194, 205313, 168440, 100015, 176658, 338963, 339547, 142085, 20943, 149807, 336539, 347687, 271295, 308654, 386395, 283189, 37347, -98062, -73085, -94990, -242528, -331708, -245704, -127344, -124661, -172288, -159624, -123306, -130164, -129468, -63373, 6514, 8837, -20630, -40953, -97348, -199144, -241406, -174851, -120440, -170304, -203260, -70656, 138791, 210496, 112617, 8465, 4912, 66352, 150287, 248770, 298193, 219130, 69895, 15394, 113053, 253016, 329335, 341116, 299323, 176573, 12083, -54585, 55532, 238609, 322477, 255998, 128665, 44051, 27667, 38013, 30228, 12777, 43004]
31195D3004J04700J15987L5791n3312o6883j9296K6456M4249K9730k8619r8851
31184A32956r5538K148Q2222L4177r4844j60005r8040K6781J19206J26296N0960
31173A26319m1098o2478p008L4141O955k6552p709J0288l0218o2338j485Q4900
31161B3717O3430m5874r0161j5263O9828P0408J1792n4151j16582j43073p2042
31150b97971P6294J79225J57698O5382j0232n5056q9668r9379o3778j0304Q567
31139a39222l0000r7259j19187k9178J32174K10810J18177k8478o3139k0857o0112
31128a26271j56269j01246J33361K72072J20040j23431j37826O4361J84157P3573
31118B02521j00584j35940m4745L0878J9207l6520o0604k2219L7110M4006j5504
$$ y = [43004, 147704, 263691, 299482, 246170, 179287, 159991, 186447, 230696, 260426, 231807, 132956, 37418, 39566, 121788, 155965, 61121, -98884, -196924, -170143, -50937, 75359, 126319, 85221, 22743, 15735, 49876, 56831, 30279, 22570, 32858, 2640, -59698, -61183, 23717, 87147, 41273, -48888, -64151, 5677, 76085, 87877, 33726, -82856, -225929, -297971, -221677, -42452, 115246, 180628, 170396, 115340, 25672, -73707, -137485, -147789, -139222, -169222, -266481, -385668, -414846, -282672, -71862, 46315, 17837, -45302, -66159, -126271, -282540, -383786, -250425, 21647, 141687, 18256, -119570, -55209, 128948, 202521, 101937, -34003, -78748, -47870, -28663, -65183, -125787, -148006, -110896, -66890, -82394]
31107h2394p0890o4165k2216J1721M8593Q9247P0777k8302j04915o6088K2654
31096a95978M8355L8221Q5251J47440J00788l6455j16037q9319m6446k8510J1199
31085h1491N0763P598p0444l6088Q8279J00720m3925j26162q893J40662J34965
31074A55984N3015M4757M3887q3663k49588k56130j05444L9204J21965J90726
31064d5287J96855N3019j42671j87911p5165J9214L5099P5834J49979J28359O575
31053B13900m6866J4697K1606j00259j64206k6423J53685J48646j498r0052o0016
31042F3214j5253M89K9987N0972p005r8420q7304L7575J17743M2050j03891j61540
31030a31383q7805M0468J43494J84286J34054j4548j79241k12945o9448R5066
$$ y = [-82394, -153284, -217449, -239665, -227944, -179351, -90104, -19327, -47629, -152544, -218632, -195978, -147623, -109402, -24151, 123289, 224077, 187622, 71585, -17734, -64180, -92690, -81491, -30728, -23130, -93574, -129662, -41383, 59337, 15412, -110750, -119643, 21019, 155984, 208999, 253756, 297643, 213980, -35608, -291738, -397182, -357978, -236013, -45287, 151568, 204587, 61916, -125995, -201160, -181946, -146847, -71013, 78966, 207325, 213900, 167034, 181731, 203337, 103078, -61128, -87551, 66134, 214780, 213282, 123230, 63214, 47961, 48450, 78437, 129409, 122404, 23984, -63320, -25745, 91998, 134048, 30157, -131383, -219188, -178720, -35226, 149060, 283114, 268566, 89325, -123620, -193068, -98002]
31020i8002Q5241p1173j45093k7619J11515Q3495l9730o3080K0839N9330J5462
31009f8815m742K0904K221n7047m9232J6167J2559m5934J100J46738J73138K3471
30997A70528p1712J2281P2512m6263j51259n0660O9043l8744k03781r1394K01576
30986a27873K50316k4624k24580q8012J48926J59419j6524j19129n6819N0642
30976d8258Q6685L7453m8291r7054o1221K0666O7432O0343L4288l016m6967m6905
30964d4845j676k3818j50192j91773N307K42704K01854n8174j67238j1745J25216
30953g4380N9583l0550J9408P4444k159p2626O957J01213M1527o3359l4600N1373
30941G6831K8175l4538K9409J41899Q8047j06598j95588p8155J00340J88762J51844
$$ y = [-98002, -12761, -83934, -229027, -256646, -145131, -61636, -101366, -164446, -143607, -84277, -68815, -73557, -52653, -50432, -107479, -156711, -140544, -127985, -173919, -172819, -26081, 147057, 170528, 98816, 111097, 183609, 137346, -13913, -64573, 4470, -34274, -238055, -329449, -127873, 122443, 97819, -126761, -214773, -65847, 93572, 77048, -42081, -98900, -48258, 38427, 75880, 27589, -69465, -130686, -110020, -42588, 17755, 52043, 49027, 2060, -44845, -46521, -70339, -220531, -412304, -406997, -164293, 37561, -20613, -187851, -199596, -74380, -14797, -45347, -25939, 48505, 46346, -26280, -19323, 81890, 123417, 60058, 25458, 76831, 105006, 70468, 99877, 241776, 329823, 223225, 27637, -50518, 49822, 238584, 390428]
30930C90428q136k29454l26647j72180Q0239J63756N8950k8347r739J1468n390
30919g5052K6274R9811Q1888l7055q6550P516R5524M8276n3176p6012k7323J9228
30907B3349N5910R3849Q8016N784j02381j64405j55973q3063K4287R1042O5626
30896e7959R051R436K7937l0493j15324q1961N1270J04730L3863L785R1631J38430
30884A84396K2739j20808j18494k6938o468n5422n5999R079O3302Q9422J10518
30873I5327P7183n9390j98714j79430j0018J29946J27135N0877J3167K1265J6537
30862H3885q246P895R4470J62740P4108j59622l06085j64257J35124K47378O3726
30851B31116j43012j10004O6508J25171K4921o3839n5457k4909k7301k9326j4099
$$ y = [390428, 382292, 152838, -173809, -345989, -265750, -101994, -43044, -71391, -81130, -69662, -75052, -48778, 51033, 132921, 95866, 9316, 16832, 112356, 160632, 107456, 31444, 4121, 23349, 79259, 173108, 261124, 266908, 164527, 122, -155851, -238914, -214627, -123585, -57959, -48908, -39472, -11535, -42028, -157352, -239313, -188043, -83313, -49450, -45665, 45966, 184396, 207135, 86327, -32167, -59105, -65573, -120995, -176994, -167915, -104613, -15191, 95327, 172510, 113120, -85594, -265024, -275042, -145096, -17961, 32916, 46083, 67348, 83885, 75639, 83534, 178004, 340744, 414852, 255230, -50855, -215112, -79988, 167390, 231116, 88104, -21900, 44608, 169779, 194700, 130861, 75404, 50495, 23194, -6132, -20231]
30840b0231l700J5738O3814Q5222K7592l7651j6343K7183l9002j64952j55965
30829b18295K1923J66933J31177J4264j7077M0631P8504M7042k5392j07269j64785
30818c2344j45125l8155Q2656J37278J22737Q4040M7530J9967R809J2263M760
30807C05416k0942n1870q0552r7381o8559J3835O9589N159j37487j96820q9014
30796c48626Q7174J79100J44146M6371m3081q8444p7447k1140M6573R1871R7337
30785A13834O5051K4435J2547J6224k4315j09913j42734o4192L6312M9076P886
30774a5789N35m054o7634r1328N9714K63790K37465l7167k43927j82196k8307
30763a08898j0625o9436l4405O4439R2166O2784O6005N9970l1015j09303l5170
$$ y = [-20231, -23931, -8193, 55621, 140843, 168435, 130784, 114441, 141624, 102622, -62330, -218295, -196372, -29439, 101738, 116002, 98925, 139556, 218060, 265102, 239710, 132441, -32344, -177469, -215624, -132968, 4310, 127047, 211087, 258617, 278584, 288393, 300656, 305416, 284474, 232604, 152052, 54671, -13888, -53, 69536, 74695, -62792, -259612, -348626, -261452, -82352, 61794, 108165, 65084, -23360, -100807, -121947, -75374, 16497, 113834, 178885, 203320, 215867, 232091, 207776, 97863, -44871, -109063, -72751, -23675, -15789, -15254, -19308, -86942, -178270, -118556, 145234, 382699, 345532, 101605, -80591, -108898, -119523, -188959, -223364, -158925, -66759, -3975, 62030, 122000, 90985, -18318, -53488]
30752e3488J04799J05920j8044n4518N5058J22724J4875j59377k22496j32672
30742b37219L4384J71285J77741M4434q7236p8323L842j2916j20610j42711l6335
30731b83664M0964J5653J8985J25692J89148Q2346p4487r5759o440L4071j5764
30720C0745o8927q0968p7832n8890p235L6597K6904O541M3062J03944R8633K0445
30708G3019m8445n5911k2252J7480M2021L5069O498o324l420l4861r7257r5386
30696a89769J2670J10736P2618m6730q8669j5657O6949Q4578N8797J1896o0119
30685A7300j08519n3714P7849J44014O3007p7445j29821m8929Q4737J54523J03220
30674B26222j6314q1639l6192L0656N12r9768j31001m4085N4783O3560R825k5316
$$ y = [-53488, 51311, 157231, 139187, 84669, 139727, 262451, 277326, 117949, -104547, -237219, -202835, -31550, 146191, 190625, 103389, 25066, 28908, 15992, -104618, -247329, -283664, -242700, -227047, -208062, -82370, 106778, 189124, 114637, 18878, 12438, 46509, 30745, -38182, -119150, -196982, -255872, -263107, -226510, -199606, -193065, -150003, -46059, 52574, 73019, 24574, -31337, -53589, -36109, 5912, 40981, 47479, 41155, 37735, 2874, -94383, -189769, -177099, -66363, 6255, -40475, -129144, -144801, -77852, 6726, 65523, 77419, 17300, -91219, -144933, -67084, 76930, 139937, 62492, -67329, -116258, -31521, 123002, 226222, 209908, 128269, 92077, 122733, 123245, 23477, -107524, -151609, -96826, -33266, -23441, -48757]
30662d8757k0557M821N0932J10667J33739Q2838n360o8589r9939j29302j48757
30651a38264j16020k9432N2506Q2189P8801Q7424J02267P1562j0726o2864j6489
30640A00954O1471K7901j35736k63201j99730M243J65195J82365J02907J3255
30630E9624m0657m3845j2559N20k7268l7019J9331O9794J2611j06349j34542l3707
30618b74066P1800Q8048N7444L3967o060o3172n9623K3319O9687l376j02014r6619
30606b60665j9768Q157j5585P148Q4587J09330L5055m2148j6477R3260J76658
30595A59552J51574L3296q6645j30842j16435j13155j16199m3630J01006J75939
30585A4461J01316L74N953L0709q0192k38968k00736M1550K03202J20761j8388
$$ y = [-48757, -69314, -64493, -13561, 97106, 230845, 313683, 308323, 239734, 139795, 10493, -138264, -254284, -283716, -231210, -149021, -70220, 17204, 119471, 191033, 180307, 117443, 100954, 162425, 190326, 54590, -208611, -408341, -404098, -238903, -56538, 46369, 59624, 18967, -24878, -37437, -36917, -64185, -101204, -81873, -12079, 532, -105817, -240359, -274066, -202266, -114218, -56774, -22807, -28867, -92039, -151662, -128343, -58656, -62032, -164046, -260665, -280433, -272276, -287861, -280713, -196126, -86796, -51741, -93889, -110366, -17106, 159552, 311126, 344422, 257777, 126935, 10500, -102655, -218854, -262484, -161478, 14461, 115777, 116151, 122104, 152813, 72621, -166347, -367083, -325533, -122331, -1570, -19958]
30574a9958J1478J38687J50179K9705o4143o3180l5495k2238r073k1231p6475
30563A8256q0123N1914J92136J29220r4971j93562l6361J63113J60618p53j15749
30552A93738j11798o7250m0826l1884m1780n3027j3279O0372N3926n6106j05813
30541b13727J4338J41398O7145j10427j14129P2661J67619K1272j74325j94001
30531c22176o9873L9711P8076O2495l422o4503j4654J18017J45618N739j02483
30520a27455k2168J02662P1000m1759m1371L0724r573j23717r5090P5068J33164
30509d8515j1392j30302m7765Q7185N9523p7833j15951q059J07361J36850J28025
30498G9127J47831J74857J34789K650j43211j85461j10113l9342o0744q9377j0883
$$ y = [-19958, -8480, 130207, 280386, 310091, 245948, 182768, 147273, 125035, 115962, 94731, 18256, -61867, -9953, 182183, 311403, 216432, 22870, -13491, 149622, 310240, 309487, 193738, 81940, 14690, -26136, -58020, -99800, -152827, -166106, -105734, -51808, -107914, -213727, -199389, -57991, 9154, -101273, -215402, -142741, 24878, 46150, -128175, -322176, -392049, -352338, -274262, -211767, -215189, -279692, -294346, -176329, -30711, -24972, -127455, -149623, -46961, 24039, -17720, -59091, -28367, -37940, -161657, -256747, -181679, -48515, -59907, -190209, -237974, -150789, -91266, -169099, -285050, -293109, -185748, -48898, 79127, 226958, 401815, 536604, 539254, 396043, 210582, 100469, 61127, 383, -88994, -99877]
30487i9877J03994R4587j4875l7488O9270J31724M8031n9412o5052k1140j2112
30476A37650p424K0214p05q4826j00037J9367J20926N6479q2915j27226r2307
30465a40804r3394j07383l4412P8571Q7940j0472p9764m9647L1941J15409J65762
30454c6253J15918l2647j18302p219J73798J82805P675j31714j08368j4432L6931
30443F8192L7483l245q1349j14343j9595J02829O3358j08431j61406M175J71307
30432d1025J22008o1225j42584m6278J08615J88503J45602J1007j19477j47001
30422A8145p6470p453M533m636j1137m0407p4622m7635K8256N4927R527j7331
30410a64303J1487J8130k6549k8852N7649J29538R3580K135n8456q5894q3198
$$ y = [-99877, 4117, 98704, 83829, 46341, 115611, 247335, 295366, 235954, 170902, 149762, 137650, 130226, 150440, 149735, 64909, -35128, -15761, 105165, 161644, 78729, -48497, -140804, -234198, -341581, -375993, -297422, -209482, -219954, -299718, -349365, -317424, -202015, -36253, 79665, 47018, -71284, -78503, 95295, 278100, 285775, 154061, 45693, 31261, 68192, 105675, 102430, 21081, -93262, -112857, -10028, 53330, -55101, -216507, -212332, -41025, 80983, 19758, -122826, -169104, -60489, 128014, 273616, 284623, 165146, 18145, -58325, -65778, -61245, -65881, -77018, -117425, -192047, -239682, -211426, -156499, -146972, -164303, -152816, -134686, -161235, -190087, -132438, -2900, 90680, 92815, 34359, -51535, -134733]
30399a34733n344J12178J18923k8610j46009o7477J04143J50068M1739o7402q5498
30388h022o1040n7220p4318p3287j663J49960K71325K20061L9428o3145k8670
30377C13409l6650j62760j93594M609J75735M1014k13829j97742N3860J33480
30367h2468p0062j99987k2036K19214K18052M7938m6361l6722m1624n9139j6783
30356h9978M1242L2790L031K5772M1992k0309o7459J7800J37273R7518p5355j59575
30344a5258p1387L3795K7982j0281L9846J42191J68349P8247m8673j19458j09823
30333A15530o5791m9341o3853m2072N2901J40257J10247q765o7494k210P2970
30322A92379L5719o5733r2167k3690J7474m2772j17520q8002J9539O7185o25p8757
$$ y = [-134733, -140077, -27899, 91024, 62414, -83595, -151072, -46929, 103139, 144878, 77476, -8022, -69062, -126282, -200600, -273887, -275550, -125590, 145735, 365796, 405224, 342079, 313409, 276759, 113999, -79595, -74986, 100749, 141763, -72066, -269808, -215948, -82468, -152530, -352517, -374553, -155339, 62713, 110651, 64290, 27568, -14056, -73195, -89978, -48736, -15946, -12915, 12857, 54849, 34540, -32919, -15119, 122154, 219672, 144317, -15258, -86645, -52850, -24868, -35149, 4697, 146888, 315237, 393484, 344811, 225353, 115530, 49739, 398, -63455, -105527, -52626, 87631, 197878, 189113, 121619, 119409, 192379, 228098, 162365, 70198, 46508, 63982, 21210, -96310, -184312, -164773, -97588, -98213, -176970]
30310a76970m5902P2545J41566Q9408j6534o7701l8716O540N497l1353m0792N095
30298i7317M7658J2409p1083q3609J6087J10591Q2755q531j9774N0671O7193j1658
30286I5392n9593P558Q8109N6179l7225m4075N8430J40945R7145m3583j71249
30275A88033j98520j19433j4973J7607k2064l2479M1541J15548Q8112j701l3908
30264B7763J3238M9277K2947j7637k4010j1742l383J2804L7690L9384N813k9992
30252A22152l6608j4697K2810N4155M0633k2665n9347K597J00471R4844k3913
30241B80432j03356n2402K2275r085r3340q9309J346M8321J3385L8N8086Q5893
30229A62284K035j01551q9081O138K6678p0006j43854p4181P4559J54271J27662
$$ y = [-176970, -222872, -150327, -8761, 80647, 64113, -3588, -42304, -35764, -30267, -61620, -102412, -97317, -49659, -37250, -108333, -191942, -175855, -65264, 17491, 8960, -10814, 39857, 107050, 95392, 35799, 43357, 131466, 187645, 150420, 106345, 164775, 305720, 402865, 359282, 188033, -10487, -129920, -144893, -127286, -149350, -181829, -140288, -24740, 63372, 61671, 27763, 41001, 90278, 113225, 95588, 71578, 59836, 56453, 69257, 106947, 146331, 152144, 122152, 85544, 70847, 93657, 147812, 188445, 165780, 106433, 109030, 209501, 304345, 280432, 177076, 124674, 146949, 137864, 44524, -44785, -43439, 4882, 18267, 18305, 76391, 162284, 164319, 62768, -26313, -20175, 6503, -63503, -207357, -281538, -206979, -52708, 74954]
30218G4954P4861M6890J4933l3099m4294Q946O2474M4493j8143l9101P881O4763
30206B65558O8332M598r8115j79577j71186o9103L1104L8203j2435k0454J1759
30195a31316j0466p9517m6431J39520K80184J64917j11985k42822j09339P6338
30185g0917Q2836m3173r8252k8325L7070J2300l8383l9504j4600j284L1445R2059
30173g8728Q3186o2788k15361j70652M7626J74930N9844j18385j06465O9855J77560
30162a39378J25915M1332R811l6110j22459j34047j8523Q3960N4838q014K6961
30151a15714Q3208K1761p7917l1377J10726J12158n0300j24419L709J12182R319
30140E3336j47960j14959M8078R6451j702n1397L2742J19669R6046L253q1328
$$ y = [74954, 149815, 196705, 211638, 178539, 134245, 143191, 205665, 250158, 232015, 192914, 200795, 265558, 333890, 338488, 240373, 60796, -110390, -179493, -148389, -110186, -122621, -143075, -131316, -141782, -221299, -267730, -128210, 151974, 316891, 204906, -37916, -147255, -70917, 11919, -31254, -129506, -157831, -120761, -108461, -146844, -186348, -200948, -202232, -170787, -78728, 4458, -58330, -273691, -444343, -396717, -221787, -161943, -280328, -386793, -316938, -139378, -13463, 27869, 37680, 1570, -120889, -254936, -273459, -189499, -134661, -142675, -115714, -32506, -10745, -88662, -120039, -9313, 102845, 52545, -71874, -68165, 44017, 53336, -94624, -209583, -161505, -65054, -66756, -118153, -85411, 34258, 130304, 133557, 52229]
30129E2229j27501r9512J6682J19473Q8327j5651k1914O7063P3410m0444r0478
30118B1684P084P4196k4156j35890p5879O4535Q9367K6553K8559N8894l4598j87597
30106h7248j59209P8002K57624J93253L434j17671j46664j43536r6581J6626J33774
30095f8196J78552J41272L8312r7737j57580m0621J46026J51182p0560k50826
30085c0176j65601O9683K01376J68737O9744m7435j60138j63745n091J63228J65560
30074B66142O0509J3768O647q6593k01655j46857M9825J38707K9506q7475o3781
30063b1257J2934L4712M6309Q5996O6444m8120j26257o8077L8425Q4065R9002
30052B04176J18111N8856j07751k21181j45609R372O1081K7236L9426Q9651O6760
$$ y = [52229, -75272, -174784, -158102, -38629, 49698, 34047, 12133, 79196, 152606, 112162, 21684, 28768, 102964, 78808, -57082, -132961, -68426, 20941, 47494, 76053, 134947, 100349, -87248, -246457, -168455, 89169, 282422, 285856, 168185, 21521, -122015, -218596, -201970, -68196, 110356, 251628, 289940, 192203, 34623, -5998, 140028, 291210, 220650, -30176, -195777, -126094, 75282, 244019, 313763, 266328, 106190, -57555, -62646, 100582, 266142, 326651, 340419, 347066, 260473, 58818, -88039, -38214, 100493, 129999, 42524, -21257, -8323, 26389, 72698, 158694, 225138, 177018, 50761, -17316, 21109, 105174, 204176, 322287, 381143, 273392, 52211, -93398, -84026, -22945, 4291, 43717, 133368, 200128]
30041B00128k7729r3600j07018j09173p9949Q095P5042M2883j4205k559M686q0925
30029a84324j34891l991J70286J25351p0334q9932J13734K19552P1581q2624m8546
30018H5862o154j27328k07082j1819K57098K34560k8838j54503k8517Q8876M9912
30007A52067K5743J28699J75700J3907j82167j68171o015N8052j5694l8777O3911
29996B07255J25256R438j62510j80220m0222O1740J0811q3048o3931M1775O9127
29985d529m5499j68168j35502M7488K19060K36004J06287l3859o1316Q80P899
$$ y = [200128, 172399, 78799, -28219, -137392, -217341, -209246, -134204, -91321, -105526, -108085, -103399, -184324, -319215, -323206, -152920, -27569, -97903, -187835, -74101, 145451, 217032, 134408, 85862, 79708, -47620, -254702, -266521, -9423, 225137, 196299, 41796, 13279, 102155, 152067, 177810, 306509, 482209, 496116, 313949, 145778, 139763, 197815, 182121, 143344, 207255, 332511, 341949, 179439, -781, -41003, 20737, 31548, -51500, -115431, -73656, -4529, -50028, -218196, -353698, -306210, -87150, 148854, 255141, 221282, 159966, 160846, 168745]
$$ [...]
##END NTUPLES=NMR SPECTRUM
##END=
