##TITLE=31Pdec_PMA0606
 , 24 sc
 6.6.2019
##JCAMPDX= 6.0         $$ Bruker NMR JCAMP-DX V2.0
##DATA TYPE= NMR SPECTRUM
##DATA CLASS= NTUPLES
##ORIGIN= UXNMR, Bruker Analytische Messtechnik GmbH
##OWNER= root
$$ XWIN-NMR		Version 3.5
$$ Thu Jun  6 15:53:10 2019 Russian Standard Time (UT+4h)  she@DPX200
##.OBSERVE FREQUENCY= 81.013821
##.OBSERVE NUCLEUS= ^31P
##.ACQUISITION MODE= SIMULTANEOUS
##.ACQUISITION SCHEME= undefined
##.AVERAGES= 24
##.DIGITISER RES= 17
##SPECTROMETER/DATA SYSTEM= spect
##.PULSE SEQUENCE= zgpg30
##.SOLVENT NAME= DMSO
##.SHIFT REFERENCE= (INTERNAL, DMSO, 0, 182.463)
##AUDIT TRAIL= $$ (NUMBER, WHEN, WHO, WHERE, WHAT)
$$ ##TITLE= Audit trail, XWIN-NMR		Version 3.5
$$ ##JCAMPDX= 5.01
$$ ##ORIGIN= Bruker BioSpin GmbH
$$ ##OWNER= she
$$ F:/spectra/data/she/nmr/P31/1/pdata/1/auditp.txt
$$ ##AUDIT TRAIL=  $$ (NUMBER, WHEN, WHO, WHERE, WHAT)
(   1,<2019-06-06 15:51:45.46 +0400>,<she>,<DPX200>,
      <created by zg, POWCHK disabled, PULCHK disabled
       configuration hash MD5:
       00 E9 B6 7A A2 85 ED C7 34 08 36 98 17 FE 4E 26
       data hash MD5: 32K
       EB 65 0C 27 4D 8E 7C 06 FA D1 C5 3D C9 0E 01 79>)
(   2,<2019-06-06 15:51:48.48 +0400>,<she>,<DPX200>,
      <Start of raw data processing
       efp BC_mod = 2 LB = 1 FT_mod = 6 PKNL = 1 PHC0 = -2359.357 PHC1 = -341.401 SI = 64K 
       data hash MD5: 64K
       57 EE 23 A7 D3 37 DA 25 84 ED E8 17 FA 16 4D 46>)
(   3,<2019-06-06 15:52:23.01 +0400>,<she>,<DPX200>,
      <pk PHC0 = -59.73189 PHC1 = -95.39999 
       data hash MD5: 64K
       73 CC EB 98 2B 92 BA 7B 63 E9 B8 2A 1A 86 C2 76>)
(   4,<2019-06-06 15:52:26.57 +0400>,<she>,<DPX200>,
      <abs ABSG = 5 
       data hash MD5: 64K
       4F A5 12 5C 11 A1 9B 39 53 2B 07 57 CC 99 DF 53>)
$$ ##END=
$$ 
$$ hash MD5
$$ 1D F1 BA 1F 11 BB E9 0A 0A 2A 7F 0C 87 1F 64 0F
##$RELAX= 
##$RELAX= 
##$RELAX= 
##$RELAX= 
##$RELAX= 
##$RELAX= 
##$RELAX= 
##$RELAX= 
$$ Bruker specific parameters
$$ --------------------------
##$DU= <F:/spectra>
##$EXPNO= 1
##$NAME= <P31>
##$PROCNO= 1
##$TYPE= <nmr>
##$USER= <she>
##$AMP= (0..31)
100 100 100 100 100 100 100 100 100 100 100 100 100 100 100 100 100 100 
100 100 100 100 100 100 100 100 100 100 100 100 100 100 
##$AQSEQ= 0
##$AQ_mod= 1
##$AUNM= <au_zg>
##$AUTOPOS= <>
##$BF1= 81.014009
##$BF2= 200.13
##$BF3= 200.13
##$BF4= 200.13
##$BF5= 200.13
##$BF6= 200.13
##$BF7= 200.13
##$BF8= 200.13
##$BYTORDA= 1
##$CFDGTYP= 0
##$CFRGTYP= 5
##$CHEMSTR= <none>
##$CNST= (0..31)
1 1 145 1 1 1 1 1 1 1 1 1 1 1 1 1 1 1 1 1 1 1 1 1 1 1 1 1 1 1 1 1 
##$CPDPRG= <waltz16>
##$CPDPRG1= <>
##$CPDPRG2= <waltz16>
##$CPDPRG3= <>
##$CPDPRG4= <mlev>
##$CPDPRG5= <mlev>
##$CPDPRG6= <mlev>
##$CPDPRG7= <mlev>
##$CPDPRG8= <mlev>
##$CPDPRGB= <>
##$CPDPRGT= <>
##$D= (0..31)
0 1 0 0 0 0 0 0 0 0 0 0.03 2e-05 3e-06 0 0 0 0 0 0 0 0 0 0 0 0 0 0 0 0 
0 0 
##$DATE= 1559821904
##$DBL= (0..7)
120 120 120 11 120 120 24 19 
##$DBP= (0..7)
150 150 150 150 150 150 150 150 
##$DBP07= 0
##$DBPNAM0= <>
##$DBPNAM1= <>
##$DBPNAM2= <>
$$ [...]
##$SUBNAM3= <"">
##$SUBNAM4= <"">
##$SUBNAM5= <"">
##$SUBNAM6= <"">
##$SUBNAM7= <"">
##$SUBNAM8= <"">
##$SUBNAM9= <"">
##$SW= 369.568048894756
##$SWIBOX= (0..15)
0 1 3 0 0 0 0 0 0 0 0 0 0 0 0 0 
##$SW_h= 29940.119760479
##$TD= 32768
##$TD0= 1
##$TE= 0
##$TE2= 300
##$TE3= 300
##$TEG= 300
##$TL= (0..7)
0 120 53 12 22 120 120 120 
##$TP= (0..7)
150 150 150 150 150 150 150 150 
##$TP07= 0
##$TPNAME0= <>
##$TPNAME1= <>
##$TPNAME2= <>
##$TPNAME3= <>
##$TPNAME4= <>
##$TPNAME5= <>
##$TPNAME6= <>
##$TPNAME7= <>
##$TPOAL= (0..7)
0.5 0.5 0.5 0.5 0.5 0.5 0.5 0.5 
##$TPOFFS= (0..7)
0 0 0 0 0 0 0 0 
##$TUNHIN= 0
##$TUNHOUT= 0
##$TUNXOUT= 0
##$USERA1= <user>
##$USERA2= <user>
##$USERA3= <user>
##$USERA4= <user>
##$USERA5= <user>
##$V9= 5
##$VALIST= <valist>
##$VCLIST= <CCCCCCCCCCCCCCC>
##$VD= 0
##$VDLIST= <DDDDDDDDDDDDDDD>
##$VPLIST= <PPPPPPPPPPPPPPP>
##$VTLIST= <TTTTTTTTTTTTTTT>
##$WBST= 1024
##$WBSW= 4
##$XGAIN= (0..3)
0 0 0 0 
##$XL= 0
##$YL= 0
##$YMAX_a= 2303
##$YMIN_a= -2256
##$ZGOPTNS= <>
##$ZL1= 120
##$ZL2= 120
##$ZL3= 120
##$ZL4= 120
##$ABSF1= 182.463
##$ABSF2= -187.1042
##$ABSG= 5
##$ABSL= 3
##$ALPHA= 0
##$AQORDER= 0
##$ASSFAC= 0
##$ASSFACI= 0
##$ASSFACX= 0
##$ASSWID= 0
##$AUNMP= <proc_1d>
##$AZFE= 0.1
##$AZFW= 0.5
##$BCFW= 0
##$BC_mod= 2
##$BYTORDP= 0
##$COROFFS= 0
##$CY= -3
##$DATMOD= 1
##$DC= 0
##$DFILT= <>
##$DTYPP= 0
##$F1P= 0
##$F2P= 0
##$FCOR= 1
##$FTSIZE= 65536
##$FT_mod= 6
##$GAMMA= 0
##$GB= 0
##$INTBC= 1
##$INTSCL= 5.30512e-09
##$ISEN= 30
##$LB= 1
##$LEV0= 0
##$LPBIN= 0
##$MAXI= 10000
##$MC2= 0
##$MEAN= 0
##$ME_mod= 0
##$MI= 50
##$NCOEF= 0
##$NC_proc= -7
##$NLEV= 6
##$NOISF1= 182.463
##$NOISF2= 159.3651
##$NSP= 0
##$NTH_PI= 0
##$NZP= 0
##$OFFSET= 182.463
##$PC= 4
##$PHC0= -2419.089
##$PHC1= -436.801
##$PH_mod= 1
##$PKNL= yes
##$PPARMOD= 0
##$PSCAL= 0
##$PSIGN= 0
##$REVERSE= no
##$SF= 81.0140089999434
##$SI= 65536
##$SIGF1= 159.3651
##$SIGF2= -187.1042
##$SINO= 113.3802
##$SIOLD= 16384
##$SREGLST= <1H.CDCl3>
##$SSB= 0
##$STSI= 65536
##$STSR= 0
##$SW_p= 29940.119760479
##$SYMM= 0
##$S_DEV= 0
##$TDeff= 32768
##$TDoff= 0
##$TI= <>
##$TILT= no
##$TM1= 0
##$TM2= 0
##$TOPLEV= 0
##$USERP1= <user>
##$USERP2= <user>
##$USERP3= <user>
##$USERP4= <user>
##$USERP5= <user>
##$WDW= 1
##$XDIM= 65536
##$YMAX_p= 276472453
##$YMIN_p= -2252582
$$ End of Bruker specific parameters
$$ ---------------------------------
##NTUPLES= NMR SPECTRUM
##VAR_NAME=  FREQUENCY,     SPECTRUM/REAL,   SPECTRUM/IMAG
##SYMBOL=    X,             R,               I
##VAR_TYPE=  INDEPENDENT,   DEPENDENT,       DEPENDENT
##VAR_FORM=  AFFN,          ASDF,            ASDF
##VAR_DIM=   65536,         65536,           65536
##UNITS=     HZ,            ARBITRARY UNITS, ARBITRARY UNITS
##FACTOR=    0.456856943014862, 1,           1
##FIRST=     14782.0589164792, 0,            0
##LAST=      -15158.0608439998, 0,           0
##MIN=       -15158.0608439998, -2252582,    0
##MAX=       14782.0589164792, 276472453,    0
$$ Real data points
##PAGE= N=1
##DATA TABLE= (X++(R..R)), XYDATA
$$ [...]
38579h9432O25K8746L0651K1721J6672J0396n26j5392l7984n8268m7627l155L1993
38566a11580K6416N232J4n171k9559l9578K7N0957M7450j707k7482o958J3590
38553g8349J915j8203j8024m349L238k666j8841k7229r62M9596O0864k278p3436
38540a28724o0670K0780O9521M6045J2661J4998J5895j8203m8096l1421L149Q431
38528i5634m689j49J4548J0379l476Q48J3056L256j7327r720K2908L1136p621
38515d2485n4740o3303l2865M872K9463M0783M0859K9451J4373P776P379m301
38503b2738l0729m3347j4826L3299M6835J2302j8980l381K9541K0492l2763p5249
38491i9544o9683k9165J7089M7219M0888l794m6779m3108m478J9053J5103J5302
$$ y = [-89432, -88807, -60061, -29410, -7689, 8983, 19379, 18853, 3461, -34523, -92791, -140418, -143573, -111580, -85164, -79932, -79918, -85089, -114648, -154226, -154199, -103242, -55792, -57499, -84981, -91939, -78349, -76434, -94637, -112661, -117010, -113772, -116438, -135279, -162508, -163470, -113874, -53010, -55288, -128724, -189394, -168614, -99093, -53048, -40387, -25389, -9494, -27697, -75793, -107214, -104065, -95634, -100323, -100472, -85924, -75545, -79021, -78173, -65117, -61861, -79188, -88908, -66000, -34864, -42485, -97225, -160528, -193393, -188521, -159058, -118275, -77416, -47965, -33592, -25816, -18437, -22738, -53467, -96814, -111640, -78341, -31506, -19204, -38184, -41565, -12024, 8468, -24295, -99544, -169227, -198392, -181303, -134084, -93196, -96990, -143769, -186877, -191355, -172302, -157199, -141897]
38479a41897K7184K1086o290j8720p477p739k5873j7081L2115O4682L8839o120
38467d7291j7020n759j0470k6934l1265k7025k0308O391M6423M7533n977m5842
38455a37544k0322J6209n877m7309k5677L7141M6231q067l8410p659K0207o952
38443a78029n9704r2028r4867o7493j2763K6280M193m2606l3456K6756N1345J9151
38431d53221Q641N4226Q3468M9254J3645L0717M7980Q121m1277l3127J175j820
38419b32218j8801Q440N4724N1451O390j8508j7394k8532l9329o525M5873N0014
38407a44415O595k1650k0166k9037m5282k2436K7438L5917j822j1691K9610N1002
38395a45937J1292k7737m097M8550O4397M0057J1824p289j9110j5437k066l723
$$ y = [-141897, -114713, -93627, -99917, -118637, -126114, -133853, -159726, -176807, -144692, -80010, -41171, -47291, -64311, -70070, -80540, -107474, -138739, -165764, -186072, -179681, -133258, -85725, -91702, -137544, -157866, -141657, -147534, -194843, -220520, -183379, -137148, -145215, -183625, -191284, -171077, -178029, -237733, -329761, -424628, -492121, -504884, -478604, -474411, -517017, -550473, -523717, -472372, -453221, -444580, -390354, -306886, -257632, -243987, -213270, -165290, -157169, -198446, -231573, -230398, -232218, -251019, -242579, -187855, -136404, -130014, -148522, -165916, -194448, -233777, -240302, -194429, -144415, -137820, -159470, -179636, -208673, -253955, -276391, -248953, -213036, -214858, -226549, -196939, -145937, -134645, -162382, -166479, -117929, -53532, -13475, -1651, -8940, -28050, -43487, -45553, -49276]
38383d9276j5735k524L0162K6327k2957m4994L523N9628M8100p907l6332k4855
38371c6840j0921n504L907P143q471k1219j3040q640k3355j8986K5222N0452P403
38358e2849m2695j4062N5652N7073j1578m1270P276M5687J2646l0043j2086L1663
38346E414L3122K366q387J383k928j6596p169K0538L1057J8224P820P018m663
38333H7199l3865n7587n3575k5278N208J7553J0896O129J8470K7801J733m6374
38321d1690n7578m859O0902P0418J9295l5263m4256q776L4017M4834J3196k9458
38309B0782m0051j6898j522j7179l5624k4962J151J1719Q947J4627K5293J9533
38297c4184K46o133J0186L0902L6875K5173L368j4935j6776q280j3319l5881m3240
$$ y = [-49276, -65011, -67535, -37373, -11046, -34003, -78997, -75474, -15846, 32254, 24347, -11985, -36840, -47761, -53265, -49358, -42215, -50686, -71905, -84945, -93585, -116940, -135926, -110704, -60252, -52849, -95544, -109606, -53954, 3119, -8459, -49729, -42453, 3234, 15880, -14163, -26249, 5414, 38536, 40902, 32515, 33898, 30970, 14374, 7205, 27743, 58800, 77024, 84844, 91862, 87199, 53334, -4253, -57828, -83106, -77898, -60345, -49449, -43320, -24850, 2951, 4684, -41690, -99268, -104127, -43225, 27193, 46488, 11225, -33031, -41807, -7790, 37044, 50240, 20782, -19269, -36167, -37689, -54868, -90492, -115454, -114303, -102584, -93637, -79010, -53717, -34184, -33938, -40071, -29885, 1017, 37892, 63065, 66433, 51498, 34722, 26442, 13123, -22758, -65998]
38284f5998j2444K5410K1653k0573m9737l5755l692N660j6078m0265l0489J9433
38272b02875O6679N6158p903n3452l0545K0495L0749K847o478J5700K5359L391
38260g9875j7373j6762j4520j6554K233L7622M2852Q626p886K2058L8498j1778
38248a2859p4037n7690K4882P4679M7089k872j6483J357K2040L4251K6676j2078
38236E4955n5409n4240j1623J2329o394j7713J3210M1019J6723k5337k4187M358
38224e2309j923m0871m7370k356L7650L2685J1765J1104K1263K4431L0298M2011
38212F6378L4100n28k4837j4772j1q979j6401P466L5752K8385K096m272m404l3701
38198F6272o5448l9224L0850N9817J7534k7424j5694K2325L0448Q134j6833m3298
$$ y = [-65998, -78442, -53032, -31379, -51952, -101689, -137444, -141136, -135476, -151554, -191819, -222308, -202875, -136196, -80038, -87941, -141393, -171938, -151443, -120694, -117847, -124325, -108625, -83266, -79875, -97248, -114010, -128530, -145084, -142851, -105229, -62377, -53751, -61637, -39579, -1081, -12859, -86896, -144586, -119704, -45025, 2064, -808, -17291, -15934, 6106, 40357, 67033, 54955, -454, -54694, -66317, -53988, -60382, -78095, -64885, -23866, -7143, -32480, -56667, -52309, -54232, -95103, -142473, -144829, -107179, -74494, -62729, -51625, -30362, -5931, 24367, 66378, 100478, 99950, 75113, 60341, 60330, 51351, 34950, 42416, 78168, 106553, 108649, 104377, 99973, 66272, 824, -38400, -7550, 52267, 69801, 42377, 26683, 49008, 79456, 87590, 70757, 27459]
38186B7459p3230p6017l0949K3923L6055J0260p902n80J3792K2885K8041K1679
38174d584k809k7433l0197j8700j1987n028J3424K5247P443k0455j8668R697K2599
38161f1451N010j2514n692J2094J8593J1086j705j0965q183M417Q742k077n250
38148d7895J4258K8114P608j7489J813M6599M7036j0628o1336o1214m3645m6424
38136a43203m5767p958M1561N3162K6469Q76o405r019j2533q130M4m707k2881
38123a38491l3959k2369N787L0914L7623K8997K4280L2155L1644P07m1521n3282
38111i7515l1787j7431k7601k9112L614M2788M7813K0073j0721k8025l0612j9148
38099a77664m845o441j7757p810K6068M1727J6347j0850M278M4739O2360M4191
$$ y = [27459, -45771, -121788, -152737, -128814, -92759, -82499, -90401, -90981, -77189, -54304, -26263, -4584, -7393, -34826, -65023, -83723, -95710, -100738, -87314, -62067, -54624, -75079, -93747, -84050, -61451, -56441, -68955, -74647, -62553, -43960, -32874, -34579, -45544, -53727, -49310, -40568, -42645, -47895, -33637, -5523, 2085, -15404, -13591, 33008, 80044, 69416, 8080, -53134, -96779, -143203, -188970, -196928, -155367, -102205, -75736, -74860, -81265, -90284, -102817, -110947, -110903, -115610, -138491, -172450, -194819, -189032, -158118, -120495, -91498, -67218, -35063, -3419, -2712, -44233, -97515, -129302, -146733, -174334, -203446, -199832, -157044, -109231, -89158, -99879, -127904, -158516, -177664, -182509, -188950, -206707, -214517, -188449, -146722, -130375, -141225, -136947, -92208, -29848, 14343]
38087A4343J0524k4492n0537m8422k0102k471j2105j2609J8183L3810n811m8740
38075a48429k1945M2876N0045m907k4008L5606R1781O2084k3821q4929r5695p7939
38063a99281l8311K5750Q7048J07255Q1314L2358j9480n8830o9040n0400k5296
38052a26913o243J8324M9841O1263L5989j895k0865k1224j8603j4016n678o351
38040e6371k1463l0559j7344L34l058k0545k4451n632K0776L6678L1203N280j8320
38027a03472r684K5493M0779R611l1454k9116J3590M1911J9213l3978o7219m7596
38015a71922J4725P2615P9736L4419k0376m5938m2457l0312j9385r148R33J4377
38003a22733L3999M7859M0322K1010J3776J3757n314l4286l0239P053J8698j9374
$$ y = [14343, 24867, 375, -50162, -98584, -118686, -121157, -133262, -145871, -127688, -93878, -99689, -148429, -170374, -127498, -77453, -82360, -106368, -70762, 21019, 83103, 59282, -25647, -121342, -199281, -237592, -211842, -124794, -17539, 63775, 96133, 76653, 17823, -51217, -101617, -126913, -133156, -114832, -64991, -3728, 32261, 30366, 9501, -11723, -30326, -44342, -50020, -56371, -77834, -108393, -125737, -125403, -128461, -149006, -173457, -179089, -158313, -121635, -90432, -85152, -103472, -113156, -87663, -46884, -37273, -68727, -97843, -84253, -42342, -23129, -57107, -124326, -171922, -157197, -84582, -4846, 29573, 9197, -36741, -79198, -109510, -128895, -138043, -137110, -122733, -88734, -40875, -553, 20457, 34233, 47990, 42676, 8390, -21849, -14796, 3902, -15472]
37991a5472m5219m678N5792N5797K461k7407l784K9765L5084J8499n492k9323
37979F6023l3173o904J3005j4253o0099n8401q581K2869R118m049J0945J6732
37967d6768j1939l4613j4698J4785P349j9306j5886J9260M4035L5162M289l1201
37955d9531n5913n0512j3234K3953K9317J0036n799r001p468l476J162m939k1562
37942a56967k3914J491K5966J4140k4260m8475m0069j2862J7311M0354M0042J0161
37930a57082k1064j6547J8568M1600L0777R116L056O173p30j4723j6417j270J3193
37917a05350J2455M450N616J3090N533k2330m1336k1804K2771M9038L8790J6379
37905b2698R146J5650J9397J1142r311l2294l6318j1193J6657J2515j3720k1285
$$ y = [-15472, -60691, -65369, -9577, 46220, 48681, 21274, 17490, 47255, 82339, 100838, 95346, 66023, 32850, 25946, 38951, 24698, -35401, -93802, -102383, -79514, -70396, -74445, -63500, -46768, -58707, -93320, -108018, -93233, -85884, -105190, -121076, -101816, -57781, -22619, -18330, -49531, -105444, -155956, -169190, -145237, -115920, -105884, -111683, -120684, -128152, -131628, -130466, -135405, -156967, -180881, -179390, -153424, -139284, -163544, -212019, -252088, -264950, -247639, -207285, -167243, -157082, -178146, -194693, -176125, -134525, -103748, -94632, -91576, -85403, -86133, -100856, -117273, -118543, -105350, -92895, -88445, -82829, -69739, -64206, -86536, -127872, -149676, -126905, -77867, -39077, -22698, -13552, 2098, 21495, 32637, 23326, -8968, -45286, -56479, -39822, -27307, -41027, -62312]
37893f2312n306J14q728L974L3514J8967n0404q7062k9979M6371L5218l6757n1082
37880a93472J6060O1938K3347l1490j8946L5939N1647J2232k5463k0406Q814K2174
37868e7626O498j7588k4348j6319k1543m7343n6103j5928M2342O1081L7358J7921
37856i1598J7866L746l5006n9171m4046j5431K233K0245M1335L6170J53j8065
37844a41569J1602M6153L5600K610L92K3582K3862l716j3202J5212M4278L5201
37832H0005n029m2299n3814m0272j8904p481l996J0846L9842N3763K7901k1160
37820A9402n5499n8333l7570m968K5182L2913J3567r836j5091p086J061J1347
37808h4911K4330K3986M629j1478j0599j4209l7025m8009j5280L3989M5675J5173
$$ y = [-62312, -67618, -67504, -76232, -72258, -38744, -19777, -70181, -157243, -187222, -140851, -105633, -142390, -193472, -177412, -115474, -92127, -123617, -142563, -106624, -54977, -42745, -68208, -88614, -79800, -57626, -51128, -68716, -93064, -109383, -130926, -178269, -234372, -250300, -207958, -146877, -109519, -91598, -73732, -69986, -104992, -164163, -208209, -223640, -221407, -201162, -159827, -123657, -123504, -141569, -129967, -83814, -48214, -45604, -45212, -21630, 2232, -1484, -14686, 526, 44804, 80005, 74976, 32677, -21137, -61409, -80313, -87794, -91790, -80944, -41102, 12661, 40562, 19402, -36097, -94430, -132000, -136968, -111786, -78873, -65306, -75142, -90233, -97319, -96258, -84911, -60581, -36595, -31966, -43444, -54043, -68252, -105277, -153286, -168566, -134577, -88902, -73729]
37796g3729j3695j4636Q5J5363K6891K5171N387j2415q150L474k317j6324j4417
37783g9312k385L46P80R304K011l7274o3666k9256K7095K8591j4626k1405K1317
37770a58480L8014J237j7029K7614P0351M2982j8433l9876j9603l515k355k56
37758g9349l138j6770j5459J0933K0085j5847n0759l3935O164J5765Q244K3825
37746a30241L8084L773m4398k8718L8529O3887J8854k4010j7741k944j1028l863
37734i9816L8416N7266J1286m0375k8906P669j0966o5536o2244J0675N5952J9268
37722a07311k5929J183N6179L6262n7517j14156p0253P485K8618K147j620L1190
37710b13722M8613K6337K74k203j879j7174k7222j5260l976j2384j6375P963L3915
$$ y = [-73729, -87424, -102060, -101975, -86612, -59721, -34550, -29163, -41578, -49728, -46254, -48571, -64895, -79312, -81697, -81351, -80571, -71267, -69256, -106530, -170196, -199452, -172357, -143766, -158392, -179797, -158480, -120466, -119229, -136258, -108644, -38293, 4689, -13744, -53620, -73223, -76738, -79093, -79349, -82487, -99257, -114716, -103783, -83698, -99545, -150304, -184239, -178075, -162310, -154066, -130241, -92157, -88384, -132782, -161500, -122971, -59084, -40230, -64240, -81981, -84925, -95953, -99816, -61400, -4134, 7152, -33223, -62129, -54460, -65426, -130962, -193206, -182531, -126579, -107311, -133240, -132057, -75878, -39616, -97133, -211289, -281542, -274057, -245439, -243292, -244912, -213722, -165109, -138772, -138498, -140701, -142580, -159754, -186976, -202236, -206212, -218596, -234971, -227008, -193093]
37697a93093K1156j9509m0653k2213J4829M3452M7538K1777j4686k5488o491J136
37685a72245k0870k7681J3368N1797K6437k6325k1143L7467N8263Q360l8089k1267
37673a31928J7709J4041k1265k9193J0275O0105P1180K3841n1125q6560m7041
37662a69961J8548L5744P227l847J3495M312m2188o0711k0816J9527J8305K0268
37650a60097O1629Q6833M0369k7205l5048o02R33l5071n0565l3051k1488k1561
37638a94924n679J4123L104j3447K2927R1974J03379L1962m4606o5207n6134n2277
37626a64805l3310J4608M7142K9272j945J331K0325J1014j5237j3828J3277J8977
37614g3179j4343m9089m5472r792J5652l114n4384q3477m8692K2234N8572L6501
$$ y = [-193093, -171937, -191446, -232099, -254312, -239483, -196031, -148493, -126716, -141402, -166890, -173381, -172245, -193115, -220796, -207428, -155631, -129194, -155519, -176662, -139195, -80932, -72572, -110661, -131928, -114219, -100178, -121443, -150636, -140361, -80256, -9076, 14765, -36360, -122920, -169961, -151413, -115669, -108442, -112289, -98794, -94482, -136670, -197381, -218197, -198670, -180365, -160097, -98468, -11635, 28734, 1529, -33519, -34121, -33188, -68259, -118824, -151875, -173363, -194924, -200603, -186480, -183376, -196823, -173896, -81922, 21457, 53419, 8813, -56394, -112528, -164805, -198115, -183507, -136365, -107093, -109038, -107707, -87382, -76368, -91605, -105433, -92156, -73179, -87522, -136611, -182083, -191875, -176223, -179337, -233721, -317198, -365890, -343656, -285084, -248583]
37602b48583N711J0069K6032J3924r371M90L6539M6134J0935k8134l3632j8757
37590a88643j5731k7256l1484j9313n515m944j0814l062K2692M2206K8964q140
37578b21040k9261j2410J7583K1775k517k1033q502K0553L0811O973l1312n4266
37566b82646n3933m3088k7468L89L3270M1925J6796o898J675J5536r913n6724
37554c71079o0833j0322L2896K5666q73n701j051j1798k2812j6372j8566n1117
37542e11962p2565l3097L5030N0839j759n9696p6507o5656m4201l889M1715M6664
37530f95084L485k7293K482N9086P7456M8938J8213J7141M1272P5319J04697J11570
37518a62718R0902O3570M9154L7161J0866j4384r720J8009L0476J2566q553n858
$$ y = [-248583, -242872, -232803, -206771, -192847, -202218, -201728, -165189, -119055, -108120, -136254, -169886, -188643, -204374, -231630, -263114, -282427, -287942, -292886, -303700, -306762, -284070, -241864, -212900, -221040, -250301, -262711, -245128, -223353, -225870, -246903, -255405, -234852, -204041, -197068, -228380, -282646, -336579, -379667, -407135, -406746, -373476, -331551, -314755, -321653, -319978, -304442, -314355, -371079, -431912, -442234, -409338, -383672, -384545, -390246, -391297, -403095, -425907, -442279, -460845, -511962, -584527, -617624, -582594, -531755, -533514, -593210, -669717, -735373, -779574, -783463, -741748, -695084, -691599, -718892, -716410, -657324, -579868, -530930, -512717, -495576, -454304, -378985, -274288, -162718, -71816, -8246, 40908, 78069, 88935, 74551, 64831, 82840, 113316, 125882, 117329, 111471]
37506A11471J3135K5888K8002L2109M4603N5555M9137K1765p662j1177J6204M5310
37494D24340M7112L0892K9803N3009P5030P4389O0170N3328O1108P7961R3533
37483A080675R0510N3375p815n8120p5561p4041p5612p6952o2235l5233j5559
37472G43432j0720j3985k4138m4022o1848n8252l5005j5882j4555k0764k2618
37461D21643k2356k2845j8084p227p80k327j002O819O508r545k3650j9347j0952
37448B96855k2384m5962m8966k0007J4781K5114P478k0494l8174k9580Q126N1915
37436A78702O1583J6991n4567r6761p3231Q3O7951Q2148M0710j5325m2879l1345
37424A34060J253L2820M8663L9571N951l5897o2938o2642l6868M371M2940N4332
$$ y = [111471, 124606, 150494, 178496, 210605, 255208, 310763, 359900, 381665, 374003, 362826, 379030, 424340, 471452, 502344, 532147, 585156, 660186, 734575, 794745, 848073, 909181, 987142, 1080675, 1171185, 1224560, 1216745, 1158625, 1083064, 1009023, 933411, 856459, 794224, 758991, 743432, 732712, 718727, 694589, 650567, 588719, 530467, 495462, 479580, 465025, 444261, 421643, 399287, 376442, 358358, 351131, 350351, 348024, 347022, 353841, 360349, 350804, 327154, 307807, 296855, 274471, 228509, 179543, 159536, 174317, 199431, 206909, 186415, 148241, 118661, 126787, 178702, 240285, 257276, 202709, 105948, 32717, 32800, 100751, 182899, 223609, 208284, 165405, 134060, 135313, 168133, 216796, 256367, 262318, 226421, 163483, 100841, 63973, 68344, 111284, 165616]
37412A65616K7200j7770m2466k9023N030L0105L4633K9267K5850J6453j8920p4785
37400A51190j01678n4783L5527P9784L6781l1245m2812j093L1947L3124K6625
37389A63367J4229k6658p3413o5316j614L9990J5431k3450k0760k980j5717l5329
37377c2220j8390P494j1094m6603k3276N1024Q0739K5344m0016l8365Q244L4469
37365b650K7426J5225N172j1688k3496j5469n750j9029l9908l5275j1481n259
37353a22182k2033k6854k193K3701K0137k773j0867J2590N5583R3512J04833Q1233
37341B04687L4264j1142l4187k8095J413L6305M9354K5061j8774m4781l6141j0620
37329A67344P127J0121J813j3870k3928j0299J8914K3805j4581n3422l6906K2526
$$ y = [165616, 192816, 175046, 132580, 103557, 108587, 138692, 173325, 202592, 228442, 244895, 225975, 151190, 49512, -5271, 30256, 110040, 146821, 115576, 72764, 71671, 103618, 136742, 163367, 177596, 150938, 77525, 12209, 10595, 50585, 66016, 42566, 21806, 18826, 3109, -32220, -50610, -43116, -54210, -100813, -124089, -73065, 7674, 33018, -6998, -45363, -37119, -2650, 24776, 40001, 45173, 33485, 9989, -5480, -11230, -30259, -70167, -105442, -116923, -122182, -144215, -171069, -173262, -149561, -129424, -132197, -143064, -130474, -74891, 18621, 123454, 204687, 238951, 227809, 193622, 165527, 166940, 203245, 252599, 277660, 258886, 214105, 177964, 167344, 174471, 184592, 186405, 172535, 148607, 138308, 157222, 181027, 166446, 113024, 76118, 98644]
37317I8644N5208L0456m922k692J7645J1672j3079j2355J9257L9008K2741k567
37305B59016k991J9175L8535L7899J8293j555M617L6057M6442l512p7842r7911
37293B76223m9691k805l963j3655J2803M1694J8371l6217n6651l3000q120O336
37281A51325L4124O0830L8367k4583n4362k0804J7118R180j0937K308K0646m579
37269B18633m6944m0371J0103L0329q333m6209k7582J9830L1145n991m4760m4813
37257D5037j2774J9061L0869K5926J4895J380j2571j4293Q133L6792K9083k6095
37245A45443p4542n2949K5873Q1542O6036J6546q843r292k0869m6409n2778k9409
37233D0349l723P023J8428L9898M9322K8822l304k1866l1614m6263n2021k6614
$$ y = [98644, 153852, 184308, 179386, 176694, 194339, 206011, 192932, 180577, 199834, 238842, 261583, 259016, 256025, 275200, 313735, 351634, 369927, 368372, 372989, 409046, 455488, 451976, 374134, 276223, 226532, 223727, 219764, 206109, 218912, 260606, 278977, 242760, 186109, 153109, 144989, 151325, 185449, 246279, 284646, 260063, 205701, 184897, 202015, 211195, 200258, 202566, 223212, 218633, 171689, 131318, 141421, 171750, 163417, 117208, 89626, 109456, 140601, 134610, 89850, 45037, 32263, 51324, 82193, 108119, 123014, 124394, 111823, 97530, 105663, 142455, 171538, 145443, 70901, 17952, 43825, 125367, 191403, 207949, 199106, 189814, 168945, 122536, 69758, 40349, 36626, 43649, 62077, 101975, 151297, 180119, 176815, 154949, 123335, 77072, 25051, -1563]
37221a563J8888N1949O2606O1324M3802M53m4002m9230k2264j1673k7521k2345
37209F0424K4092N7830L0471k0819k6856J1504L1795L108m2602o4701n3263j8642
37197g659J8423L0986J4427J418J6286L3856K2881L860J0117J7664j5878o0004
37185H6377m3959K0583M2436n635m1352q503L4419K0247j4472j666L6949L0836
37173A56260j7708m4056l1748k4592l4548k1002K7620O3708N3465K3714J1384
37162A62497J0995k148k8698m6942l7658J794M9125O3801K7595k4175m0492j8982
37150A16712L41l78L1J3691K3434J9150J2836O759j1708l1404j9858J6079K0950
37137A66635k6166o4888l5024L0288M8605O195k8178q126K8919K6190j0281k9863
$$ y = [-1563, 17325, 69274, 131880, 193204, 237006, 237459, 193457, 144227, 121963, 110290, 82769, 60424, 84516, 142346, 172817, 151998, 125142, 136646, 168441, 171549, 128947, 64246, 10983, -7659, 10764, 41750, 56177, 57595, 73881, 107737, 130618, 134478, 144595, 162259, 146381, 86377, 42418, 63001, 105437, 99802, 58450, 49947, 84366, 104613, 90141, 88475, 125424, 156260, 138552, 94496, 62748, 38156, 3608, -17394, 10226, 73934, 127399, 151113, 162497, 173492, 171344, 142646, 95704, 58046, 59840, 108965, 172766, 200361, 176186, 135694, 116712, 117053, 116675, 116706, 130397, 153831, 172981, 185817, 192576, 180868, 149464, 129606, 145685, 166635, 140469, 75581, 40557, 70845, 119450, 125645, 97467, 89341, 118260, 144450, 134169, 104306]
37125A04306j4226M819J986m620R084K5174N875m3276o9528m3694j597R750j205
37112a7152M520K4893K1648n595o528L9431P9846O1425Q128j6707j394J0224n099
37099A97640k1983j9694j5895k7584l5872j8084J1143K3006K1248K9821M2628
37088A86374K7781j1280k1732K5225P9029O8013k006n2270l4347J5815M0533L3407
37076C54542K0972Q256j3442k6654o940K3528J3914l5006n9138k3891J6934l557
37064B69518o3183p9471l1902M160l5852j13821j44189j13620r4447j39626k11641
37053g54074k36067j92021j20854o9190n7401q5522j25467j14230r177J35537
37043a628466J98396J27799J1532k8474K2245Q0552Q9970P3156O6023O4157N3401
$$ y = [104306, 90080, 94899, 96885, 92265, 101349, 126523, 132398, 89122, 19594, -24100, -25697, -15947, -17152, -12632, 12261, 33909, 28314, 21786, 61217, 141063, 202488, 210616, 193909, 192515, 202739, 197640, 175657, 155963, 140068, 112484, 76612, 58528, 69671, 92677, 113925, 143746, 186374, 214155, 202875, 181143, 206368, 285397, 353410, 351404, 299134, 264787, 280602, 321135, 354542, 375514, 383770, 370328, 343674, 336734, 360262, 374176, 339170, 280032, 256141, 273075, 269518, 206335, 126864, 94962, 99122, 63270, -50551, -194740, -308360, -402807, -542433, -754074, -990141, -1182162, -1303016, -1372206, -1429607, -1515129, -1640596, -1754826, -1764003, -1628466, -1430070, -1302271, -1290739, -1319213, -1296968, -1216416, -1126446, -1053290, -987267, -923110, -869709]
37032h69709M3135M0383K8531L563L96M5015J00373J02487M5619p491p089K5203
37020d49584L5979J2170j3221j5279n304n93N412K4305M3037L9396J8619O137
37008b98926N773l082k1259j8504J6172M6108L6697P141p49J4739K1477R219j408
36995a86602q20j691o064K177K4034L5595K1981l427k1190k5313j6540M34R418
36982a68008m000k8260l7382k6721j2653k02J7772L2101K6114J3861K6287N3112
36970a07979M7343K515k6979q923J4877j287l1463k4224J0174J9109m282j4352
36958a25471P039K1411j082l3414l4168q610J772k1126m7701l9717p22K5623J0483
36945b45683k0846k1861J1701L9352L6318K1055J3291N071n566N006L7352M1936
$$ y = [-869709, -826574, -786191, -757660, -754097, -753701, -708686, -608313, -505826, -460207, -467698, -474787, -449584, -413605, -401435, -414656, -429935, -435239, -435832, -430420, -406115, -363078, -323682, -305063, -298926, -293153, -296235, -317494, -335998, -319826, -273718, -237021, -229880, -230629, -215890, -194413, -185194, -186602, -187422, -189113, -195177, -193000, -168966, -133371, -111390, -114817, -136007, -161320, -177860, -177426, -168008, -172008, -200268, -237650, -264371, -277024, -277226, -259454, -227353, -201239, -187378, -161091, -107979, -60636, -58121, -85100, -94023, -79146, -80433, -111896, -136120, -125946, -106837, -111119, -125471, -118432, -97021, -98103, -131517, -165685, -174295, -172523, -193649, -241350, -281067, -281789, -256166, -245683, -266529, -288390, -276689, -237337, -201019, -179964, -166673, -161602, -167168, -162162, -124810, -82874]
36933h2874r490n9115l3595M0472O5765J6849k6379p304K4959P414l0103j8934
36921a12335L0372M3535J103l5844k5718k610p778k3695j4808J0004K0639J9811
36909i7324K6480K8899N755k0972j0942K1686K1016j8439l6061k156L2754K1291
36897b8013p604r169m105l3742p1758n6542O064M6363L3398O012j570q98o614
36884a28178j1133j3562k1493j7678J8900N5845L7944j7028k9282J8218M9445
36873e8002K1552p223J2946L2897l703n2541m2259O23o87l8336l6557J3190L7156
36860a20944N226k1841M149M4698M0242m753l9001l2084K862L1597K7291p025
36848f9583l8755m1258k2204j863J7135L4173L0706J201k0846r361O847r171l4318
$$ y = [-82874, -92364, -151479, -185074, -144602, -78837, -61988, -88367, -95671, -70712, -63298, -93401, -112335, -81963, -38428, -37325, -73169, -98887, -101497, -109275, -132970, -147778, -137774, -117135, -97324, -70844, -41945, -36190, -57162, -68104, -46418, -25402, -43841, -79902, -82058, -49304, -28013, -35617, -44786, -48891, -82633, -154391, -210933, -204869, -158506, -125108, -119096, -120666, -121564, -128178, -139311, -152873, -174366, -192044, -173144, -117299, -79355, -96383, -125665, -107447, -58002, -36450, -43673, -30727, 2170, -1533, -54074, -96333, -95710, -96397, -134733, -171290, -158100, -120944, -115718, -137559, -133410, -88712, -48470, -53223, -92224, -124308, -121446, -89849, -62558, -69583, -108338, -149596, -171800, -173663, -156528, -122355, -91649, -90448, -111294, -120655, -113808, -122979, -157297]
36835a57297k2011J4901K5004Q924J5716N0691O1545K6793j0966j7058p974n242
36823a6974m480p339k6190m0863j2575L8839L7782l6623j05351r3475k5035K7033
36811b65251L6780K6432J2526k549j1879j2740j2961r211J0967L3338K7199O003
36799a61346K2540Q0491J12930Q3335M2678L9132L7340p875n5421l6092L1272
36788A88984O4471L7746o08j8358l1622m7403m3285j6378K371l586j5353j3503
36776A03476O86J8718K6471J034n5241q9822n6279J3408M4887K4262P086K4179
36764F2865M3346L9096L5227M8386M7582J2199j6470O750N2398N1070o617n6380
36752C19452m8783q703P310j7265m9766n4798l0684l188N237k647n812O121J6364
$$ y = [-157297, -179308, -164407, -139403, -130479, -114763, -64072, -2527, 24266, 13300, -3758, -11732, -16974, -21454, -28793, -54983, -95846, -108421, -69582, -31800, -68423, -173774, -267249, -292284, -265251, -228471, -202039, -189513, -192062, -203941, -216681, -229642, -238853, -227886, -194548, -167349, -161346, -138806, -58315, 54615, 137950, 180628, 219760, 257100, 249225, 193804, 157712, 188984, 253455, 291201, 290593, 272235, 240613, 193210, 149925, 133547, 135918, 132332, 116979, 103476, 104162, 122880, 149351, 150385, 95144, 5322, -50957, -37549, 7338, 31600, 38686, 62865, 106211, 145307, 180534, 228920, 276502, 288701, 272231, 278981, 331379, 382449, 375832, 319452, 270669, 261966, 269276, 252011, 202245, 147447, 116763, 113575, 118812, 116165, 110353, 116474, 132838]
36739A32838M061j8849j6080J6790L1050q916n7846m0260L1097N3447j9625r5656
36727A2051o7670K9306O9306J5624m4925m5076j5673j35J5011M2003M6736J4983
36715G1541o871P466J1590k4467m4553k832L8470M046n7658m5569K3211L9106
36703A3480j6120m2895L121L9845O068l4156m972N2459M9674r796m6401k6520
36691a6213Q709K1379J8211J5940J6013J7669K0491J2785j3708l9286l3827Q48
36679B9011K9688K7692N564j0625r576P99Q182P611J065q835j9803k5302j7923
36666A7548j947P578N749N115J2126J3369J719k906J6107L7793L0677J729j6453
36653A28204j8472k7299m5597m6825k0678Q942K0378J7776J0818N49p289k706
$$ y = [132838, 136899, 118050, 101970, 118760, 149810, 140894, 83048, 42788, 73885, 127332, 107707, 12051, -55619, -26313, 42993, 58617, 13692, -31384, -47057, -47192, -32181, 9822, 56558, 71541, 64670, 72136, 83726, 59259, 14706, 11874, 50344, 54390, -3268, -48837, -25626, 13480, -2640, -45535, -42414, -2569, 3499, -30657, -35629, 16830, 66504, 56708, 10307, -16213, -7504, 13875, 32086, 48026, 64039, 81708, 102199, 114984, 101276, 61990, 28163, 29011, 58699, 86391, 91955, 81330, 71754, 72553, 80735, 88346, 89411, 80576, 60773, 35471, 17548, 15601, 23179, 28928, 34043, 46169, 59538, 61257, 58351, 74458, 112251, 142928, 144657, 128204, 109732, 82433, 36836, -9989, -30667, -21725, -1347, 16429, 27247, 27796, 20507, 17801]
36641A7801Q690J1700Q247R857P061j7266m5315l8031L021L1606K4603Q777N357
36628C6108m159l1915m6299j4668M5540Q8507R2105O6868L4886J8586L0348N8874
36616C74781Q4300J09286J44988J67013J32786N5126P041K7577O9871P4288M8164
36605A295221L2791K9769Q504l5760p3895q0018m8140J0636O3728P2393L5925
36594A311154j349o036R318K2756L4635M0232J7336k5561l5552Q640N1842M1236
36582A468651O294N090L1701M0373K7545K0774J2684k2503o6928q6355j02410
36571A334916j59455k28952k30977j55262p9032n0994l8033j0621q87l3711o5976
36560B81016m7317K698K6212N973k6303l7565j9906J0089J8113j8029p0326q1442
$$ y = [17801, 26491, 38191, 46438, 56295, 63356, 46090, 775, -37256, -34235, -2629, 21974, 30751, 36108, 31949, 34, -46265, -60933, -15393, 73114, 165219, 232087, 266973, 285559, 315907, 374781, 459081, 568367, 713355, 880368, 1013154, 1068280, 1075321, 1102898, 1172769, 1247057, 1295221, 1328012, 1357781, 1366285, 1330525, 1256630, 1176612, 1128472, 1139108, 1202836, 1275229, 1311154, 1309805, 1303769, 1313087, 1335843, 1370478, 1410710, 1428046, 1402485, 1366933, 1375573, 1427415, 1468651, 1474945, 1480035, 1511736, 1552109, 1579654, 1600428, 1613112, 1590609, 1523681, 1437326, 1334916, 1175461, 946509, 715532, 560270, 481238, 430244, 392211, 381590, 380703, 346992, 281016, 233699, 236397, 262609, 268582, 242279, 204714, 184808, 194897, 213010, 194981, 124655, 43213]
36548D3213l8482P892J4922P8j142R047R005q4m936q631j5688j0264J7645M1494
36534F4069K7414j5690m4029l1798N068L2549K9966M975j1637L864L5887M3523
36522A44161J3515k2638l4023k6396j7910p099J1928K5015J4636j3289l8432m7428
36510B040l3399L979M3141N1577L0063J6841K7231K5596j1534m2878k0002L1087
36498A23742M1702J71l5652k3233J7390M5003M1046O072m4995p4362m8275J3526
36486F2135M9044K8089j5027l2836j6693J3600L8031L9224R660k6613l0315j818
36474A16481J3161q051k9175j6043M867q378l8692l3851P535K8038m949n2116
36462b1173n5283q172M2968N2513J8055k0461k2125P145J8406j4292n0708l7493
$$ y = [43213, 4731, 12623, 27545, 27623, 26481, 35528, 44533, 44449, 39513, 30882, 15194, 4930, 22575, 64069, 91483, 75793, 31764, -34, 5034, 37583, 67549, 72524, 60887, 64751, 100638, 144161, 157676, 135038, 101015, 74619, 56709, 49610, 61538, 86553, 101189, 87900, 49468, 2040, -31359, -27380, 15761, 67338, 97401, 114242, 141473, 167069, 155535, 112657, 92655, 123742, 165444, 165615, 129963, 106730, 124120, 169123, 210169, 216241, 171246, 96884, 48609, 62135, 111179, 139268, 124241, 91405, 74712, 88312, 126343, 165567, 175227, 148614, 118299, 116481, 129642, 121591, 92416, 76373, 81240, 72862, 34170, 319, 7854, 35892, 30943, -21173, -76456, -84628, -41660, 10853, 28908, 8447, -13678, -6533, 11873, -2419, -53127, -90620]
36450i0620J1753L4573J3558j579K1602M6196K9420o645j1448J6315L3523J8760
36438A15408r223l0223m0794l8207k1256m904l241k562J6790L9574L5115J2619
36426F9096J1524L3820L5946J790k6414j6015K346j4152n0095n5602k0607J4729
36414a3634J4812j6951n0742n3347j0378N0733P3746L5016k2421m2206k4616j0949
36402g0937j5299j4255K027J2085O78k1631m0633m7735k6472L1274Q9613R1933
36390i352L6276j1013J319M7369P1996O7423O4557P0380N8016J5529l1476n1803
36378C29221l9426p894K5037M0685K5272j5932n8185p7875o9208l9778n84L3058
36366A44391M1316J6611j8823k7855r40K7387J9715j4591l2808j8106N020J9882
$$ y = [-90620, -78867, -44294, -30736, -32315, -10713, 35483, 64903, 58258, 46810, 63125, 96648, 115408, 106185, 75962, 35168, -3039, -24295, -29199, -32440, -35002, -18212, 21362, 56477, 69096, 80620, 114440, 150386, 152176, 125762, 109747, 112093, 97941, 47846, -7756, -28363, -13634, 1178, -15773, -66515, -119862, -130240, -79507, -5761, 29255, 6834, -35372, -59988, -70937, -86236, -100491, -98464, -86379, -85701, -107332, -147965, -195700, -222172, -190898, -101285, -9352, 26924, 15911, 17230, 64599, 136595, 204018, 268575, 338955, 396971, 412500, 381024, 329221, 289795, 281901, 306938, 347623, 372895, 356963, 298778, 220903, 151695, 111917, 111333, 144391, 185707, 202318, 183495, 155640, 154700, 182087, 201802, 187211, 154403, 136297, 141317, 161199]
36354A61199M3089P7888Q1189K1611n4521p1095k8150j068k7776n8082l9833J205
36342A05656J0362r320j2769R192K2924J4699P838J1848J643l3712n8392l5384
36330C4585J5813L8790J3330j9022j1845K4112L8170J2957r574J0306M9027N2898
36318B49547J8582m110O173P159l4721p8825o1945O686N1682L0512j6925k8263
36306A45552M083L3617K0370k5285n5400l6199J3185M1472K7216J078n125m081
36294A60483j9791l5105j7352J7956K2687n863j9241K03J1559p971k0794k682
36282H4089R69m7640r2980n5758L7182P7406K7691l1408k3884K8206O4119O9200
36270A37192N5845J7173m3744p9389n3202l820K883l2268n1882l3177j0211p515
$$ y = [161199, 204288, 282176, 363365, 384976, 330455, 259360, 231210, 230142, 202366, 144284, 104451, 105656, 116018, 106698, 93929, 103121, 126045, 140744, 148582, 160430, 162073, 128361, 69969, 34585, 50398, 89188, 102518, 83496, 71651, 95763, 133933, 146890, 137316, 147622, 196649, 249547, 268129, 264019, 270192, 277351, 242630, 163805, 101860, 108546, 160228, 190740, 173815, 145552, 149635, 183252, 203622, 178337, 122937, 86738, 99923, 141395, 168611, 169689, 164564, 160483, 140692, 105587, 88235, 106191, 128878, 123015, 103774, 103977, 115536, 107565, 86771, 84089, 85058, 37418, -55562, -111320, -74138, 3268, 30959, -449, -24333, 3873, 67992, 137192, 193037, 210210, 166466, 87077, 33875, 30055, 32938, 670, -51212, -84389, -94600, -102115]
36258a02115q350L316J8418K9661L8103K6913k0672o6620l9762O0894J38115J11669
36246A89570K0608l3101j1259L6125N0303K0859k5961n5390m3760L4L5843L5478
36234B19349J3874q96q417k1712l4426l3997k8462k7117j4297K0417M6600L2369
36222A63285K796P771M1299M8373J1429k6819l4442k7740k1666R30M1442N5756
36210B62414J3487m5475n6657j5965J9774J1376j6644j6045J8978M2593J7362
36199B35198k8482k7782L4889R1111P4804J1506k3214j3998j3936m5826o3548
36188B30722l2971Q200Q425k3119m0256k7141k495K1643M6242O0709M5641K158
36176B97758l9875m7453j6628J7481J1037l4516o3252l4624J5764K5346j639o232
$$ y = [-102115, -110465, -107149, -88731, -59070, -20967, 5946, -14726, -81346, -121108, -60214, 77901, 189570, 210178, 177077, 165818, 201943, 252246, 273105, 247144, 191754, 147994, 148028, 183871, 219349, 233223, 232327, 223910, 202198, 167772, 133775, 105313, 78196, 63899, 84316, 130916, 163285, 166081, 173852, 215151, 263524, 274953, 248134, 213692, 185952, 164286, 165216, 206658, 262414, 275901, 230426, 173769, 157804, 177578, 188954, 172310, 156265, 175243, 217836, 235198, 206716, 178934, 213823, 304934, 379738, 391244, 368030, 354032, 340096, 294270, 230722, 197751, 205951, 214376, 191257, 151001, 123860, 121365, 143008, 189250, 249959, 295600, 297758, 257883, 210430, 193802, 211283, 222320, 187804, 124552, 89928, 105692, 131038, 129399, 123167]
36164A23167K4989M0411J5543o837L975J4944l846k1803m672K4179K9266K1998
36152B61314K3493J5840j4267k9554k007K3816l575n0447m6929O96K7292J8204
36140B23876J5345K2805k537n5355o3364M257P8260P9378J9212k7042j6177K7901
36128C06559N5914M5633J7342L410L434j2068m4248m8975p258K8223O765l6738
36116C17993l5921n60P644j2821n432L2813L7744o753l2169J819M0592K5818j8031
36103C52736l9479m0706m6681m4194r823L7315O1598O0854N0337K8975j487j8532
36091C90913j6470k4009m7640m2188J6290P3005O5687J5531j2309m899O088J6760
36079D36759M1732N3803J3756m6304n0648L052L4348N077k6059q580J4871j4923
$$ y = [123167, 148156, 188567, 204110, 197273, 201248, 216192, 212346, 190543, 185871, 210050, 239316, 261314, 284807, 300647, 286380, 256826, 254819, 278635, 275060, 224613, 177684, 178380, 205672, 223876, 239221, 262026, 259489, 204134, 140770, 145027, 223287, 302665, 321877, 294835, 278658, 306559, 362473, 408106, 425448, 428858, 432292, 420224, 375976, 327001, 319743, 347966, 354731, 317993, 282072, 281512, 289156, 276335, 270903, 303716, 341460, 334707, 302538, 304357, 344949, 370767, 352736, 313257, 272551, 225870, 181676, 171853, 209168, 270766, 331620, 381957, 410932, 409445, 390913, 374443, 350434, 302794, 260606, 276896, 349901, 415588, 431119, 418810, 413911, 419999, 436759, 478491, 532294, 546050, 499746, 449098, 452150, 486498, 491575, 465516, 456936, 471807, 456884]
36067D56884o8247o7776o892M2328L3319k917j8903j2867p051j693J6000L6632
36055C98817L6950J8725R081J7068J7596o699l0634j8982J8563L4791P097l5237
36043D67136n2337l7953j2020P693J0649r239l9590m6316q938M5763O6658L5357
36031D26863j5224l9878k4948P987K8680K2684k636k8744m0832l2610k377M3282
36019C42247P9363P3147K0890l5310m7775j9762r85k0705m8005l7246M567K7551
36007C37977J2493m180O417J6203j1121n1190n0282j2295O118r395p688L2792
35995B65849N4238J1576m4913m4579r253j2008n0492n1339K388L9143J5018j9428
35983A56200p664K3870J7437k1888m0067j6554J6904K8896K0185N287r124k3124
$$ y = [456884, 388637, 320861, 313969, 356297, 389616, 386699, 367796, 354929, 347878, 346185, 362185, 398817, 435767, 454492, 463573, 480641, 498237, 491538, 460904, 441922, 460485, 495276, 502373, 467136, 414799, 376846, 364826, 372519, 383168, 373929, 334339, 288023, 279085, 324848, 391506, 426863, 411639, 371761, 346813, 354800, 383480, 406164, 403528, 374784, 333952, 301342, 298965, 342247, 421610, 494757, 515647, 480337, 432562, 412800, 411815, 391110, 343105, 305859, 310426, 337977, 350470, 346290, 352707, 368910, 357789, 306599, 256317, 244022, 250140, 240745, 233057, 265849, 320087, 331663, 286750, 242171, 232918, 220910, 170418, 119079, 121467, 160610, 175628, 156200, 148536, 172406, 189843, 167955, 127888, 111334, 128238, 157134, 177319, 182606, 173482, 150358]
35971A50358l4286l2688p261L3810N5705L1082j9903m6705k6427J6109M2705L3563
35959A96062n862m1848l0474K6060O0426K4508l0035k0360L7120N0272J664k5946
35947B41587N815K8694m079l2566l453K6119r827n7935k8067M9426O4849l88n6672
35934B23503n0213j9309k929Q298J3391j5853o5311p1460j8415K7083J6167r387
35922C5565P848M5180L7664j7707n4386k8716K4856M3115J3045j9106j2957J3453
35910H7854J3505j8524m1752l4223k0429j6017N492N3873P7416L2165l8794n8549
35898D2017k3910P458J6936L3470N0490K2484m1247o3909j4710L7962K9268j0079
35886H6230j6534N107O305j4786j4868J5773L6402K1015p147j7940j5096j7392
$$ y = [150358, 116072, 83384, 76123, 109933, 165638, 196720, 176817, 130112, 103685, 119794, 162499, 196062, 190200, 148352, 117878, 143938, 204364, 228872, 198837, 178477, 215597, 265869, 267533, 241587, 247402, 276096, 272017, 239451, 235998, 262117, 252290, 194355, 166288, 215714, 280563, 280175, 223503, 173290, 153981, 151052, 159350, 172741, 156888, 91577, 20117, 1702, 28785, 44952, 35565, 43413, 88593, 126257, 108550, 54164, 25448, 50304, 93419, 106464, 87358, 74401, 87854, 101359, 82835, 41083, 6860, -13569, -29586, -24094, 29779, 107195, 139360, 100566, 42017, 18107, 25565, 42501, 75971, 126461, 148945, 107698, 43789, 29079, 67041, 96309, 86230, 69696, 74803, 81108, 66322, 51454, 67227, 103629, 124644, 117497, 99557, 84461, 67069]
35874F7069k4319k1688q343L619J1386K3853L7238K9470m650l1030j7644J2781
35862G7742J1122j8659j9070K7129N8887K7720k6008m0409l0681n0362q3771o2369
35850a28729J4911O2949L4739p752J2542P5730R6822M1731l4850o1004k4726K5349
35838A07712L9932J8983J35O176K2925L0657K8903J6938j6538n9483o7490k4386
35826A04464K0493J7322j3670k4418j7375k1554k1855J3178N3524M0161j2127
35815A38143k9281K197J7343j1846l2279r412J3573j892k2120n475K6769L4554
35803A20274K2707J2601l220l0657m0238j1033K6802L5674K3020J2361q20k3330
35791A44141l1315q520J3959J920k4908k5686n127o33j8311k6081n015K6380L7743
$$ y = [67069, 42750, 21062, 12719, 16338, 27724, 51577, 88815, 118285, 113635, 82605, 64961, 77742, 88864, 70205, 51135, 78264, 137151, 164871, 138863, 98454, 67773, 17411, -66360, -128729, -113818, -50869, -16130, -23882, -11340, 64390, 161212, 202943, 168093, 107089, 82363, 107712, 147644, 166627, 166762, 172938, 195863, 226520, 255423, 272361, 255823, 196340, 128850, 104464, 124957, 142279, 128609, 104191, 86816, 65262, 43407, 56585, 110109, 150270, 138143, 108862, 111059, 128402, 116556, 84277, 74865, 88438, 86546, 64426, 58951, 85720, 120274, 142981, 155582, 152362, 121705, 81467, 70434, 97236, 132910, 155930, 168291, 167471, 144141, 112826, 104306, 118265, 120185, 95277, 69591, 64464, 63831, 45520, 19439, 14424, 40804, 78547]
35778G8547J7163j7649k9554m68L6181L1098p492j8866J7713M7188K4725j3869
35766A64717j2795J3838Q042l9660p7475o4678j5626K7552L7843J9477k056q183
35754E0996p417j3825j3604J3514M4050L1042j8197l9620o209L2179K9919J0257
35742A13085J2349K5569K0438K281q793j4557j8565p884J1846P152k3554l1108
35730H8259N123L4136J5582j1549K440L5428M1868L2415L6817L4702j657l6164
35718B77400j9225K3596L1681R410O761K5028K4281P311J4434M4624N7689M6935
35706E49925M0069M0719L8754N8747J19339J64381J24933L7348K363L1399L9001
35695A246978m272k5960J1292L7887l656o1912o5813l4900k7314l6421j6405K8100
$$ y = [78547, 95710, 78061, 48507, 48039, 84220, 115318, 107826, 88960, 106673, 153861, 178586, 164717, 151922, 165760, 173802, 134142, 56667, -8011, -23637, 3915, 41758, 61235, 59179, 50996, 43579, 29754, 16150, 29664, 73714, 104756, 86559, 46939, 40730, 72909, 102828, 113085, 125434, 151003, 171441, 173722, 164929, 150372, 131807, 123923, 135769, 142921, 119367, 88259, 93382, 127518, 143100, 131551, 133991, 169419, 211287, 243702, 280519, 315221, 313564, 277400, 258175, 281771, 313452, 322862, 329623, 354651, 378932, 386243, 400677, 445301, 502990, 549925, 589994, 630713, 669467, 728214, 847553, 1011934, 1136867, 1174215, 1176578, 1207977, 1246978, 1242706, 1216746, 1228038, 1265925, 1262269, 1200357, 1134544, 1099644, 1072330, 1035909, 1019504, 1047604]
35683A047604N2496N0392N3854O4018M2863j7738o6775n5312M55M0838L5400R716
35671A257811k693p185k2458l0030L216N5167O1631J6404q988J7125K1737n4680
35659A307057j40093j24387l0890J0481n1852j34880j54879j22788q6112n9094
35649D12563m0784l7230l8389k3913m175l973o724K0769N1934K8080l4216n2337
35637B71605q626K1920M18j8508M19K162n4487j08988r1095l1147K19L950K2070
35624I912M3358K8046l066Q567N7704P4024K6896l1194m0217o721J6068k315l5508
35611A45554l3117J2623M5404J4315m7587o0364j0808L1832K5888J2052K6996
35600A62788L5211j61m1045l4555o93R218J149J1689K5944L471l3014j9861L8808
$$ y = [1047604, 1100100, 1150492, 1204346, 1268364, 1311227, 1293489, 1226714, 1171402, 1171857, 1212695, 1248095, 1257811, 1255118, 1247933, 1225475, 1195445, 1198661, 1253828, 1315459, 1331863, 1322875, 1340000, 1361737, 1307057, 1166964, 1042577, 1011687, 1022168, 970316, 835436, 680557, 557769, 471657, 412563, 371779, 334549, 296160, 272247, 268072, 264099, 257375, 278144, 330078, 358158, 323942, 271605, 262979, 284899, 285317, 266809, 267228, 269390, 214903, 105915, 14820, -16327, -16108, -12158, 9912, 53270, 81316, 78250, 86817, 144521, 218545, 245441, 214247, 174030, 167309, 183377, 181062, 145554, 112437, 125060, 170464, 184779, 137192, 76828, 66020, 97852, 123740, 135792, 162788, 197999, 197838, 156793, 122238, 121545, 130763, 131912, 143601, 169545, 173016, 140002, 120141, 158949]
35587A58949O5323K3753l1263m2942k5047j4593p299J6096L6874J9534l0277o7306
35575A01802o0928k1710K0254L9179K0668k6690o2592m5677J2976N0514K8190
35564E5986j4463j3971K5015M0113J1478q279J5350L9253J6375k3658k6499n275
35552A11425j0995l7927l5408j469J4268J112K975L3159M8366K7198M663L586
35540A60953k167k6782l8092j8084Q99l404l249J9587L0663N661j5947O119M0559
35527A56716L5205O646J4108O0338Q1532L9724k3102l9094M441N4158N1696m246
35515D38122o0199o9490l7181K382K8210L2715P715l4917n3429k8115O88q712
35503B17789l1703k2996K101N46j3878Q02K6557J5887j0144N086L9164K2209k5983
$$ y = [158949, 224272, 248025, 216762, 173820, 148773, 134180, 126881, 142977, 179851, 199385, 169108, 101802, 40874, 19164, 39418, 78597, 99265, 72575, 9983, -35694, -22718, 27796, 55986, 41523, 27552, 52567, 92680, 104158, 95879, 111229, 150482, 166857, 143199, 116700, 111425, 100430, 62503, 27095, 25626, 39894, 41006, 43981, 77140, 125506, 152704, 157367, 160953, 158786, 132004, 93912, 75828, 76727, 73323, 70074, 89661, 120324, 125985, 110038, 116157, 156716, 191921, 198567, 212675, 273013, 354545, 394269, 371167, 332073, 336514, 390672, 442368, 438122, 377923, 308433, 271252, 273634, 301844, 334559, 342274, 307357, 253928, 225813, 226501, 217789, 186086, 163090, 165191, 165737, 151859, 152661, 179218, 195105, 184961, 190047, 229211, 251420, 225437]
35490B25437j7913L8464L8692l2879o3166n16O0219M6018J9816M7813Q3139P0998
35478E16122M9034N0059K2716n2432q6353k9967J7629l0146r2504o2556N015J246
35466C07863l6672k671P2220O9614n947m0613r793K378k9349m0949j6328r282
35454B60471k2330l44M5215L7187k6799n8674k4965P295p969l4820l8789l5012
35442A00466l1789j2647J1431J1694N624L0191N9623L9401r363j7669R667N014
35430B01643l5775m7657j6267P208J3432M3433Q2307O1876j2476n1106k0806J0884
35418B36696j844k0167j0002L435J917N913J3677o280m2161m3252j0485M944k90
35405A32101J8908N3888M6072K447n631K5944K1804l1246n2900j2196K0434N376
$$ y = [225437, 207524, 245988, 284680, 251801, 188635, 188119, 248338, 294356, 314172, 361985, 445124, 516122, 565156, 615215, 637931, 585499, 499146, 469179, 486808, 456662, 364158, 301602, 306617, 307863, 271191, 268520, 340740, 410354, 404407, 363794, 354001, 356379, 327030, 286081, 269753, 260471, 238141, 237797, 283012, 320199, 293400, 234726, 209761, 217056, 209087, 174267, 135478, 100466, 68677, 56030, 67461, 79155, 84779, 114970, 174593, 213994, 204631, 186962, 196629, 201643, 165868, 118211, 101944, 109152, 122584, 166017, 248324, 310200, 297724, 246618, 225812, 236696, 234852, 214685, 204683, 208118, 210035, 215948, 229625, 223345, 181184, 137932, 127447, 132391, 132101, 151009, 204897, 250969, 253416, 247785, 273729, 295533, 264287, 211387, 199191, 219625, 225001]
35393B25001k004L0366M5185P031k8223j8610j0241m0584o1562k8389J8595K8160
35381A64725J8565K1215J5915j6487m1899l0001o095j65j194J534p277k2533j1631
35368H4672K0167K7427R659J9905O3584P3292J7059m9303p0988n8569l5116K923
35356A04712M3922N4828L9340L2783L2575J1699o166J9160M7010P709n7580m2569
35344B87423L8705O0737m473m4455k651M1119L0309J4991K3620N776m0052l5118
35332C75931K3788L3081l1261n8851m219K9962j1062l0940K9060P2593K9579j3560
35320D44101J5744M0242l958k9544L4695Q9753L1946o2209o8699j1376K0629L1483
35308E32807N2310L5643l9325p1497P532R4540P1528q598l1812o854m00J630L0886
$$ y = [225001, 222997, 253363, 298548, 305579, 277356, 258746, 248505, 207921, 146359, 117970, 136565, 164725, 183290, 204505, 220420, 203933, 162034, 132033, 125938, 125773, 124579, 126113, 118836, 96303, 84672, 104839, 132266, 141925, 161830, 225414, 298706, 315765, 266462, 195474, 136905, 101789, 104712, 148634, 203462, 242802, 275585, 308160, 319859, 313693, 332853, 379863, 387572, 329992, 287423, 326128, 386865, 382392, 337937, 335286, 376405, 406714, 421705, 445325, 451101, 411049, 375931, 399719, 432800, 401539, 342688, 338469, 368431, 357369, 326429, 355489, 428082, 457661, 444101, 459845, 500087, 496129, 466585, 501280, 591033, 622979, 560770, 492071, 480695, 501324, 532807, 585117, 620760, 581435, 509938, 517470, 612010, 683538, 674940, 643128, 636274, 635874, 637504, 668390]
35295F68390M2556J2455J3811P6412R8631K3408m1303r167L2026k946l0554L2465
35283I16184R6296O3509R068K4203M3290Q19j1124P3289J30553O2783p827L8730
35271A439773R7715N4131J4822R1638J62321J00678L3360R8995J69787R9963K6232
35260B389415J11849K22231J86104J40038K54560L66728K81431J87245L36563
35251D476164N58878N66727N03724O71623R47255J034678J075869J399428J867719
35242A3102065K134634K360854K951045L753736M325105M854469N938768P521874
35234D6942550R088442J1002876J4559129K0282130K6902490L2203451L4205888
35227A95186956L1747928K5185438J6590058P762073k153267j5088859k9293093
$$ y = [668390, 710946, 723401, 737212, 813624, 912255, 935663, 894360, 885193, 917219, 914273, 883719, 916184, 1012480, 1075989, 1085057, 1109260, 1152550, 1153369, 1142245, 1215534, 1346087, 1408870, 1401043, 1439773, 1537488, 1591619, 1606441, 1698079, 1860400, 1961078, 1994438, 2093433, 2263220, 2363183, 2389415, 2501264, 2723495, 2909599, 3049637, 3304197, 3670925, 3952356, 4139601, 4476164, 5035042, 5601769, 6105493, 6777116, 7724371, 8759049, 9834918, 11234346, 13102065, 15236699, 17597553, 20548598, 24302334, 28627439, 33481908, 39420676, 46942550, 56030992, 67033868, 81592997, 101875127, 128777617, 160981068, 195186956, 226934884, 252120322, 268710380, 276472453, 274319186, 259230327, 229937234]
35220B29937234l8463249l7780277k9586954k0915913j6143016j4231434j2555986
35213F0260405j0526862q787777p275781n621974m202964l489151l098915k457695
35205A4799286j764060j483271j440889j189238q18772o92665p37036o38344m50183
35196E584828m23386m80692l84152k12191j97727k81522k54971j68978k01838
35187B979371k85028k34752j08867q8874j44368j29473p4808q9735j15358n4229
35177A653879j15o8664j50342r8840r627m0420j11302o4336K7153j804r3568q4567
35165I57447j5492l2425q6223k8061Q3572O9582m2136o7757J28k819r7632j25394
35153F12790l2067N4376N2161K0454O917j4849m2543l9866l1251n9217p5181j7363
$$ y = [229937234, 191473985, 153693708, 124106754, 103190841, 87047825, 72816391, 60260405, 49733543, 40945766, 33669985, 28048011, 23845047, 20355896, 17256981, 14799286, 13035226, 11551955, 10111066, 8921828, 8103056, 7410391, 6673355, 6035011, 5584828, 5161442, 4680750, 4296598, 4084407, 3886680, 3605158, 3350187, 3181209, 2979371, 2694343, 2459591, 2350724, 2261850, 2117482, 1988009, 1913201, 1823466, 1708108, 1653879, 1653764, 1585100, 1434758, 1335918, 1326291, 1285871, 1174569, 1110233, 1137386, 1135582, 1042014, 957447, 941955, 909530, 823307, 795246, 878818, 948400, 906264, 838507, 838635, 835816, 738184, 612790, 580723, 635099, 687260, 707714, 714631, 699782, 657239, 617373, 586122, 526905, 451724, 434361]
35141D34361M8242K1157n0155m4232K3937M2445M770n930O524k6757p4863m8348
35129C31151J9932J7614m2995m4910K2021M9483O899k4257j4064j5864l0692q08
35117B73510N5724N8138J3781N533L1351J1601m5511m7444Q417K5788j3715k5925
35105C51248O890M129m9759o7739k1506Q208j8596m0835k3158q949j2342R280
35093A36871M2843J6441n6544o9425J335N1438K6122K71K5502L8576o487m5045
35081A61898k0409J9461K1827J7776L3483J9416m6174q1182k1190O4450P2615
35070B41971J6882j2316J3062M2761L6643J274l6630m7581j8323J8435J2221k9661
35058B38738m7450k3399l155n587P086L9498L2211l1972p3535k8366N4512Q8867
$$ y = [434361, 482603, 503760, 453605, 409373, 433310, 475755, 480525, 474595, 481119, 454362, 379499, 331151, 351083, 368697, 325702, 280792, 302813, 352296, 359195, 334938, 320874, 305010, 274318, 273510, 329234, 387372, 401153, 406686, 438037, 449638, 404127, 356683, 365100, 390888, 377173, 351248, 358138, 362267, 312508, 244769, 223263, 231471, 212875, 172040, 148882, 139933, 127591, 136871, 179714, 196155, 139611, 70186, 71521, 122959, 149081, 149352, 174854, 213430, 206943, 161898, 141489, 160950, 182777, 200553, 234036, 253452, 207278, 126096, 104906, 169356, 241971, 258853, 246537, 259599, 302360, 339003, 340277, 303647, 256066, 237743, 256178, 268399, 238738, 191288, 167889, 164734, 159147, 166233, 205731, 237942, 205970, 132435, 104069, 158581, 247448]
35046B47448O5322K9623J367k3718l4226k3540j5628k4749k5286o56J8673O709
35034B21339r324N111L2615L2326m8l5092m9124l6846q935Q471n97j3069R33K2831
35020A70591J3562j0355L606M7815N6616J6221j1877l7R53l6825n8217j7837L9228
35007B13444M5934N471l3657m3379j8564L1600O2532K6208m5465n9625K799N1727
34995B39025K6810j7471j8221l037j3930k1059N979K1611j1053l2957J5999Q1369
34983B73065P7801K9783J8807M1200L6852J8121M2086Q0104M9160l2146n2599
34972E82234J1609N2968L199o7591p3578l7115k6569m5271m9257k5650L446K0807
34960C49232J7561j0743m2136l8385k151J6455m997k5827j2529M782j0784l3019
$$ y = [247448, 312770, 342393, 343760, 320042, 285816, 262276, 246648, 221899, 196613, 195957, 214630, 221339, 212015, 217126, 249741, 282067, 282019, 246927, 197803, 160957, 152022, 160493, 159896, 146827, 147760, 170591, 184153, 173798, 177404, 225219, 281835, 298056, 286179, 286142, 287095, 250270, 192053, 174216, 213444, 259378, 264849, 231192, 187813, 169249, 200849, 263381, 289589, 244124, 184499, 187298, 239025, 265835, 248364, 230143, 227106, 213176, 192117, 198096, 219707, 208654, 175697, 191696, 273065, 350866, 380649, 399456, 440656, 477508, 495629, 537715, 617819, 666979, 634833, 582234, 593843, 646811, 650010, 582419, 508841, 471726, 445157, 399886, 350629, 324979, 328425, 349232, 366793, 356050, 313914, 275529, 273378, 289833, 284836, 259009, 246480, 251262, 240478, 207459]
34948B07459j4415L1158M6629K0334J49J6544M0436L3281K669j5087o171J0357
34936C73343J3961M289q284j8745k7427l1679k6667j3456J544J6776L6613N6658
34924C76926N6736K1966k9527n4383k9411J7383L4198M570l4512m0854j8919o296
34912B97877j8887l6197l9398l2284j8005Q858L1527J3283m0357o2953j5249M4028
34900A32243L4357k6314n0049j5736N893k4908n2761k1545L6830N7729L5586Q209
34888A19534j0109k4885k0818J7860O0487N5123m68n1675n3742j7896J2392J1602
34876I7405o109q418J2473K6307Q570j5326l458L2623L9437O681j5890k919P148
34863A78524j1875k1514R658L8609J5370k6367j8809K8704M5078J1806j3285R436
$$ y = [207459, 193044, 224202, 270831, 291165, 291314, 307858, 348294, 381575, 384244, 369157, 362986, 373343, 387304, 391593, 383309, 364564, 337137, 305458, 278791, 265335, 266879, 283655, 320268, 376926, 433662, 455628, 426101, 371718, 342307, 359690, 393888, 398458, 363946, 323092, 304173, 297877, 278990, 242793, 203395, 171111, 153106, 161964, 193491, 206774, 166417, 103464, 88215, 132243, 166600, 140286, 90237, 74501, 80394, 55486, 2725, -18820, 18010, 75739, 111325, 119534, 109425, 84540, 63722, 81582, 142069, 197192, 196724, 145049, 91307, 73411, 85803, 97405, 91296, 82878, 95351, 121658, 130228, 114902, 111444, 144067, 183504, 190185, 174295, 171376, 178524, 166649, 145135, 154793, 193402, 208772, 182405, 163596, 192300, 237378, 249184, 235899, 245335]
34851B45335M9060O0231L7529k681m8152p9426p1927l1121L057M026j2998k2459
34839A30474k2660k2878j7980L304L3262M4192J5678l7788o9627m3832K0135O1342
34827I3622M7081J0229J205K3413M0653L1054L574k7674n2806n4382j8493L7353
34815A34829P0962N7735J3786k3722k9096m828K3948L5425L4916M0909M8009L1242
34803D34115l959j2635K4541O1755N0150J1316M770M2279Q3975J08172J31448
34792I35927J58158J62380J34013R8850P3559L9135j5478n7473n3985l1044m5498
34781A398544r9534j25349p4512Q974M1386J0469j3741J3735M7663K8353k2736
34770A213252l8897j1806P696J553M597K6850K8658m829l0572j8639L918J1923
$$ y = [245335, 294395, 354626, 392155, 389474, 341322, 261896, 189969, 158848, 161905, 165931, 152933, 130474, 107814, 84936, 66956, 70260, 103522, 147714, 163392, 125604, 55977, 12145, 32280, 93622, 140703, 150932, 152137, 175550, 216203, 247257, 250831, 223157, 170351, 115969, 97476, 134829, 205791, 263526, 277312, 253590, 224494, 219666, 243614, 279039, 313955, 354864, 402873, 434115, 430156, 417521, 442062, 503817, 553967, 565283, 570053, 612332, 696307, 804479, 935927, 1094085, 1256465, 1390478, 1489328, 1562887, 1602022, 1586544, 1529071, 1475086, 1444042, 1398544, 1299010, 1173661, 1099149, 1108123, 1149509, 1159978, 1146237, 1159972, 1207635, 1235988, 1213252, 1174355, 1162549, 1170245, 1171798, 1176395, 1203245, 1231903, 1227074, 1196502, 1177863, 1181781, 1193704]
34758A193704K3985M8006M6286J740l7721l2728j7109l4207o0966n7232m2486
34747A031272n6771q7077r9178j01841j12514j03475n5457j8329l5577n4913r620
34736B96520N4504M5347j4948k2218L1129M5473r222m3427q187K5067n67k9371
34724C70100j127M0389K7169k1262m4410l7890l1090k1012K561J2711q490k3011
34712B64638J457K6078K043m2909m8014j6510P02p551j0400K92J0189K9856P1633
34699B81504R1769L3009p2184j17785o3220J1942K3996m103M238N8377R3071O7037
34687D07651J2553k0295k3049j2267R029L8287M5967P695m2530m1375J3190N0869
34675D45725K8081j4823k7077k1860k8193k4104J3032L6464k886n3431k7883M7514
$$ y = [1193704, 1217689, 1265695, 1311981, 1313721, 1276000, 1243272, 1226163, 1191956, 1130990, 1073758, 1031272, 974501, 887424, 788246, 686405, 573891, 470416, 414959, 396630, 361053, 306140, 296520, 351024, 396371, 381423, 359205, 390334, 435807, 426585, 383158, 374971, 400038, 399471, 370100, 368973, 409362, 436531, 415269, 370859, 332969, 301879, 280867, 283428, 296139, 287649, 264638, 266095, 292173, 294216, 251307, 203293, 186783, 187485, 179934, 169534, 169826, 180015, 209871, 281504, 373273, 406282, 334098, 216313, 153093, 165035, 189031, 184928, 189166, 247543, 340614, 407651, 420204, 399909, 376860, 364593, 373622, 411909, 457876, 465571, 423041, 381666, 394856, 445725, 473806, 458983, 431906, 410046, 381853, 357749, 370781, 407245, 404359, 350928, 323045, 370559]
34663C70559O2128m2l3843Q927M1532k463n4227l1906K1409K1114j4733j2984
34651C75471J8781J6287j6423j7115J5151J6115k6774m9560j8424K2275L0762
34640C66546K4147K6314K1956l143k3819j2585J7505L4812K9530J1387j1367l1810
34628D49473l8677k6735n929O880K241j3481k1408j1072J266n485j6363M668M9325
34615C74703O0088J6245k3625o778L1256K4821j8511l9264k4842j4176j7050m549
34603C58318J9899J4418k3372m0055r850K5068K4230O538P584K2839K6492J4686
34591D46795J229n772l750N034M213j7587l3213l022N4943O9131J2140n2435n4618
34578D23088r221J8779Q129p254k800Q005O956l238j1811j6588k4229m3290p0563
$$ y = [370559, 432687, 432645, 398802, 407729, 449261, 446798, 392571, 360665, 382074, 403188, 388455, 375471, 394252, 410539, 394116, 377001, 392152, 408267, 381493, 331933, 313509, 335784, 366546, 390693, 417007, 438963, 435820, 412001, 399416, 416921, 451733, 481263, 492650, 481283, 449473, 410796, 384061, 378132, 385012, 387253, 373772, 352364, 341292, 342558, 337073, 320710, 325378, 374703, 434791, 451036, 427411, 420633, 451889, 476710, 458199, 418935, 394093, 379917, 362867, 358318, 378217, 392635, 369263, 329208, 319358, 344426, 368656, 375194, 382778, 405617, 432109, 446795, 448024, 442252, 438502, 443536, 447749, 430162, 396949, 393927, 448870, 518001, 530141, 477706, 423088, 413867, 432646, 440775, 433521, 430721, 438726, 445682, 442444, 430633, 414045, 389816, 346526, 275963]
34565B75963p9664m3316K1731N8839M1281R862J2099L3313L0558J1079J9361N3304
34553D44410N7416J3123k4550j1178J7922P731k6805k7604J2711M5004M5685M2842
34541E96707N0861L8930p958m5931k8969K5180O3742O6129M5546J1349k6154l6348
34529G53084l563L3595K9117K823R701M4639M5375l627m0764k2212J8512L7564
34517I04244M5521O2841O5773L0150j2576j8494P30N826j762M837J6091n40l5164
34504A067477m0606m111L4758M3208L0240J5321r7j6879k2699q074J5803K3683
34492A138024j908m9165p5157m5114J7312M4284M035n9464q4835o1622k0591Q990
34480H14789P340l1489p2744o0981k561K0523l4772r7478q3656k1113M915j2121
$$ y = [275963, 196299, 152983, 174714, 233553, 274834, 284696, 296795, 330108, 360666, 371745, 391106, 444410, 501826, 514949, 490399, 479221, 497143, 504874, 478069, 450465, 463176, 508180, 553865, 596707, 647568, 686498, 678540, 632609, 603640, 628820, 692562, 758691, 804237, 815586, 789432, 753084, 749521, 783116, 812233, 815056, 824757, 869396, 914771, 911144, 870380, 848168, 866680, 904244, 949765, 1012606, 1078379, 1108529, 1095953, 1077459, 1078189, 1084015, 1082253, 1087090, 1103181, 1102641, 1067477, 1026871, 1022760, 1057518, 1100726, 1130966, 1146287, 1146190, 1129311, 1106612, 1098538, 1114341, 1138024, 1136116, 1086951, 1011794, 966680, 983992, 1028276, 1032311, 972847, 888012, 826390, 805799, 814789, 822129, 790640, 717896, 656915, 654354, 674877, 640105, 542627, 458971, 437858, 442773, 430652]
34468D30652j0678J9467K7977M080j1352j3734l8557p0410m7715K2120N0343J742
34456C63935n0295m4059j6837k1665l8376k8355q757p349j834L0494N2978K5562
34444B55442k1466l3543j5105m049L189L3547O7908N8261O189l3846k9722n240
34432B81565K262j5838l8697l6146k79K9875K924o7049r7980m7668J9904K3606
34420E6479j9878l2206L824K9914J2373j3934j2429K790L411o170l771J3438K6859
34407F0700K0271k644j9064q888J7915K8937J3914M88Q522J4582r645m5491m9823
34394B9774j7159J5446J9867L718j0460q004J1769L2417L0075K104k6067l6141
34382D7339l8368m1001k6788J2786M6940M3901J8462O558J1828J2908N249p65
$$ y = [430652, 419974, 439441, 467418, 471498, 460146, 446412, 407855, 337445, 289730, 311850, 362193, 363935, 313640, 269581, 252744, 231079, 192703, 164348, 155591, 148242, 146408, 176902, 229880, 255442, 233976, 200433, 185328, 181279, 184468, 218015, 285923, 344184, 350373, 316527, 286805, 281565, 283827, 267989, 229292, 193146, 192867, 222742, 225666, 158617, 60637, 12969, 32873, 56479, 36601, 4395, 8219, 38133, 50506, 36572, 24143, 26933, 30344, 24174, 20403, 33841, 60700, 80971, 78327, 59263, 50375, 68290, 97227, 111141, 111629, 120151, 134733, 125088, 79597, 29774, 12615, 28061, 47928, 51646, 41186, 33182, 44951, 77368, 107443, 109547, 83480, 47339, 8971, -32030, -58818, -46032, 908, 44809, 63271, 69829, 81657, 94565, 99814, 99049]
34370I9049o124j2724n983J7305K8143J0610k417J4078K0366k4421p3125m8064
34358A6693K6887M6236j6483o3833k3049M8018N7912J3770j3392p619j3694m3663
34346B7783n2396j5290K5732J9516k2609m2872j5656J8271R266k7530k9198K0635
34334h4348N6637K1926m1763m6108J9068P3884O1343J1164k3326l3586l3360j7867
34322c6336J6694M7255N2221L9749K2235o425m1363n0420k2268L075o913k0076
34310b572P314M6379K9406l9789p8102m0068J8905K8081J013K423M4903P3876
34298I1769N1861Q322j0466m497n453k1979l3365k9168k0578j0534J3231M4725
34286G3868N3250K9994Q351R776L209l9249p6032m6641K4592M7689k01l5325N440
$$ y = [99049, 92925, 80201, 74218, 91523, 119666, 130276, 127859, 141937, 162303, 137882, 64757, 16693, 43580, 89816, 73333, 9500, -13549, 34469, 92381, 106151, 92759, 85140, 71446, 27783, -24613, -39903, -14171, 5345, -17264, -60136, -75792, -57521, -48255, -75785, -104983, -84348, -27711, -5785, -47548, -93656, -74588, -704, 60639, 71803, 48477, 14891, -18469, -36336, -19642, 27613, 79834, 119583, 141818, 135393, 94030, 43610, 21342, 24417, 17504, -2572, 4742, 51121, 80527, 40738, -37364, -77432, -58527, -30446, -29433, -27010, 17893, 91769, 143630, 151952, 141486, 136989, 131536, 109557, 76192, 47024, 26446, 15912, 29143, 73868, 127118, 157112, 165463, 175239, 178448, 139199, 63167, 16526, 41118, 88807, 88606, 53281, 58721]
34273E8721O5022N1745k2809o3903l0932J8373K4458J947m027J0585J5252l385
34261A21047k8296m0081l5937k4635j5964j2112l729J8320M3854M8573K5394l268
34249I3166j5440j7277k4405k8531q187L0228N0461L4270P292Q08P094l494l2277
34236I3708m7178k7511J0915M0458M9501L7596M602m0404p3708p5996m9696j0276
34224h7989K7360M7413L7476Q688n440J1129L2136K3767q146k7724j6601J0936
34212E3005L3977M3609L8695K3881J0875O184J860p946j2835p465j2390m5599
34200A25851q3462q3495m3059k447J1372J0475J0644N567r363j6572l6K7258L6301
34187a0966J4226k3137m3339k4006K0210M4325K4483p463o431J9719K2641j1218
$$ y = [58721, 123743, 175488, 152679, 88776, 57844, 76217, 100675, 102622, 98595, 109180, 124432, 121047, 92751, 52670, 16733, -7902, -23866, -35978, -39707, -21387, 22467, 71040, 96434, 93166, 77726, 60449, 36044, 7513, -674, 29554, 80015, 114285, 121577, 122385, 129479, 125985, 93708, 46530, 19019, 29934, 70392, 119893, 157489, 162091, 121687, 47979, -28017, -77713, -87989, -60629, -13216, 24260, 32948, 27508, 38637, 70773, 94540, 86394, 58670, 42069, 53005, 86982, 130591, 169286, 193167, 204042, 210226, 212086, 204140, 191305, 183840, 171450, 125851, 42389, -41106, -84165, -86612, -75240, -64765, -54121, -48554, -57917, -74489, -74525, -47267, -10966, 3260, -19877, -63216, -87222, -67012, -22687, 1796, -5667, -12098, 7621, 30262, 19044]
34175A9044l9764k7558R402L4881L5087J5702j3370l5057l2957j3264N007K2728
34163b0119M9166O0173J9683m7276o3892j0374L7109J6827k6918j8635L0790N1909
34151G8443K9748J1682J5207M717l2816n5439k9973K0483N2920N0763J9683k6030
34139A39388n6966m2587Q499M7091L8170k459l4951l6787j0822K3090L6248J4776
34127A22690j7479k3512m240N504k880L764L7718N4529J5334m6004o3091k9079
34115E3254j700j6580l9820k2796K8799O6493O2145L2353M410j6097l4687m3418
34103G2356k7181Q265L3819L0587J2566M224O339J433j3380k2083k0746k7751
34091E8448m9058n4192j2725N3057Q1114M2877j8993m1721j5807J4411J5941N046
$$ y = [19044, -20720, -48278, -38876, -3995, 31092, 46794, 33424, -1633, -34590, -47854, -42847, -20119, 29047, 89220, 108903, 61627, -2265, -12639, 24470, 41297, 14379, -4256, 26534, 78443, 108191, 119873, 135080, 139797, 106981, 51542, 21569, 42052, 94972, 145735, 165418, 139388, 82422, 39835, 48334, 95425, 133595, 131136, 96185, 59398, 48576, 71666, 107914, 122690, 105211, 81699, 77459, 82963, 80083, 83847, 121565, 176094, 191428, 145424, 82333, 53254, 51554, 34974, -4846, -27642, 1157, 67650, 129795, 162148, 166558, 150461, 115774, 72356, 45175, 53440, 87259, 117846, 130412, 134636, 140975, 142408, 129028, 106945, 86199, 58448, 9390, -44802, -57527, -4470, 76644, 119521, 100528, 58807, 43000, 57411, 73352, 78398]
34079G8398J2887L7524M9573L3545L370j8860k2752j0636O078J3483J1473J7976
34067B12059M0213N0938K0816k9527m6300j9204k092l6033q8290j01978p7609
34056g7007n9777n9041m1451Q50K2744m709l9200k1334L8141P0364M4463O723
34044a19234P927L0190K1169k1513m6398k6385O791J9909K3621L1782J9850k8733
34032h1024o8153m4239J4625K9489r331k8847P006M1823K3667j4882k3320j6610
34020a69796k9036l7093k713M3667M2969P411j18K6112L1770P407Q568N1844P3253
34007E4245K7687l7697n4892k6320K314J5277K2249J5462j5141m4991m1808j6978
33995a00593q191k0382k3658m996J5610K1727K0757K1875J9507P449p905j5654
$$ y = [78398, 91285, 128809, 178382, 211927, 215297, 196437, 173685, 163049, 169127, 182610, 194083, 212059, 252272, 303210, 324026, 294499, 248199, 228995, 226903, 190870, 102580, 602, -77007, -136784, -195825, -237276, -236426, -213682, -218391, -257591, -278925, -240784, -170420, -125957, -119234, -111307, -81117, -59948, -81461, -127859, -154244, -147453, -127544, -103923, -72141, -52291, -81024, -149177, -193416, -178791, -149302, -158633, -187480, -180474, -138651, -114984, -129866, -153186, -169796, -198832, -235925, -238638, -194971, -152002, -144591, -144709, -118597, -86827, -79420, -70852, -19008, 54245, 81932, 44235, -10657, -36977, -34663, -19386, 2863, 18325, 3184, -41807, -83615, -100593, -108784, -129166, -152824, -157820, -142210, -120483, -99726, -77851, -58344, -50895, -58800, -74454]
33983g4454j1761k61R674J0525O794J2305K9588M1165L1217O459j5138k5901k6784
33970f572j6448J782J1732J948j3901j1757R699K6105J7765q862l0265k8457n811
33957e3042J7474K4676K2729L0075M2219L0452j2672m9099m0365j069K1089Q419
33945D0886j5272l0790m3744n2990l7037P799M4068L5810j363j9826j203K7857
33933d5805L8709L3357K8010K6573K3916J9600J1850j0565m9042p3337m6879J8135
33921b5478N7590K8827l0749m8371j1241K0065J109l2015j6539M3569P9369M9621
33909A15757o911k6773k024K0343O607k4237l2841r931J8975K8332J6170m317
33897I9150k0530k2696l868L0541N9521O4073M5265J7044j1781l5339l8460q918
$$ y = [-74454, -86215, -86476, -76802, -66277, -59483, -47178, -17590, 23575, 54792, 61251, 46113, 20212, -6572, -23020, -21238, -9506, -7558, -21459, -33216, -23517, 2588, 20353, 11491, -18774, -47231, -53042, -35568, -10892, 11837, 41912, 84131, 114583, 101911, 52812, 12447, 11378, 32467, 40886, 25614, -5176, -48920, -101910, -138947, -131148, -87080, -51270, -52633, -72459, -73662, -45805, -7096, 26261, 54271, 80844, 104760, 124360, 136210, 125645, 76603, 3266, -43613, -25478, 32112, 60939, 30190, -18181, -29422, -9357, -8248, -40263, -56802, -13233, 66136, 115757, 108846, 82073, 80049, 100392, 106999, 82762, 49921, 39990, 58965, 87297, 103467, 99150, 78620, 55924, 52056, 82597, 142118, 206191, 251456, 268500, 256719, 221380, 182920, 174002]
33885A74002L6721O2592N7470M9058O3595R2730J16809J37827J62630J72421J46172
33874A272027J05849R5159J08998Q9822J4486n7631n9830j1365J1312j8721n3118
33863A496988n0447l0954k9603m0261m0700l9101n2259n8864k4998K9524M2873
33852A202198J014l2746o282M1761L3851l4680q4735n7534J1440M2141P619m4584
33840A079463n9227l5860j8329l7206p7293j02661j02247r8220j08731j17047
33830C22642r2515l8337P21j1296n4377p1891l6744J6027K9418j1699o5256p6124
33818h9431k9480L5053N7471J4210n1335o7090j3515M9762N9370K8640J3778J8038
33806B5471o280n6162n7138J7343P8444L9965n1459q5392m6500j0150m009J6396
$$ y = [174002, 210723, 273315, 330785, 379843, 443438, 536168, 652977, 790804, 953434, 1125855, 1272027, 1377876, 1473035, 1582033, 1671855, 1686341, 1628710, 1568880, 1557515, 1568827, 1550106, 1496988, 1446541, 1415587, 1385984, 1345723, 1305023, 1265922, 1213663, 1154799, 1129801, 1159325, 1202198, 1203212, 1170466, 1164184, 1205945, 1239796, 1205116, 1120381, 1062847, 1074287, 1116428, 1124047, 1079463, 1020236, 984376, 966047, 928841, 851548, 748887, 646640, 548420, 439689, 322642, 230127, 191790, 192511, 181215, 126838, 54947, 18203, 34230, 63648, 51949, -13307, -89431, -118911, -83858, -26387, -12177, -63512, -130602, -144117, -94355, -34985, -6345, 7433, 25471, 19191, -36971, -94109, -76766, 1678, 41643, -9816, -95208, -141708, -151858, -155867, -139471]
33794a39471N3298M3553j9821n0306l229M6988K9709q776N158M4984M1197Q660
33782E1944J1868L8781J7931n0896q5265m6172J2253L4697L0716K8256K5083J0676
33770G9872j0842l5212n7391n6299k2328Q976J671j5432J0056O0654P0336L3134
33758F7195P843J1311l186m5447n9655k6253j685j5380j5941K6807N2125R508
33746G242m5485l6776J1431K5769Q374J7230N0143M3262j7592o5337m5374J7508
33734b9605O1135N3419P868l6437m3512j0177L2205N5322N8733M9150K4558m858
33722B17801j5048q245j5149l4041j8732L7844O4920J2029o4589p7855l0442J0268
33710G8761K1927L3320M4919K6693j1688k3714J22K5931M1776O5683R0075Q2569
$$ y = [-139471, -86173, -42620, -62441, -112747, -115976, -68988, -39279, -48055, -42897, 2087, 43284, 51944, 63812, 102593, 120524, 69628, -15637, -61809, -49556, -14859, 15857, 44113, 69196, 79872, 69030, 33818, -23573, -79872, -102200, -93224, -91553, -106985, -96929, -36275, 34061, 67195, 75038, 86349, 83163, 37716, -21939, -48192, -49877, -65257, -81198, -54391, -2266, 7242, -38243, -75019, -63588, -37819, -29445, -12215, 37928, 81190, 63598, -1739, -47113, -29605, 31530, 84949, 92817, 56380, 12868, 2691, 34896, 90218, 148951, 198101, 222659, 217801, 202753, 194508, 179359, 145318, 126586, 164430, 229350, 241379, 176790, 98935, 68493, 78761, 100688, 134008, 178927, 205620, 193932, 170218, 170340, 196271, 238047, 303730, 393805, 476374]
33698D76374M4375Q592j7351m5708n2529l199O3614N9456k8045j08925j15970
33687B80684q3437o8910o7481m8901k1130o259K554J4460J0701j5019k2529K0735
33675d532P8576Q5756L2606k9233n4358m3409k1978p386K309J8325L9192M3145
33663A39013J8741m459J2763N8061P5399M0643j0255l9731n3598o9445p9784p1748
33651A5600n2757l4613j8317r134j6047k4631p838K2828K0911k0537m4938j1246
33639a80719M6600P2378O0379M0654K9586L2443N9794J01877J18126Q9295M7241
33628E17654J7353k7181j06934j73387j65103r8668m2526k2030j2267n873j8236
33617a37198l2982j3096K8851L7488L273j8147N056L1083J3862k6274l8629j5012
$$ y = [476374, 520749, 529341, 511990, 466282, 413753, 410554, 474168, 533624, 505579, 396654, 280684, 197247, 128337, 60856, 11955, -9175, -15434, -12880, 1580, 12281, -2738, -25267, -4532, 74044, 159800, 192406, 163173, 108815, 65406, 43428, 36042, 38351, 56676, 95868, 139013, 157754, 153295, 166058, 224119, 299518, 340161, 329906, 290175, 236577, 167132, 87348, 15600, -37157, -71770, -90087, -99221, -115268, -139899, -147737, -124909, -103998, -124535, -169473, -180719, -134119, -61741, -1362, 39292, 68878, 101321, 161115, 262992, 381118, 470413, 517654, 535007, 507826, 400892, 227505, 62402, -36266, -78792, -100822, -113089, -118962, -137198, -170180, -183276, -154425, -116937, -113664, -131811, -126755, -95672, -81810, -108084, -146713, -161725]
33605a61725J0316J2611k537j8258k3272j5953m166M475J3095K3804K1809l566
33593a43367k6047p256L9367N0814O85n4985m9356O829M5985L3373n351l6993
33581a46302n6576o3683m2731J0868O7455Q9753P3146M1930J3655j3360l9131
33570f4976n0045l7063j2947O72k081r209r106q50J1372K3351K9509K5344J3311
33557h2718j39j2468k2274k1063q41K8224M1386K7018K49j7583k2748k3683k1356
33544a27996r164R148J4593o505m0637n4842l1959O692K4481J4101L430J3053
33532a85605K8724K9461K1757K2297K3067M416k5155l4522j4605J1213K1981J7623
33520g9348L208j5630k1262O4K8408K9242M646j2221j6717l8740p5062o9632L945
$$ y = [-161725, -151409, -138798, -141335, -159593, -182865, -198818, -202984, -198509, -185414, -161610, -139801, -143367, -169414, -176670, -137303, -86489, -85804, -140789, -190145, -183316, -137331, -103958, -109309, -146302, -202878, -266561, -309292, -298424, -230969, -141216, -68070, -26140, -12485, -25845, -64976, -115021, -152084, -165031, -164359, -166440, -175649, -184755, -185605, -174233, -150882, -121373, -96029, -82718, -82857, -95325, -117599, -138662, -139503, -111279, -69893, -42875, -42626, -60209, -82957, -106640, -127996, -137160, -128012, -113419, -119924, -160561, -215403, -247362, -240670, -216189, -202088, -198658, -185605, -156881, -127420, -105663, -83366, -60299, -55883, -81038, -115560, -130165, -118952, -96971, -79348, -76140, -91770, -113032, -112968, -84560, -55318, -50672, -62893, -79610, -118350, -193412, -263044, -259099]
33507b59099Q3171Q6221J6389m6950m9261j3723M661j2137l0445r919L9541N6968
33495a34583O580n9140n6989P931M2170K041l7704l90O9615P3513Q467l3885q420
33482a20794K7121J2014k9861l7012j023K9358J7057k0779l9430k1368N867J0509
33470a68341K309J2728L5131K6749j8604m8492k9649O18J14r740N537J9520q724
33457a80844m7429l2380K2858M1677O698j8625j890J0588j3572l1491j833M0523
33445b05720M0788R605l127J0989J7781M112n658M394J5062K78l5632n9417m8052
33432b54597k2630k8541p2406j01265o9441l888L4096L1588J9079lm8222j03008
33420f19238j00582l2697K5805J7639k5850m9481n4693o9787q6349p8464n5430
$$ y = [-259099, -175928, -89707, -73318, -120268, -169529, -183252, -178591, -190728, -221173, -231092, -191551, -134583, -128003, -187143, -244132, -236201, -194031, -191990, -229694, -230084, -160469, -86956, -78489, -112374, -120794, -93673, -81659, -111520, -148532, -149555, -120197, -103140, -123919, -163349, -184717, -178850, -168341, -166032, -153304, -118173, -91424, -110028, -158520, -188169, -187551, -187437, -197177, -191640, -172120, -180844, -228273, -260653, -237795, -196118, -189420, -208045, -209935, -199347, -212919, -244410, -246243, -205720, -164932, -155327, -158454, -147465, -129684, -125572, -131230, -126836, -111774, -111496, -147128, -206545, -254597, -277227, -305768, -378174, -479439, -548880, -552768, -518672, -487084, -468005, -468008, -516230, -619238, -719820, -752517, -726712, -709073, -734923, -784404, -839097, -908884, -995233, -1073697, -1129127]
33409a129127m8007o3117q8235j16250j33678j15147o6297l8704n7871o7131M667
33398a918897J40711K52885K85829K56406K05311J63169J56169J88962K18227
33389e1228J90845J13805M4409J0569j1039l3158l0492N060L2361J8323j0136
33378B79319r913J0478J0642j0472j2109J6652K9117j1190o6177o4620Q93N7631
33366B30251M4131j3809m2784j5717K5734L2433k325n2024q2538o5742k010O2207
33354A17807P1924K9872o807n847M358m635j1830Q368L2769K5701j145j2498j0388
33341B37649k2002m3759m8084l4447k2955o900L2412O8519N1344n975k7307J6424
33329A94919N8640L4482k7022n5758m2183k8168k5394r270J4140K082m9523q0446
$$ y = [-1129127, -1177134, -1240251, -1328486, -1444736, -1578414, -1693561, -1759858, -1798562, -1856433, -1923564, -1918897, -1778186, -1525301, -1239472, -983066, -777755, -614586, -458417, -269455, -51228, 139617, 253422, 297831, 308400, 297361, 264203, 233711, 238771, 271132, 289455, 279319, 269406, 279884, 290526, 280054, 267945, 284597, 313714, 302524, 236347, 171727, 172620, 230251, 274382, 260573, 217789, 202072, 227806, 260239, 257914, 205890, 123352, 57610, 55600, 117807, 189731, 219603, 212796, 206949, 211307, 206672, 194842, 203210, 235979, 261680, 260535, 248037, 237649, 215647, 171888, 123804, 89357, 66402, 59502, 91914, 160433, 211777, 205802, 178495, 194919, 253559, 288041, 261019, 205261, 163078, 134910, 109516, 100246, 114386, 116468, 66945, -13501]
33317a3501m5829J8792M9184M0896M0929O4183O9674K9819k2263m2378l8716m6649
33305A04141o1002m2824Q238L9407J9493j4798j4966J1848K6929K3685K4034K8047
33293A52232J4840j0276j5791K486R640j2828l6073k8018J669K3433L0333L3470
33281A65117L2548J7776p150k5595k8237j8814m969N064L288r689k2777k7536
33269G9026k4021j0049J7737M3806L8012k223l5763k8744l104l328k9364m0206
33257A779j8434R509K0992K5539L3411L1711J1698p937o733Q857K0138K0655J1488
33244A62673p144k5277k6931j8164k4182m3161l7347O562M6005M4205K5337K6194
33232A28770L0533N556k8443k9124q915j0497k3336l506L2475K2137k9742m5200
$$ y = [-13501, -59330, -40538, 8646, 49542, 90471, 154654, 224328, 254147, 231884, 189506, 150790, 104141, 43139, 315, 8553, 47960, 67453, 52655, 37689, 49537, 76466, 100151, 124185, 152232, 167072, 156796, 141005, 143491, 153131, 140303, 104230, 76212, 77881, 101314, 131647, 165117, 197665, 215441, 208291, 182696, 154459, 135645, 130676, 135740, 139028, 129339, 106562, 79026, 55005, 44956, 62693, 106499, 144511, 142288, 106525, 77781, 74677, 71349, 41985, 1779, -16655, -7146, 13846, 39385, 72796, 104507, 116205, 108268, 101535, 110392, 130530, 151185, 162673, 155529, 130252, 103321, 85157, 60975, 17814, -19533, -12971, 33034, 77239, 102576, 128770, 159303, 164859, 136416, 107292, 98377, 87880, 64544, 61038, 93513, 115650, 85908, 40708]
33220D0708m39L3773J2722j2856M394K7484J3216q348j362K160k7412m2084K446
33207D4402N0893K9179k8763l5722O652K4734K928q757K047L038j84K2394M0463
33194A53304n55o4756n9952J0670M6965J3373j7055j659J0784o718n769K9352
33182A07984L5567q526k6819K1167N7338J5427m2858l2933J5613K3511o617k0062
33170A38792j3418j4873j1340J6269L1924L994k1846M183L9197J8881k0037N503
33158A77229P9401J06051O0938J4934Q747L858k7241n0325l5161n134L935j2688
33146C24544l9282n5157l8871N644L4892J5941k3278l2872j0474R474J1483l15
33134B01729k9110o5001o8476k5518J4310R139m921K2595O3026N2907n79l5281
$$ y = [40708, 40269, 74042, 86764, 73908, 78302, 105786, 119002, 110654, 109292, 111452, 84040, 41956, 44402, 95295, 124474, 95711, 59989, 66641, 91375, 94303, 85546, 87593, 90631, 90447, 112841, 153304, 152749, 87993, 28041, 38711, 85676, 99049, 81994, 80335, 91119, 84401, 78632, 107984, 143551, 135025, 108206, 129373, 186711, 202138, 159280, 126347, 141960, 165471, 158854, 138792, 125374, 110501, 99161, 115430, 147354, 151348, 129502, 133685, 172882, 191763, 171726, 177229, 256630, 362681, 423619, 438553, 447300, 451158, 423917, 373592, 338431, 333297, 337232, 324544, 285262, 230105, 191234, 196878, 231770, 247711, 224433, 191561, 181087, 190561, 202044, 201729, 172619, 107618, 39142, 13624, 27934, 37073, 32152, 54747, 117773, 170680, 170101, 134820]
33122A34820k9928j1222R052L1954L4377N966q922K0990M4521P480m4308l4423
33110A60357J7057L6781K0811M385l4383j09951j29639k1417R2089M9201n1208
33099C4083M5282L13837L94538R3596k97868l75242j37985P9192P9036k6089p2211
33088A30169n1480k6929n149L0416N1843K2531l8534p0867l9626K5009N4441J5775
33076I7599m3600n0760j490M2882N0484N0659O1376N4094J5989j8429k8363l7861
33064A92580n6658n4224k3338k746m546R223M3251M1773j0464m0864J720O5032
33052A60739P9945N6557L2116l132n6266p6063k6599L7924M6657J0823j8732l7837
33040B06132o0625n9578j2795L4906L4089R586M513m318n2356r4951o2069K4554
$$ y = [134820, 104892, 93670, 102722, 134676, 169053, 175019, 166097, 187087, 231608, 239088, 194780, 160357, 177414, 214195, 235006, 239391, 205008, 95057, -34582, -55999, 36090, 85291, 34083, 79365, 393202, 787740, 881336, 583468, 208226, 70241, 149433, 228469, 202380, 130169, 78689, 51760, 46611, 77027, 128870, 151401, 112867, 42000, 2374, 27383, 81824, 97599, 53999, 3239, 1749, 44631, 95115, 145774, 207150, 261244, 277233, 258804, 230441, 192580, 135922, 81698, 58360, 55614, 51068, 60291, 103542, 145315, 134851, 93987, 95707, 160739, 240684, 297241, 329357, 326225, 269959, 193896, 167297, 205221, 251878, 262701, 243969, 206132, 145507, 85929, 73134, 108040, 142129, 151715, 156228, 151910, 99554, 4603, -57466, -32912]
33028c2912P8322P1491M9480L8008J8123j0416j4028J9077N8959P2630M9573Q78
33016C99185l9689l7758o774L17k8424m0463o398K7392J6216j1279r342J0991
33004B73974J7076J4783K3444L5664M2891N3328N5346K2973j9766j6894J6341
32993E19160N102m4435l4810N1166J02350O2875K1340L9251M2184j8352m9903
32982F95928J0634O2523J8226l1263J4547P4008L7238k1713K0090J05841J07030
32971A093089N4010N4707Q3063N4831J6318M8248Q0649J4703p7524q6894p2141
32960A263059j08636r5735K8478P7588o7081j58233J2548J69608K0567r9437K43951
32949A286677N84089P668j285657j870451r74908L93061Q34827L56593k0567J04617
$$ y = [-32912, 45410, 116901, 166381, 204389, 222512, 212096, 198068, 217145, 276104, 348734, 398307, 399185, 359496, 321738, 314964, 315281, 286857, 246394, 239996, 267388, 283604, 272325, 262983, 273974, 291050, 305833, 329277, 364941, 407832, 461160, 516506, 539479, 519713, 502819, 519160, 524262, 479827, 445017, 496183, 598533, 661408, 682748, 721999, 764183, 745831, 695928, 706562, 769085, 787311, 756048, 770595, 844603, 881841, 860128, 880218, 986059, 1093089, 1147099, 1201806, 1284869, 1339700, 1356018, 1404266, 1484915, 1499618, 1422094, 1335200, 1263059, 1154423, 1058688, 1087166, 1164754, 1097673, 939440, 951988, 1121596, 1142163, 1042726, 1286677, 1870766, 1878434, 592777, -1277674, -2252582, -1859521, -1024694, -668101, -688668, -584051]
32939e84051K30663N5639r9555j5643O6780r489l6718Q9855J34733l0485j74746
32928c73017j18387k2483n5736j06049m3707J8655m5782j30408r0309J2142M7288
32917i07793L2343L7682L7036K521J280O1897Q9799L7631O041N3139O8451k4372
32905e04345j01491l6738P6998P8781m543l2234J1310K9843O293J1188N1298N6000
32893c57640M436m7553n9916m2045j0585J7819J8489j116N964M4933M9924r371
32881c86661o1802m2213O134J2862l888J1340M3491M0566R704m608k41J09O945
32868c68262L2004L8381m685n4245n1244j0674J2535J1518J5391K4734K4494K7166
32856c02887M1111L2794j6444n5104l0646K2431L3912N474m877J8591L6051K2249
$$ y = [-584051, -353388, -297749, -397304, -412947, -346167, -355656, -392374, -302519, -167786, -198271, -373017, -491404, -513887, -569623, -675672, -719379, -700724, -746506, -876914, -967223, -955081, -907793, -875450, -837768, -800732, -798211, -796931, -735034, -645235, -607604, -601563, -548424, -479973, -504345, -605836, -642574, -565576, -486795, -491338, -523572, -512262, -482419, -476126, -464938, -413640, -357640, -353204, -400757, -460673, -502718, -513303, -495484, -476995, -478111, -472147, -427214, -377290, -386661, -448463, -490676, -484542, -471680, -475568, -464228, -420737, -380171, -370467, -375075, -375316, -375207, -368262, -336258, -297877, -302562, -356807, -408051, -418725, -406190, -394672, -379281, -354547, -330053, -302887, -261776, -228982, -245426, -300530, -331176, -308745, -274833, -269359, -274236, -255645, -219594, -197345]
32844a97345q976l6996m5817k4547O406L961k6920k1219M3242R2434O5131R981
32832a40665j081Q291k0881o0946m5154L464Q078k1065l671N9345P5922J9496
32820a18867k2279Q731N2603L7991p805j7276R714J9767p770m0422m3639k0000
32808a49252j467r967k1745R010P0769P9432n289q9293n4577O2524J10480M3654
32796D4279j7496J2632M8096j6181j14922j03812R280O5107j1011j02857q0185
32785b67070K1634P8783O4064M9111N1502J823j09209j61741o6203P8006R2088
32774a67212l5615j23449l6128J45077K37278J67991J7945r0571r0362k74Q2619
32763A07299N8518n6924j32277q9064j2807k0926p8814n7442N6353J34368R9346
$$ y = [-197345, -206321, -243317, -289134, -313681, -307275, -303314, -330234, -351453, -308211, -215777, -150646, -140665, -141746, -133455, -154336, -215282, -260436, -256972, -248894, -269959, -273630, -214285, -138363, -118867, -141146, -132415, -79812, -41821, -49626, -66902, -57188, -37421, -45191, -85613, -129252, -149252, -150719, -160686, -182431, -173421, -102652, -23220, -28509, -117802, -172379, -109855, 625, 44279, 26783, 39415, 87511, 71330, -43592, -147404, -138124, -73017, -84028, -186885, -267070, -245436, -166653, -102589, -53478, -1976, -153, -109362, -271103, -337306, -259300, -167212, -202827, -326276, -362404, -217327, 19951, 187942, 205887, 115316, 24954, 24680, 107299, 165817, 108893, -23384, -112448, -125255, -146181, -224995, -282437, -226084, -91716, 7630]
32752G630K1110j6637l5825q4564j23390p9491K6608Q9501M8090m5769r1432m4438
32740c28607M4514Q4999M3760k1263l9584j8569j3236k7013j3262K4885K2687
32729b40689k9839m6160K5625J03757Q3589n398m5848q875J4683l5656r9975r4958
32717c79744l4812J321q562p34P1351J48146J22146j3008j19531o8679Q6310J61886
32705c3910P6186n3107q3531l5740k4298o4295o4225O746O6536N6819K5164K5165
32693a02490K5795j4425n3770k6977M4374P7876M4698p859l4994l6320k4857o100
32681a15049J0518J7125K0364K0085m730n1599o5205p837O4190O3245j528l4564
32669h4985N139N2627M4952L773k3203l4684m5416m0366r162J7197J1278n234
$$ y = [7630, 28740, 12103, -23722, -108286, -231676, -311167, -284559, -195058, -146968, -192737, -284169, -328607, -284093, -199094, -155334, -176597, -216181, -234750, -247986, -274999, -288261, -263376, -240689, -270528, -316688, -291063, -187306, -103717, -109115, -154963, -163838, -149155, -184811, -284786, -379744, -414556, -413235, -421797, -422531, -351180, -203034, -80888, -93896, -213427, -282106, -195796, -33910, 42276, -10831, -94362, -130102, -154400, -218695, -282920, -276174, -209638, -152819, -127655, -102490, -76695, -91120, -144890, -171867, -127493, -49617, -4919, -12778, -47772, -84092, -108949, -115049, -104531, -87406, -67042, -46957, -51687, -103286, -168491, -176328, -112138, -48893, -50421, -84985, -79846, -27219, 17733, 21506, -1697, -36381, -81797, -122163, -131325, -114128, -102850, -108084]
32657a08084k952M740m338j2750L388K3428J4137j1063j4024L934O712j5888l1471
32644a44231q341M7218R2798Q3097K0753k8033o738M4308L1771n2895j13512q9092
32632a22897l0737j220J4064M1141M9282J7487r764l308n566l5993l3491K5020
32620i5982N2626j799m6269j773N1044K1565j5791L4474Q8927K9301o1201l1625
32608B3497O2011O2514K815J7281M7611m7358j59444p0225J24827J38481J3345
32597B15355M9136K00674J25611o8554J72455P97123Q47050j99937j398623j447554
32587g07264m44795L43220K71823o1559k3056J72166J05480p9013n0392Q7373
32577c86017N4388p3732n1349O9117O6852l0741l1617N3612O0772r298j9951K5672
$$ y = [-108084, -111036, -106296, -110634, -123384, -119996, -96568, -82431, -93494, -107518, -103584, -96872, -112760, -144231, -152572, -105354, -12556, 70541, 91294, 63261, 56523, 100831, 132602, 79707, -33805, -122897, -153634, -154854, -140790, -99649, -50367, -32880, -42644, -45952, -51518, -87511, -121002, -95982, -43356, -45155, -91424, -93197, -42153, -20588, -36379, -1905, 87022, 116323, 55122, 23497, 85508, 148022, 150837, 168118, 215729, 168371, 8927, -61298, 63529, 202010, 215355, 264491, 465165, 590776, 522222, 694677, 1491800, 2338850, 2138913, 740290, -707264, -1152059, -808839, -537016, -598575, -621631, -449465, -343985, -422998, -473390, -386017, -331629, -405361, -456710, -387593, -320741, -351482, -383099, -329487, -268715, -278013, -297964, -272292]
32565b72292P291o5257o6640J6809P9108Q0693O6187L8842j9916n4517j2818L4940
32553a67570J870n5152l1519L6215L6942j9878l7926j2146j3004l4946j5389K9402
32541b83101L1915L348K688J7626N278j562L7256N8328j551n9912j2040O6762
32529a34965L0136p9335q6391K3943Q3327J8878m9588k6697K8155L8007J7091
32518a37439q014m6091o8528k1001N8269O1954j5923o4108l3197O397J1115K3920
32506b32646N2269L3536l0533m5211J8155O7036M3898P383N959K516j9979j0803
32494a08420L0741K2822m9440q4383l1511K4896K1473J5252M5128L8493m0411
32483a15360q5977j6590P4010N8855l0288p9300o7950m3153q64P4474J22785Q7922
$$ y = [-272292, -265001, -330258, -396898, -380089, -300981, -220288, -154101, -115259, -135175, -189692, -202510, -167570, -165700, -220852, -252371, -216156, -179214, -199092, -237018, -249164, -262168, -297114, -312503, -283101, -251186, -247838, -245150, -227524, -222246, -223808, -186552, -128224, -129775, -189687, -201727, -134965, -104829, -184164, -270555, -246612, -163285, -144407, -193995, -220692, -192537, -154530, -137439, -145453, -191544, -260072, -281073, -222804, -160850, -176773, -240881, -274078, -267681, -256566, -232646, -180377, -146841, -177374, -222585, -204430, -137394, -93496, -86113, -80154, -77638, -97617, -108420, -77679, -54857, -104297, -188680, -220191, -195295, -173822, -158570, -113442, -74949, -115360, -201337, -217927, -143917, -85062, -115350, -194650, -262600, -305753, -306617, -232143, -109358, -21436]
32471b1436K6076J9289M0261J5934l5648m8938l4679m2216m8861m803N4059N1006
32459b9956q818n8767p2378n7279n988N7299N4945j9844m6292M1357J19429O6096
32447C9804k6794j4323M2525R816k1856J32773L58653L09752o3281l71587l12702
32436H2780o2606M1448k6537o3428j7339j0636o4458o0374K9539Q6292M5955r719
32424b9083o892J2091j2079n2616n2851j4844K0663L7213M5196M9236M0341Q983
32412D5358l9280p2752n4524N302M2413J4686l7292m3951l83L6855L2353O785
32400f4430n618L621K0240K3022M40l1311m0931k5926j6206j7466N433N6955P4232
32387a7945J6173n4679n0306J2576L9781J451l8817l7300k4434k5392j0611L2839
$$ y = [-21436, 4640, 23929, 64190, 80124, 44476, -4462, -39141, -81357, -130218, -135021, -80962, -29956, -38774, -97541, -169919, -227198, -233186, -175887, -120942, -140786, -187078, -145721, -26292, 39804, 13010, -1313, 41212, 51028, 29172, 161945, 520598, 830350, 767069, 395482, 82780, 20174, 61622, 35085, -28343, -45682, -56318, -120776, -181150, -151611, -65319, -19364, -29083, -35975, -23884, -35963, -88579, -141430, -156274, -135611, -98398, -53202, -3966, 36375, 45358, 6078, -66674, -121198, -115896, -73483, -58797, -96089, -140040, -140423, -103568, -71215, -64430, -70048, -66427, -46187, -23165, -22725, -54036, -94967, -120893, -137099, -154565, -149132, -92177, -17945, -1772, -56451, -106757, -94181, -54400, -52949, -91766, -129066, -153500, -178892, -189503, -156664]
32375a56664N1368M768n3477m1290L2589P7395M3031k0315l6919k26L1666J7043
32363e1031j9710k5259R697L4593L693n9650q4824l6382M6249R4293P7773K4633
32351A4075j3111p449K1278K7749l161l5045k9989m293k984k7628l2166K490L3259
32338e6975J6456k9369n2373l7082j4227j2619k8763m0677l1951l007K9158M4928
32326b16501M2361L6750L6690L4053K2862J0344L38j4976l4854m1399k6460p848
32314a58640j286M801K5774M8790M7689J9152j4457k8664j2540K1181L2759p421
32302b2862o3357n7005K3029Q3893M8599l1190n1323q961Q578k5793m1728N6M1089
32289i6975K7674n696j1115j1106l8501n3787n860O3954O6948O63m4802j6606
$$ y = [-156664, -105296, -100528, -154005, -195295, -162706, -85311, -42280, -62595, -99514, -99740, -68074, -51031, -70741, -96000, -86303, -51710, -48017, -107667, -192491, -228873, -182624, -88331, -10558, 14075, 964, -6485, 14793, 42542, 39381, 4336, -25653, -29946, -32930, -60558, -92724, -90234, -56975, -40519, -69888, -122261, -159343, -173570, -186189, -214952, -255629, -287580, -290587, -261429, -216501, -174140, -137390, -100700, -66647, -43785, -33441, -33103, -48079, -82933, -124332, -150792, -158640, -159926, -155125, -129351, -80561, -32872, -13720, -28177, -56841, -69381, -48200, -15441, -22862, -86219, -143224, -120195, -36302, 12297, -18893, -70216, -79177, -70599, -96392, -138120, -138064, -96975, -69301, -74997, -86112, -97218, -135719, -189506, -195366, -131412, -64464, -63801, -108603, -125209]
32277a25209L6363M4449M649l6829m7702l0104l281J5018K1812K8479L8191L3318
32265b0846K069l5672n0478l7305o757L4847O9456O0207N76n4779n5470k7882
32253a22034k7685m3640j9201M1103O6829L1235j0595j3264Q80L767J3219M2610
32241c6776N8334L5135O545J1287K7241P997m2760p8960p5171m4951j2460N259
32229a39280L766J91J6821M1664L5647n640l5372k1877Q585J9616J2679J60k2718
32216h5758m5508l0881K3055N5330K4189k6868l5514j0043L857N349K2996M7144
32204e2652M1982N776l3380n8487n6375q571N9399O9518k581o6683m2753J0907
32192a33900m617n7324m0373L3745M5881k3852n8272j995N0946K5568j4195O996
$$ y = [-125209, -88846, -44397, -39748, -76577, -124279, -154383, -157664, -142646, -120834, -92355, -54164, -20846, -18777, -54449, -104927, -142232, -148989, -114142, -44686, 15521, 16097, -38682, -94152, -122034, -149719, -193359, -212560, -171457, -104628, -73393, -83988, -97252, -96372, -92605, -79386, -36776, 21558, 56693, 63238, 74525, 101766, 109763, 67003, -11957, -87128, -132079, -144539, -139280, -135514, -135323, -118502, -76838, -41191, -46831, -82203, -104080, -95495, -75879, -63200, -63040, -85758, -131266, -162147, -139092, -83762, -59573, -86441, -121955, -131998, -128141, -122792, -99796, -52652, -10670, -4894, -38274, -96761, -153136, -161707, -102308, -32790, -35371, -102054, -144807, -133900, -138517, -195841, -236214, -202469, -156588, -180440, -238712, -240707, -189761, -164193, -178388, -171392]
32180a71392M6584L6266O565J8067M4702K7665j3638k3127j2561k9057n6194m0926
32168a67046P483L1837K0409Q199M246q077j7413l422J0311n262j6006K5719Q2047
32155b6975O9580q499o1163m5334j3690j1058j0598J5299L6788K1870p439j5256
32143e6475n077j23o633k0416l5211k9457J4364O3943N8246p557o6416o9045l9006
32130a98863j4967P266L9890O0539M8408K4825J6547J2444m818j8767j2350p601
32118d7447k6930m5003k8193L676O862j4976k2036o388M983N529J3096K3083J2733
32105a21011o853Q44L0517L4169K860j0702K0092M3045Q380m3098l4304L0186
32093d5875O6613L1601k2053k8766J49P393j9849l6874j3725K2278L1370J7795
$$ y = [-171392, -124808, -88542, -81977, -63910, -19208, 8457, -5181, -28308, -40869, -69926, -126120, -167046, -159563, -127726, -107317, -99118, -94872, -102949, -120362, -123784, -113473, -118735, -134741, -109022, -26975, 42605, 34106, -27057, -72391, -86081, -97139, -107737, -92438, -55650, -33780, -41219, -56475, -61552, -61675, -68308, -88724, -123935, -153392, -139028, -75085, -16839, -24396, -90812, -159857, -198863, -213830, -206564, -166674, -106135, -57727, -32902, -16355, -3911, -8729, -27496, -39846, -47447, -74377, -119380, -147573, -143897, -137035, -152011, -174047, -180435, -175452, -169923, -156827, -133744, -121011, -127864, -127020, -96503, -62334, -59474, -70176, -50084, -7039, 1341, -41757, -76061, -45875, 20738, 52339, 30286, 1520, 1669, 9062, -10787, -47661, -61386, -39108, -7738, 10057]
32081A0057J3304K0439Q227l2560o3549m7668j978K4572J4822k830j171J3220
32069d5115J9825J3065Q19q379o793P731J9452N667k8244m5258k6194j901r275
32056a04600l2521k5624J3087L2760O177k7908k3534M791J0020j2081j9309P977
32044a70765L5864K7437p486l3414l8040l5931l5710k8988j1154O883J3668J1874
32032b65762J1085J2406P271q782k5647k7034j1886j132j2467l1354k5402O153
32020c72551J9028k0077p9137r2266m2712J7042L5606K1442J2058J3380M570j1119
32008d94736k837L5279O4704N3912K2601J1013K3856L2268K1024M579j871J51
31996b30057P426K1461L0816J1447l8095p8486o6666m864O0936Q6604O4721K1246
$$ y = [10057, 23361, 43800, 52027, 19467, -44082, -91750, -93728, -69156, -54334, -57164, -58335, -45115, -25290, -12225, -11406, -19785, -26578, -18847, 605, 6272, -21972, -67230, -93424, -95325, -104600, -137121, -162745, -149658, -116898, -110721, -138629, -162163, -157372, -147352, -159433, -178742, -170765, -134901, -107464, -114950, -148364, -186404, -222335, -258045, -287033, -298187, -291304, -277636, -265762, -254677, -242271, -235000, -243782, -269429, -296463, -308349, -309481, -321948, -353302, -378704, -372551, -353523, -373600, -452737, -545003, -587715, -570673, -535067, -513625, -501567, -488187, -483617, -494736, -497573, -462294, -397590, -343678, -321077, -310064, -286208, -253940, -232916, -228337, -230208, -230057, -222631, -201170, -170354, -158907, -197002, -275488, -342154, -347018, -286082, -199478, -134757, -113511]
31984a13511j1533k1697k2262k5473j8498J6014N7288N8306J4269j7463M641M1467
31972c8452L0580j6253l1034K679K4713n056m5887m4878j7170j1013k5536j7973
31960a95280J8517L7120O993l8243m3119p98M1880M3871J4937n467p74R650Q650
31947a02063P348J8455K6802J4132k672O491L2920L7827J0576k2449m6728p0118
31935h9479q0397m8562R831L6098J7003R219L8410M3596j7881p5237l9751M9410
31923a47740P4997J6876k7697l082K9254N096m2558m8564j3965J6381K7392L2194
31911h1416K9926J1492j4733l6723n4923n9951k8643K7172M8086O353l8145j4928
31899b06433N0763P1269K3572k4508k1704j212j3125m1908l7850j383J6832m064
$$ y = [-113511, -125044, -146741, -169003, -194476, -212974, -196960, -139672, -81366, -67097, -84560, -79919, -38452, -7872, -24125, -55159, -52480, -27767, -32823, -78710, -123588, -140758, -151771, -177307, -195280, -176763, -139643, -132650, -170893, -214012, -214810, -172930, -129059, -114122, -119589, -120363, -110713, -102063, -94715, -76260, -49458, -35326, -37998, -31507, 1413, 39240, 49816, 27367, -19361, -89479, -169876, -218438, -208607, -172509, -155506, -146287, -107877, -64281, -82162, -157399, -197150, -147740, -72743, -55867, -83564, -86646, -57392, -52296, -94854, -143418, -157383, -141002, -113610, -81416, -51490, -39998, -54731, -91454, -146377, -206328, -234971, -207799, -159713, -153360, -191505, -206433, -155670, -84401, -60829, -85337, -107041, -108253, -121378, -163286, -201136, -202519, -185687, -189751]
31887a89751k2964j766L3784L1759o206k5735q57L0328K9360J3879J4882J4466
31875g8821k0240o3439n6549m639K1199p955l4611q867L4170L6304P601R41K6946
$$ y = [-189751, -212715, -214481, -180697, -148938, -155144, -180879, -181736, -151408, -122048, -108169, -93287, -78821, -99061, -162500, -219049, -223688, -202489, -210444, -245055, -253922, -219752, -183448, -175847, -174906, -147960]
$$ [...]
##END NTUPLES=NMR SPECTRUM
##END=
