##TITLE=31Pdec_PM1003
 CDCl3, 24 sc
 12.3.2019
##JCAMPDX= 6.0         $$ Bruker NMR JCAMP-DX V2.0
##DATA TYPE= NMR SPECTRUM
##DATA CLASS= NTUPLES
##ORIGIN= UXNMR, Bruker Analytische Messtechnik GmbH
##OWNER= root
$$ XWIN-NMR		Version 3.5
$$ Tue Mar 12 15:29:34 2019 Russian Standard Time (UT+4h)  she@DPX200
##.OBSERVE FREQUENCY= 81.013821
##.OBSERVE NUCLEUS= ^31P
##.ACQUISITION MODE= SIMULTANEOUS
##.ACQUISITION SCHEME= undefined
##.AVERAGES= 24
##.DIGITISER RES= 17
##SPECTROMETER/DATA SYSTEM= spect
##.PULSE SEQUENCE= zgpg30
##.SOLVENT NAME= CDCl3
##.SHIFT REFERENCE= (INTERNAL, CDCl3, 0, 182.463)
##AUDIT TRAIL= $$ (NUMBER, WHEN, WHO, WHERE, WHAT)
$$ ##TITLE= Audit trail, XWIN-NMR		Version 3.5
$$ ##JCAMPDX= 5.01
$$ ##ORIGIN= Bruker BioSpin GmbH
$$ ##OWNER= she
$$ F:/spectra/data/she/nmr/P31/1/pdata/1/auditp.txt
$$ ##AUDIT TRAIL=  $$ (NUMBER, WHEN, WHO, WHERE, WHAT)
(   1,<2019-03-12 15:28:23.90 +0400>,<she>,<DPX200>,
      <created by zg, POWCHK disabled, PULCHK disabled
       configuration hash MD5:
       00 E9 B6 7A A2 85 ED C7 34 08 36 98 17 FE 4E 26
       data hash MD5: 32K
       54 EE 2E EB 1B 3D F9 F1 73 0D 96 98 E7 66 4F 37>)
(   2,<2019-03-12 15:28:37.34 +0400>,<she>,<DPX200>,
      <Start of raw data processing
       efp BC_mod = 2 LB = 1 FT_mod = 6 PKNL = 1 PHC0 = -1996.048 PHC1 = 524.999 SI = 64K 
       data hash MD5: 64K
       63 73 49 BE D1 D3 A5 46 30 99 DB C6 92 59 F2 52>)
(   3,<2019-03-12 15:28:58.03 +0400>,<she>,<DPX200>,
      <pk PHC0 = 1.232761 PHC1 = 0 
       data hash MD5: 64K
       88 0D 44 BA 32 8C 5E FC 2D C8 DB A5 70 C5 91 84>)
(   4,<2019-03-12 15:29:04.73 +0400>,<she>,<DPX200>,
      <abs ABSG = 5 
       data hash MD5: 64K
       48 FF 5F ED 7E EF 10 C0 55 9B BF F8 CF 06 36 21>)
$$ ##END=
$$ 
$$ hash MD5
$$ 21 6D 56 C7 1B B8 AD 16 7D 67 E6 EB 35 DB 37 01
##$RELAX= 
##$RELAX= 
##$RELAX= 
##$RELAX= 
##$RELAX= 
##$RELAX= 
##$RELAX= 
##$RELAX= 
$$ Bruker specific parameters
$$ --------------------------
##$DU= <F:/spectra>
##$EXPNO= 1
##$NAME= <P31>
##$PROCNO= 1
##$TYPE= <nmr>
##$USER= <she>
##$AMP= (0..31)
100 100 100 100 100 100 100 100 100 100 100 100 100 100 100 100 100 100 
100 100 100 100 100 100 100 100 100 100 100 100 100 100 
##$AQSEQ= 0
##$AQ_mod= 1
##$AUNM= <au_zg>
##$AUTOPOS= <>
##$BF1= 81.014009
##$BF2= 200.13
##$BF3= 200.13
##$BF4= 200.13
##$BF5= 200.13
##$BF6= 200.13
##$BF7= 200.13
##$BF8= 200.13
##$BYTORDA= 1
##$CFDGTYP= 0
##$CFRGTYP= 5
##$CHEMSTR= <none>
##$CNST= (0..31)
1 1 145 1 1 1 1 1 1 1 1 1 1 1 1 1 1 1 1 1 1 1 1 1 1 1 1 1 1 1 1 1 
##$CPDPRG= <waltz16>
##$CPDPRG1= <>
##$CPDPRG2= <waltz16>
##$CPDPRG3= <>
##$CPDPRG4= <mlev>
##$CPDPRG5= <mlev>
##$CPDPRG6= <mlev>
##$CPDPRG7= <mlev>
##$CPDPRG8= <mlev>
##$CPDPRGB= <>
##$CPDPRGT= <>
##$D= (0..31)
0 1 0 0 0 0 0 0 0 0 0 0.03 2e-05 3e-06 0 0 0 0 0 0 0 0 0 0 0 0 0 0 0 0 
0 0 
##$DATE= 1552390103
##$DBL= (0..7)
120 120 120 11 120 120 24 19 
##$DBP= (0..7)
150 150 150 150 150 150 150 150 
##$DBP07= 0
##$DBPNAM0= <>
##$DBPNAM1= <>
##$DBPNAM2= <>
$$ [...]
##$SUBNAM3= <"">
##$SUBNAM4= <"">
##$SUBNAM5= <"">
##$SUBNAM6= <"">
##$SUBNAM7= <"">
##$SUBNAM8= <"">
##$SUBNAM9= <"">
##$SW= 369.568048894756
##$SWIBOX= (0..15)
0 1 3 0 0 0 0 0 0 0 0 0 0 0 0 0 
##$SW_h= 29940.119760479
##$TD= 32768
##$TD0= 1
##$TE= 0
##$TE2= 300
##$TE3= 300
##$TEG= 300
##$TL= (0..7)
0 120 53 12 22 120 120 120 
##$TP= (0..7)
150 150 150 150 150 150 150 150 
##$TP07= 0
##$TPNAME0= <>
##$TPNAME1= <>
##$TPNAME2= <>
##$TPNAME3= <>
##$TPNAME4= <>
##$TPNAME5= <>
##$TPNAME6= <>
##$TPNAME7= <>
##$TPOAL= (0..7)
0.5 0.5 0.5 0.5 0.5 0.5 0.5 0.5 
##$TPOFFS= (0..7)
0 0 0 0 0 0 0 0 
##$TUNHIN= 0
##$TUNHOUT= 0
##$TUNXOUT= 0
##$USERA1= <user>
##$USERA2= <user>
##$USERA3= <user>
##$USERA4= <user>
##$USERA5= <user>
##$V9= 5
##$VALIST= <valist>
##$VCLIST= <CCCCCCCCCCCCCCC>
##$VD= 0
##$VDLIST= <DDDDDDDDDDDDDDD>
##$VPLIST= <PPPPPPPPPPPPPPP>
##$VTLIST= <TTTTTTTTTTTTTTT>
##$WBST= 1024
##$WBSW= 4
##$XGAIN= (0..3)
0 0 0 0 
##$XL= 0
##$YL= 0
##$YMAX_a= 42548
##$YMIN_a= -47206
##$ZGOPTNS= <>
##$ZL1= 120
##$ZL2= 120
##$ZL3= 120
##$ZL4= 120
##$ABSF1= 182.463
##$ABSF2= -187.1042
##$ABSG= 5
##$ABSL= 3
##$ALPHA= 0
##$AQORDER= 0
##$ASSFAC= 0
##$ASSFACI= 0
##$ASSFACX= 0
##$ASSWID= 0
##$AUNMP= <proc_1d>
##$AZFE= 0.1
##$AZFW= 0.5
##$BCFW= 0
##$BC_mod= 2
##$BYTORDP= 0
##$COROFFS= 0
##$CY= -3
##$DATMOD= 1
##$DC= 0
##$DFILT= <>
##$DTYPP= 0
##$F1P= 0
##$F2P= 0
##$FCOR= 1
##$FTSIZE= 65536
##$FT_mod= 6
##$GAMMA= 0
##$GB= 0
##$INTBC= 1
##$INTSCL= 5.30512e-09
##$ISEN= 30
##$LB= 1
##$LEV0= 0
##$LPBIN= 0
##$MAXI= 10000
##$MC2= 0
##$MEAN= 0
##$ME_mod= 0
##$MI= 50
##$NCOEF= 0
##$NC_proc= -3
##$NLEV= 6
##$NOISF1= 182.463
##$NOISF2= 159.3651
##$NSP= 0
##$NTH_PI= 0
##$NZP= 0
##$OFFSET= 182.463
##$PC= 4
##$PHC0= -1994.815
##$PHC1= 524.999
##$PH_mod= 1
##$PKNL= yes
##$PPARMOD= 0
##$PSCAL= 0
##$PSIGN= 0
##$REVERSE= no
##$SF= 81.0140089999434
##$SI= 65536
##$SIGF1= 159.3651
##$SIGF2= -187.1042
##$SINO= 113.3802
##$SIOLD= 16384
##$SREGLST= <1H.CDCl3>
##$SSB= 0
##$STSI= 65536
##$STSR= 0
##$SW_p= 29940.119760479
##$SYMM= 0
##$S_DEV= 0
##$TDeff= 32768
##$TDoff= 0
##$TI= <>
##$TILT= no
##$TM1= 0
##$TM2= 0
##$TOPLEV= 0
##$USERP1= <user>
##$USERP2= <user>
##$USERP3= <user>
##$USERP4= <user>
##$USERP5= <user>
##$WDW= 1
##$XDIM= 65536
##$YMAX_p= 427502444
##$YMIN_p= -1242862
$$ End of Bruker specific parameters
$$ ---------------------------------
##NTUPLES= NMR SPECTRUM
##VAR_NAME=  FREQUENCY,     SPECTRUM/REAL,   SPECTRUM/IMAG
##SYMBOL=    X,             R,               I
##VAR_TYPE=  INDEPENDENT,   DEPENDENT,       DEPENDENT
##VAR_FORM=  AFFN,          ASDF,            ASDF
##VAR_DIM=   65536,         65536,           65536
##UNITS=     HZ,            ARBITRARY UNITS, ARBITRARY UNITS
##FACTOR=    0.456856943014862, 1,           1
##FIRST=     14782.0589164792, 0,            0
##LAST=      -15158.0608439998, 0,           0
##MIN=       -15158.0608439998, -1242862,    0
##MAX=       14782.0589164792, 427502444,    0
$$ Real data points
##PAGE= N=1
##DATA TABLE= (X++(R..R)), XYDATA
$$ [...]
43951 103008 110397 88570 -32934 -175635 -231549 -239318 -262129 -191153 92354 423454 501243
43940 501243 325368 197225 245715 256747 79240 -106173 -112351 -76861 -216751 -442744
43930 -442744 -495759 -348314 -193682 -105826 8072 126571 62676 -232931 -527213 -571474
43920 -571474 -381379 -166828 -87613 -153052 -275903 -346538 -304987 -194354 -107192 -57941 33145
43909 33145 202602 359104 390639 315146 265426 329072 438390 434151 244786 2217 -51085
43898 -51085 193808 573574 795418 715447 448001 217328 151175 219831 316853 352930 283024
43887 283024 92261 -189798 -443967 -492003 -266710 42183 111433 -184141 -618016 -842480
43877 -842480 -721796 -389204 -50051 175199 256981 226556 160924 129969 137377 141467 120022
43866 120022 84490 63581 108654 262363 467604 569078 479874 286495 106622 -75049
43856 -75049 -302855 -460494 -372077 -76986 186709 300735 387147 556664 720160 751149
43846 751149 678952 591989 476384 296460 137261 105574 145922 107758 -33501 -159936
43836 -159936 -197470 -186501 -168111 -122602 -35466 75863 205041 328091 343694 172117 -76041
43825 -76041 -178055 -94226 -40336 -182492 -393108 -433764 -281966 -131605 -127628 -246173 -404492
43814 -404492 -536035 -556938 -412870 -199435 -101872 -153296 -171670 -17948 192487 250797
43804 250797 149407 74114 124377 183245 107460 -51857 -98871 61533 291026 360894 213998
43793 213998 32158 3715 81154 76151 -31633 -55132 75981 148193 -22213 -267420 -292471
43782 -292471 -129761 -91024 -272536 -397925 -237891 69462 262579 312778 350556 383732
43772 383732 299227 85123 -115190 -154780 -731 250806 416532 373930 230639 223227
43762 223227 378353 450959 315524 201850 335587 547106 530096 342939 299601 426354
43752 426354 411346 129411 -151774 -208155 -178942 -270357 -400642 -360257 -147237 70721
43742 70721 210176 300156 337304 275992 124285 -54092 -191816 -220461 -107947 54942
43732 54942 113021 43867 -25257 -38057 -79390 -157201 -115682 107907 329920 385904 375256
43721 375256 450890 527827 437214 253908 212557 352156 481814 477392 395492 297591 166823
43710 166823 24279 -44559 -16390 41658 77831 81344 30779 -58231 -75079 53893 218797
43699 218797 264729 224824 235162 266516 164574 -44451 -119219 70685 366086 521070
43689 521070 437442 174470 -116477 -252669 -183448 -98669 -194200 -349073 -276310 4022
43679 4022 147098 13866 -102483 59216 332419 415645 313227 219761 163489 58343
43669 58343 -30504 22650 134247 123210 34864 61116 167937 117009 -108262 -208163 -3638
43658 -3638 296917 415667 367444 319775 272917 117844 -79857 -106319 78575 250184 227209
43647 227209 123653 169700 359472 432387 225718 -80883 -166720 44466 315545 405110
43637 405110 325245 247833 262176 317871 345478 327976 267319 162541 24673 -137320 -333153
43626 -333153 -547521 -707654 -755602 -725855 -675552 -558191 -269306 158557 498314 534938
43616 534938 297481 30830 -59083 4267 38868 -68937 -252763 -385367 -445216 -494545
43606 -494545 -520985 -410398 -117757 213634 369021 267601 23175 -157283 -124614 86208
43596 86208 251470 168290 -92560 -250858 -187778 -106393 -206566 -352761 -268362 33686
43586 33686 265565 294635 298736 426591 542385 451576 205048 -187 -109877 -210112
43576 -210112 -292453 -223188 25913 273065 329491 219104 122661 155232 267185 339686 315017
43565 315017 234379 194962 273076 440040 538111 396384 20563 -364059 -514484 -400374
43555 -400374 -189232 -39746 8047 -35968 -161594 -305140 -361604 -316383 -274967 -294203 -279983
43544 -279983 -144682 23168 70153 3243 -24316 74297 236922 368402 432925 436361 408035
43533 408035 390617 370358 253748 12806 -190286 -157693 79537 284448 300323 184955
43523 184955 63531 -4627 4061 88107 161884 125683 35171 56167 204759 295325 220712
43512 220712 113356 113604 137307 33211 -146779 -216433 -128054 -3701 74403 141696 218203
43501 218203 243125 179312 79701 5770 -51859 -131548 -219463 -245287 -161421 -30660 -13874
43490 -13874 -207257 -480060 -560536 -336278 4705 196425 182888 101051 51447 7923 -76208
43479 -76208 -194731 -327226 -456035 -530294 -491241 -354739 -213061 -140169 -134635 -152365 -150309
43468 -150309 -102549 -19398 47943 54012 4782 -62563 -119870 -145090 -118111 -50204 24790 111970
43456 111970 240191 353275 319885 128424 -37265 -37623 8749 -80406 -221701 -163679 87522
43445 87522 194290 -58947 -442362 -569137 -366115 -76459 113168 236512 355668 414764
43435 414764 362273 280396 283646 356327 381731 291334 106317 -128241 -350394 -441156 -303572
43424 -303572 -20781 171981 141286 -5647 -109205 -174323 -267008 -293568 -100388 216172
43414 216172 335049 126097 -155624 -209336 -47493 135741 282889 433011 477340 246142
43404 246142 -152560 -345764 -144170 212412 378177 322555 281869 385886 504467 461254
43394 461254 268269 93563 50282 68464 -23174 -299462 -627824 -765040 -579026 -184364
43384 -184364 143486 208915 72887 -25062 53061 178363 136240 -65742 -202679 -160341
43374 -160341 -96498 -184986 -345311 -377565 -264358 -157475 -118375 -65698 21377 31379 -101424
43363 -101424 -286062 -394931 -390794 -301507 -174150 -87549 -104725 -171974 -161189 -51372 25873
43352 25873 -36576 -186719 -297060 -301598 -215454 -105700 -82423 -228968 -484192 -660801 -629803
43341 -629803 -438421 -226162 -90148 -48925 -60037 -46277 28702 99928 86687 27289 28737
43330 28737 94401 133912 148011 238839 389267 403224 167628 -157811 -327614 -289556 -168856
43319 -168856 -60460 41322 151862 237673 238840 107065 -141871 -388443 -482901 -389519
43309 -389519 -206583 -45336 32392 -19532 -194846 -364886 -398396 -366668 -458344 -663416
43299 -663416 -742902 -571757 -299650 -86875 91834 262955 314121 205161 99346 96523
43289 96523 50304 -140064 -283257 -204171 -88854 -208359 -470304 -593004 -589386 -688678 -857856
43278 -857856 -822797 -566923 -395259 -429763 -424120 -208175 23873 34807 -130407 -307229
43268 -307229 -442483 -490229 -322663 44483 329519 302748 90636 -20709 36797 106093
43258 106093 70483 -44830 -167125 -230350 -187091 -75304 -27053 -134113 -347760 -537992
43248 -537992 -579240 -395084 -60026 157319 56205 -174297 -144318 168846 338348 107849
43238 107849 -215889 -220345 31217 173913 98932 8639 36680 131064 245460 357088 348199
43227 348199 148448 -50854 -4574 204457 285401 207511 211445 341591 344885 140084 17288
43216 17288 166472 321965 157954 -186553 -299707 -94395 103162 38469 -177762 -310826
43206 -310826 -310347 -274266 -262994 -279096 -343220 -460389 -543735 -489753 -337305 -243187 -251906 -193251
43194 -193251 82162 430310 536930 319503 36625 -70464 -78021 -191848 -403737 -530365
43184 -530365 -515358 -474716 -456782 -369800 -187007 -36131 -8104 -24355 18963 92555 106275
43173 106275 46197 -38336 -107835 -134469 -112807 -117407 -247769 -452044 -520446 -355591 -152993
43162 -152993 -181961 -441128 -662126 -637379 -428985 -245650 -211272 -290178 -377394 -411849 -407690
43151 -407690 -396480 -364645 -277656 -152585 -49399 18041 95152 184237 202947 102574 -24300
43140 -24300 -23103 154888 407742 587060 618915 549737 497078 524592 556427 468544 273991
43129 273991 131463 129674 159822 82332 -61041 -113605 -37708 35525 -15893 -175358 -343863
43118 -343863 -442282 -441522 -362565 -273793 -240600 -259647 -279278 -286099 -321266 -398981 -458012 -425560
43106 -425560 -307661 -190453 -149713 -163841 -129291 16946 202942 296627 273516 238947 263835
43095 263835 290908 259435 221015 227747 194108 24563 -166150 -147598 87351 256163 142320
43084 142320 -124061 -257246 -183516 -76525 -81608 -159264 -212068 -236205 -282264 -334217 -301617
43073 -301617 -129497 112124 256362 169994 -118394 -419034 -536855 -443950 -291288 -246684
43063 -246684 -330700 -415552 -374978 -220801 -82830 -60864 -123563 -169189 -152435 -102520 -35281
43052 -35281 74376 213326 303317 307872 304343 375962 477389 495575 414528 315558 223892
43041 223892 80755 -101794 -189072 -108394 18156 37063 -15657 7547 109236 129040 -4858
43030 -4858 -162987 -215854 -210012 -235479 -224160 -37073 280712 490580 446183 279657 234715
43019 234715 375837 533471 514190 307354 76646 -26385 -26176 -90552 -319477 -586647
43009 -586647 -651457 -447887 -194042 -146819 -285449 -333493 -102869 279480 534890 537352
42999 537352 371490 158266 -39078 -148626 -91152 88557 222029 243998 303041 513574
42989 513574 699374 576816 158669 -225983 -329484 -209320 -17819 207384 426865 474683
42979 474683 243527 -113303 -338916 -359581 -269741 -122982 78839 245704 247140 97340
42969 97340 -61173 -146371 -166190 -96886 87313 275694 306503 208742 171834 245152 263064
42958 263064 126212 -32100 -47825 61656 168987 184518 79041 -87446 -121454 121108
42948 121108 446437 452128 57060 -338236 -374172 -169982 -39173 -20958 18550 26594 -133193
42937 -133193 -328865 -283348 -27953 104308 -35534 -233782 -265840 -146906 22609 179899
42927 179899 188572 -103878 -557151 -742818 -443749 38169 245929 81132 -201550 -349088
42917 -349088 -274536 -4532 325739 498438 417120 241839 180501 209981 155592 -15024
42907 -15024 -156632 -186782 -190585 -257951 -348336 -368288 -304703 -239655 -266105 -391021 -504431
42896 -504431 -487009 -378301 -357616 -487564 -569961 -384198 -9520 247194 234298 108628
42886 108628 75232 123568 106040 -29551 -199681 -322721 -381124 -355145 -208208 14302
42876 14302 156013 111264 -17531 -29212 107747 218718 195154 151852 195348 185437 -53391
42865 -53391 -363923 -386615 -90167 110753 -105402 -545144 -793216 -735895 -577555 -480073
42855 -480073 -432377 -405748 -404386 -381875 -298194 -238668 -298427 -379201 -296786 -76931 61530
42844 61530 27695 -45840 -58442 -75122 -134043 -124328 31702 231343 334600 321378 218724
42833 218724 26680 -169223 -170220 86890 365337 387315 187991 48160 121426 288200
42823 288200 359474 276656 105491 -41858 -65724 33742 118898 60453 -80477 -124245 -29672
42812 -29672 51434 15461 -29764 67248 264309 371536 293588 119185 -21621 -91260 -117639
42801 -117639 -122736 -132198 -195923 -320191 -396257 -279179 29296 325609 383456 180804 -83589
42790 -83589 -199931 -148017 -79495 -120634 -227849 -264481 -198697 -152061 -214872 -291607 -229314
42779 -229314 -52758 69223 85078 113223 183592 123550 -162650 -466814 -525710 -386302
42769 -386302 -304357 -352439 -372288 -288692 -209639 -185841 -121165 11095 97940 118475 208977
42758 208977 381755 423175 235273 44749 56443 108598 -56315 -339291 -418647 -249245
42748 -249245 -104045 -132022 -183851 -125628 -48799 -65902 -113823 -76075 58000 245220 453984
42737 453984 602919 581551 411490 249078 158238 35231 -157813 -260442 -152497 17609
42727 17609 9695 -192612 -393493 -440531 -325348 -93711 183552 371751 350649 149553
42717 149553 -84759 -249260 -339562 -376556 -374579 -364757 -360218 -313982 -192026 -56757 17596
42706 17596 77607 218568 399303 470023 400174 335843 378989 437860 379345 229474 121686
42695 121686 112709 153088 198745 244959 261818 201557 96788 68806 182262 335006 354124
42684 354124 193484 -14657 -115260 -92250 -42353 -23630 5852 96387 220266 313934 361590
42673 361590 390002 409433 407604 381350 328781 233797 111655 45266 104256 234515 302720
42662 302720 258552 182725 162080 190402 213067 194698 117004 -7149 -81937 10072 228274
42651 228274 352253 238417 19271 -75482 -34498 -47773 -196374 -331211 -301748 -159704
42641 -159704 -56616 -41878 -47246 -3972 95077 199693 223960 122904 -23186 -83030 -59475
42630 -59475 -84012 -183296 -210477 -106191 -46932 -159766 -256172 -103651 155070 176287 -24367
42619 -24367 -45489 290921 650613 677614 472075 337667 298430 172387 -31139 -113840
42609 -113840 -22279 111540 235406 409473 573235 546079 302385 17470 -197804 -379311
42599 -379311 -492704 -404014 -161130 -39599 -154511 -257545 -107332 162062 266797 201132
42589 201132 177310 243016 243843 146535 132939 308964 512361 501828 228136 -139669 -377725
42578 -377725 -370986 -191874 -33393 -2991 2261 139777 376888 517565 462186 314468 215486
42567 215486 194650 219493 274333 327592 315429 233601 183485 253916 389657 433219 287634
42556 287634 15035 -211967 -254822 -133534 -6814 -2327 -87192 -148376 -162973 -204267 -292126
42545 -292126 -341568 -289690 -190287 -135694 -142033 -155825 -131817 -63488 35924 147332 245420
42534 245420 292797 240078 68600 -141685 -241249 -172168 -58479 -54747 -140770 -170488 -104539
42523 -104539 -67838 -156733 -303299 -373151 -307580 -131036 93461 269771 309839 226112 130411
42512 130411 106030 131560 146244 122473 57566 -30037 -79783 -47138 2378 -46710 -184167
42501 -184167 -264900 -208277 -95512 -27407 -5727 -13208 -83908 -207001 -269049 -189630 -30704
42490 -30704 109761 224663 342086 441310 506208 559427 562580 408761 120766 -78721 -34885
42479 -34885 125030 201861 222113 329772 488350 527364 428322 323170 233508 61731 -147280
42468 -147280 -197152 -64908 -2417 -197278 -515862 -708315 -713233 -622783 -479216 -271760
42458 -271760 -61649 49712 65692 96257 202936 307487 274742 68921 -177715 -273576
42448 -273576 -173285 -37009 -27810 -104137 -117398 -65961 -89512 -206446 -239931 -81291 118451
42437 118451 130186 -68744 -287095 -338729 -200251 -615 95787 36511 -71199 -109065
42427 -109065 -114226 -190353 -289884 -265358 -149243 -162366 -363751 -513894 -426912 -253400 -216434
42416 -216434 -238025 -80180 244102 469365 461101 359666 323679 341612 348003 346441 341806
42405 341806 285217 160607 28617 -66273 -139954 -179068 -108671 84466 270571 296080 158307
42394 158307 13765 15197 151942 255745 187026 10543 -81559 -38329 -26238 -157765 -270539
42383 -270539 -137562 177477 371089 295765 117553 48111 93069 135758 127184 94567 51852
42372 51852 -6782 -65144 -83405 -13802 168271 389970 480043 350971 147342 73215 104407
42361 104407 58446 -61449 -40244 168664 304066 193559 57904 193597 517411 686475
42351 686475 576849 382523 278612 236537 180291 95550 -58581 -339022 -652306 -783250
42341 -783250 -680501 -556046 -595370 -703395 -659171 -416229 -121043 85036 148655 53170
42331 53170 -160107 -331753 -293964 -84021 54976 -51005 -293547 -406116 -269627 -33935
42321 -33935 62470 -55917 -254357 -361862 -340440 -264669 -183969 -78357 46476 105873 45421
42310 45421 -39019 16794 230127 413371 377576 147439 -81644 -170051 -146483 -99809 -45178
42299 -45178 53296 181294 269968 283755 252213 205715 130484 11233 -116452 -184716 -150975
42288 -150975 -31220 97574 128192 9984 -166747 -228601 -119448 -1904 -74291 -298591
42278 -298591 -414835 -261815 14443 152817 101056 21540 7055 -35601 -159767 -203398
42268 -203398 3013 343700 530876 496951 467810 594988 724232 657863 466582 346272
42258 346272 294024 166389 -9682 -55221 34030 64143 12732 127268 493048 770746
42248 770746 629462 265612 174502 471388 752016 654239 280253 -34746 -146011 -144279
42238 -144279 -133904 -134990 -141207 -149596 -152974 -159058 -172940 -130482 62861 366391 564197 476865
42226 476865 158587 -182497 -397030 -461852 -414352 -317110 -236561 -167673 -26825 199711
42216 199711 367028 337788 176974 55304 11879 -34709 -76659 -11895 130643 156211 -23967
42205 -23967 -244897 -316648 -268358 -241611 -252666 -209922 -98150 5472 64564 97146 79065
42194 79065 -28896 -160055 -184481 -95777 -30453 -61128 -90744 -21261 75254 55333 -82877
42183 -82877 -190006 -157848 -35785 66107 128891 222616 356391 392392 182674 -205919
42173 -205919 -496062 -497347 -330567 -252285 -306351 -297869 -113915 99456 153586 74546 30560
42162 30560 87804 157881 147020 59909 -22811 -4784 147669 322201 313470 50914 -267924
42151 -267924 -368170 -195634 61469 210958 210176 107268 -39915 -163201 -205181 -180115
42141 -180115 -147705 -110203 -8819 156550 278387 254718 111381 -17404 -13114 119910
42131 119910 247969 223942 31518 -216103 -430687 -623411 -786562 -816437 -658630 -437954
42121 -437954 -316949 -303585 -329875 -417390 -580275 -656969 -477796 -152904 60833 149010
42111 149010 303738 501778 473640 182266 -30907 44730 169972 87769 -37687 63667
42101 63667 261658 220637 -47419 -216260 -167144 -103821 -144918 -145573 11412 229071 381908
42090 381908 462321 478895 413123 328080 327198 369449 321152 211425 212430 329960 354935 189067
42078 189067 -15241 -115697 -140513 -102191 79314 326424 342226 4152 -393288 -511423
42068 -511423 -404751 -353658 -420542 -442799 -364434 -291701 -251810 -152020 5568 81246 10100
42057 10100 -106470 -157132 -133865 -65221 35664 123873 129757 48973 -44697 -84023 -47272
42046 -47272 59018 176130 190499 60494 -77009 -36696 187691 425562 542554 541836 466578
42035 466578 333146 188269 124083 189084 344206 516727 633629 616072 438436 202628
42025 202628 60615 40621 27948 -66678 -200853 -280976 -267199 -170226 -20019 120342 165957
42014 165957 82634 -71220 -192159 -213285 -157450 -127600 -201136 -303031 -259119 -43289 120222
42003 120222 24550 -221139 -322417 -189906 -10203 72129 127221 227069 266447 138050
41993 138050 -55829 -132866 -93124 -93729 -193527 -266940 -190598 -16419 84917 12344 -165128
41982 -165128 -295569 -321030 -329346 -397406 -444426 -342570 -137103 -6910 4285 45353 190166
41971 190166 298789 263002 212348 291741 371929 220310 -106458 -296029 -211276 -46421
41961 -46421 5360 14817 127911 293822 345516 248014 111851 16294 -48514 -98100 -129710
41950 -129710 -165400 -223007 -257539 -214096 -121082 -51764 -19425 2330 -11335 -94200 -174902
41939 -174902 -137007 1139 104328 136620 197251 290724 257716 63952 -30750 187385 500734
41928 500734 497689 168558 -38390 162413 493865 517985 233322 21230 93469 256285
41918 256285 233036 -2759 -297102 -551340 -758003 -885077 -860884 -676047 -421336 -205004
41908 -205004 -75019 -32120 -68520 -152013 -201815 -148798 -32155 29708 3245 7933 150398
41897 150398 350528 437841 380435 283682 176438 -31821 -336392 -542310 -479377 -199925
41887 -199925 117560 348323 429975 331367 125321 -31631 -106287 -238037 -453365 -506095
41877 -506095 -206553 236530 454297 393839 286219 224360 92825 -105207 -194128 -154028
41867 -154028 -185362 -346407 -417167 -253707 -11106 130782 204563 255944 174082 -63769
41857 -63769 -216877 -103530 99908 151339 152410 350171 658803 732913 484012 199683
41847 199683 123155 193954 257258 278192 263340 174704 18711 -126077 -229962 -324870 -370424
41836 -370424 -274331 -86990 4479 -54286 -95332 -1476 97006 29677 -140419 -206054 -104868
41825 -104868 27261 63003 21638 -5567 16556 37737 -16477 -164796 -337632 -429445 -392062
41814 -392062 -272387 -164770 -132574 -153297 -130117 -371 148746 139784 -79100 -357632
41804 -357632 -537764 -617544 -631331 -504291 -199734 89867 126891 -31840 -110485 -31423
41794 -31423 -16470 -219699 -489497 -595367 -500781 -304586 -86210 76034 98297 33385
41784 33385 73632 280524 452403 403754 241385 200023 315825 435070 458049 399837 272776
41773 272776 78363 -115862 -225448 -244079 -196922 -76158 74911 123145 25223 -70333
41763 -70333 -54007 -48836 -173325 -263310 -113487 112170 59557 -253766 -426004 -271606 -65821
41752 -65821 -66271 -150524 -136091 -133362 -286062 -412772 -259567 40117 119043 -71754 -206725
41741 -206725 -91513 88674 99877 -27013 -129977 -156347 -138887 -87619 -29564 -31316 -70743
41730 -70743 -4416 220667 434461 458109 359939 345099 449153 504518 394771 190405 17159
41719 17159 -77282 -91674 -26613 70533 108539 67895 50392 153706 347625 529226 650565
41708 650565 725593 745674 665367 473860 229418 11515 -134719 -201911 -186558 -65675
41698 -65675 171907 453866 624744 590398 448789 379014 389675 306680 68377 -115722
41688 -115722 -35736 199324 295879 176786 49568 73992 161840 165636 94708 48781 62992
41677 62992 111067 159962 145060 959 -203754 -285762 -200424 -143838 -265982 -409306 -320859
41666 -320859 -38818 151221 114154 -8724 -94716 -225614 -464794 -625911 -448642 43861
41656 43861 505382 606580 350881 32617 -83328 -3732 76625 47793 -16929 -38006 -68356
41645 -68356 -164890 -239714 -188483 -91131 -111284 -236985 -305681 -268020 -226936 -209331 -119741
41634 -119741 34119 97292 33996 15247 120027 167031 7641 -212757 -286271 -262568 -308015
41623 -308015 -390420 -369905 -307686 -398656 -627415 -754481 -649689 -411410 -158372 59924
41613 59924 142083 -12811 -282570 -397318 -301073 -197836 -174122 -58126 220339 416398
41603 416398 319270 81307 -33341 -33548 -80907 -149043 -92908 43659 81489 18746 16451
41592 16451 88346 66875 -106108 -293830 -398034 -452317 -450575 -319911 -129140 -91908 -260140
41581 -260140 -417367 -388897 -267236 -205542 -180348 -123328 -119221 -267065 -455899 -488520 -369844
41570 -369844 -281608 -298227 -305179 -209088 -82774 -63082 -194183 -396370 -535864 -528650 -413396
41559 -413396 -291956 -175801 23630 298550 458407 358271 123423 8162 98453 289610
41549 289610 476289 592481 539087 297317 89051 176858 470007 570438 291578 -96209
41539 -96209 -256806 -205464 -159447 -158750 -76952 89211 192874 186486 186110 253802 288066 194647
41527 194647 42388 -18824 87012 329568 604459 750019 629074 284463 -37301 -107255
41517 -107255 51834 210599 195143 39176 -117436 -197159 -211282 -178598 -91543 43216
41507 43216 186536 303142 383365 423425 421652 402158 396592 383594 296129 122054 -50933
41496 -50933 -137240 -157604 -184024 -216101 -183172 -54680 115634 248488 289490 219208 74611
41485 74611 -54106 -111104 -144079 -223107 -317618 -337038 -272190 -197643 -144167 -80516 -26797
41474 -26797 -60812 -173212 -226821 -119244 90982 261140 295693 183854 3478 -87723
41464 -87723 19242 217541 260763 65689 -177583 -268792 -243021 -247225 -286553 -241275 -79970
41453 -79970 81094 122178 39252 -65962 -66033 77713 238240 228593 31678 -161897 -198388
41442 -198388 -132570 -81437 -39678 37060 82149 7518 -132751 -218003 -244821 -302632 -421494
41431 -421494 -565738 -709414 -794259 -702896 -421638 -137095 -5503 71936 247196 407269
41421 407269 313346 -4224 -265591 -334472 -315691 -266934 -121144 59299 69188 -91501 -147022
41410 -147022 36756 233847 220712 96334 37756 -20223 -207901 -420063 -477823 -453453
41400 -453453 -538973 -674660 -607476 -299519 -2758 101090 94465 104006 105611 43234 -32337
41389 -32337 -61032 -88497 -170296 -250804 -253731 -234070 -311917 -465268 -516219 -377233 -214690
41378 -214690 -256205 -472246 -590353 -453776 -216195 -92291 -68464 -21490 12511 -70417
41368 -70417 -161136 -45828 205412 277791 107544 1418 112234 140061 -181446 -593456
41358 -593456 -661418 -421597 -282993 -377378 -412659 -188309 110935 234164 186341 107293
41348 107293 59195 61769 146592 243144 168358 -130787 -437193 -492804 -294787 -68162 -1303
41337 -1303 -81308 -149040 -73791 93515 144949 -42744 -315170 -393615 -208050 49114 197648
41326 197648 243933 255512 230336 167048 124722 115890 49377 -123097 -292892 -324875 -236956
41315 -236956 -163874 -190597 -290003 -384575 -418445 -405061 -426697 -529727 -611521 -505713 -212762
41304 -212762 58064 132744 61319 -2506 -6994 9283 47383 133874 209230 159766 -13684
41293 -13684 -145581 -79083 137823 277789 175036 -81565 -243358 -192888 -68122 -57085
41283 -57085 -156378 -224962 -206574 -171765 -176732 -210846 -260184 -290925 -198286 67898 335932
41272 335932 349072 92743 -183771 -296808 -294188 -255816 -149180 18116 103680 30243 -73210
41261 -73210 -66336 2183 19264 -1899 4673 17140 1514 11853 70338 63317 -85299 -242920
41249 -242920 -238148 -111686 -30859 -38016 -58173 -83547 -165795 -271977 -320689 -327310 -361212 -401516
41237 -401516 -383637 -337770 -329280 -319080 -242150 -159094 -153261 -144416 -7443 174243 194924 41730
41225 41730 -98689 -141915 -189557 -298497 -389093 -418273 -437266 -440504 -361059 -251581 -253156
41214 -253156 -335604 -296166 -88426 78231 65723 6141 43357 87439 -9985 -208145 -372753
41203 -372753 -475020 -531962 -477075 -262383 2091 159171 181786 133211 52688 -11799 22631
41192 22631 143113 202040 130427 53822 58036 3954 -225040 -434694 -335945 20346 277361
41181 277361 226891 12156 -125541 -102305 23893 142650 135401 -15070 -139947 -55642
41171 -55642 173067 298034 224823 111010 98785 135377 131196 128553 203370 317413 377443
41160 377443 362996 308736 224152 107138 -7400 -68599 -49746 51546 207724 350309
41150 350309 421193 432627 418545 357479 232843 127644 127645 158061 79731 -58107 -53741 128088
41138 128088 281020 272240 221643 253672 278449 181460 49023 11470 15931 -33301 -50730
41127 -50730 66611 171774 59461 -144231 -114576 148764 278431 99085 -112035 -91412
41117 -91412 -4623 -136363 -399500 -474150 -308751 -155739 -147692 -148122 -56925 16290 -20462
41106 -20462 -71104 -38893 -1689 -51368 -105767 -51325 33433 -15861 -177144 -263440 -205188
41095 -205188 -133121 -148718 -174535 -111047 -18042 -26726 -132980 -187935 -88971 94019 205289
41084 205289 184673 131625 167025 237188 123523 -282787 -758928 -919629 -626137 -130284
41074 -130284 212305 267719 134383 -23763 -55416 136622 470164 662663 500345 113368
41064 113368 -160025 -177705 -114323 -164595 -289822 -333189 -258528 -163393 -118878 -96506 -40859
41053 -40859 43258 84724 26930 -73462 -71826 77460 210219 144852 -44648 -106975 26078
41042 26078 146492 104275 39004 139323 331304 393467 282194 146749 73900 9671 -77294
41031 -77294 -129696 -120740 -103285 -115852 -143818 -174612 -188841 -117000 70150 246913 252280 117157
41019 117157 15340 -14427 -112532 -323427 -467099 -379025 -127385 108546 242880 266493
41009 266493 164753 -14588 -114862 -30135 154571 287488 334018 329673 244492 37569
40999 37569 -212937 -372367 -404243 -350296 -216191 -11403 150429 151482 55942 49870 192552
40988 192552 357990 425494 395470 305486 172128 55262 54164 177158 305136 339667 314292
40977 314292 311165 333092 313723 218435 93113 20419 32866 66269 28495 -76211 -152050
40966 -152050 -160262 -161343 -157888 -38513 204134 350469 241014 64592 109863 304846 302212
40955 302212 17048 -239847 -238015 -131419 -148676 -251119 -290786 -288090 -327286 -333654 -185349
40944 -185349 45254 157582 73804 -113508 -267728 -267698 -53121 254919 391638 249644
40934 249644 34301 -13053 89141 192502 276666 369062 356611 133795 -157411 -286202
40924 -286202 -256874 -234889 -235739 -155062 -35517 -7469 -9363 120975 300700 284279 102571
40913 102571 63922 256971 410219 350596 243009 222448 146112 -70111 -194943 -38481
40903 -38481 195230 204145 26563 -102722 -144699 -203311 -242576 -176150 -119208 -231085 -395193
40892 -395193 -371756 -196430 -97130 -68917 98164 360606 381817 55677 -272928 -272545 -28749
40881 -28749 192493 328777 451591 520219 458828 354942 346304 384955 322223 173878 94976
40870 94976 112587 84684 -52636 -175417 -170580 -106363 -122392 -243309 -382434 -465965 -475591
40859 -475591 -409924 -280594 -132080 -5882 108003 233727 333198 329286 216504 90134
40849 90134 37510 48315 63452 61193 50590 32190 27084 94198 234038 315715 210525 -11925
40837 -11925 -133260 -41228 169319 355190 458558 459198 338935 159858 52913 52011 51124
40826 51124 -7140 -34899 22810 64181 9839 -38413 26386 114099 93288 28951 51564 90571
40814 90571 -10257 -173613 -162762 31264 154174 82437 -12389 23932 99693 85268 37081
40803 37081 63914 138560 192191 253307 344659 368365 247651 81078 6419 -3798 -65868
40792 -65868 -176038 -224304 -172211 -90400 -51364 -85526 -201080 -351907 -433066 -398737 -330001
40781 -330001 -298936 -243846 -96145 44148 13488 -166799 -297232 -255791 -117641 -7378
40771 -7378 49413 96140 165266 274465 437313 629931 769712 750220 511006 113938 -240951
40760 -240951 -353221 -230539 -94392 -115235 -215799 -219272 -108951 -14415 7530 30153 99087
40749 99087 146268 89262 -67307 -244063 -340029 -288811 -130934 -5717 -1596 -57176 -87879
40738 -87879 -132360 -244949 -324561 -247505 -136475 -255342 -588746 -766775 -540042 -140343
40728 -140343 13856 -150617 -323956 -253426 -24810 115598 68004 -58027 -101673 -4949
40718 -4949 152803 225562 122122 -102033 -266196 -207349 59749 317038 314765 4693 -409855
40707 -409855 -677071 -723293 -656198 -600400 -597034 -625380 -632590 -551142 -368668 -179596 -96542
40696 -96542 -120658 -171223 -213631 -259239 -269574 -193332 -89821 -69384 -106193 -76447 -4164
40685 -4164 -68700 -297592 -462572 -405816 -268207 -217756 -137645 170507 595760 810653 717883
40674 717883 548149 505498 550188 570432 546464 469631 291782 53501 -88188 -51682 72747
40663 72747 178690 254243 279404 185837 12332 -72617 -20174 7238 -58515 5794 376215
40652 376215 804725 876750 572498 271115 213383 266205 254269 206756 166042 50371 -121121
40641 -121121 -131141 89943 255507 128380 -66262 30627 307720 309391 -56844 -356818
40631 -356818 -277025 -58823 -81187 -310948 -440720 -367244 -236409 -131470 -4391 130450
40621 130450 188914 195651 254188 339510 323601 212122 147135 151439 87326 -74803 -163589
40610 -163589 -79556 34062 22371 -43573 -11168 97397 130013 21982 -163372 -334912
40600 -334912 -398581 -271197 -406 204266 187002 21983 -134288 -256679 -374709 -413408
40590 -413408 -320593 -252119 -375471 -545978 -464162 -148049 59037 1257 -91094 -33429 8022
40579 8022 -145804 -326133 -285346 -125529 -128688 -279434 -301852 -130809 -5764 -61714 -144738
40568 -144738 -133273 -158448 -341337 -531736 -508829 -300526 -113575 -40220 -10378 25252 32489
40557 32489 -3519 -42730 -55082 -35170 18925 61054 -12268 -215153 -365112 -260850 48142
40546 48142 303774 349344 260187 153791 26704 -158577 -357408 -499579 -562374 -512158
40536 -512158 -285488 65111 310415 280860 110196 85578 269383 426889 349791 96965
40526 96965 -146210 -304916 -406235 -444718 -402627 -356140 -414263 -545384 -585130 -449514 -244259
40515 -244259 -118633 -92690 -84081 -35080 55424 171513 276090 307782 261189 237498 324652
40504 324652 446975 439198 274354 106009 50515 37932 -54000 -211195 -319129 -318817 -226333
40493 -226333 -50443 185279 356456 310504 65008 -166622 -207828 -110302 -51420 -92778
40483 -92778 -123734 -39457 100823 140867 28533 -112230 -142109 -89859 -91362 -154422 -108121
40472 -108121 143919 424756 464895 230625 -58875 -212585 -221176 -138124 20363 204713
40462 204713 309224 300951 258524 216135 99293 -93958 -188763 -52310 187051 299313
40452 299313 260171 235813 311354 406961 442215 412962 305593 103852 -100793 -170925 -128335
40441 -128335 -134255 -221884 -226441 -56724 144802 228002 251998 324267 374090 282975 131391
40430 131391 90609 130864 77990 -56554 -63918 93336 160729 -25932 -252508 -214682 51671
40419 51671 244806 213433 69849 -75880 -246148 -416790 -439318 -268574 -105248 -152465
40409 -152465 -327833 -379372 -237517 -88896 -95775 -182469 -154078 54029 300488 382244 240801
40398 240801 47207 58023 337201 651052 713087 509494 287833 234522 283837 275951 186355
40387 186355 121309 151046 215250 167275 -100613 -514605 -796103 -683925 -227030 231647
40377 231647 410543 337683 203549 102027 23255 -9967 46142 151270 213577 206772 164744
40366 164744 100408 23447 -9102 34463 75976 17813 -119756 -246805 -336164 -400929 -402403
40355 -402403 -308346 -185667 -98936 16348 218006 368886 295158 89769 16463 114408
40345 114408 157844 46836 -40499 13916 48053 -93973 -276724 -278970 -122090 12932 72474
40334 72474 128907 182381 165426 96927 62473 77597 107458 167154 263526 302096 207927 83383
40322 83383 78214 145336 107843 -46957 -128634 -21744 166625 288755 342598 401183 458129
40311 458129 428959 264382 14724 -200417 -282377 -239810 -175840 -171834 -220642 -288794 -364978
40300 -364978 -406651 -344639 -215412 -171782 -256942 -296462 -160575 -770 -24866 -151022 -140988
40289 -140988 -5550 22903 -88140 -105606 42633 102950 -78891 -250315 -110642 218483
40279 218483 351974 167955 -78304 -133382 -20036 84610 76747 -16330 -104715 -124154 -101516
40268 -101516 -122148 -198901 -235113 -182965 -157955 -283359 -478579 -540566 -417243 -264320 -219437
40257 -219437 -243966 -223155 -116197 45114 220528 357471 380442 255658 47532 -135813
40247 -135813 -245609 -314987 -390603 -466449 -484258 -391763 -207782 -29653 42889 -1152 -86066
40236 -86066 -147825 -199892 -273962 -322567 -241587 -8016 254786 395189 389983 332725 288501
40225 288501 233401 138603 28335 -77494 -197151 -310151 -320653 -174894 34542 159159
40215 159159 153271 76319 -15430 -98491 -145338 -145561 -130961 -103669 2159 186364 283232 148249
40203 148249 -94525 -164487 17104 246664 326633 258275 117635 -65176 -223913 -230711
40193 -230711 -68301 102189 147299 117127 110337 122526 134233 205428 345605 416532 318196
40182 318196 165512 123327 168132 189202 231024 417230 674056 751619 543851 216004
40172 216004 -15686 -89579 -67352 -40023 -93074 -237420 -350263 -306986 -187612 -210568 -425025
40161 -425025 -615483 -579145 -369182 -179867 -105879 -117331 -174212 -232963 -192693 21682 310092
40150 310092 436034 261719 -103739 -418950 -528453 -432559 -195184 117806 390930 462412
40140 462412 287597 55229 4687 120715 151751 -29293 -245278 -289109 -210890 -164762
40130 -164762 -105507 120346 431042 523126 281950 -35885 -128080 10219 176368 246024
40120 246024 225439 121625 -65315 -240533 -250226 -60907 168452 231800 69360 -192670
40110 -192670 -373296 -396057 -321439 -234556 -139091 4363 169296 263667 242098 152542 53255
40099 53255 -55689 -183673 -282240 -282186 -189649 -104707 -120727 -207984 -227937 -98149 80303
40088 80303 130825 32171 -65429 -85612 -146293 -335525 -503021 -446165 -219925 -62499 -50514
40077 -50514 -39409 53755 134671 150466 204073 346990 449625 415099 358050 402029 429026
40066 429026 235704 -124461 -361113 -316490 -152060 -122896 -282560 -470464 -516751 -395000
40056 -395000 -202234 -44353 39819 60302 29857 -27462 -58583 -45302 -71655 -231501 -453319
40045 -453319 -523188 -336978 -44729 122849 102568 2751 -77245 -136128 -198376 -237178 -201622
40034 -201622 -102175 -40505 -109461 -246610 -264714 -100605 57654 30223 -53833 62049 309438
40023 309438 313636 -56496 -444123 -480643 -263065 -128547 -153417 -160776 -95724 -77076 -115784
40012 -115784 -77031 51713 105097 10038 -93996 -74389 22032 82925 79680 48077 36161
40001 36161 101043 237596 297248 121445 -213863 -429325 -359089 -109054 127465 263975
39991 263975 289219 200910 52130 -57001 -106250 -172506 -276077 -330976 -297903 -257670 -271777
39980 -271777 -293227 -273102 -230273 -167893 -67182 -12554 -139332 -374922 -437886 -230753 -36299
39969 -36299 -137630 -413204 -532801 -422999 -285085 -235326 -200202 -150563 -178463 -293872
39959 -293872 -355465 -280362 -170357 -158149 -240506 -319729 -328005 -277987 -245923 -293437 -357506
39948 -357506 -292239 -104665 -21170 -154491 -248517 -29902 280402 183035 -344713 -718412
39938 -718412 -539035 -143777 -79947 -326279 -424778 -219787 -33377 -112118 -285078 -286669
39928 -286669 -137871 -44793 -97522 -221107 -313510 -312179 -203841 -61043 -2779 -48204 -77823
39917 -77823 -1782 113754 167077 192040 300056 486467 606206 555013 394543 263949
39907 263949 218439 203072 168727 156156 228064 345183 380327 279289 142164 87306 86855
39896 86855 20745 -136695 -281990 -326824 -276758 -159393 13894 177622 212072 85728
39886 85728 -74358 -123284 -55738 29485 56889 4586 -120459 -248360 -241128 -30282 254767
39875 254767 391435 305333 135431 52963 88263 159554 207417 245641 296898 328319 283633
39864 283633 174858 95293 98395 101346 -5793 -164528 -179439 12368 220291 238296 114287
39853 114287 67397 193421 373284 447749 373016 215053 86887 81109 174315 213390 86952
39842 86952 -113873 -208983 -173503 -134398 -133510 -58780 140398 316077 292062 80571 -150981
39831 -150981 -263031 -231420 -116861 -11844 25975 33810 101822 254222 424736 552262
39821 552262 618873 586141 405901 134399 -72094 -132554 -118635 -110973 -90693 -33024 21576
39810 21576 77827 228488 459267 544169 318254 -32759 -166199 -34949 67797 -60145
39800 -60145 -259866 -263508 -60100 124578 134036 36877 -7971 57031 162306 228948 258600
39789 258600 288460 291908 193148 -160 -153251 -157898 -80660 -76466 -179930 -269096 -235458
39778 -235458 -112376 -16468 -14460 -66745 -77729 -7725 51342 -42138 -282776 -470468 -438954
39767 -438954 -271844 -179600 -207369 -211053 -113709 -17033 -12170 -38239 -22378 -29761 -142062 -270437
39755 -270437 -240732 -41026 148066 181157 98958 25398 10281 26136 47537 58833 19545
39744 19545 -101848 -263769 -382482 -434734 -472450 -516913 -504134 -388452 -251006 -220843 -295651
39733 -295651 -325001 -199787 5639 125338 94606 991 -38998 -7089 21705 -11600 -68423
39722 -68423 -59524 27005 86352 23117 -114662 -185094 -122261 1701 77999 70330 29423 45314
39710 45314 163627 306293 334030 256461 281317 517447 733331 635656 328281 198786
39700 198786 329435 358766 51201 -333199 -463497 -435896 -531777 -696349 -637937 -344305
39690 -344305 -124473 -142807 -238120 -245243 -207986 -196365 -154353 -27624 138750 307342 499533
39679 499533 683627 752269 656992 452763 208292 -6379 -84153 3169 98854 60559 5975
39668 5975 123990 300393 237514 -58625 -248295 -166964 -19074 32609 107123 267326 296955
39657 296955 65052 -179876 -161281 20842 125461 189904 385423 621673 651720 485396
39647 485396 367690 385429 398139 347100 342927 416835 441398 358886 281120 297947 352987
39636 352987 364122 328982 270362 196161 138928 130308 129509 75997 528 -18873 14993 44179
39624 44179 70723 120629 133277 32966 -111791 -149838 -62229 25050 42773 54647 118023
39613 118023 190844 200773 117602 -44431 -220155 -315630 -314236 -307477 -333944 -279226 -69853
39602 -69853 128202 91196 -136432 -291408 -239144 -85766 31853 69512 404 -172211
39592 -172211 -307627 -231306 20295 235282 322334 378813 449807 446944 362404 336770 422425
39581 422425 483924 434691 373906 370636 308791 98493 -126165 -190655 -133579 -116257 -185849
39570 -185849 -278838 -359966 -402745 -319623 -78226 166700 212807 59938 -96528 -98285 40816
39559 40816 190454 207850 38983 -196370 -281443 -153463 -1929 -12215 -103857 -73015 81288
39548 81288 168968 126483 114784 251835 426068 470733 390152 297799 225769 127719 19044
39537 19044 -23600 -101 -4792 -78969 -147527 -151835 -152440 -220251 -300206 -289909 -206928 -155785
39525 -155785 -153426 -126912 -83897 -124673 -246175 -299507 -215977 -113032 -78335 -21657 120116
39514 120116 205556 108166 -37354 -41340 6544 -123123 -400014 -560977 -508637 -395121 -303580
39503 -303580 -143870 83165 204760 154549 86125 115281 175459 203568 224544 181055 -36670
39492 -36670 -296966 -286303 -6425 138784 -37499 -173212 43054 298611 123499 -328971
39482 -328971 -487806 -222685 37108 30627 -12109 116694 239660 155926 -8482 -66686
39472 -66686 -101934 -265532 -456710 -471396 -325716 -188758 -102028 3446 89449 41544 -110091
39461 -110091 -203858 -185705 -166307 -222062 -286001 -268663 -167705 -27963 100417 142533 55744
39450 55744 -56371 -11628 201525 357451 270914 40296 -106726 -118777 -105603 -74652 97321
39439 97321 398763 603241 560589 399738 309228 266600 157066 33886 39737 136185 144049
39428 144049 36038 -38833 -37880 -97147 -256991 -337037 -202512 19182 125304 115435 148668
39417 148668 302322 476417 494480 267898 -64965 -182257 83963 456224 472475 79596
39407 79596 -287948 -316667 -209119 -282429 -452818 -414130 -136281 144222 317938 456365
39397 456365 523681 361732 -7963 -333863 -442641 -395280 -308400 -223036 -185177 -256915 -389884
39386 -389884 -453864 -436778 -455757 -527509 -498580 -279881 -12035 94256 471 -136026 -127572
39375 -127572 68162 287428 302153 86452 -118693 -93285 101576 275931 402083 552933
39365 552933 645731 512451 204697 -32674 -112996 -187786 -342594 -468377 -502550 -541901
39355 -541901 -605727 -525142 -222121 91048 156699 -20653 -248618 -400845 -465335 -453773
39345 -453773 -394632 -336984 -270897 -133280 43980 116908 38787 -48617 -28682 17447 -39981
39334 -39981 -179301 -288670 -316993 -260330 -114590 50674 93903 -1782 -51867 77254 249816
39323 249816 237816 22394 -221880 -353306 -331229 -151737 117484 300245 271290 115875
39313 115875 2360 -42838 -95225 -144949 -128127 -97145 -163951 -282429 -278939 -123846 6077
39302 6077 -12458 -88487 -92905 -57033 -89373 -187720 -246390 -204642 -97693 13727 89309 101649
39290 101649 58241 35579 120596 286223 382311 308282 158108 110539 184539 213967 102747
39279 102747 -19137 2306 88213 32039 -181533 -339643 -296238 -141382 -29137 19853
39269 19853 72816 156990 252955 328866 325761 195633 -885 -128175 -144565 -131769 -124238
39258 -124238 -48159 108209 211643 169393 71302 40369 54765 27727 -42558 -113026 -177452
39247 -177452 -194587 -53951 245897 491180 483223 293647 141461 105882 126700 192886 315508
39236 315508 371596 223085 575 27521 386480 759155 811253 587435 393544 395302
39226 395302 490090 535579 545237 603540 683098 653719 475791 294368 273904 386845 455711
39215 455711 383011 231552 80016 -63066 -161597 -116248 78181 254683 268505 186516
39205 186516 170447 244085 297561 271877 218585 198980 220013 258438 287980 307853 369860
39194 369860 503614 591261 451456 123190 -86617 32155 320461 502692 570754 694107
39184 694107 849737 826876 600216 427915 490651 634994 595650 337982 58580 -73471
39174 -73471 -64011 -10554 44076 144706 316493 454580 390459 103208 -202962 -297286 -151585
39163 -151585 83256 264519 347525 349663 313933 278170 230983 150272 105749 204555 380601
39152 380601 395178 160965 -86338 -93265 71117 159884 109072 42910 16127 -15447 -25831
39141 -25831 47074 128805 87828 -36687 -102908 -136098 -287949 -518466 -570751 -330360 -3246
39130 -3246 147249 81028 -63994 -150978 -117633 6981 110503 111311 66311 73133 107688 84864
39118 84864 25128 9146 25888 30531 76574 199273 261753 150649 25511 88643 199227
39107 199227 66240 -231861 -332361 -200624 -199781 -445341 -556391 -266838 126519 213993
39097 213993 37468 -103118 -127639 -131770 -85124 92196 297107 374260 355208 326355 210563
39086 210563 -64694 -331402 -383958 -288093 -222887 -154287 37676 228811 183861 -42324
39076 -42324 -162780 -93728 -22124 -42152 -38757 25432 7531 -139791 -242970 -171843 -28567
39065 -28567 33571 8622 -40761 -101047 -144231 -84462 91940 254360 278023 186061 76176
39054 76176 -4763 -44329 -14258 72696 116750 34505 -118089 -200792 -159131 -76472 -42161
39043 -42161 -20451 92740 287285 388990 258280 -1736 -134812 -31419 161373 255717
39033 255717 245655 256692 352155 458569 447892 269226 37477 -33546 126193 304843
39023 304843 252188 27566 -92771 -46873 -61120 -230805 -326083 -178438 13575 -486
39013 -486 -123302 -95472 91793 257040 367621 514980 639938 587590 392274 225724
39003 225724 95184 -125575 -387565 -485432 -395901 -307141 -277437 -159119 70871 202185
38993 202185 135851 76656 219668 449929 522112 382747 163683 -9583 -60876 63938
38983 63938 314763 501623 465597 244470 -56 -157562 -218913 -229124 -245625 -280995 -266905
38972 -266905 -158637 -71885 -181436 -460154 -666559 -637005 -442656 -211539 23298 210436
38962 210436 208244 -14027 -236214 -219111 4669 214719 297933 309780 307547 290290 280428
38951 280428 308883 311824 178238 -67401 -238991 -197025 -14886 108714 60033 -106197
38941 -106197 -266125 -362286 -422194 -461530 -421955 -251463 -22339 103311 42038 -130041
38931 -130041 -279115 -340445 -326347 -273516 -220254 -185921 -137646 -22690 138447 249043 265566
38920 265566 268091 341729 440479 450347 362022 291260 318643 387507 397654 340682 282149 244171
38908 244171 188672 122415 124548 211059 252104 134384 -34807 -28654 180624 351974 286277
38897 286277 72779 -69806 -76660 -33292 9174 51636 39179 -89760 -259355 -315786 -233883
38886 -233883 -125900 -46294 57622 184064 234653 189289 167257 230883 267486 172570 27894
38875 27894 -36220 -59242 -167658 -324571 -344813 -177700 -7557 6182 -39370 58189 300171
38864 300171 484653 500247 464490 511111 572713 490182 259783 42885 -36743 6526 96788
38853 96788 167669 183530 193194 315276 545666 655599 471817 194623 174133 380680 417165
38842 417165 131962 -125869 -43120 182126 172364 -65184 -223272 -181538 -86360 -39733 -13582
38831 -13582 -27054 -133923 -250883 -233446 -105315 -8211 32858 86749 120216 54813 -33791
38820 -33791 -11542 69315 67463 36220 131116 278908 257734 109212 135228 421527 679274
38809 679274 664328 472799 300779 177780 89781 129344 334342 541585 572008 451839
38799 451839 328040 267560 242127 222395 203985 202235 253293 353132 409798 353225 256521
38788 256521 226916 229933 169509 77479 50065 68333 73261 125481 263356 317159 153064
38777 153064 -6399 144108 482018 630062 601656 799873 1317672 1724064 1695427 1415327
38767 1415327 1157384 897124 576107 354756 317694 267567 97366 46479 281755 526593
38757 526593 450511 179704 68256 160318 228602 194130 164245 148592 49330 -107037 -175744
38746 -175744 -114719 -33050 -52415 -213806 -432944 -494160 -249383 120201 254600 94721
38736 94721 -46854 24890 147563 182116 271730 504183 655385 535532 295647 130524
38726 130524 -23547 -227164 -297563 -142267 -21380 -135986 -256354 -125561 69603 43117
38716 43117 -56301 88255 395475 556894 576555 659852 733769 578007 311480 249213 354338
38705 354338 311077 81721 -77241 -101807 -149850 -179293 16107 340667 441767 270148
38695 270148 155765 264756 400326 412091 394680 395550 316350 199600 241618 419942 463138
38684 463138 296324 177824 283272 473294 581402 627545 640480 558957 416405 362985
38674 362985 422403 471159 493599 582048 665970 561850 334404 268191 406805 462050 283744
38663 283744 84639 63241 115668 86886 39039 94706 223899 334070 401130 412798 345402
38652 345402 256073 233783 242787 198737 178041 320544 547295 638461 580294 556995 606266
38641 606266 579251 444778 328200 241452 89424 -50300 9406 206989 285804 225116
38631 225116 244742 351534 301963 100879 98213 426454 747338 771623 673344 743643 942582
38620 942582 1072584 1167785 1430259 1909207 2476253 3076142 3849837 4953863 6211709
38611 6211709 6961936 6502830 4896885 3116066 2086806 1780440 1579737 1271181 1138973
38602 1138973 1246078 1281278 1144474 1076307 1102588 916922 472124 162532 220327 392463
38592 392463 405228 316207 229307 84498 -89603 -106976 41697 162652 257658 528169
38582 528169 908746 1068984 966213 891798 882226 654513 261806 197810 624664 1079038
38572 1079038 1202402 1206128 1345433 1488904 1508589 1573984 1766188 1897211 1953304 2175799
38562 2175799 2475000 2375978 1814008 1336543 1216839 1065925 679550 510372 818611 1091937
38552 1091937 888410 578566 624762 768272 619095 454143 673586 977488 871682 572493
38542 572493 621113 934183 1004054 787831 683488 816539 979503 1094738 1186071 1108949
38532 1108949 814020 614742 713292 786022 529652 234038 270081 416349 300011 117618
38522 117618 266941 605999 731034 677706 712791 746956 588128 455697 601652 743259
38512 743259 517480 171096 147436 326371 341813 302808 500666 741140 684392 521872
38502 521872 601824 721254 518928 223132 257332 454466 429747 360650 585212 803016
38492 803016 546997 109721 106052 424926 518451 433318 626467 1019632 1159028 1071005
38482 1071005 1071009 1007759 605606 242051 431433 851984 861746 637725 769897 1078400 950679
38471 950679 546051 514134 785817 800744 664761 891778 1261658 1158974 788441 804423
38461 804423 1013029 758180 316325 506273 1151069 1377705 1232699 1491070 2038167 2012754
38451 2012754 1446780 1188083 1295830 1108335 772759 1024470 1567625 1448018 943017
38442 943017 1219190 2165767 2520701 2142742 2114553 2544930 2422170 1784608 1805383 2496500
38432 2496500 2605819 2064486 2179735 3078152 3414539 3002750 3175078 4081310 4310931
38423 4310931 3726384 3875776 4988336 5479867 5097908 5464389 6776024 7287998 6899647
38414 6899647 7676794 9853207 11179879 11373333 13004005 16615885 19542497 21170155
38406 21170155 24342573 29650681 34001724 37235167 43769900 54684112 65480923 75597564
38398 75597564 91581072 115857694 143583634 179175375 241440287 333265329 414084245
38391 414084245 427502444 361202702 261441137 182215643 137007069 108232438 84150758
38384 84150758 67609567 58765635 50159652 39117941 30930852 27901948 25527217 21159233
38376 21159233 17725147 16867124 15747705 12818592 10568663 10414094 10141258 8398884
38368 8398884 7070367 7314002 7397232 6232733 5339753 5642993 5716228 4737557 4045273
38359 4045273 4322925 4204200 3065569 2400336 3032553 3585119 3064125 2494853 2679418
38350 2679418 2696356 1956406 1519766 2036801 2451594 2036160 1737962 2250262 2647461 2205120
38340 2205120 1771116 2064467 2321583 1884374 1504844 1824722 2100905 1670949 1219377
38331 1219377 1393002 1589994 1314913 1317833 2136797 2853649 2593759 2022791 2060352 2283588
38321 2283588 1942677 1483882 1680446 2153816 2095060 1696728 1633714 1807174 1755020 1678078
38311 1678078 1981751 2377364 2412357 2317619 2449972 2526686 2272720 2157986 2618042 3208290
38301 3208290 3396662 3511163 4014188 4531575 4548365 4428491 4781752 5399271 5758911 6031271
38291 6031271 6647577 7402465 7926843 8552731 9772865 11307014 12622967 13928847 15724477
38282 15724477 17805213 19649760 21386028 23400169 25319059 26331476 26257919 25440834
38274 25440834 23896050 21497386 18739526 16375184 14448740 12518469 10629726 9214723
38266 9214723 8218304 7202439 6190903 5559595 5190694 4586046 3773755 3278989 3189040
38257 3189040 3024351 2580614 2174618 1985323 1816060 1590779 1483541 1483781 1377628 1199189
38247 1199189 1187161 1290631 1226026 1012266 944597 1049031 1049596 863026 670606 538402
38237 538402 401495 346192 466839 551784 370350 141145 228659 511516 570592 382249
38227 382249 292307 416844 621381 989362 1714924 2564118 3009668 2909206 2557238 2117031
38217 2117031 1531398 953549 698505 731415 702390 514782 402057 454046 525684 586366
38207 586366 705396 748248 553713 328340 373812 535552 464776 301925 470826 870473
38197 870473 959444 651892 435942 527699 597072 472009 440251 638885 763158 637178
38187 637178 525550 622715 732476 694108 650896 669949 563501 310056 187182 259161
38177 259161 200144 -129599 -395539 -344139 -196362 -191569 -166381 77754 359178 412943 301144
38166 301144 223659 198113 197322 319312 548183 618803 396028 143827 154148 335513 423290
38155 423290 387766 382551 460074 559509 637933 652350 558162 436930 447714 567513 594865
38144 594865 484496 423608 489896 513822 389913 243527 170402 92081 -13027 -25861 47142
38133 47142 23299 -123938 -198342 -163205 -234803 -442166 -474589 -186862 97993 51304 -199722
38122 -199722 -332440 -276699 -149780 1577 144594 171441 87694 74392 185736 235096
38112 235096 145719 116643 249873 336079 234631 132191 168011 147533 -70718 -245001
38102 -245001 -156085 -22544 -117473 -258734 -120406 182116 287817 203610 245239 460055
38092 460055 572728 485765 412550 474378 520510 416997 238180 113760 95109 185240 318184
38081 318184 339495 187451 30741 42451 137456 149055 144780 292382 502402 514571 309267
38070 309267 131860 96476 49592 -120343 -290690 -312543 -217987 -121476 -47120 61294 235855
38059 235855 438397 580453 593524 509126 426180 374660 292701 165057 65362 22856 -6829
38048 -6829 2297 129364 283081 229893 -41932 -232889 -157315 -3928 10325 -25776 33216
38037 33216 76457 -26459 -106351 51645 317128 415510 360721 346571 360453 270562 162147
38026 162147 195656 238033 48736 -241198 -267180 -13244 183618 213019 316244 567992
38016 567992 691653 539901 359699 392516 546554 646306 696743 715093 596036 347423
38006 347423 193635 234912 248018 41767 -218454 -276503 -174442 -122977 -144145 -104995 4031
37995 4031 78494 124115 245795 443232 605075 683729 713696 685554 568211 441912 436497
37984 436497 513186 460989 167846 -219898 -472385 -513491 -407292 -201263 84889 347944
37974 347944 437197 348958 253049 242610 193436 13453 -106930 60688 356707 368322 30258
37963 30258 -236701 -121630 153643 220686 93679 26713 63708 61957 13627 7803 -19696
37952 -19696 -162004 -254895 -75515 221079 247130 -22132 -175045 40060 390807 551980
37942 551980 522699 509719 629529 854855 1077741 1161621 1112565 1197824 1654537 2306226
37932 2306226 2782664 3100436 3621812 4419841 5213938 6096201 7701908 10198575 12538976
37923 12538976 13308934 12160529 9969515 7762030 5985154 4711099 3931439 3463170
37915 3463170 2971569 2325434 1723982 1358077 1159876 989165 848966 779391 710550 568277
37905 568277 408577 322547 297381 275677 272953 331604 411151 419660 331953 212795 144012
37894 144012 178499 338190 589293 810596 839361 596517 174502 -217387 -411354 -387366
37884 -387366 -233412 -41111 133729 252363 303353 327796 383507 483106 596384 684506
37874 684506 695166 586491 427458 397143 570117 780101 849575 869424 1022906 1185081
37864 1185081 1014159 501471 103828 159623 453636 594391 580326 680324 914779 1021109
37854 1021109 902955 784191 862053 1064313 1227984 1304224 1292259 1155394 925790 763364
37844 763364 789549 940342 1069300 1122181 1132547 1120734 1099748 1147701 1374595 1793878 2273476
37833 2273476 2653010 2923192 3275745 3925325 4854118 5803278 6615553 7550078 9087982
37824 9087982 11317200 13576924 14845770 14540576 12932976 10820963 8870614 7281514
37816 7281514 5956537 4820287 3925392 3353513 3103503 3042850 2925986 2540107 1928041
37807 1928041 1407565 1251220 1382896 1510562 1505290 1472658 1474147 1415951 1280489 1235167 1358693
37796 1358693 1432936 1198862 717630 297012 123178 130636 191097 262795 354798 473367
37786 473367 612885 718885 695409 541787 424074 482650 614839 602127 435570 344538
37776 344538 470287 665165 695164 540604 405822 471786 696979 852154 739421 394154
37766 394154 59972 -58425 15454 120295 174408 223790 318172 444302 575750 698349
37756 698349 780191 789617 745612 687914 609230 488216 373303 345030 391724 407844 336849
37745 336849 248746 247762 343834 436444 418219 311388 297098 535943 933057 1190170 1163774
37734 1163774 1047092 1070046 1147791 1034067 746610 579357 678491 858944 921747 926056
37724 926056 1009241 1118313 1098587 941567 777552 683913 642782 644821 703996 791982 864269
37713 864269 925318 967869 887652 595394 215083 25902 142319 351037 355639 131193
37703 131193 -62196 -13887 184177 271251 145878 -34134 -81259 -4503 57344 46206 13150
37692 13150 -28150 -131865 -273967 -309679 -162866 32426 87039 5253 -29991 92973 279604
37681 279604 363068 298278 189042 169090 285474 466993 584149 564086 459445 376853
37671 376853 335496 253193 101270 -140 71741 240293 297753 191128 103470 173444 266218
37660 266218 175714 -32494 -94156 44013 123524 -30136 -223989 -175115 82713 272344
37650 272344 253563 113020 -63612 -266265 -414275 -387462 -257687 -253784 -401392 -429887
37640 -429887 -187002 71882 28857 -225137 -331147 -180244 1533 63214 116557 249956
37630 249956 346718 338216 391596 626144 825490 706708 381301 250808 441248 622451
37620 622451 474957 98577 -187492 -266695 -262386 -271674 -261016 -182870 -32511 192924 458787
37609 458787 641371 645293 547059 479783 405451 183835 -130873 -280689 -166789 -23418
37599 -23418 -98592 -318856 -434204 -378602 -295437 -264931 -205698 -60094 83062 109272 26788
37588 26788 -58733 -65177 2393 75629 94716 72355 75680 129371 170509 129359 16533 -104691
37576 -104691 -186368 -194921 -101232 61657 176263 154550 54288 18608 111804 259242 331608
37565 331608 259593 98929 1207 63879 192225 195704 46627 -78728 -71103 -45690 -116169
37554 -116169 -169120 -47814 150898 185016 21309 -136913 -161372 -128306 -126163 -141406 -175708
37543 -175708 -276561 -378943 -299466 5381 315734 393001 244921 56119 -47096 -69079
37533 -69079 -65468 -87389 -153125 -210656 -183818 -101495 -101329 -239549 -373108 -319388 -92586 97746
37521 97746 72554 -138911 -338510 -350398 -175283 47204 224909 401442 616073 764025
37511 764025 714200 517339 357613 315761 319383 311825 307084 272758 139885 -35226 -100403
37500 -100403 -50534 -48473 -126431 -79747 203122 499509 538031 386872 337700 483568 636580
37489 636580 642620 566125 522751 495823 402932 250096 134471 121412 169617 186811 146230
37478 146230 119148 168796 251732 285793 273428 255757 182511 -17161 -237118 -259581 -71587
37467 -71587 75314 9943 -146135 -224809 -255356 -287041 -183079 143778 444613 405500 140523
37456 140523 80826 352888 589340 462870 130893 -27313 80761 222953 208391 95830
37446 95830 54517 149156 281631 290159 111465 -132394 -244059 -164807 -21663 57057 84912
37435 84912 122326 130634 25507 -167877 -322302 -366964 -347472 -319755 -278380 -229515 -248965
37424 -248965 -384879 -543078 -560253 -394944 -179018 -69209 -103304 -203153 -245457 -122277
37414 -122277 168610 456341 525007 366848 195940 140542 73265 -124657 -300562 -254344
37404 -254344 -99853 -113308 -274515 -282885 -54905 126477 60665 -82644 -81842 10971 63248
37393 63248 130719 292013 418934 369684 246930 208494 178561 26546 -111804 -19746 186897
37382 186897 185162 -40645 -162596 -27346 126118 75131 -55527 -41680 77317 78567 -121131
37371 -121131 -378975 -501246 -406822 -167115 52675 128308 73890 -28489 -156941 -324845
37361 -324845 -480444 -558798 -598642 -665303 -689547 -550349 -303429 -142754 -120438 -86272 63438
37350 63438 253331 385246 451400 438517 293374 59067 -107848 -135177 -117283 -138210 -154782
37339 -154782 -122462 -89707 -80444 -14726 156844 342853 418126 359726 229458 113194 100515
37328 100515 205141 284610 180095 -39166 -132433 -22201 110210 117049 71372 75515 85521
37317 85521 51275 49346 129773 185418 123458 32258 34865 104268 160687 217771 285967 267942
37305 267942 117185 -22504 -14198 43341 -29357 -199776 -283060 -231840 -170238 -168258 -161669
37294 -161669 -95562 -3797 61251 74176 24639 -54896 -82496 -25336 40965 35910 -31705 -127348
37282 -127348 -241430 -311858 -243614 -106293 -138475 -400311 -593673 -438340 -85579 88053
37272 88053 -5636 -126165 -113807 -55694 -45047 -37468 7194 54736 119862 273292 471417
37261 471417 540127 387519 114621 -110626 -185303 -95100 66134 126594 21831 -91744
37251 -91744 -55307 31808 -36009 -227295 -326127 -291331 -289361 -365551 -372251 -269996 -205334 -201777
37239 -201777 -69106 239801 455519 361231 108779 -33029 -49422 -84383 -139241 -102901
37229 -102901 19405 120122 165944 187057 156465 40383 -91304 -151459 -173298 -226128 -257709
37218 -257709 -158822 65932 310557 491526 556044 456163 239193 70728 29979 -18657
37208 -18657 -195033 -358174 -299619 -100164 -48806 -225235 -401535 -388054 -261369 -184035
37198 -184035 -176924 -153372 -48061 151726 390969 524270 429777 184058 3605 -18092
37188 -18092 13589 1279 -26593 -54950 -156325 -326569 -410516 -319134 -176210 -104015 -5912
37177 -5912 244174 504166 498416 224282 -10007 5882 139051 157407 45753 -49665 -71523
37166 -71523 -87253 -120081 -95196 16816 100586 5391 -270453 -549857 -645439 -543000 -392178
37155 -392178 -316813 -287670 -222904 -153071 -181250 -290216 -317471 -173763 19275 94243 61133
37144 61133 59342 134563 181520 105046 -58071 -192413 -211247 -106058 50430 151989 164245
37133 164245 167837 240959 337627 366040 342821 350956 377690 342779 275063 285295 348774 318884
37121 318884 213319 257646 518459 713908 583717 269000 91394 99819 111624 99833
37111 99833 207368 386946 367593 73759 -207924 -229816 -124434 -165171 -357138 -468426
37101 -468426 -370093 -158818 14400 87509 76322 33629 17586 31522 10056 -92537 -238902
37090 -238902 -367128 -452311 -476471 -421570 -339201 -323384 -343983 -229782 63810 285361 169669
37079 169669 -158514 -269009 44844 487958 611093 332294 -11075 -91342 61828 187718
37069 187718 165433 123858 182452 238869 130544 -87291 -194607 -114237 9064 62137 119349
37058 119349 268670 434480 487972 431764 371735 383938 483482 631472 705516 580696 318548
37047 318548 141942 133214 122388 76 -53815 144500 439120 537240 439110 382233 433643
37036 433643 445770 388942 399954 465904 383281 127431 -33306 65953 231695 218713 70160
37025 70160 -31158 -59272 -92071 -114368 -78625 -49327 -96334 -137311 -66939 37511 18516
37014 18516 -114892 -210675 -197545 -131631 -60953 11300 60194 64796 69748 116045 163384 180198
37002 180198 225739 323482 359248 260891 174040 269328 463010 536080 448952 308691 111868
36991 111868 -187126 -398136 -235973 208528 468204 287389 -74097 -253280 -215866 -108101
36981 -108101 42080 238006 349505 300112 260555 400430 575934 521969 258003 50777
36971 50777 41796 144268 242541 261979 114208 -170541 -318405 -107085 242441 278741 -60881
36960 -60881 -367030 -358911 -234612 -278509 -423746 -424995 -244520 -33736 113975 182570 138812
36949 138812 21382 7756 184131 342343 218697 -128881 -386136 -378887 -208933 -34800
36939 -34800 72209 63931 -74530 -213310 -165812 50340 195064 107512 -115154 -294385
36929 -294385 -372994 -364247 -255283 -88050 -16554 -128102 -277273 -256082 -96210 -33945 -154553
36918 -154553 -235742 -37627 361795 648197 636365 420036 171520 -44601 -196860 -187739
36908 -187739 11863 212864 185490 -21996 -128563 -20207 85674 -29530 -262035 -344578
36898 -344578 -210407 -22737 91178 152206 191217 168580 68455 -44371 -105815 -115292 -94524
36887 -94524 -51058 -3881 6893 -42897 -133903 -203665 -170451 -8316 184302 268943 250742
36876 250742 272940 379783 427409 327326 219173 243527 290285 186161 17633 10444 152729
36865 152729 216207 139272 106512 210674 307053 283008 226168 221172 201206 120321 72257
36854 72257 109974 130320 71244 52656 179576 358883 452276 466847 454177 367037 175364
36843 175364 -1295 -39859 9405 34513 41980 81254 102443 51042 7291 65144 155499
36832 155499 156578 110888 164845 340227 517537 608057 605824 504711 292945 13677 -253887
36821 -253887 -438666 -459391 -263643 45790 249491 266715 236772 256677 220115 54295
36811 54295 -80119 -16654 162920 302801 417346 531531 481039 173276 -119746 -72572
36801 -72572 211608 378187 360207 344859 301738 21381 -376823 -468916 -158349 162637
36791 162637 215206 159467 152648 45392 -216795 -318791 -59987 230033 157091 -119670
36781 -119670 -149024 127294 373895 422213 409076 402458 290295 73984 -66458 -67193 -65873
36770 -65873 -133907 -173459 -138247 -111633 -90965 65232 366316 582442 550309 413813 405696
36759 405696 523949 589465 529453 429902 350693 253099 117386 -3626 -89085 -203680 -380476
36748 -380476 -521936 -506427 -363599 -248613 -236186 -238097 -165648 -74393 -63387 -113464 -143003
36737 -143003 -161113 -216216 -230225 -69066 206517 349263 244725 51175 -58301 -119762
36727 -119762 -231719 -350608 -387748 -380304 -395133 -365539 -208179 -29158 -17554 -161212 -246995
36716 -246995 -146277 47336 171090 155321 30721 -103719 -113606 55971 284396 384545
36706 384545 305705 148862 14657 -59495 -53329 7865 1648 -163585 -369914 -393440 -202354
36695 -202354 6696 101972 173165 319489 446026 403762 230549 115679 170894 337671
36685 337671 482693 495976 332034 56098 -153165 -134133 93154 330526 387798 251555
36675 251555 76382 34310 170509 376482 483223 388779 131696 -121185 -172189 47460
36665 47460 371154 509007 343732 85727 48001 277807 508958 494418 280179 91394
36655 91394 35738 20290 -75051 -251680 -435684 -576707 -647167 -600139 -415469 -184555 -63384
36644 -63384 -97861 -157493 -110307 -20889 -79076 -334575 -600387 -654610 -464358 -171720 68223
36633 68223 181108 174995 128211 139532 221603 271877 213305 130210 175960 349805 460742
36622 460742 356450 123014 -16831 12786 43395 -107903 -374788 -510784 -414912 -257304
36612 -257304 -218800 -236037 -138411 53045 140991 31888 -175714 -375085 -540690 -619448
36602 -619448 -530033 -327482 -190538 -176699 -157869 -61373 15903 14783 24723 71335 9130
36591 9130 -213941 -383926 -302104 -67760 109439 205879 286700 294414 183300 105875 196341
36580 196341 313528 287793 273008 502891 809544 790146 420526 92130 9220 -39499
36570 -39499 -214190 -329492 -204814 19749 124208 105510 44711 -81036 -256231 -313508
36560 -313508 -172015 -14914 -36951 -171509 -243203 -230369 -194339 -107372 47031 136697 48010
36549 48010 -120706 -225916 -324333 -536596 -758839 -754081 -502678 -241199 -141150 -140076 -131966
36538 -131966 -156107 -298091 -487769 -504775 -212287 240677 508794 393639 58474 -175762
36528 -175762 -193535 -113192 -9676 170557 392811 472405 338466 165653 115461 117200 44321
36517 44321 -51213 -39806 74525 188337 237420 188176 21026 -163473 -169324 41359 275153
36506 275153 402537 524208 691815 705736 431258 106325 40380 164482 191064 92591
36496 92591 80930 188922 226715 138993 74854 82551 40381 -70874 -115332 -70674 -69922 -112761
36484 -112761 -14826 261846 488713 497518 396892 345170 327812 293205 300976 374810 377728
36473 377728 201546 -43649 -174446 -167176 -125679 -112167 -122590 -153492 -202614 -261833 -349560
36462 -349560 -464525 -499711 -345190 -101729 -13881 -132231 -233254 -159948 -34523 -6653
36452 -6653 -6742 61937 78239 -99768 -324591 -329997 -156617 -118891 -323285 -486782 -340749
36441 -340749 -9912 167525 71508 -117812 -212327 -215905 -207548 -171907 -52728 90828 111281
36430 111281 -29301 -186349 -200419 -66645 101228 195182 153284 -24386 -221142 -268728
36420 -268728 -176234 -191262 -489317 -891651 -1060438 -898121 -569408 -216465 102587 253537
36410 253537 115483 -143838 -186140 23945 150526 -1458 -205493 -211786 -134772 -196339
36400 -196339 -314329 -246013 -3990 159865 119916 -14208 -111761 -139802 -103693 -45772 -66096
36389 -66096 -193250 -294071 -258200 -181250 -189094 -183698 7480 296480 404555 254732 54077
36378 54077 -34301 -73153 -158133 -253314 -297771 -307355 -290135 -200555 -52144 45691 35274 -4675
36366 -4675 14589 58409 12979 -180703 -440642 -552966 -330270 141883 488953 424409 91131
36355 91131 -136448 -134607 -107544 -216788 -386109 -503238 -563978 -544442 -370328 -114875 1363
36344 1363 -66930 -89977 64895 187916 59702 -166738 -176795 39921 209197 200122 169797
36333 169797 270955 437102 516916 469436 364765 285743 265329 266329 229929 184840 248263
36322 248263 453474 663459 749162 748818 725399 594259 289468 3441 8638 271651 499805
36311 499805 577125 680002 895278 1002725 793028 395176 107228 42457 104885 193076
36301 193076 256571 234948 105682 -48495 -135330 -162417 -159986 -86339 69461 181910 131292
36290 131292 -20312 -143089 -255619 -449886 -652266 -668118 -475192 -286500 -275810 -389797
36280 -389797 -479171 -480923 -416779 -331119 -290725 -346896 -442125 -436250 -268743 -27167 161327
36269 161327 229702 171343 50978 12280 143298 326035 363779 265997 227368 292446 261311
36258 261311 24825 -225190 -279803 -221901 -250892 -340083 -300584 -110811 42900 34843 -73998
36247 -73998 -172306 -208334 -172125 -103189 -101292 -205181 -288235 -203167 2360 147574 157856
36236 157856 102319 40728 -1662 52662 251670 455053 456370 282206 178944 269133 410893
36225 410893 447479 401908 340982 224933 12147 -213247 -334026 -341727 -313134 -315829 -375219
36214 -375219 -455702 -463931 -370814 -316121 -448348 -670250 -726525 -561049 -385099 -351828 -382298
36203 -382298 -378826 -372043 -350710 -188339 108520 301664 251431 144465 193263 298449 241365
36192 241365 52459 -67444 -75613 -81104 -93703 -29367 82090 119201 64469 -12287 -106284
36181 -106284 -217398 -217831 -16073 205415 177860 -46238 -133882 64132 339940 460997
36171 460997 432542 350884 217767 25072 -133606 -164082 -97134 -32981 -21166 -31229 8575
36160 8575 135782 263979 227479 86 -218053 -247366 -151744 -70801 16335 141369 129385
36149 129385 -145889 -405832 -263433 158485 337534 122616 -63803 70062 245322 135475
36139 135475 -81386 -56505 141376 174208 -7537 -138286 -83603 14328 9421 -82071 -170781
36128 -170781 -170934 -44375 89311 7166 -289825 -467246 -287549 22714 98299 -38101
36118 -38101 -93218 -11800 7562 -62095 -31317 116691 169961 75414 24778 70453 12960
36107 12960 -199336 -304206 -140484 83211 148524 168402 313479 453834 381097 197220
36097 197220 148941 195254 79396 -216789 -417565 -374328 -257056 -256388 -331558 -352594 -305030
36086 -305030 -243209 -182247 -139322 -166531 -244262 -241108 -84583 102618 144674 47888 -7083
36075 -7083 102191 295146 388843 293348 86140 -83260 -135455 -98544 -24399 76004 182976
36064 182976 217504 130133 16499 29547 151998 168774 -63201 -401916 -573824 -493902
36054 -493902 -328052 -248208 -232887 -150494 34177 210605 266994 225438 203531 266596 367670
36043 367670 441782 491859 519479 430239 135328 -250788 -461030 -392319 -245952 -248840 -349712
36032 -349712 -339519 -183325 -37901 24910 97109 212966 261070 200745 179920 308147 454675
36021 454675 423337 231540 66937 34594 88491 161222 215552 194005 58298 -118713 -214239
36010 -214239 -213309 -207736 -238197 -234631 -123609 84611 317767 479804 485761 346549 206038
35999 206038 198235 271482 250839 76460 -121454 -202231 -175010 -147078 -182446 -245733 -251464
35988 -251464 -168341 -96446 -186322 -421699 -562045 -416934 -116654 38434 -38192 -157024
35978 -157024 -168899 -151545 -223185 -332912 -336603 -186828 30180 186559 203164 104329 -6189
35967 -6189 -71457 -139508 -214976 -147849 157646 490157 516713 210611 -139304 -348675 -496288
35956 -496288 -624856 -597881 -380671 -172694 -84127 52643 337590 523963 356475 -7857
35946 -7857 -211334 -187432 -149014 -191927 -214856 -185821 -204071 -296422 -382384 -439633 -504041 -527510
35934 -527510 -438728 -323242 -340241 -476465 -573541 -570181 -522788 -435052 -295189 -241795 -431568
35923 -431568 -745999 -888456 -781706 -605476 -435281 -162092 168338 282714 102065 -63626
35913 -63626 53964 305112 397358 325984 275573 272887 224976 180659 249403 317124 153529
35902 153529 -176785 -301516 -40317 315455 374724 127681 -132741 -256646 -361444 -510516
35892 -510516 -520571 -241004 130603 239793 44460 -140234 -109473 -41439 -163182 -357457
35882 -357457 -343822 -127362 17862 -14131 -21332 153670 372861 417348 273157 76044
35872 76044 -95552 -240889 -337288 -341982 -260739 -148299 -67742 -66902 -136802 -185919 -132310 -26541
35860 -26541 3229 -73486 -169332 -227186 -268635 -295029 -272347 -224074 -207402 -196270 -133588 -88625
35848 -88625 -180844 -348655 -410808 -377601 -444497 -612743 -607772 -320095 -51586 -106760 -361083
35837 -361083 -481609 -396392 -272994 -166043 12873 230162 314763 219258 86112 39610
35827 39610 81229 186312 333865 430692 357273 113763 -178259 -399273 -466001 -319184
35817 -319184 -26209 169298 85453 -138817 -207296 -74432 10402 -114378 -301338 -328211
35807 -328211 -181895 -3936 122468 212223 273792 271429 180409 27978 -118821 -196744 -195104
35796 -195104 -159145 -130663 -107651 -78946 -53691 -27618 24133 87879 116263 126424 192529
35785 192529 287532 264404 91751 -30315 69826 284331 402507 418202 452151 467217
35775 467217 319730 57763 -95064 -68569 -17584 -31632 -16348 65454 67477 -107975 -332173
35764 -332173 -421248 -342220 -160715 62805 233991 243720 135370 103010 214808 300836 241332
35753 241332 180143 262117 324089 110684 -282475 -460620 -237594 143245 351379 330892
35743 330892 231675 154793 106865 102089 158342 224634 224233 159060 89033 25964 -61361 -142459
35731 -142459 -129730 -14854 95153 125082 120910 124077 59670 -130588 -323440 -343825 -224329
35720 -224329 -158644 -199861 -202741 -104782 -51866 -147975 -276254 -298978 -251820 -188218 -28876
35709 -28876 222878 303539 17224 -377820 -435077 -128857 123847 57571 -148899 -238357
35699 -238357 -217893 -197407 -146233 9537 225449 422635 581362 641485 493166 198066
35689 198066 29189 124618 275437 242989 115679 118880 211487 158272 -55919 -177685 -75701
35678 -75701 78096 105350 89142 201074 392939 435812 242890 13782 -1768 178997
35668 178997 283095 127754 -133366 -202738 -30041 130643 69807 -122781 -227582 -190829
35658 -190829 -135805 -166068 -277844 -410595 -471318 -354451 -53279 272310 438491 427381
35648 427381 350246 265379 151614 40998 30663 118307 139267 -45777 -346513 -505152
35638 -505152 -372052 -79854 89950 12025 -154125 -176304 -43146 47177 -17872 -110012
35628 -110012 -60454 91667 158398 57611 -95794 -137885 -15735 192098 346928 341959
35618 341959 182320 -10007 -101630 -72025 -27176 -88263 -255275 -372533 -270764 12114
35608 12114 206361 100241 -183386 -330120 -237892 -108693 -106806 -125161 -9521 148354
35598 148354 120650 -133098 -415830 -532587 -452518 -263573 -92739 -61519 -203452 -402319
35588 -402319 -482752 -378930 -181143 -34898 -29011 -147723 -287416 -345089 -313851 -253801 -170927
35577 -170927 -11920 199235 325442 267787 61938 -211233 -491766 -671136 -610326 -327447
35567 -327447 -39753 88444 123236 191592 278727 318769 338891 358391 282732 74263 -96978
35556 -96978 -63958 86150 162470 155894 166915 172785 111341 85883 209629 339281 275183
35545 275183 156717 296101 629204 728188 439498 124390 105001 218306 151972 -57909
35535 -57909 -147198 -57520 29791 -2327 -102702 -205613 -305161 -391962 -435366 -409495 -276853
35524 -276853 -13255 298322 496789 527101 489623 456574 380416 250127 165498 147265 47780
35513 47780 -200811 -407010 -365840 -154968 1827 51926 87001 92688 -33833 -246351 -358600
35502 -358600 -315385 -273463 -372544 -566060 -710361 -703235 -518016 -218171 44576 155316
35492 155316 171289 230873 335431 351893 242293 143721 170388 264929 313625 293674 220829
35481 220829 56763 -206866 -429446 -425269 -198799 21650 24997 -163860 -343321 -370973
35471 -370973 -290270 -237985 -280466 -359945 -368619 -246415 -22653 208314 354053 384532 329301
35460 329301 224442 94415 -14066 -42173 446 19902 -45800 -144934 -203937 -242843 -320136
35449 -320136 -415309 -460087 -443039 -389812 -296227 -191486 -192115 -336318 -433069 -282828 -12567
35438 -12567 54523 -125971 -246257 -117778 62128 52835 -75025 -119522 -69982 -29243 15655
35427 15655 112271 170399 106477 39555 97180 137279 -55836 -374052 -493144 -358756 -251363
35416 -251363 -328077 -405520 -301792 -124846 -66636 -118468 -156326 -147821 -112423 -11661 149749
35405 149749 214982 44277 -261975 -464573 -477406 -419365 -398515 -393773 -370170 -376101 -457600
35394 -457600 -558750 -584787 -525429 -450914 -407733 -385198 -380991 -418894 -466997 -417964 -231199
35383 -231199 -38424 8403 -31564 40397 235489 294645 34873 -362661 -560916 -472169
35373 -472169 -293969 -202111 -187204 -178921 -151133 -72625 90370 262844 276485 69908 -213567
35362 -213567 -390335 -425711 -401284 -361147 -269108 -99793 83793 165102 94657 -27248 -33231
35351 -33231 116320 275844 302608 234657 198747 208274 174430 81428 18295 43712 135047
35340 135047 261037 389150 441525 378246 303259 327631 344694 148245 -199969 -361247
35330 -361247 -179498 76869 98246 -33655 -21125 175827 312085 261728 176733 190597
35320 190597 199825 71792 -94843 -95345 72895 210953 224939 256408 431600 624362 618746
35309 618746 432322 287614 263187 183320 -61859 -285789 -262462 -70286 31901 -15369
35299 -15369 -47610 10525 56559 45379 61256 91221 -31328 -337380 -580850 -537303 -290640
35288 -290640 -82356 -20087 -81559 -258827 -509412 -671101 -630258 -521160 -574471 -794716
35278 -794716 -949189 -863243 -587131 -282542 -70165 22589 74713 209369 414038 475273
35268 475273 230164 -164317 -380428 -318628 -181018 -143370 -145697 -57474 128850 355307
35258 355307 597855 802466 844841 677388 436920 296815 272839 270190 256298 270631 302429
35247 302429 282626 201060 135855 145924 200411 230326 198198 109928 11822 -14279 89935
35236 89935 278783 421610 428055 326246 203995 114610 66301 59779 87408 115475 111398
35225 111398 80463 48083 29214 48043 144357 293938 361065 234443 6100 -101843 -14669
35214 -14669 111227 130018 94446 107086 118696 32040 -83435 -72355 40635 56818 -100377
35203 -100377 -258482 -220735 3672 243448 337461 227261 -17415 -221204 -238939 -103283
35193 -103283 33855 99309 135366 161496 150196 141852 209401 282537 197840 -22052 -139659
35182 -139659 -36281 124943 172228 152526 153609 117475 13050 -8045 145476 274167 151650
35171 151650 -112480 -234066 -174636 -131443 -187026 -248188 -287752 -370111 -457729 -459391 -454358
35160 -454358 -590449 -763107 -698457 -392997 -166980 -204778 -334952 -369000 -365515 -410094 -403182
35149 -403182 -257341 -88717 -25370 -16085 -6053 -104015 -368903 -608469 -621112 -499824 -468317
35138 -468317 -534458 -539158 -450419 -369278 -316810 -250962 -233065 -329943 -393887 -211489 126958
35127 126958 285880 168564 72382 238292 479580 447202 111029 -230459 -346395 -285635
35117 -285635 -202463 -139349 -44169 95461 220389 278931 281884 274491 287892 329740 388956
35106 388956 419857 352152 170568 -29938 -135065 -156745 -210633 -334999 -422931 -373727 -223944
35095 -223944 -72824 38791 109836 125274 104660 127280 214243 255862 158750 -5857 -119070
35084 -119070 -204666 -343865 -448683 -323620 15188 266363 185487 -116648 -323583 -289605
35074 -289605 -160118 -140755 -246593 -323604 -275651 -188402 -181088 -198713 -81288 151642 252592
35063 252592 81833 -156215 -179128 -22249 45318 -54929 -121997 -34989 47172 -48496 -240255
35052 -240255 -334086 -296051 -227855 -164940 -58911 79106 156528 125095 39701 -18765 -27823
35041 -27823 -27573 -65842 -136265 -181801 -189362 -237039 -360080 -415464 -238185 63701 168474
35030 168474 -29144 -241745 -175069 88291 272562 319000 367507 425868 345797 125661
35020 125661 -35820 -52877 -83661 -244871 -404872 -408858 -341156 -375636 -473125 -434174 -218878
35009 -218878 -25090 -22169 -153268 -257487 -277503 -266990 -261624 -237335 -183895 -145016 -159730
34998 -159730 -201846 -211258 -172907 -132538 -130727 -151456 -152727 -122851 -80516 -39432 -7265 -5995
34986 -5995 -51651 -114983 -141609 -117194 -79689 -64913 -78218 -121948 -195959 -246684 -174157 46366
34974 46366 270206 284745 35638 -288734 -444245 -387706 -292851 -302735 -341403 -238331 12844
34963 12844 234202 300359 265511 205146 65969 -209318 -500343 -605624 -489429 -295163
34953 -295163 -127749 34588 201978 294110 253615 132545 18109 -42343 -21469 75598
34943 75598 155460 119836 41605 110963 340071 478841 334779 38136 -144672 -139264 -52983
34932 -52983 50497 175492 259131 211671 82398 23040 84033 179619 241112 270847 264028
34921 264028 219589 211858 304830 413839 409319 336131 348934 443137 461217 379201 350521 412689
34909 412689 403952 278740 251325 448646 638758 538677 239908 72559 134733 214523
34899 214523 155566 59394 82408 215650 336625 359869 280127 155641 92969 176243 365901
34888 365901 507135 467301 251440 -13348 -189759 -238123 -223734 -209377 -177191 -113259 -108772
34877 -108772 -239430 -371619 -284031 -15288 129301 9493 -138597 -73795 86133 81634
34867 81634 -95393 -275038 -418300 -565442 -595495 -362245 -16607 126073 29197 -55410
34857 -55410 -13187 23739 19036 130140 362504 455610 269447 4551 -123572 -158164 -170205
34846 -170205 -34676 311700 618100 621211 452330 451449 660753 781950 614708 297361
34836 297361 86822 77790 180373 257853 251177 218783 244093 296434 272903 200001 240178
34825 240178 420192 526024 403716 208050 179602 302285 370500 295562 154969 18597
34815 18597 -86917 -107710 -33627 22166 -24995 -79713 -30214 41644 9955 -44633 30188
34804 30188 160613 146461 1405 -78396 -48086 -32085 -28867 93004 286547 334754 224998
34793 224998 192520 296894 290508 63582 -107712 13311 230829 229707 61077 -3493 48834
34782 48834 -13999 -234798 -384523 -345079 -280397 -327078 -357258 -210571 5511 51445 -77411
34771 -77411 -128413 33149 205461 127990 -137163 -286876 -207869 -106051 -145795 -189938 -67074
34760 -67074 89275 24744 -206290 -273523 -30654 295322 403906 214194 -151633 -473573
34750 -473573 -515803 -227908 112982 184579 49828 43048 225568 301415 148032 38581
34740 38581 158802 281041 180577 37220 99127 238658 214156 132913 240412 427344
34730 427344 388649 169245 107614 273747 389892 320297 229126 201402 105287 -72694 -128976
34719 -128976 -12551 47287 -58479 -100663 121320 461319 659785 660794 530997 306734
34709 306734 105370 145545 437280 659650 565468 308653 145921 33637 -186647 -383856
34699 -383856 -277039 94252 373740 361159 202659 93703 48527 9572 -35682 -105470
34689 -105470 -208460 -237817 -65546 208840 291883 60169 -265471 -399358 -314475 -197183
34679 -197183 -191579 -289937 -405152 -466451 -476138 -500180 -555366 -522791 -285868 36663 143952
34668 143952 -89891 -429060 -534353 -321975 9582 219018 201327 13137 -175377 -208506
34658 -208506 -113182 -85299 -231488 -404005 -400898 -253528 -165319 -203526 -219798 -89905 120424
34647 120424 276385 336581 336569 316303 329615 432596 589925 675456 642450 611296 695405
34636 695405 816998 815433 684887 566446 526426 488949 399667 307650 234227 97317 -143610
34625 -143610 -369382 -433947 -348577 -233631 -140681 -27884 124282 278437 399975 455721
34615 455721 383034 174843 -27964 -72746 -31034 -137279 -441368 -687471 -644705 -415426
34605 -415426 -260962 -223672 -118224 131832 348395 338127 132662 -84294 -189925 -183417
34595 -183417 -101813 37452 218634 394639 484622 429805 281614 185966 201426 180464 -37550
34584 -37550 -337321 -415300 -200459 10783 -43596 -234029 -258431 -72967 117939 202941
34574 202941 237606 220369 75266 -117548 -152409 -41173 -59568 -317000 -532117 -433456
34564 -433456 -169949 -74218 -174595 -224299 -125967 -34753 -56173 -106318 -101077 -60748 8854
34553 8854 133010 229543 161836 -19422 -95256 -3710 64981 -18705 -135301 -155766 -148332
34542 -148332 -190023 -180490 -46420 44633 -84996 -304237 -339700 -184692 -87768 -163528 -257705
34531 -257705 -212098 -50856 127743 255881 254871 70564 -189157 -306875 -216442 -87660
34521 -87660 -88062 -169086 -152467 51469 352762 545661 469172 194562 26381 183210 492786
34510 492786 569455 301167 -31648 -162322 -147378 -168110 -226424 -209285 -120390 -63140 -65224
34499 -65224 -75248 -80953 -91559 -46693 115885 317612 388267 267053 70051 -41786 4749
34488 4749 175774 366647 459394 402821 243987 65801 -73673 -128358 -65857 68197 154691
34477 154691 129709 49807 -19427 -95642 -191168 -228916 -153162 -45933 -10185 -459 92390
34466 92390 235995 295878 267539 301544 458851 585306 509287 272246 77343 50905 118117
34455 118117 102951 -83943 -361430 -575755 -664933 -686687 -689444 -642992 -539997 -467405 -480798
34444 -480798 -480979 -335421 -77992 132974 219659 219153 147998 -4680 -144867 -109594 105449
34433 105449 297268 312538 231426 200324 187802 41399 -253895 -501427 -505796 -300912 -128599
34422 -128599 -191270 -435955 -607533 -527056 -271763 -41937 82195 160890 230489 259327
34412 259327 260751 301523 362370 326209 166838 30599 50965 177007 266147 264427 214272
34401 214272 158921 125316 142443 197045 219403 174193 106502 45152 -52811 -185456 -232339
34390 -232339 -113745 51318 82003 -15919 -80450 -47950 -22044 -67975 -83726 51386 293374
34379 293374 484510 545540 542548 562325 574986 467330 217103 -24456 -94634 -34246 -26995
34368 -26995 -113066 -109897 106857 387064 501386 438940 350064 284313 180208 62509 35000
34357 35000 82400 83806 35749 53453 123552 89320 -48815 -64128 139272 332269 296860
34346 296860 143726 75674 29434 -156967 -355309 -275928 42231 218675 78663 -93711
34336 -93711 10844 294672 448713 396209 316116 323429 346175 302472 226998 191924 209483
34325 209483 246634 281686 331142 433730 579094 652263 536084 304279 198371 328509
34315 328509 508649 512329 389469 356775 441919 455345 320990 213075 280155 411970 412634
34304 412634 286543 201740 226989 252068 175182 58578 42442 145867 215253 101215 -137016
34293 -137016 -279314 -229460 -157461 -256428 -440378 -454988 -258141 -80063 -73372 -128640 -129967
34282 -129967 -159762 -277626 -306239 -90673 171863 159746 -80568 -183368 -12415 156360
34272 156360 87201 -79333 -109409 -47296 -75178 -174341 -181244 -83353 -5813 51456 206534
34261 206534 409855 416005 134553 -190606 -290714 -214251 -192516 -260747 -221409 14121 238925
34250 238925 200309 -73455 -316018 -353118 -278182 -288370 -438180 -605531 -645461 -512711
34240 -512711 -255928 41443 299123 457743 487654 391219 217612 73719 56624 123000
34230 123000 83489 -176307 -498352 -602704 -447327 -290151 -322947 -393561 -241139 94575
34220 94575 307183 252573 129599 162212 288107 305238 196108 114059 101557 31556 -139628
34209 -139628 -247233 -147673 53946 136796 53144 -50905 -73261 -79010 -167247 -320746 -432603
34198 -432603 -421344 -295026 -151888 -118803 -218581 -297820 -180500 88438 261120 193997
34188 193997 28679 -6757 120382 255529 264180 130880 -75801 -228785 -200439 -14363
34178 -14363 122027 65614 -46867 10488 202676 277411 149402 16986 41749 123364 102000
34167 102000 12184 -4646 81177 190661 263887 262774 137172 -76676 -194001 -63702 214650
34156 214650 371540 247363 -90198 -455909 -665889 -596750 -273636 83212 206489 19678
34146 19678 -307244 -524053 -483031 -213281 97231 222108 89668 -149324 -299066 -317887
34136 -317887 -273192 -177659 -607 200394 306313 290391 220223 121914 -14433 -105358 -32243
34125 -32243 134946 159127 -33245 -212506 -161269 14060 49702 -95582 -210702 -143767
34115 -143767 29064 152672 164649 86451 -34213 -121605 -108397 -31073 -15092 -112344 -226554
34104 -226554 -265753 -295384 -434833 -636446 -692488 -486917 -139970 149181 318846 427082
34094 427082 489620 457387 340557 231526 174748 118687 43803 29586 108194 145868 3400
34083 3400 -226804 -287779 -75924 223695 353495 243303 23433 -128015 -108022 45506
34073 45506 148984 26946 -248397 -367580 -153378 165548 225348 28413 -58087 146241
34063 146241 339814 175323 -207338 -372495 -229588 -141651 -338438 -555987 -456430 -146754
34053 -146754 9694 -57203 -93582 14202 85218 3345 -75225 555 137018 186773 174178
34042 174178 161237 72970 -141315 -316744 -264362 -59804 68679 67756 67135 118628 148508
34031 148508 149551 205635 310989 353807 305088 253962 230221 158694 27662 -52785 -9820
34020 -9820 102006 201870 253902 225731 108660 -13101 -51452 -64107 -151858 -224837 -90732
34009 -90732 200013 340836 180038 -83703 -218636 -238910 -226879 -114846 142133 354683
33999 354683 306496 74548 -71624 -20013 122257 248268 338083 365998 301554 192041
33989 192041 105801 20894 -102410 -185094 -111488 82114 239825 285099 263620 221953 176381
33978 176381 175094 256019 355228 372599 304822 204311 53046 -185306 -418330 -473787 -294554
33967 -294554 16437 311305 458468 367018 96290 -126288 -158363 -141332 -261416 -402368
33957 -402368 -293454 41559 287849 320632 372419 617931 880002 915519 759902 592431
33947 592431 447515 274428 145371 178922 326972 422818 396309 298022 169003 30663
33937 30663 -48542 -21179 39282 33372 -7353 17250 94720 115471 49233 -24023 -54243 -70576
33925 -70576 -83654 -52760 24621 83316 82147 56505 55063 80863 117489 169538 253337 364366
33913 364366 458280 466719 362415 210001 97350 13700 -111222 -224956 -151630 134224
33903 134224 377542 354523 212317 275528 550015 672352 408675 -29129 -292924 -332161
33893 -332161 -329293 -332411 -202719 78795 281293 198601 -84602 -317170 -384677 -358612 -293355
33882 -293355 -140787 94994 263388 241114 125793 127898 292710 453911 473278 400581
33872 400581 342711 284353 139004 -73438 -199114 -104804 181058 471903 550835 340072
33862 340072 -13962 -252230 -234086 -41603 137776 167404 3806 -295443 -545717 -533237
33852 -533237 -246825 66939 186004 168364 199253 273508 220959 15264 -156533 -170720
33842 -170720 -123195 -132191 -153239 -107133 -58179 -114655 -227178 -235195 -89691 90298 176270
33831 176270 144094 29954 -125176 -258984 -299905 -249695 -209177 -272071 -413491 -520795
33821 -520795 -521640 -446186 -369318 -331327 -321060 -290981 -166016 103802 434923 601283 446064
33810 446064 105616 -100938 -48004 58724 -52 -143863 -149846 -16082 47334 -40559 -125271
33799 -125271 -88601 -19481 -29474 -76420 -83939 -83632 -108364 -79094 50895 151862 87104 -59135
33787 -59135 -101610 -35545 -4438 -30295 4794 104500 111688 -26466 -154278 -164836 -173488 -298379
33775 -298379 -427660 -383335 -209802 -104431 -116305 -110659 -25074 31697 -18225 -87794 -79899
33764 -79899 -46964 -80166 -127459 -62141 95547 162085 27276 -192167 -296809 -241384 -153374
33753 -153374 -141799 -172148 -153580 -85417 -57624 -124320 -231342 -278479 -217665 -77600 75582
33742 75582 179915 205212 171101 133489 134386 164577 178766 135087 17984 -149859 -299045
33731 -299045 -341759 -243207 -64163 85142 132859 88542 24447 24953 118373 229907 235145
33720 235145 100760 -55861 -97356 -35995 -12901 -114499 -272117 -355896 -318836 -231423 -207191
33709 -207191 -298629 -437626 -492038 -417709 -320816 -309587 -336046 -294185 -230786 -283975 -399651
33698 -399651 -325591 2511 263280 127017 -295327 -596720 -593891 -469181 -416878 -402255
33688 -402255 -332210 -242771 -197505 -160023 -95746 -77760 -161786 -252026 -222464 -99799 1523
33677 1523 69201 183837 347401 447652 401176 244201 77244 -16782 -13731 31233 28443
33666 28443 -26872 -32607 49127 77900 -76200 -287057 -297532 -90788 59454 -27363 -192165
33655 -192165 -198427 -84325 -65516 -173876 -213435 -79435 82781 114048 76343 127438 268053
33644 268053 365244 371085 347408 275273 28261 -382255 -691060 -656050 -365919 -117404 -38684
33633 -38684 -7007 78255 142566 107375 32607 -7021 -36627 -62221 13226 206425 319306
33622 319306 181759 -59338 -108392 66732 215225 188533 106661 92936 78661 -15928 -103732
33611 -103732 -87596 -49035 -111663 -216635 -206964 -81330 -5877 -91287 -282052 -453869 -517807
33600 -517807 -450081 -320668 -268048 -339416 -382699 -221365 73771 224083 75489 -234590
33590 -234590 -478047 -576165 -573531 -491068 -320930 -115309 25228 50419 -5260 -73372 -98906
33579 -98906 -59967 21733 105905 186881 286844 381441 394894 309131 210249 163727 110836 -19303
33567 -19303 -149178 -128236 44065 191526 171806 8907 -195081 -357496 -395450 -252509
33557 -252509 -21349 87714 1092 -109705 -86457 -22085 -76734 -174502 -117848 51008 76734
33546 76734 -91818 -182186 -7711 233550 236446 -1510 -226673 -264867 -139269 46207
33536 46207 165009 86639 -185988 -446847 -505720 -417339 -345624 -291945 -157445 -1179 6527
33525 6527 -135954 -269984 -358428 -497073 -623782 -516638 -181212 48166 -39976 -226787
33515 -226787 -209417 -43000 7910 -98179 -167831 -108975 -20395 25471 60834 81601 28775
33504 28775 -61279 -52131 108420 319240 454512 453112 295251 27803 -185680 -188081 -35707
33493 -35707 42412 -67912 -231078 -262363 -163773 -91308 -145898 -259875 -281445 -154249 -4535
33482 -4535 -10670 -178167 -326753 -339346 -306131 -334034 -349686 -246802 -114708 -117194 -220062
33471 -220062 -261536 -238701 -273654 -327669 -244192 -96341 -163111 -458206 -605706 -364149 12844
33460 12844 170329 150881 209550 332227 288342 63424 -106115 -107369 -50286 17186 189509
33449 189509 438172 549138 439787 304332 313598 379554 367830 346862 429222 518466 445602
33438 445602 267984 191154 222092 142590 -129367 -367455 -335502 -105543 56257 21604
33428 21604 -122538 -261999 -357335 -366347 -230870 -2562 142893 113696 42466 112527 299833
33417 299833 411667 359976 261211 242880 275879 256914 159211 29775 -84630 -132940 -54177
33406 -54177 129609 267091 228068 75923 -3921 64340 171231 168491 11413 -230633 -414713
33395 -414713 -385830 -111027 224631 357862 221996 -3542 -146401 -229857 -342290 -436747
33385 -436747 -394505 -238767 -147964 -242246 -446494 -587491 -567668 -430000 -299231 -265859
33375 -265859 -294178 -263276 -140774 -63560 -149548 -272141 -183436 113519 298261 147792
33365 147792 -135875 -187353 33057 229832 220622 155519 234652 421362 552468 564524 467493
33354 467493 237200 -86917 -301017 -240811 -38201 28495 -75321 -107903 71393 308066
33344 308066 413338 423330 466321 518709 456929 275080 103531 41822 77927 143454 163023
33333 163023 85892 -47881 -109940 -33813 77464 81934 -406 -17139 105822 282143 390428
33322 390428 390829 308749 185938 72732 8138 -19697 -56879 -114669 -146199 -102794 -2121
33311 -2121 60608 -13002 -197076 -305914 -175368 105334 255722 149679 -22586 -25841 110655
33300 110655 187571 136463 57403 17066 -15151 -55179 -88078 -145298 -247660 -301586 -220904
33289 -220904 -119930 -182481 -352047 -390932 -272993 -246668 -413157 -516315 -330629 -29507
33279 -29507 69031 -38046 -94381 -664 100398 132813 213228 402414 538860 444602 182445
33268 182445 -14683 -30974 8251 -86439 -314933 -464941 -366254 -114705 45983 45290 52721
33257 52721 187887 320062 268257 81128 -31213 26875 175672 325970 452021 512558
33247 512558 440349 233158 -31292 -266754 -398367 -364476 -203518 -85068 -122668 -198736
33237 -198736 -123527 70481 172379 119011 74767 151963 253073 266429 232727 210971 148329
33226 148329 19739 -48101 43394 169795 148302 25194 7202 134436 218594 136112 5892
33215 5892 -7200 66094 67591 -57222 -217767 -335146 -415150 -448686 -362242 -151667 13877
33204 13877 -47661 -275944 -404647 -292746 -93137 -7302 5186 123227 346840 475647
33194 475647 406652 276097 252671 332442 404367 392405 258730 -9898 -320084 -479914
33184 -479914 -401143 -217323 -100954 -46490 48351 167809 198745 126246 52374 24690 -7251
33173 -7251 -45345 4563 174733 336883 336936 168539 -38946 -153113 -121639 13478 129546
33162 129546 101498 -65306 -203668 -148448 69651 243482 213712 35532 -103034 -102412 -43462
33151 -43462 -49017 -105731 -84684 72524 264929 360562 350556 319536 310031 293659 256464 225097
33139 225097 192524 94653 -91530 -271496 -313899 -202903 -67833 -44538 -127535 -185024 -120098
33128 -120098 13186 79046 24901 -66244 -87646 -23766 65164 126196 141108 99033 -9530
33117 -9530 -167008 -320062 -407411 -405000 -355816 -340050 -385512 -421208 -361618 -222192 -94970
33106 -94970 -26224 4276 -2424 -56746 -74584 78860 370966 556186 455554 184575 -11934
33095 -11934 -64329 -83281 -132620 -159565 -129099 -78337 -28736 35169 90209 87213 52540 80523
33083 80523 208815 373899 482743 459491 263375 -36206 -245011 -233921 -113006 -74280
33073 -74280 -95225 16710 282711 464513 381272 137574 -46758 -79175 17247 201015
33063 201015 386153 447975 369509 279431 256137 218779 111118 46781 127971 246883 242675
33052 242675 165472 197213 361418 494643 490586 407806 328370 256853 188864 159894 180074
33041 180074 196998 158894 72961 -5836 -16067 59584 159888 201126 183306 167233 132583
33030 132583 -9983 -206877 -223860 53305 420895 613222 620100 566230 426009 126742
33020 126742 -160183 -153336 117375 327075 328503 300781 350939 302526 56458 -139274 -46866
33009 -46866 148675 89778 -214877 -414126 -335256 -180666 -163657 -211959 -153511 -11932 40571
32998 40571 -65229 -224086 -298020 -228741 -28854 241656 472679 555509 489671 401427 400667
32987 400667 439339 380711 208540 75819 103177 221378 299328 345415 443663 530504 413443
32976 413443 57884 -288428 -351762 -135126 113952 186114 96818 27730 129576 358683
32966 358683 495305 370411 77892 -111553 -60193 104506 194519 184701 159824 138232 62926
32955 62926 -74369 -204181 -270307 -282818 -282686 -302154 -356373 -433625 -486335 -452312 -302789
32944 -302789 -89155 60741 49592 -50934 -41386 152784 351340 359246 253560 253427 357985
32933 357985 347559 156242 -10558 -9990 26432 -55187 -178603 -199829 -145377 -113315 -87780
32922 -87780 -28159 -1412 -44058 -33469 105281 204372 93144 -88761 -73768 124625 245733
32911 245733 164032 -18046 -201988 -343805 -318979 -45999 256235 253210 -21736 -185345
32901 -185345 -76711 22844 -124254 -335828 -337382 -194866 -152265 -228993 -259428 -210872 -186314
32890 -186314 -167720 -11681 289767 542570 585965 459237 296091 153964 -1452 -187012
32880 -187012 -320699 -280787 -77299 84627 18645 -184881 -258169 -118604 47860 106163
32870 106163 154358 271476 303297 102081 -173522 -232960 -50300 126195 117630 -23948
32860 -23948 -170840 -252753 -234660 -123017 -12766 -3483 -59082 -54140 48259 162251 201535
32849 201535 144075 14478 -102526 -94653 13388 5702 -257532 -584806 -653426 -425778 -163825
32838 -163825 -46856 2257 92136 199656 302336 460275 657413 736763 612418 397489
32828 397489 206378 -19395 -344214 -627579 -661422 -455290 -222719 -105756 -45145 75775
$$ [...]
##END NTUPLES=NMR SPECTRUM
##END=
