##TITLE=31Pdec_PHDE3005
 CDCl3, 24 sc
 30.4.2019
##JCAMPDX= 6.0         $$ Bruker NMR JCAMP-DX V2.0
##DATA TYPE= NMR SPECTRUM
##DATA CLASS= NTUPLES
##ORIGIN= UXNMR, Bruker Analytische Messtechnik GmbH
##OWNER= root
$$ XWIN-NMR		Version 3.5
$$ Tue Apr 30 14:46:09 2019 Russian Standard Time (UT+4h)  she@DPX200
##.OBSERVE FREQUENCY= 81.013821
##.OBSERVE NUCLEUS= ^31P
##.ACQUISITION MODE= SIMULTANEOUS
##.ACQUISITION SCHEME= undefined
##.AVERAGES= 24
##.DIGITISER RES= 17
##SPECTROMETER/DATA SYSTEM= spect
##.PULSE SEQUENCE= zgpg30
##.SOLVENT NAME= DMSO
##.SHIFT REFERENCE= (INTERNAL, DMSO, 0, 182.463)
##AUDIT TRAIL= $$ (NUMBER, WHEN, WHO, WHERE, WHAT)
$$ ##TITLE= Audit trail, XWIN-NMR		Version 3.5
$$ ##JCAMPDX= 5.01
$$ ##ORIGIN= Bruker BioSpin GmbH
$$ ##OWNER= she
$$ F:/spectra/data/she/nmr/P31/1/pdata/1/auditp.txt
$$ ##AUDIT TRAIL=  $$ (NUMBER, WHEN, WHO, WHERE, WHAT)
(   1,<2019-04-30 14:45:18.90 +0400>,<she>,<DPX200>,
      <created by zg, POWCHK disabled, PULCHK disabled
       configuration hash MD5:
       00 E9 B6 7A A2 85 ED C7 34 08 36 98 17 FE 4E 26
       data hash MD5: 32K
       D5 3C B5 98 6B 1C 8C C4 D8 C6 19 99 6A EB CD AA>)
(   2,<2019-04-30 14:45:21.85 +0400>,<she>,<DPX200>,
      <Start of raw data processing
       efp BC_mod = 2 LB = 1 FT_mod = 6 PKNL = 1 PHC0 = -1830.377 PHC1 = 61.19899 SI = 64K 
       data hash MD5: 64K
       9E EB 26 C6 91 D7 84 2F 70 2C 2D 49 F0 CE 2F 30>)
(   3,<2019-04-30 14:45:33.20 +0400>,<she>,<DPX200>,
      <pk PHC0 = 30.82295 PHC1 = 0 
       data hash MD5: 64K
       43 33 DA FC 4E 1B D0 B7 90 2F AA D8 44 F3 6A 50>)
(   4,<2019-04-30 14:45:36.17 +0400>,<she>,<DPX200>,
      <abs ABSG = 5 
       data hash MD5: 64K
       BF D9 DF 45 D7 04 F2 A2 CE 56 27 64 A6 69 0C A5>)
$$ ##END=
$$ 
$$ hash MD5
$$ 03 46 3C 12 E5 CE 9C EB 8E A4 30 BA 52 2A 88 47
##$RELAX= 
##$RELAX= 
##$RELAX= 
##$RELAX= 
##$RELAX= 
##$RELAX= 
##$RELAX= 
##$RELAX= 
$$ Bruker specific parameters
$$ --------------------------
##$DU= <F:/spectra>
##$EXPNO= 1
##$NAME= <P31>
##$PROCNO= 1
##$TYPE= <nmr>
##$USER= <she>
##$AMP= (0..31)
100 100 100 100 100 100 100 100 100 100 100 100 100 100 100 100 100 100 
100 100 100 100 100 100 100 100 100 100 100 100 100 100 
##$AQSEQ= 0
##$AQ_mod= 1
##$AUNM= <au_zg>
##$AUTOPOS= <>
##$BF1= 81.014009
##$BF2= 200.13
##$BF3= 200.13
##$BF4= 200.13
##$BF5= 200.13
##$BF6= 200.13
##$BF7= 200.13
##$BF8= 200.13
##$BYTORDA= 1
##$CFDGTYP= 0
##$CFRGTYP= 5
##$CHEMSTR= <none>
##$CNST= (0..31)
1 1 145 1 1 1 1 1 1 1 1 1 1 1 1 1 1 1 1 1 1 1 1 1 1 1 1 1 1 1 1 1 
##$CPDPRG= <waltz16>
##$CPDPRG1= <>
##$CPDPRG2= <waltz16>
##$CPDPRG3= <>
##$CPDPRG4= <mlev>
##$CPDPRG5= <mlev>
##$CPDPRG6= <mlev>
##$CPDPRG7= <mlev>
##$CPDPRG8= <mlev>
##$CPDPRGB= <>
##$CPDPRGT= <>
##$D= (0..31)
0 1 0 0 0 0 0 0 0 0 0 0.03 2e-05 3e-06 0 0 0 0 0 0 0 0 0 0 0 0 0 0 0 0 
0 0 
##$DATE= 1556621118
##$DBL= (0..7)
120 120 120 11 120 120 24 19 
##$DBP= (0..7)
150 150 150 150 150 150 150 150 
##$DBP07= 0
##$DBPNAM0= <>
##$DBPNAM1= <>
##$DBPNAM2= <>
$$ [...]
##$SUBNAM3= <"">
##$SUBNAM4= <"">
##$SUBNAM5= <"">
##$SUBNAM6= <"">
##$SUBNAM7= <"">
##$SUBNAM8= <"">
##$SUBNAM9= <"">
##$SW= 369.568048894756
##$SWIBOX= (0..15)
0 1 3 0 0 0 0 0 0 0 0 0 0 0 0 0 
##$SW_h= 29940.119760479
##$TD= 32768
##$TD0= 1
##$TE= 0
##$TE2= 300
##$TE3= 300
##$TEG= 300
##$TL= (0..7)
0 120 53 12 22 120 120 120 
##$TP= (0..7)
150 150 150 150 150 150 150 150 
##$TP07= 0
##$TPNAME0= <>
##$TPNAME1= <>
##$TPNAME2= <>
##$TPNAME3= <>
##$TPNAME4= <>
##$TPNAME5= <>
##$TPNAME6= <>
##$TPNAME7= <>
##$TPOAL= (0..7)
0.5 0.5 0.5 0.5 0.5 0.5 0.5 0.5 
##$TPOFFS= (0..7)
0 0 0 0 0 0 0 0 
##$TUNHIN= 0
##$TUNHOUT= 0
##$TUNXOUT= 0
##$USERA1= <user>
##$USERA2= <user>
##$USERA3= <user>
##$USERA4= <user>
##$USERA5= <user>
##$V9= 5
##$VALIST= <valist>
##$VCLIST= <CCCCCCCCCCCCCCC>
##$VD= 0
##$VDLIST= <DDDDDDDDDDDDDDD>
##$VPLIST= <PPPPPPPPPPPPPPP>
##$VTLIST= <TTTTTTTTTTTTTTT>
##$WBST= 1024
##$WBSW= 4
##$XGAIN= (0..3)
0 0 0 0 
##$XL= 0
##$YL= 0
##$YMAX_a= 40979
##$YMIN_a= -47922
##$ZGOPTNS= <>
##$ZL1= 120
##$ZL2= 120
##$ZL3= 120
##$ZL4= 120
##$ABSF1= 182.463
##$ABSF2= -187.1042
##$ABSG= 5
##$ABSL= 3
##$ALPHA= 0
##$AQORDER= 0
##$ASSFAC= 0
##$ASSFACI= 0
##$ASSFACX= 0
##$ASSWID= 0
##$AUNMP= <proc_1d>
##$AZFE= 0.1
##$AZFW= 0.5
##$BCFW= 0
##$BC_mod= 2
##$BYTORDP= 0
##$COROFFS= 0
##$CY= -3
##$DATMOD= 1
##$DC= 0
##$DFILT= <>
##$DTYPP= 0
##$F1P= 0
##$F2P= 0
##$FCOR= 1
##$FTSIZE= 65536
##$FT_mod= 6
##$GAMMA= 0
##$GB= 0
##$INTBC= 1
##$INTSCL= 5.30512e-09
##$ISEN= 30
##$LB= 1
##$LEV0= 0
##$LPBIN= 0
##$MAXI= 10000
##$MC2= 0
##$MEAN= 0
##$ME_mod= 0
##$MI= 50
##$NCOEF= 0
##$NC_proc= -5
##$NLEV= 6
##$NOISF1= 182.463
##$NOISF2= 159.3651
##$NSP= 0
##$NTH_PI= 0
##$NZP= 0
##$OFFSET= 182.463
##$PC= 4
##$PHC0= -1799.554
##$PHC1= 61.19899
##$PH_mod= 1
##$PKNL= yes
##$PPARMOD= 0
##$PSCAL= 0
##$PSIGN= 0
##$REVERSE= no
##$SF= 81.0140089999434
##$SI= 65536
##$SIGF1= 159.3651
##$SIGF2= -187.1042
##$SINO= 113.3802
##$SIOLD= 16384
##$SREGLST= <1H.CDCl3>
##$SSB= 0
##$STSI= 65536
##$STSR= 0
##$SW_p= 29940.119760479
##$SYMM= 0
##$S_DEV= 0
##$TDeff= 32768
##$TDoff= 0
##$TI= <>
##$TILT= no
##$TM1= 0
##$TM2= 0
##$TOPLEV= 0
##$USERP1= <user>
##$USERP2= <user>
##$USERP3= <user>
##$USERP4= <user>
##$USERP5= <user>
##$WDW= 1
##$XDIM= 65536
##$YMAX_p= 333667161
##$YMIN_p= -7804868
$$ End of Bruker specific parameters
$$ ---------------------------------
##NTUPLES= NMR SPECTRUM
##VAR_NAME=  FREQUENCY,     SPECTRUM/REAL,   SPECTRUM/IMAG
##SYMBOL=    X,             R,               I
##VAR_TYPE=  INDEPENDENT,   DEPENDENT,       DEPENDENT
##VAR_FORM=  AFFN,          ASDF,            ASDF
##VAR_DIM=   65536,         65536,           65536
##UNITS=     HZ,            ARBITRARY UNITS, ARBITRARY UNITS
##FACTOR=    0.456856943014862, 1,           1
##FIRST=     14782.0589164792, 0,            0
##LAST=      -15158.0608439998, 0,           0
##MIN=       -15158.0608439998, -7804868,    0
##MAX=       14782.0589164792, 333667161,    0
$$ Real data points
##PAGE= N=1
##DATA TABLE= (X++(R..R)), XYDATA
$$ [...]
40078I11931l17291k27305p8358l0654o6556j4033M9491j13474l31359j40311
$$ 911931 594640 367335 288977 258323 191767 177734 227225 113751 -217608 -357919
40068c57919L79459N62552K09740m5467K00614M47254K20455m1389K37675O88058
$$ -357919 21540 584092 793832 748365 948979 1396233 1616688 1575299 1812974 2501032
40058B501032N31110j78246o81868o54046m19100k08135R683M3967l62124q56772
$$ 2501032 3032142 2853896 2172028 1517982 1098882 890747 900430 944397 582273 -274499
40048b74499p29850J734M55288Q8126n63756p00502l18142j5273n3491q4128K49102
$$ -274499 -1004349 -1002615 -547327 -459201 -1022957 -1723459 -2041601 -2056874 -2110365 -2194493 -1945391
40037a945391P81941J015877P13012J80102r2771R702K12294L48461N31987P26235
$$ -1945391 -1163450 -147573 565439 745541 652770 662472 874766 1223227 1755214 2481449
40027B481449N84254M2557l33424j03174K48891r1969j005578j470943r48314
$$ 2481449 3065703 3108260 2774836 2671662 2920553 2828584 1823006 352063 -596251
40018e96251p5014K68777M9965j25078P5376M16457N27579K81057j81454n56842
$$ -596251 -671265 -402488 -352523 -477601 -402225 14232 541811 822868 641414 84572
40008H4572n56714j59756L10269M64508K24549j07920j54753J49458M73649M65329
$$ 84572 -472142 -631898 -321629 142879 367428 259508 104755 254213 727862 1193191
39998A193191J89514J3157L4973n3460l80060n48980k39848J76787J22267l12653
$$ 1193191 1382705 1395862 1430835 1377375 997315 448335 208487 385274 507541 194888
39988A94888n47434m28652l03565k16711J79493P36030O62144k57738r99852n55339
$$ 194888 -352546 -781198 -1084763 -1301474 -1121981 -385951 276193 18455 -981397 -1536736
39978a536736N98678J069065L84590n21840o80626j93328K53426L57923K76768
$$ -1536736 -938058 131007 515597 -6243 -686869 -880197 -626771 -268848 7920
39969G920J48166K6902P9667L77797N76446K50057m16288p01369k77117L12722
$$ 7920 156086 182988 262655 640452 1216898 1466955 1050667 349298 72181 384903
39959C84903L77486k0498k70585j26531M5381q7548l56315l83403n2291M04918
$$ 384903 762389 741891 471306 344775 390156 302608 -53707 -437110 -489401 -84483
39949h4483N65226R2100q17608j323686p67488L51253Q02266J97309n04527l81197
$$ -84483 480743 572843 -244765 -1568451 -2335939 -1984686 -1182420 -985111 -1489638 -1870835
39939a870835K42704N03620L02418J63069K18780J69098K8272J11786L44332K92996
$$ -1870835 -1628131 -1124511 -822093 -659024 -440244 -271146 -242874 -131088 213244 506240
39929E06240j12814n01876o63455o62528m64100n4453K10124N6909p7261L40639
$$ 506240 393426 -108450 -771905 -1434433 -1898533 -1952986 -1742862 -1685953 -1763214 -1422575
39919a422575Q93781P44388Q1457j16410K01062J2438q83635j248604l60433P04896
$$ -1422575 -528794 215594 297051 180641 381703 394141 -489494 -1738098 -2098531 -1393635
39909a393635P04044M4704j40239J76183K60476R8362J98783L77419N1528n25499
$$ -1393635 -689591 -644887 -785126 -608943 -348467 -250105 -51322 326097 377625 -147874
39899a47874n79601j85293q7015k82756r4222L59504J81229n73474o39374M19187
$$ -147874 -727475 -912768 -999783 -1282539 -1376761 -1017257 -836028 -1409502 -2048876 -1629689
39889a629689J253557O90424m50366n97360K81846Q45308M37974k08282l18132
$$ -1629689 -376132 314292 -136074 -733434 -451588 393720 831694 623412 305280
39880C05280q7010n8983k15825j42497K52029N86810N14294J45275r5979P846
$$ 305280 218270 159287 -56538 -199035 52994 639804 1154098 1299373 1203394 1211240
39870A211240J91811N7206l71755o53261n09030j53211N9299Q1602J05858K06071
$$ 1211240 1403051 1460257 1088502 435241 -73789 -227000 -167701 -86099 19759 225830
39860B25830K28142j3697m89934q48415o30947J85107R07841P32388k87696j190559
$$ 225830 453972 440275 -49659 -898074 -1529021 -1343914 -436073 296315 8619 -1181940
39850a181940j191295n29515j6290n30j13958P2502M79481O81099M50509R868
$$ -1181940 -2373235 -2902750 -2919040 -2919570 -3033528 -2961026 -2481545 -1800446 -1349937 -1340069
39840a340069k41271j46552J35893M05082N58149M68905N5695l94877l67032J29419
$$ -1340069 -1581340 -1727892 -1591999 -1186917 -628768 -159863 -104168 -499045 -866077 -736658
39830g36658L64742r0518n78328k66798M95915O50769R5219j97057J63568L64719
$$ -736658 -371916 -462434 -1040762 -1307560 -811645 -160876 -65657 -262714 -99146 265573
39820B65573j25935n71486k13005M15139L82500j06893j66230K20143K29716l58661
$$ 265573 139638 -431848 -644853 -229714 152786 45893 -120337 99806 329522 -29139
39810b9139q23326o81535l09750j73293j63011L8939M68673R51004J241599J042102
$$ -29139 -852465 -1534000 -1843750 -2017043 -2180054 -2141115 -1672442 -721438 520161 1562263
39800A562263L12000m45544o81738n15805m22223l65288K6511N19905M29251j79240
$$ 1562263 1874263 1428719 746981 231176 -191047 -556335 -529824 -9919 419332 240092
39790B40092l96649J20361N97504M39446J29530K04036K35386k93161q40633n80442
$$ 240092 -156557 -36196 561308 1000754 1130284 1334320 1569706 1276545 435912 -144530
39780a44530J74726M11088m042k63058l5451J29310r3663k92179j59693J0070
$$ -144530 30196 441284 437242 174184 138733 268043 174380 -117799 -277492 -267422
39770b67422p104L9447K51745K54438r9886l44658j92644j18556n74603j106202
$$ -267422 -274526 -235079 16666 271104 171218 -173440 -366084 -484640 -1059243 -2165445
39760b165445r03437N4107R94187J308360J011212M20248j21581l06780j00333
$$ -2165445 -3068882 -3014775 -2020588 -712228 298984 719232 597651 290871 190538
39751A90538J23688J7331k67895l39578j18253J98727N00574O94985N31433r128
$$ 190538 314226 331557 63662 -275916 -394169 -195442 305132 1000117 1531550 1522422
39741A522422l75186r3519M00360K62198m89388r53673o81805k41301j84371k15405
$$ 1522422 1147236 1053717 1454077 1716275 1226887 273214 -408591 -649892 -834263 -1049668
39731a049668J32750N99860N97715J46390j90453j28177R5817K31362L25414M66909
$$ -1049668 -916918 -317058 280657 427047 236594 108417 204234 435596 761010 1227919
39721A227919N17665K37334l77504r33012r37838l86344J38441K14602J86017
$$ 1227919 1745584 1982918 1605414 672402 -265436 -651780 -513339 -298737 -112720
39712a12720N24305Q36084L28434p46287j127531l66447M02698J47824n21063
$$ -112720 411585 1247669 1576103 829816 -297715 -664162 -261464 -113640 -634703
39703f34703m04874M06670Q09507M18583r4948k31561j86374j48285o493J46412
$$ -634703 -1039577 -632907 176600 595183 500235 268674 82300 -65985 -72478 73934
39693G3934J3468k95078l35656o9996J14017R2104M2418r9457m45025n41409J00138
$$ 73934 87402 -207676 -543332 -613328 -499311 -407207 -364789 -464246 -909271 -1450680 -1350542
39682a350542R04712P40214l42909r84319m14331N93987J051188R45825O24084
$$ -1350542 -445830 294384 -48525 -1032844 -1447175 -853188 198000 1143825 1767909
39673A767909P4477n06988m61459K37044N51009j08753q07670m68319M56546P38963
$$ 1767909 1842386 1335398 873939 1110983 1661992 1553239 745569 277250 733796 1472759
39663A472759J67584m83147p57345p42933m43257M7448J63748l13824n24059K76011
$$ 1472759 1640343 1157196 399851 -343082 -786339 -738891 -575143 -888967 -1413026 -1137015
39653a137015J252974J052611l7850m79162Q4700L89653k39495q31381m86936
$$ -1137015 115959 1168570 1130720 651558 736258 1125911 886416 55035 -431901
39644d31901K23845L82272J30005N5132L3261l40242p32533m52558L92029Q88223
$$ -431901 -208056 174216 304221 359353 392614 52372 -680161 -1132719 -740690 147533
39634A47533M57741m55751q73698k94884P11343R77592N8904j087693j213572
$$ 147533 605274 149523 -724175 -1019059 -307716 669876 728780 -358913 -1572485
39625a572485l62018L69139M86944N28214P53117N96889j11503m89818O9360P81615
$$ -1572485 -1934503 -1565364 -1078420 -550206 202911 799800 688297 198479 267839 1049454
39615A049454N76796l21683q36783n81064o5934K75870L95690J99473l22945o53154
$$ 1049454 1626250 1304567 467784 -113280 -179214 96656 492346 691819 368874 -284280
39605b84280k32201O15698R61114N18905k5177m0595K78433L61026K5561m33392
$$ -284280 -516481 99217 1060331 1579236 1554059 1513464 1791897 2152923 2178484 1745092
39595A745092o43723m66292o0854K73893L78613K97133O2884l23763o21620m40881
$$ 1745092 1101369 635077 574223 848116 1226729 1523862 1586746 1262983 641363 200482
39585B00482J51321N26136L45923J01620L12302N92856K08169o67170j029085
$$ 200482 351803 877939 1223862 1325482 1637784 2230640 2438809 1771639 742554
39576G42554m22989M47539O85444K23768l69365o54313n59048j77460K87244N05112
$$ 742554 319565 767104 1452548 1676316 1306951 652638 93590 -83870 203374 708486
39566G08486K73403j93379m44771l38861k32244m59419p51484n16798K37860P03393
$$ 708486 981889 788510 343739 4878 -227366 -686785 -1438269 -1955067 -1717207 -1013814
39556a013814L05319m45369o55857k94715l1526l1766J88982O67785P37410J84073
$$ -1013814 -708495 -1153864 -1809721 -2104436 -2135962 -2167728 -1978746 -1310961 -573551 -389478
39546c89478k48776n74M70165N51384M13150M20866L31922j44805n84430m58574
$$ -389478 -638254 -638828 -168663 382721 795871 1216737 1548659 1403854 819424 360850
39536C60850l4066J07079j6135q1571j53976k88674l0056P67764J198593M79128
$$ 360850 326784 433863 417728 336157 182181 -106493 -136549 631215 1829808 2308936
39526B308936o15874p17917Q3919M73063q51m41375k52520O8220Q201k69340n84145
$$ 2308936 1693062 975145 1059064 1532127 1531276 1089901 837381 905601 913802 644462 60317
39515F0317j014666j249780o99505M51321J247746J258583R41411N90647j2424
$$ 60317 -954349 -2204129 -2903634 -2452313 -1204567 54016 995427 1586074 1573650
39506A573650p18720r21770o26270m98892o10846l24667L21370M76103P8139J02555
$$ 1573650 854930 -66840 -693110 -1192002 -1802848 -2127515 -1806145 -1330042 -1251903 -1149348
39496a149348O88034O42995l95648r86110j70368Q41719O48355j17656j33216
$$ -1149348 -461314 181681 -213967 -1200077 -1370445 -528726 119629 1973 -131243
39487a31243L04625J30464l30285k9919O60916N01898l21304m47513K56234M97157
$$ -131243 173382 303846 -26439 -56358 604558 1106456 785152 337639 593873 1091030
39477A091030j29046n03930l8935L49890q0579o99088o83394k34443P6667K13125
$$ 1091030 961984 458054 419119 769009 688430 -10658 -694052 -928495 -851828 -638703
39467f38703L12085K27199o3511k77088l65608n31815n69259o8906N99007N79808
$$ -638703 -326618 -99419 -162930 -440018 -805626 -1337441 -1906700 -1975606 -1376599 -796791
39457g96791K1717L9707P92531R48881j84074j285809q76669M45444R20128J60166
$$ -796791 -775074 -735367 57164 1006045 821971 -463838 -1340507 -895063 25065 185231
39447A85231n54334k81201M81795P88974M31151j15926l46462j13901K98306M10722
$$ 185231 -369103 -650304 -168509 620465 1051616 935690 589228 475327 773633 1184355
39437A184355O9135l22421k94227Q7077L32076J30368l50151o68384n10664r303
$$ 1184355 1253490 931069 636842 723919 1055995 1186363 836212 167828 -342836 -352139
39427c52139L32622K25986Q474J36828M11891K56060k93444n59846k89891l799
$$ -352139 -19517 206469 214943 351771 763662 1019722 726278 166432 -123459 -127258
39417a27258n7984j09355J31057L27533J55279j39014k85226m62408p12601n45831
$$ -127258 -185242 -294597 -163540 163993 319272 180258 -104968 -567376 -1279977 -1825808
39407a825808K37788R31913Q36517K71239l8734p6903k30688l41432l198M82652
$$ -1825808 -1588020 -656107 180410 451649 412915 336012 105324 -236108 -239306 243346
39397B43346M23547j11531l63740q8209J73815Q7618l4414M7656Q9349o9090j51770
$$ 243346 666893 555362 191622 103413 277228 364846 330432 378088 467437 398347 246577
39386B46577K4747J77986L5925j95079j41438K11871N32106N10296J13196l77342
$$ 246577 271324 449310 485235 290156 148718 360589 892695 1402991 1516187 1138845
39376A138845n38056j88322L75045O45605L74200k82533q92851r46318k48084
$$ 1138845 600789 412467 787512 1433117 1807317 1524784 631933 -314385 -562469
39367e62469O78121R45971L47419l53738m82762k97833l09095l43891k1555L26128
$$ -562469 115652 1061623 1409042 1055304 572542 274709 -34386 -378277 -399832 -73704
39357g3704J34129k90269j40369N26168Q07669L77481j11523k00432k29889m84000
$$ -73704 60425 -229844 -370213 155955 963624 1341105 1229582 1029150 799261 315261
39347C15261o45417n05068l84779l95965p1587P09342J170822P06311r0920k32734
$$ 315261 -330156 -835224 -1220003 -1615968 -1687555 -978213 192609 898920 808000 575266
39337E75266K31415L75327k04626q78401q87339k24742M89209O83682L16172j43326
$$ 575266 806681 1182008 977382 98981 -788358 -1013100 -523891 159791 475963 332637
39327C32637k05264R2184K54485L649l55215l65070K0719M56509N77765K41104
$$ 332637 127373 219557 474042 477691 122476 -242594 -221875 234634 812399 1053503
39317A053503l86312q74597q86752n44410k09220N8495M51221Q46795Q04161K70262
$$ 1053503 667191 -207406 -1094158 -1638568 -1847788 -1789293 -1338072 -491277 312884 583146
39307E83146j86504q8412L62055N95956K86208m39783j076649j056600l92155
$$ 583146 396642 308230 670285 1266241 1552449 1112666 36017 -1020583 -1412738
39298a412738J22172j01114m75365q5581O98982O41775k72505n96705K73755J040083
$$ -1412738 -1290566 -1391680 -1867045 -1952626 -1253644 -611869 -884374 -1481079 -1207324 -167241
39288a67241O02081j76400j7241O53327O21862R17k17451o5294l26419p77216
$$ -167241 434840 258440 241199 894526 1516388 1517305 1299854 1234560 908141 130925
39278A30925m88746K93134L79687k27892k84346L93595M95161l64720p29872K45175
$$ 130925 -357821 -64687 315000 87108 -197238 196357 691518 326798 -403074 -157899
39268a57899J202538P35904l67587n83783j33301k46325q05055o37535K37053
$$ -157899 1044639 1780543 1412956 829173 695872 449547 -355508 -993043 -755990
39259g55990N56893K3805k06740M03146Q06705J62902p17643o48415J56613O05676
$$ -755990 -199097 -175292 -382032 21114 827819 990721 273078 -375337 -218724 386952
39249C86952M16662K38194L69517L51256j09015n81234n53761j42396J38616M1468
$$ 386952 803614 1041808 1411325 1762581 1653566 1072332 518571 376175 514791 556259
39239E56259k18241k78860Q727M29687N32240O5715o14640p93241k29302M58929
$$ 556259 338018 59158 67885 497572 1029812 1095527 480887 -312354 -541656 -82727
39229h2727N27652M9987k83030k03891j38233l26498l33523J58792O32465M41754
$$ -82727 444925 494912 211882 7991 -130242 -456740 -790263 -631471 994 442748
39219D42748j28946k52915J86976N15612L84149J51777M8785k03001o55820q14584
$$ 442748 313802 60887 247863 763475 1147624 1299401 1348186 1145185 489365 -325219
39209c25219m68751j29099j30285K496O31195J086503N49075n44037r22831j99484
$$ -325219 -793970 -923069 -1053354 -1050858 -419663 666840 1215915 671878 -250953 -450437
39199d50437O85456P66892Q1633p06084j061643q07081j39135L97844L77779K1072
$$ -450437 235019 1001911 1083544 377460 -684183 -1491264 -1630399 -1232555 -854776 -833704
39189h33704j36523m9989q3948j67837K02825R47472J203996N77927j46405j49541
$$ -833704 -970227 -1020216 -1104164 -1272001 -1069176 -121704 1082292 1660219 1513814 1364273
39179A364273J94094J2510n98601p55537k48406J69450N3598j10122J01350K81122
$$ 1364273 1558367 1570877 972276 216739 -31667 137783 191381 81259 182609 463731
39169D63731j806l12336l9622M85898M66042j9629j52430J37956m9897r50205
$$ 463731 461925 149589 109967 595865 1061907 1042278 889848 1027804 977907 27702
39159B7702j384590m72077Q04573Q95113n245l07428M62664R93811L53910n75935
$$ 27702 -1356888 -1828965 -1024392 -129279 -134524 -441952 20712 1014523 1368433 792498
39149G92498n98033j045J78085j09492j25026J81972J30370l83474o48336l07313
$$ 792498 194465 193420 371505 262013 136987 318959 449329 65855 -582481 -889794
39139h89794J78277M08534N38709O51092M25076k09681p38813p52295m40684j08806
$$ -889794 -711517 -302983 235726 886818 1311894 1102213 363400 -388895 -829579 -938385
39129i38385K60164O45643P53216N06917K68271K03644k2431n10655o88919j89946
$$ -938385 -678221 -32578 720638 1227555 1495826 1699470 1677039 1166384 477465 287519
39119B87519L80537K84754j59868q1896N09648P23785J96910m16861n57272n05378
$$ 287519 668056 952810 792942 711046 1220694 1944479 2141389 1724528 1167256 661878
39109F61878o25910o13587j14506M27891L11772k68728l84655K59219Q14276M54283
$$ 661878 35968 -577619 -692125 -264234 47538 -221190 -605845 -346626 467650 921933
39099I21933m74047r54225o45553j31731J03582K89158P01967R47555M59680n12236
$$ 921933 447886 -506339 -1151892 -1283623 -1180041 -890883 -188916 758639 1218319 706083
39089G06083j012517n34317L78303Q28027N27438j04200n23320n19979k66164
$$ 706083 -306434 -840751 -462448 365579 893017 788817 265497 -254482 -520646
39080e20646r9083j78416k90484j16078K93172N18092L11047r4647l06689j93155
$$ -520646 -619729 -798145 -1088629 -1204707 -911535 -393443 -82396 -177043 -483732 -676887
39070f76887J05395L51785L01511j30813o51511p64059l29003K31965M11421J17846
$$ -676887 -571492 -219707 81804 -49009 -700520 -1464579 -1793582 -1561617 -1150196 -1032350
39060a032350l57745o29693m09062K78490R41078R94525M33202j54861l27043
$$ -1032350 -1390095 -2019788 -2428850 -2150360 -1209282 -214757 218445 63584 -263459
39051b63459j82206M6728K98222M13214J24710l92070n18533j04011K01198m2829
$$ -263459 -445665 -398937 -100715 312499 437209 45139 -473394 -577405 -376207 -419036
39041d19036l63138k61152j19332m03112n62166J87470J326451J484655M26323
$$ -419036 -782174 -1043326 -1162658 -1565770 -2127936 -1940466 -614015 870640 1296963
39032A296963n41075l76839M31295P77842L28331m35487r79855j112079r57701
$$ 1296963 755888 379049 810344 1588186 1916517 1481030 501175 -610904 -1568605
39023a568605p74436n72267l7439P82566J082801L50647n15296k25495Q91164
$$ -1568605 -2343041 -2915308 -2952747 -2170181 -1087380 -736733 -1252029 -1477524 -586360
39014e86360J209527K68516n61139l36793O1545l18366p68085k16180Q19603J045811
$$ -586360 623167 891683 330544 -6249 55296 -263070 -1031155 -1247335 -427732 618079
39004F18079M41841L4747J09812P6550j90397k79544l36723q47956j381904r36804
$$ 618079 1059920 1094667 1204479 1281029 1090632 811088 474365 -373591 -1755495 -2692299
38994b692299L42065J111916P25675n1632m49440n48449m30322J83284R57710
$$ -2692299 -2350234 -1238318 -512643 -564275 -1013715 -1562164 -1992486 -1809202 -851492
38985h51492R37207J30980k09911L58313N54425m63486j418050q37776N03181
$$ -851492 85715 216695 6784 365097 919522 456036 -962014 -1799790 -1296609
38976a296609Q19138J52437J1813O17452O29074l15765q70628l14925K54556o4854
$$ -1296609 -477471 -325034 -313221 304231 933305 617540 -253088 -568013 -313457 -378311
38966c78311m30045J11074P95615M04137o15713q26892l8819O24558N94784L60946
$$ -378311 -808356 -697282 98333 502470 -113243 -940135 -978954 -354396 240388 601334
38956F01334J84488k75324q78859q67351j94338J83181j44781l26157K26250O74848
$$ 601334 785822 510498 -368361 -1235712 -1430050 -1246869 -1391650 -1717807 -1491557 -816709
38946h16709J20223p40313n68723N05217J075933O12190P6045K03159M28279P9731
$$ -816709 -696486 -1436799 -2005522 -1500305 -424372 187818 263863 467022 895301 975032
38936I75032l86479j73371N00946P15442J71969n70524j001364j084139q52697
$$ 975032 588553 415182 916128 1631570 1803539 1233015 231651 -852488 -1705185
38927a705185k72983L98322O82231M73497J47240l8225k06653m03312l62785p437
$$ -1705185 -1978168 -1579846 -897615 -424118 -276878 -315103 -521756 -925068 -1287853 -1295290
38917a295290K52253Q6578k12731j78180R9678J69294J0445Q6438N59156R48086
$$ -1295290 -1043037 -956459 -1169190 -1347370 -1247692 -1078398 -1067953 -981515 -422359 525727
38907E25727P74093J83433l01483l73779o6755M15303O98911L67605m87553j051988
$$ 525727 1299820 1483253 1181770 807991 741236 1156539 1855450 2223055 1735502 683514
38897F83514o66375J55074K39000n91419j111974l92367P62183Q48808k16786
$$ 683514 17139 172213 411213 -180206 -1292180 -1684547 -922364 -73556 -290342
38888b90342r89324n21007M51921P22111K24361j92755q8413K19003L83735L99185
$$ -290342 -1279666 -1800673 -1348752 -626641 -402280 -595035 -683448 -464445 -80710 318475
38878C18475K55177j47114o12781o80020k21803L43040O08044O17035N67760M18475
$$ 318475 573652 426538 -186243 -866263 -1088066 -745026 -136982 480053 1047813 1466288
38868A466288P5382k62935k92965p6198m1449m49547r90275j018579k34695Q72229
$$ 1466288 1541670 1278735 985770 909572 868123 418576 -571699 -1590278 -1824973 -952744
38858i52744J374929Q38640j73075p12150n04100j22840j20387l59169l85361
$$ -952744 422185 1260825 1087750 375600 -128500 -251340 -371727 -730896 -1116257
38849a116257j38167M4401k3209j49598r1772J32245L11511K85289P2412j63691
$$ -1116257 -1254424 -1210023 -1233232 -1382830 -1474602 -1342357 -1030846 -745557 -673145 -836836
38839h36836k52066j54584J4957R3162l1878l36207n64428l38240L81968J006443
$$ -836836 -1088902 -1243486 -1228529 -1135367 -1167245 -1503452 -2067880 -2406120 -2024152 -1017709
38829a017709Q72688J58780k22156J34103N03476J33639n00935l29688O08841
$$ -1017709 -145021 13759 -208397 -74294 429182 562821 61886 -267802 341039
38820C41039J042669K68190q03434r54182l25684K1616k05096k66542K22210O19805
$$ 341039 1383708 1651898 848464 -105718 -431402 -409786 -614882 -881424 -659214 -39409
38810c9409L28281k29134k75543J81779N31579N58363N53409N58215K47887l28853
$$ -39409 288872 59738 -215805 -34026 497553 1055916 1609325 2167540 2415427 2086574
38800B086574n91692l08892n1437l36587p87858p03558j40602K21924J74782K36837
$$ 2086574 1494882 1185990 1134553 797966 10108 -693450 -834052 -612128 -437346 -200509
38790b00509O95350J002966N04962n73194j260433q76698K71243J168779R94138
$$ -200509 494841 1497807 2002769 1429575 169142 -707556 -436313 732466 1726604
38781A726604j09699j091345j012712r3746N14455J19699o76830p99493m5853
$$ 1726604 1616905 525560 -487152 -580898 -66443 53256 -623574 -1423067 -1468920
38772a468920P97481J000915N60044j34465p46918r71979n77595J79626N45522
$$ -1468920 -671439 329476 889520 755055 8137 -963842 -1541437 -1361811 -816289
38763h16289J13721n32585m88512K69125Q48719O31821k5273m22814l25272J40516
$$ -816289 -702568 -1235153 -1723665 -1454540 -605821 26000 727 -422087 -747359 -606843
38753f06843Q49027J440453J195104j06891j434439j478805l99832K82968k25953
$$ -606843 242184 1682637 2877741 2770850 1336411 -142394 -542226 -259258 -485211
38744d85211r42002o50238L36977Q26707N63646L37617M95026M47596j60988p27271
$$ -485211 -1427213 -2077451 -1740474 -913767 -350121 -12504 482522 930118 769130 41859
38734D1859n67857Q9390M79708L10638j4815j2134L18356M92384Q1402o51800
$$ 41859 -525998 -436608 43100 353738 338923 326789 645145 1137529 1218931 567131
38724E67131q49631j18243P42393O39406k93581q10869k77495N07247N26284j20762
$$ 567131 -282500 -400743 341650 981056 687475 -123394 -400889 106358 632642 511880
38714E11880n88399m63027m2127K14432P5900l46947n87797k42006M11750O62015
$$ 511880 -76519 -539546 -581673 -367241 -291341 -638288 -1226085 -1468091 -1056341 -394326
38704c94326M04132K83351N34745N10460j25590o11423k76048K87114K26508q3945
$$ -394326 9806 293157 827902 1338362 1212772 601349 325301 612415 838923 754978
38694G54978K27488Q35209O50676k61980o60860j10144L93664J03359m37522n36235
$$ 754978 982466 1817675 2468351 2206371 1545511 1435367 1829031 1932390 1494868 958633
38684I58633m12791m87995n50100l15767o0442n3933m0544J58457K13828K55j5434
$$ 958633 545842 57847 -492253 -808020 -868462 -922395 -962939 -804482 -590654 -590399 -605833
38673f05833L01834K67564m33338r01129l27122N81782O18634n4686l27942m5404
$$ -605833 -303999 -36435 -469773 -1370902 -1698024 -1116242 -497608 -552294 -880236 -925640
38663i25640o7135n18792m54354M45279J153024Q20115m6712n50559o15287n30641
$$ -925640 -992775 -1511567 -1965921 -1520642 -367618 452497 405785 -144774 -760061 -1290702
38653a290702j31667O85071J242661Q52009m2253l90166k2896K59991K5619k62996
$$ -1290702 -1422369 -737298 505363 1357372 1315119 924953 902057 1162048 1187667 924671
38643I24671k08345j42331m35297p68982o29862j52698N9400k13822n81788o01123
$$ 924671 716326 573995 138698 -630284 -1260146 -1412844 -1353444 -1567266 -2149054 -2750177
38633b750177k11851L46240P43603P13476L05462p951J96899O65610O66613k5163
$$ -2750177 -2962028 -2615788 -1872185 -1158709 -853247 -861198 -664299 1311 667924 642761
38623F42761p00501n74172J72419N99207J89281n48399p43551j77794N22586O12417
$$ 642761 -57740 -631912 -459493 139714 328995 -219404 -962955 -1140749 -618163 -5746
38613e746L3286n34243m37069K00617O63875N58197K00918k5232k58317o87954
$$ -5746 27540 -506703 -943772 -743155 -79280 478917 679835 654603 396286 -291668
38603b91668q90363l23070O40304R52241L16699l68504l36635j1508j54192n34014
$$ -291668 -1182031 -1505101 -864797 87444 404143 35639 -300996 -312504 -466696 -1000710
38593a000710l21411M36971P06874p945q67933q77194k36592J19651n6362j62089
$$ -1000710 -1322121 -885150 -178276 -186221 -1054154 -1931348 -2167940 -2048289 -2104651 -2266740
38583b266740R6339K40595k5619j80587K26492O62590M07136j35189L8819P96065
$$ -2266740 -2170401 -1929806 -1955425 -2136012 -1909520 -1246930 -839794 -974983 -936164 -140099
38573a40099Q76590o9563p14730o4241Q86000O39604m89954r77142n13962k50204
$$ -140099 736491 666928 -47802 -112043 773957 1413561 923607 -53535 -567497 -817701
38563h17701o55876p59634O0640R24758Q19165P6726l05312o4201L34996N06073
$$ -817701 -1473577 -2233211 -2172571 -1247813 -428648 -351922 -657234 -721435 -386439 119634
38553A19634L25667j69513n83071l96995K07353M12798j55k92069n8088Q5247
$$ 119634 445301 275788 -307283 -704278 -496925 -84127 -84282 -376351 -434439 -349192
38543c49192k81060n07407o7378L80063J64493r4097L85357R17668L37245r11229
$$ -349192 -630252 -1137659 -1205037 -824974 -660481 -754578 -369221 548447 885692 -25537
38533b5537j236497k60943P39453P63175J67414k64858k28466K11474O78303N06759
$$ -25537 -1262034 -1522977 -783524 -20349 147065 -117793 -346259 -134785 543518 1050277
38523A050277l81645r23784l05157N49773K58916o93608o71227L09074N54724
$$ 1050277 668632 -255152 -560309 -10536 248380 -445228 -1116455 -807381 -252657
38514b52657l53660q06362N550O62089r405r57162p85756P148K17969K8037K79766
$$ -252657 -606317 -1412679 -1407129 -745040 -754445 -1711607 -2497363 -2490215 -2272246 -2244209 -1964443
38503a964443P12963N48933L6723r6351m0524l14771m81495N6343O14898J87013
$$ -1964443 -1251480 -702547 -665824 -762175 -802699 -1117470 -1598965 -1542622 -927724 -740711
38493g40711o59758n27432M71700Q42409J17840n35769l11077K03295L75015N28499
$$ -740711 -1400469 -1927901 -1456201 -613792 -495952 -1031721 -1342798 -1139503 -764488 -235989
38483b35989R83946J182098M86094p89144j666471j462988l12724Q87354J142579
$$ -235989 747957 1930055 2416149 1627005 -39466 -1502454 -1815178 -927824 214755
38474B14755M18278k30789q6033K23774q9430m76313L6664R74702R75226j7764
$$ 214755 633033 402244 316211 539985 450555 -25758 10906 985608 1960834 1943070
38464A943070p23854o56975o01513p83223l55119P58440J209310K67881r13128
$$ 1943070 1219216 562241 -39272 -822495 -1177614 -419174 790136 1058017 144889
38455A44889j018522l31128J58764K66647K60008K6802l99754m09246J43346L90002
$$ 144889 -873633 -1204761 -1045997 -779350 -519342 -492540 -892294 -1301540 -1158194 -768192
38445g68192j17264m51992J19583O81201J30848q31373p70469J07929L81685j59034
$$ -768192 -885456 -1337448 -1217865 -536664 -405816 -1237189 -2007658 -1899729 -1518044 -1677078
38435a677078k92615M37275J001186O70653N6982j33116j43516l62457m79906
$$ -1677078 -1969693 -1532418 -531232 139421 196403 63287 -80229 -442686 -922592
38426i22592j29729L64353N05007L47474K21086J75613J03131K0806p9670k96861
$$ -922592 -1052321 -687968 -182961 164513 385599 561212 664343 685149 605479 308618
38416C08618m97958l29929K07709N83153L86515j40934m50137l03837J04974M22779
$$ 308618 -189340 -519269 -311560 271593 658108 517174 67037 -236800 -131826 290953
38406B90953M04081Q9347k45175m35810n89910p07758m54994K85525R38255Q69187
$$ 290953 695034 784381 539206 103396 -486514 -1194272 -1649266 -1363741 -425486 443701
38396D43701K64811k28235m71998o76465n33104M23724J575738J536152R5200
$$ 443701 708512 480277 8279 -668186 -1201290 -777566 798172 2334324 2429524
38387B429524j214968j103136j49827K86205q696k11234N1182L41817L27899J63933
$$ 2429524 1214556 111420 -38407 247798 239102 27868 79050 420867 748766 912699
38377I12699j919j93695k81253r8045J18520j7265l34578k55299K60045N17609
$$ 912699 910780 717085 435832 337787 456307 439042 104464 -150835 109210 626819
38367F26819R1020m77247l53209M93428J244122J186282M40145k81942m83238
$$ 626819 717839 240592 -112617 380811 1624933 2811215 3251360 2969418 2486180
38358B486180l56236m26338p76155q34987j35895Q56857J058864M4705j270163
$$ 2486180 2129944 1703606 927451 92464 -43431 813426 1872290 1916995 646832
38349F46832j547408n61789N20141N38477k65251o14235J22666J106643J124894
$$ 646832 -900576 -1462365 -942224 -403747 -668998 -1283233 -1160567 -53924 1070970
38340A070970J22799q17563q57257k41373K59404K59384p0288l70547l90844j38241
$$ 1070970 1193769 376206 -481051 -722424 -463020 -203636 -273924 -644471 -1035315 -1173556
38330a173556J01039P0878n7607J28143O19436Q62701M74416k51606p58987q22290
$$ -1173556 -1072517 -1001639 -1059246 -931103 -311667 551034 1025450 773844 14857 -807433
38320h07433n04045Q9736O66429P26477J66720l31679l8631Q05882J200157N97569
$$ -807433 -1311478 -1221742 -555313 171164 337884 6205 -32426 773456 1973613 2571182
38310B571182n17005j289033j317495p50603J5172N33936N28158J77989L3348
$$ 2571182 2054177 765144 -552351 -1302954 -1287782 -753846 -225688 -47699 -14351
38301a4351M01962Q90712P73096j26468j060224j062180n7300R54413J014340
$$ -14351 387611 1278323 2051419 1924951 864727 -197453 -254753 699660 1714000
38292A714000K96036k74264l04181k42774l94327m07486r6859r527n07785q82686
$$ 1714000 2010036 1735772 1431591 1188817 794490 387004 290145 280618 -227167 -1109853
38282a109853k63037R37834J442109Q57618O5351j80633r8429j17067j77133j74590
$$ -1109853 -1372890 -435056 1007053 1864671 1930022 1749389 1650960 1533893 1356760 1182170
38272A182170l15404n65298m48329J04898M01294P7088j48311L86850R81289M59053
$$ 1182170 866766 301468 -146861 -41963 359331 436419 288108 674958 1656247 2115300
38262B115300r15503j557447p09810N40833P95705R9223m32636k34527J65036
$$ 2115300 1199797 -357650 -1067460 -526627 269078 368301 -64335 -298862 -133826
38253a33826J04963l04303m47707p5649M17978N86847N00083M68078M06263l1033
$$ -133826 -28863 -333166 -780873 -856522 -438544 148303 648386 1116464 1522727 1491694
38243A491694o56401p23167k6482N73291L11266l10824l18669J52976J29771m62291
$$ 1491694 835293 112126 85644 658935 970201 659377 340708 493684 623455 161164
38233A61164n63753K10151P45329J28734q31913q05284M0946M12375n1144l52684
$$ 161164 -402589 -192438 552891 681625 -150288 -955572 -914626 -502251 -553395 -906079
38223i06079J41985P01494L86854n96196j258168j051178k69372M37559N87166
$$ -906079 -764094 -62600 324254 -271942 -1530110 -2581288 -2850660 -2413101 -1825935
38214a825935J83873j94526R0991R06647J366357R51952K01944j13868r5017l81118
$$ -1825935 -1642062 -1836588 -1745597 -838950 527407 1479359 1681303 1567435 1472418 1091300
38204A091300r61919j059698k89056O91311R85626N22164k0116j04085J58776
$$ 1091300 129381 -930317 -1219373 -528062 457564 979728 959612 855527 1014303
38195A014303K76048j04956q90048j554742j513072o77530L32651P31735L93783
$$ 1014303 1290351 1185395 295347 -1259395 -2772467 -3449997 -3117346 -2385611 -1991828
38186a991828j2531J65586P60588J011102N41182j80795m62514j93255J88351
$$ -1991828 -2004359 -1838773 -1078185 -67083 474099 293304 -169210 -362465 -174114
38177a74114L12941J62603j16459l20707j87763L08834O80849L85137l86301q48922
$$ -174114 138827 301430 184971 -135736 -323499 -14665 666184 1051321 665020 -183902
38167a83902o64352l05956j97747j03058K53488N52800M28135J62977K04452L78955
$$ -183902 -848254 -1154210 -1351957 -1455015 -1201527 -648727 -220592 -57615 146837 525792
38157E25792K89299J32319L09461N02966Q4928o69998p97273j43878L48443R7597
$$ 525792 815091 947410 1256871 1759837 1844765 1174767 377494 233616 582059 679656
38147F79656l42989l27339l0487J54312L00999M87323M05056J2694j47801J13813
$$ 679656 336667 9328 -21159 133153 434152 921475 1326531 1339225 1191424 1305237
38137A305237J46965l99928p52259k07335N72950N32008j03011k93925P3134J85545
$$ 1305237 1452202 1052274 300015 92680 665630 1197638 1094627 800702 873836 1059381
38127A059381j79533m01356k41316j23098j30882J08310M18439J23459o69538
$$ 1059381 879848 478492 237176 114078 -16804 91506 509945 633404 -36134
38118c6134r81620m65788J09070K12320K35491M10618K73553k09694k07946N33694
$$ -36134 -1017754 -1483542 -1374472 -1162152 -926661 -516043 -242490 -452184 -660130 -126436
38108a26436R95896N01892j29344n9640J24974k91530n66000J88529J024440M11564
$$ -126436 869460 1371352 1242008 1182368 1307342 1015812 449812 638341 1662781 2074345
38098B074345j078905j408976k52391N75481J42627k40081N34950J422851R51088
$$ 2074345 995440 -413536 -665927 -90446 52181 -187900 347050 1769901 2720989
38089B720989m74318j354411j255825q49372m28469K79398J091266J321579P88894
$$ 2720989 2246671 892260 -363565 -1212937 -1641406 -1362008 -270742 1050837 1839731
38080A839731O8136k98074k65797l0433J88118J76102m1604j23013J06359L30753
$$ 1839731 1907867 1609793 1343996 1313563 1501681 1677783 1636179 1513166 1619525 1950278
38070A950278K46581N1408J8811l4826l49400o50074n59414k67631j87157k39147
$$ 1950278 2196859 2248267 2267078 2232252 1882852 1232778 673364 405733 218576 -20571
38060b0571j23020J7300p9714j03488L47458Q27867N51752k65911o01659j88612
$$ -20571 -143591 -126291 -206005 -309493 37965 865832 1417584 1151673 550014 361402
38050C61402J81952P3488k8672J08021p2982o94301q57581j23825M83917L7980
$$ 361402 543354 616842 588170 696191 623209 -71092 -928673 -1052498 -568581 -530601
38040e30601o54606k99304O88489P87972j64730p74508l78007J16976N9095J13269
$$ -530601 -1185207 -1484511 -796022 -8050 -172780 -947288 -1325295 -1208319 -1149224 -1035955
38030a035955P37109J045216L10038n57464l67110L74129L53270k69762j89383
$$ -1035955 -298846 746370 1056408 498944 131834 505963 859233 589471 400088
38021D00088O32795P39294l02080r50354j43482Q50329L78404r32875j143164
$$ 400088 1032883 1772177 1470097 519743 376261 1226590 1604994 672119 -471045
38012d71045l6075O44292J2304o72255j53825Q28418P77074k44252p71612q4773
$$ -471045 -507120 137172 149476 -522779 -676604 151814 928888 684636 -86976 -171749
38002a71749R05416R78722M4577r37600j011826q1951R67006J022373o6246j168547
$$ -171749 733667 1712389 1756966 819366 -192460 -274411 692595 1714968 1648722 480175
37992D80175j132880j81664M96607L86488R7936J25496Q0852l94846p58280l52772
$$ 480175 -652705 -834369 -337762 48726 146662 272158 353010 -41836 -800116 -1152888
37982a152888M33864O38123J11477l64852k90483J1980J60227K67899M54397M32966
$$ -1152888 -719024 -80901 30576 -334276 -624759 -612779 -452552 -184653 269744 702710
37972G02710J7872l97055l18407J63395N44344N32551J84352l32188p55020p45536
$$ 702710 720582 323527 5120 168515 712859 1245410 1429762 1097574 342554 -402982
37962d02982k90105R7229j9551l56196l15115J17237M07340L36444K31585K78482
$$ -402982 -693087 -595858 -615409 -971605 -1286720 -1169483 -762143 -425699 -194114 84368
37952H4368K06121j45688m77003n09563l50596j13142L23074Q28500Q38890J68160
$$ 84368 290489 144801 -332202 -841765 -1192361 -1305503 -982429 -153929 684961 853121
37942H53121m43786k31899M68455O98695K63127j52217j93296l10504q02655j153297
$$ 853121 409335 177436 645891 1344586 1607713 1455496 1262200 951696 149041 -1004256
37932a004256p62228J72715R46489J158607Q60043K34996m39728p66484n83357
$$ -1004256 -1766484 -1593769 -647280 511327 1371370 1606366 1166638 400154 -183203
37923a83203k12017j9772J01450M72422R98421J216079R30506M32354M2535k38365
$$ -183203 -395220 -414992 -313542 158880 1157301 2373380 3303886 3736240 3778775 3540410
37913C540410n26633p50430p14778l87537k1876L5678k81466n82561l86880K41907
$$ 3540410 3013777 2263347 1548569 1161032 1139156 1174834 893368 310807 -76073 165834
37903A65834O40032L22821l63015o62669l90125j15062l12385o69944n09200K40872
$$ 165834 805866 1128687 765672 103003 -287122 -402184 -714569 -1384513 -1893713 -1652841
37893a652841Q14850M91085m75733j077308p14485J81119Q38880J071895J113375
$$ -1652841 -837991 -346906 -822639 -1899947 -2614432 -2433313 -1594433 -522538 590837
37884E90837Q96092K03977n61917o06994Q0041N60221K89780j43066r6859J16866
$$ 590837 1486929 1690906 1128989 521995 602036 1162257 1452037 1308971 1212112 1328978
37874A328978p77j23777K18499N66097K37998l29634k06759L19875O1815r99404
$$ 1328978 1328201 1204424 1422923 1989020 2227018 1897384 1690625 2010500 2072315 1072911
37864A072911j412061m33695Q07675R87452L05669k39717l43735k80982p5482
$$ 1072911 -339150 -772845 34830 1022282 1327951 1088234 744499 463517 388035
37855C88035K95887M46831J59696r6963L2557R1824k70258l91450L21414J014547
$$ 388035 683922 1130753 1290449 1193486 1226043 1317867 1047609 656159 977573 1992120
37845A992120M21090j055237j706659r37600O7531K81276Q8158J50960K51176
$$ 1992120 2413210 1357973 -348686 -1286286 -1218755 -937479 -849321 -698361 -447185
37836d47185j7370l33822k27558Q9200J79782J37313K30944K87962Q5460o3193
$$ -447185 -464555 -798377 -1025935 -936735 -756953 -619640 -388696 -100734 -15274 -78467
37826g8467K06512N59813L82283k40190n92422l09490K25832M39251J43242l74526
$$ -78467 128045 687858 1070141 829951 237529 -71961 153871 593122 736364 361838
37816C61838n59708n1549Q04114J168931P37420J77769J43133L02399j4563o17056
$$ 361838 -197870 -249419 554695 1723626 2461046 2638815 2781948 3084347 3069784 2452728
37806B452728p61150m38642l58658o11426m17605M47575R92992M40124m76181
$$ 2452728 1691578 1252936 894278 282852 -134753 312822 1305814 1745938 1269757
37797A269757n14767K56535O23201K4172p54939q07488k33535K66783L35647J07350
$$ 1269757 754990 1011525 1634726 1658898 903959 96471 -137064 129719 465366 572716
37787E72716j68549k65502k7907L80565N16531K39588k6705M2594R4430k95685
$$ 572716 404167 138665 110758 491323 1007854 1247442 1220737 1263331 1357761 1062076
37777A062076p26461m34754L90702O27093j70714r77679o71475M29335J114109
$$ 1062076 335615 -99139 291563 918656 747942 -229737 -901212 -471877 642232
37768F42232R09066L22705k33783p72261j000409l47436R26291J561870Q41297
$$ 642232 1551298 1874003 1640220 867959 -132450 -479886 446405 2008275 2849572
37759B849572l80988q35930m62214j22988j69242k13355j18321k13008m40289
$$ 2849572 2468584 1632654 1170440 1047452 878210 664855 546534 333526 -106763
37750a06763k21474N07990R14363M05274m49320p02973k97604O0760k0071l03720
$$ -106763 -328237 179753 1094116 1499390 1050070 347097 49493 110253 90182 -213538
37740b13538n23989o60680o34948l07664J46758L74177M26286O79032J052409
$$ -213538 -737527 -1398207 -2033155 -2340819 -2194061 -1819884 -1393598 -714566 337843
37731C37843R50746K75307j68595J86891O89007L71348n36572r06758l81408K16141
$$ 337843 1288589 1563896 1395301 1582192 2271199 2642547 2105975 1199217 817809 1033950
37721A033950K37082M772p1213k30273o17986o42510R5805Q59536P27910O3862
$$ 1033950 1271032 1275804 1204591 974318 356332 -286178 -190373 669163 1397073 1460935
37711A460935n1565L77453K33687q31682j676745j289677j80278M76286L76204
$$ 1460935 1409370 1786823 2020510 1188828 -487917 -1777594 -1957872 -1481586 -1105382
37702a105382R3833O7380K46843M34798M36608J22862k67726k30350K43885M76805
$$ -1105382 -1011549 -944169 -697326 -262528 174080 296942 29216 -201134 42751 519556
37692E19556J12916k43401r486L45235R6706l92718k09081M83219N57778k53867
$$ 519556 632472 389071 379585 724820 821526 428808 219727 702946 1260724 1006857
37682A006857q57549m91333J47903J08604l43563k88712L48747P33633L62753
$$ 1006857 149308 -342025 -194122 -85518 -429081 -717793 -369046 364587 727340
37673G27340l26474o02791k38412L88634P19775N20443O0120k72393m60779o74419
$$ 727340 400866 -201925 -440337 -51703 668072 1188515 1248635 976242 515463 -158956
37663a58956o92510j05137Q01853J074220L63961m83148o03320k26804Q903J77110
$$ -158956 -851466 -956603 -154750 919470 1283431 800283 196963 -29841 -20938 156172
37653A56172O05621Q57973L02401n82764o89257l0859K23421l43675p11826j09070
$$ 156172 761793 1619766 1922167 1339403 650146 619287 842708 499033 -212793 -321863
37643c21863P73256R43427N03932Q5771k34525n44174m14900L23408P86163J96449
$$ -321863 451393 1394820 1898752 1984523 1749998 1205824 790924 1114332 1900495 2096944
37633B096944o72190n23082L67867N62384j78301n73785n6948L59113J1811k41075
$$ 2096944 1424754 901672 1269539 1831923 1653622 1079837 1022889 1382002 1393813 1152738
37623A152738K81204O79676M1308p93121n44991L05952L19900m69853o98775l6246
$$ 1152738 1433942 2113618 2154926 1361805 816814 1122766 1442666 972813 274038 237792
37613B37792L79318R462k85984M3010L00838P938j05375N12516J018069M31716
$$ 237792 617110 626572 340588 383598 684436 692374 586999 1099515 2117584 2549300
37603B549300p38815j225057p48985n8694L05559L55333J56760j48826j52266
$$ 2549300 1810485 585428 -163557 -222251 83308 438641 595401 446575 294309
37594B94309K43479M36563N4518k33787K77593J019392R27726J68543j48886J86182
$$ 294309 537788 974351 1028869 795082 1072675 2092067 3019793 3188336 3039450 3225632
37584C225632K47788l27195o99331k71907L38748L34439j31286m23761l50735
$$ 3225632 3473420 3146225 2446894 2174987 2513735 2848174 2716888 2293127 1942392
37575A942392r4515K16947M20240K81865r0052k58485j25260n8354j68081j15875
$$ 1942392 1847877 2064824 2485064 2766929 2676877 2418392 2293132 2234778 2066697 1950822
37565A950822J21261O1336l53351m41427J12935O28417N06507J79030K34504L16558
$$ 1950822 2072083 2133419 1780068 1338641 1451576 2079993 2586500 2765530 3000034 3316592
37555C316592j74362q35837p87401j33345J74226j44722l37566R1276O41994O97133
$$ 3316592 3142230 2306393 1518992 1385647 1559873 1415151 1077585 1168861 1810855 2507988
37545B507988M18600L08340L46154Q8350n38567r90425p82389j92935K3452l09343
$$ 2507988 2926588 3234928 3581082 3669432 3130865 2140440 1358051 1165116 1188568 879225
37535H79225m33439K31902J001513P45595l37686q38792k37387L07027j36793
$$ 879225 445786 677688 1679201 2424796 2087110 1248318 1010931 1317958 1181165
37526A181165p63344m38672L88999N13546M18r8571L44661M65177J11471N3906
$$ 1181165 417821 -20851 368148 881694 882112 783541 1128202 1593379 1704850 1758756
37516A758756L73620J91222o29397r74888k70917N51303O16259M10911O25056
$$ 1758756 2132376 2323598 1694201 719313 448396 999699 1615958 2026869 2651925
37507B651925P82048J57353p43864q40889j33748L94078K43379j86853m42144
$$ 2651925 3433973 3591326 2847462 2006573 1872825 2266903 2510282 2323429 1881285
37498A881285m01551Q996O74829R87935M69529l78464o00885j26948J90407q4478
$$ 1881285 1479734 1488730 2163559 3151494 3621023 3242559 2641674 2514726 2705133 2620655
37488B620655l79293r0707N17027P52864L95846j84399n21614m17342j4103L10287
$$ 2620655 2241362 2150655 2667682 3420546 3816392 3631993 3110379 2693037 2678934 2989221
37478B989221K50026j27666m67491m97644k27114J22156K46384j0922l77462l17697
$$ 2989221 3239247 3111581 2644090 2146446 1919332 2041488 2287872 2276950 1899488 1581791
37468A581791K63365P32104N05773r8672k52218K75800Q75237R26020M19768k61713
$$ 1581791 1845156 2577260 3083033 2984361 2732143 3007943 3883180 4809200 5228968 4967255
37458D967255p68626r18288p43499m63798j97967J74462O01690O00449q8917q36668
$$ 4967255 4198629 3280341 2536842 2073044 1875077 2049539 2651229 3251678 3162761 2326093
37448B326093q00636j55434J42391j65130k91690K12434O57746L40360k77818
$$ 2326093 1525457 1370023 1512414 1347284 1055594 1268028 1925774 2266134 1988316
37439A988316k44202N02024J138412J064709L83390m89159j105118j068812m18202
$$ 1988316 1744114 2246138 3384550 4449259 4832649 4343490 3238372 2169560 1751358
37430A751358J92536K05199q3717k409M22530N32418J51010q8003K62648P45419
$$ 1751358 1943894 2149093 2065376 2062967 2485497 3017915 3168925 3080922 3343570 4088989
37420D088989O52135J1353m88431m05645m4962j2050m15502o70047k34193N61289
$$ 4088989 4741124 4752477 4264046 3858401 3813439 3801389 3385887 2715840 2481647 3042936
37410C042936Q24874L39173p8939J85997N82840L45308j60314m2123N23545N40662
$$ 3042936 3867810 4206983 4128044 4314041 4896881 5242189 5081875 5039752 5563297 6103959
37400F103959m6320k14686K97967M69107j53602n36259J6070N23901P1131l94426
$$ 6103959 6057639 5842953 6140920 6610027 6456425 5920166 5936236 6460137 6531268 6136842
37390F136842L50201J392844Q77771q76937j611391n24747O33585L61774n83890
$$ 6136842 6487043 7879887 8757658 7880721 6269330 5744583 6378168 6739942 6156052
37381F156052p91713k11279M17858Q25670Q88045K33360p87387q66868L96046
$$ 6156052 5364339 5153060 5570918 6396588 7284633 7517993 6730606 5863738 6259784
37372F259784J469743R55222l51325q40254n28215m56954m98328K45957J287089
$$ 6259784 7729527 8684749 8333424 7493170 6964955 6508001 6009673 6255630 7542719
37363G542719J120479k07957r29122k99278L79027R3577l27348P2266P00270O28214
$$ 7542719 8663198 8455241 7526119 7226841 7605868 7699445 7372097 7444363 8144633 8772847
37353H772847J98379J46007J62693k97094o01889J65666J393074J524998L35271
$$ 8772847 8971226 9117233 9279926 8982832 8380943 8546609 9939683 11464681 11799952
37344A1799952p72535q63361n95840q20517j129109n90748O59224J446521J104742
$$ 11799952 11027417 10164056 9568216 8747699 7618590 7027842 7687066 9133587 10238329
37335A0238329L09980Q8006M15605L79521l21967p65348j43965Q66348R33034
$$ 10238329 10548309 10636315 11051920 11431441 11109474 10344126 10200161 11066509 11999543
37326A1999543J934n99540o6291Q76253J182721P86007K11035k75126n26600k44538
$$ 11999543 12001477 11401937 11335646 12211899 13394620 14180627 14391662 14116536 13589936 13345398
37316A3345398M96205J010676Q88571N73436N38195N38840K86824J41393L95449
$$ 13345398 13841603 14852279 15740850 16314286 16852481 17391321 17678145 17819538 18214987
37307A8214987N77949L03476J15120N24073R01669M62709k49151j52980N47610
$$ 18214987 18792936 19096412 19211532 19735605 20637274 21099983 20850832 20697852 21245462
37298B1245462P44813L45658L05261Q11065R87021N94849N17864J127247J561036
$$ 21245462 21990275 22335933 22641194 23452259 24439280 25034129 25551993 26679240 28240276
37289B8240276J229661P94267R25751J184203R48849N44178N82540R23446J113174
$$ 28240276 29469937 30264204 31189955 32374158 33323007 33867185 34449725 35373171 36486345
37280C6486345J245833J597868J921265J853207J620170J669262J953454K142763
$$ 36486345 37732178 39330046 41251311 43104518 44724688 46393950 48347404 50490167
37272E0490167K172072K089525J809777J518288J801214K776839L600551L516602
$$ 50490167 52662239 54751764 56561541 58079829 59881043 62657882 66258433 69775035
37264F9775035K971378K959066L628334M302394M599377M738075M896692N042175
$$ 69775035 72746413 75705479 79333813 83636207 88235584 92973659 97870351 102912526
37256A02912526N336312N990511O699884O886638O597722O569476P243603Q212456
$$ 102912526 108248838 114239349 120939233 127825871 134423593 140993069 148236672 156449128
37248A56449128Q840325R052575R284243R882201J0748846J1494317J1859824
$$ 156449128 165289453 174342028 183626271 193508472 204257318 215751635 227611459
37241B27611459J1957168J1996081J1857805J1268937J0410494R839041R585429
$$ 227611459 239568627 251564708 263422513 274691450 285101944 294940985 304526414
37234C04526414Q901720P321600N426679L964656K686029Q40063j489447l457064
$$ 304526414 313428134 320749734 326176413 330141069 332827098 333667161 332177714 328720650
37226C28720650m786579o099599p739285r107971r591074r530411r770413j0582343
$$ 328720650 323934071 317834472 310095187 300987216 291396142 281865731 272095318 261512975
37218B61512975j1466519j1813032j1421020j0506794r486741q706784q223615
$$ 261512975 250046456 238233424 226812404 216305610 206818869 198112085 189888470
37211A89888470p881289p611586p478225p384918p032199o369320n847938n883551
$$ 189888470 182007181 174395595 166917370 159532452 152500253 146130933 140282995 134399444
37203A34399444o152233n832981m688290l558508l441200m246834m892560m615291
$$ 134399444 128247211 122414230 117725940 114167432 110726232 106479398 101586838 96971547
37195I6971547l710455k848905k247155j893279k011263k608993k954861k371238
$$ 96971547 93261092 90412187 88165032 86271753 84260490 81651497 78696636 76325398
37187G6325398j389760j194618j906067k393191j979163j315700j162558j291018
$$ 76325398 74935638 73741020 71834953 69441762 67462599 66146899 64984341 63693323
37179F3693323j214542j113586j250840j223970o96523k63868o25749j357103
$$ 63693323 62478781 61365195 60114355 58890385 58193862 57929994 57304245 55947142
37171E5947142j500972j057983q62137j151174j282677q85867l80412k01476k44151
$$ 55947142 54446170 53388187 52526050 51374876 50092199 49206332 48825920 48624444 48380293
37162D8380293k47747j63234k6622J01920R5597N006J00238K77250q4162j045205
$$ 48380293 48132546 47969312 47942690 48044610 48140207 48145213 48245451 48522701 48438539 47393334
37152D7393334j524724p70523J65071k45052j547354j795577n23331N11088L7909
$$ 47393334 45868610 45098087 45263158 45018106 43470752 41675175 41151844 41662932 41700841
37143D1700841r36637r75401m13759m47049j043596j214423q02382n97257q43341
$$ 41700841 40764204 39788803 39375044 38927995 37884399 36669976 35867594 35270337 34426996
37134C4426996q79662l94459k8318l81931j115331j449269j168454p52478o74775
$$ 34426996 33547334 33152875 33124557 32742626 31627295 30178026 29009572 28257094 27582319
37125B7582319q70833r43533p24612m26922k41392r8701j7223k95796r44149j310304
$$ 27582319 26711486 25767953 25043341 24616419 24375027 24276326 24259103 23963307 23019158 21708854
37115B1708854r17908l55717m91746j024875q85032m9668K87354l67026j016199
$$ 21708854 20790946 20435229 19943483 18918608 18033576 17983908 18271262 17904236 16888037
37106A6888037q63928n18551o61637p19641m5911N60806j4076j172675j281092
$$ 16888037 16024109 15505558 14843921 14124280 14078369 14639175 14625099 13452424 12171332
37097A2171332j44997P19414L80871l62536n15925l05944l87655n83111k91423
$$ 12171332 12026335 12745749 13126620 12764084 12248159 11942215 11554560 10971449 10680026
37088A0680026L45015N22738p8404q29145r42076m05744P2162k5210m08205m61783
$$ 10680026 11025041 11547779 11469375 10640230 9698154 9292410 9364572 9339362 8931157 8469374
37078H469374j63002o3911l39575m66012j22840K29466J79648J49341O05044J007025
$$ 8469374 8306372 8242461 7902886 7436874 7314034 7543500 7723148 7872489 8477533 9484558
37068I484558N21616n02625q66878l18712Q5806l34626q79614o61475L8357L15504
$$ 9484558 10006174 9503549 8636671 8317959 8403765 8069139 7189525 6528050 6566407 6881911
37058F881911p578l16836k10216Q4842K13523J15567p6540k34388k90645k78905
$$ 6881911 6874333 6557497 6347281 6432123 6645646 6761213 6684673 6450285 6159640 5880735
37048E880735k93873l09710j54704K06749N12190M86481J70334j96161m86574
$$ 5880735 5586862 5277152 5122448 5329197 5841387 6327868 6498202 6302041 5815467
37039E815467o76036o22043j59759N26894Q94237O00723n3188m86143n73498o99593
$$ 5815467 5139431 4517388 4357629 4884523 5778760 6379483 6326295 5840152 5266654 4567061
37029D567061j013708j051909m13094N19492J007976R14584O86670N15487J66640
$$ 4567061 3553353 2501444 2088350 2607842 3615818 4530402 5217072 5732559 5899199
37020E899199l37286n79491m56795l35026k92742K5350N03805L98895l85498p81448
$$ 5899199 5561913 4982422 4525627 4190601 3897859 3923209 4427014 4825909 4440411 3658963
37010C658963j22881N93522Q6063j167138j507017m44490Q05895J129651O98337
$$ 3658963 3536082 4129604 4215667 3048529 1541512 1097022 1902917 3032568 3730905
37001C730905J65794k90007p25161r72182q38485l50178L30678Q57348P19472
$$ 3730905 3896699 3606692 2881531 1909349 1070864 720686 1051364 1908712 2628184
36992B628184j02591p16100l24881N13539N72579j96043o00974q8887N09734M52648
$$ 2628184 2525593 1809493 1484612 1998151 2570730 2374687 1773713 1684826 2194560 2647208
36982B647208J39725J26401J27367k46110n97265m09848L6758J96766J75972L67827
$$ 2647208 2786933 2913334 3040701 2794591 2197326 1787478 1824236 2021002 2196974 2564801
36972B564801O02112M00773j91875o53461o48688k01748M99285J053544R58133
$$ 2564801 3166913 3567686 3375811 2722350 2073662 1871914 2371199 3424743 4382876
36963D382876K16774m80464n73092k73823o4664k2481o0442l30645q53828j175340
$$ 4382876 4599650 4119186 3546094 3272271 3207607 3185126 3124684 2794039 1940211 764871
36953G64871r37986m49100j96774j59383l2479K51885O28386J045664J140202
$$ 764871 -173115 -622215 -818989 -978372 -1010851 -758966 -130580 915084 2055286
36944B055286M04120q34657j346739n88749L88827M36937m4718K9194O15237Q30231
$$ 2055286 2459406 1624749 278010 -310739 78088 515025 470307 499501 1114738 1944969
36934A944969N47947L48236J87887m38883j126372q32382L34711J017949O05466
$$ 1944969 2492916 2841152 3029039 2590156 1463784 631402 966113 1984062 2589528
36925B589528l399k4172J30380n2486k55237k03222l21630p15880n88984L68290
$$ 2589528 2586129 2561957 2692337 2639851 2384614 2181392 1859762 1143882 554898 923188
36915I23188J018497L58086p79042q93451p0850L51054p537j98703K37587N47984
$$ 923188 1941685 2299771 1520729 627278 556428 907482 899945 701242 938829 1486813
36905A486813J79840l27896l89714k75843l44143k49295L25731Q24188N43234
$$ 1486813 1666653 1338757 949043 673200 329057 79762 405493 1229681 1772915
36896A772915k13960n17262j06149M06905M93022K23012r5540k15531M1259N07470
$$ 1772915 1558955 1041693 935544 1342449 1835471 2058483 1962943 1747412 1788671 2296141
36886B296141N20634k80768j108396q17286L87733J018573L90455m03026k35811
$$ 2296141 2816775 2536007 1427611 610325 998058 2016631 2407086 2004060 1768249
36877A768249L38853J45146o14860p44664p8547K93721j21030m77301q9676M60007
$$ 1768249 2107102 2252248 1637388 892724 814177 1107898 986868 509567 419891 879898
36867H79898L35583k70352n38307j46109N55111J046733R34323J97385n52944
$$ 879898 1215481 945129 406822 260713 815824 1862557 2796880 2994265 2441321
36858B441321n94777j03699L3739l53724l88354L20948Q31728L22261n31774o33678
$$ 2441321 1846544 1742845 1776584 1422860 1034506 1355454 2187182 2509443 1977669 1343991
36848A343991j76404j35757n78770o82421j70244L84378N69772M89369K20308
$$ 1343991 1167587 1031830 453060 -229361 -399605 -15227 554545 1043914 1264222
36839A264222j99408l92104r8647J91193o7791m43548j74675M52567N26094R1848
$$ 1264222 1064814 672710 574063 765256 697465 253917 79242 531809 1057903 1149751
36829A149751M0683M89056O18500K00348r6336j05985m41886j032383q79809J32266
$$ 1149751 1190434 1679490 2297990 2498338 2402002 2296017 1854131 821748 -58061 74205
36819G4205O55514n3367q07991l07783Q36986J135635M46424j37194j34526j40433
$$ 74205 729719 676352 -131639 -439422 397564 1533199 1979623 1842429 1707903 1567470
36809A567470n73763j000262q44107j62630M24730L64030j80258l10665N43545
$$ 1567470 993707 -6555 -850662 -1013292 -588562 -224532 -404790 -715455 -171910
36800a71910J610845J564466L72825o10935o07153k72322j82796J51099R06802
$$ -171910 1438935 3003401 3376226 2765291 2158138 1885816 1703020 1854119 2760921
36791B760921R48373m92120k145554k184540p10214O29447R75079Q13011O09310
$$ 2760921 3709294 3217174 1071620 -1112920 -1823134 -1193687 -218608 594403 1203713
36782A203713L37941J93572M34621N80022k5989r22826j007324k55521K36633
$$ 1203713 1541654 1735226 2169847 2749869 2723880 1801054 793730 538209 774842
36773G74842m1062m63807n26699m71146m67103k79141Q233m3208l07774j43927
$$ 774842 733780 269973 -256726 -727872 -1194975 -1474116 -1465883 -1509091 -1816865 -1960792
36763a960792M31175O43583K82534O6743L76764O61842M95726K18411R8018j58971
$$ -1960792 -1529617 -886034 -603500 -536757 -159993 501849 997575 1215986 1314004 1155033
36753A155033n82238n96948o1424K80609n166k75652Q9813O37719O31860J93473
$$ 1155033 572795 -24153 -85577 195032 189866 -85786 4027 641746 1273606 1467079
36743A467079j09207k13066l55939m21601j95731J24243K63363L09693L31235
$$ 1467079 1357872 1144806 788867 367266 171535 295778 559141 868834 1200069
36734A200069N2607n61641r23691n94091L8612L76692M00129L19789M6075l79314
$$ 1200069 1252676 691035 -232656 -826747 -788135 -411443 -11314 308475 354550 -24764
36724b4764m26140J28880N88616K76747l99768o07126l19996o7334Q4334L50424
$$ -24764 -450904 -322024 266592 543339 143571 -463555 -783551 -850885 -766551 -416127
36714d16127M22811j04665p29230n29853L80096Q97464N03764j26180k51326L8140
$$ -416127 6684 -97981 -827211 -1357064 -976968 -79504 424260 298080 46754 84894
36704H4894K93154L55930K51295j740k22273j70157L3969K6795j87302k18966
$$ 84894 378048 733978 985273 983533 761260 591103 625072 651867 464565 245599
36694B45599M1376K32882J12166j05927j14574J25714M37263N39015J96975m12915
$$ 245599 286975 519857 632023 526096 411522 537236 974499 1513514 1710489 1297574
36684A297574p00322m30865j79999m40757o72233r3236Q64464R94815J73061m18600
$$ 1297574 597252 166387 -13612 -454369 -1126602 -1219838 -355374 639441 812502 393902
36674C93902j40998K37997J8195k60593P6276N12122J42955q05339j300808r97440
$$ 393902 252904 490901 509096 248503 324779 836901 979856 174517 -1126291 -2123731
36664b123731m50366m9078L32269O52796N56857Q8173j56894J28325N05792M90288
$$ -2123731 -2574097 -2623175 -2290906 -1638110 -1081253 -993080 -1149974 -1021649 -515857 -25569
36654b5569K56667K56125M30184L00457k07294n01801j12752N67080P26358K28203
$$ -25569 231098 487223 917407 1217864 1010570 508769 396017 963097 1689455 1917658
36644A917658k36303k07120r9641l85013o62660k82957M22476M75119j95602n25756
$$ 1917658 1681355 1474235 1374594 989581 326921 43964 466440 941559 745957 220201
36634B20201P0875Q03332P46916J70655j09046o7630k86694q02842j030797p07714
$$ 220201 291076 1094408 1841324 2011979 1902933 1835303 1548609 745767 -285030 -992744
36624i92744j62905L03197O47338P31594L98632q3999k75156k83196n80865j018228
$$ -992744 -1155649 -852452 -205114 526480 925112 841113 565957 282761 -298104 -1316332
36614a316332p83091L35380J337378J216732L09996k00737R9684M34366Q6341
$$ -1316332 -2099423 -1764043 -426665 790067 1100063 899326 999010 1433376 1519717
36605A519717n47788n74230L7276L18822l22537j122354q95577K72115J041357
$$ 1519717 971929 397699 434975 753797 431260 -691094 -1586671 -1314556 -273199
36596b73199O80083O9150K69794Q11187M20862q69882j574294q75347K19891L90794
$$ -273199 406884 476034 745828 1557015 1977877 1107995 -466299 -1341646 -1121755 -730961
36586g30961k26940n48191j83004L16753N13878N07032M07841J96412J20008M98555
$$ -730961 -957901 -1506092 -1689096 -1372343 -858465 -351433 56408 252820 372828 871383
36576H71383J009723Q68118l8850q22571p34343q9283L28720K68144m1578m40463
$$ 871383 1881106 2749224 2710374 1887803 1153460 1064177 1392897 1661041 1619463 1179000
36566A179000p35196m65333M74268J233396Q70803k58414q54128m65068L0247
$$ 1179000 443804 -21529 452739 1686135 2556938 2298524 1444396 979328 1009575
36557A009575j3815m7324M44444P58492P4496r47852r56777O188N63365J82961
$$ 1009575 995760 948436 1392880 2151372 2225868 1278016 321239 327427 890792 1073753
36547A073753q9237M72670R51496K73856r23976j109770r5093P26218L74209m89336
$$ 1073753 984516 1457186 2408682 2682538 1758562 648792 553699 1279917 1654126 1164790
36537A164790o49974M1347O40295M04219l33764o50884k10239L01640R8016n54267
$$ 1164790 514816 556163 1196458 1600677 1266913 616029 405790 707430 805446 251179
36527B51179o30773J42734P67795L70082n09982p13583j10153L97394K93311k7974
$$ 251179 -379594 -236860 530935 901017 391035 -322548 -432701 -35307 258004 230030
36517B30030j54752j91984k20318j7039L74530M83220J79564j1384K22631L83696
$$ 230030 75278 -116706 -337024 -354063 20467 503687 683251 671867 894498 1278194
36507A278194n0465p18762q46487l15249K97449N48826M85022K80854k184k99885
$$ 1278194 1227729 508967 -337520 -652769 -355320 193506 678528 959382 957198 657313
36497F57313n09066n67514m12566j4354L96388M22240O7986j28162J15754K82998
$$ 657313 148247 -419267 -831833 -846187 -449799 -27559 40427 -87735 28019 311017
36487C11017j75933q51890q43726r6790M66924K54033k47331k89915J19582M28108
$$ 311017 135084 -716806 -1560532 -1657322 -1190398 -936365 -1183696 -1473611 -1354029 -925921
36477i25921L72517J61943J2753r3493k01989k16436l6966K26673K76429n2857
$$ -925921 -553404 -391461 -378708 -472201 -674190 -890626 -927592 -700919 -424490 -477347
36467d77347m77925m52704J64419Q05729Q38035L68132K1879J4219l6460l01054
$$ -477347 -955272 -1407976 -1243557 -437828 400207 768339 790218 804437 767977 466923
36457D66923l48978J10690N86433M09956k76904o66208l45237K37612M23117J19200
$$ 466923 117945 228635 815068 1225024 948120 281912 -63325 174287 597404 716604
36447G16604j91097l1260N52342R63953O02668m27843j254944j092966q9732Q93395
$$ 716604 525507 494247 1046589 2010542 2613210 2185367 930423 -162543 -252275 641120
36437F41120J222110R03884K00614o61159j307814j274903n65785J91497M64631
$$ 641120 1863230 2767114 2967728 2306569 998755 -276148 -841933 -650436 -185805
36428a85805L88790K95075O3767n00505r46665o05468K81240O72675J89484l26615
$$ -185805 202985 498060 561827 61322 -885343 -1490811 -1209571 -536896 -347412 -674027
36418f74027j39833K60175P1249m16268l04522L56466O02783J28302k82831j34100
$$ -674027 -813860 -553685 -482436 -898704 -1203226 -846760 -243977 -115675 -398506 -532606
36408e32606N5440j09316p2297N66825J000158L41700p86508j029066l54916j1969
$$ -532606 -477166 -586482 -658779 -91954 908204 1249904 463396 -565670 -920586 -932555
36398i32555m09622m42929N99814J684111J446951J37889q29880p73289k29200
$$ -932555 -1342177 -1785106 -1185292 498819 1945770 2083659 1253779 480490 251290
36389B51290J77460L91222M43624J72945l14868n18021j96028K51589L38204R3976
$$ 251290 428750 819972 1263596 1436541 1121673 603652 407624 659213 997417 1091393
36379A091393j41421k36933k77429k66574j62673j03720k45716l72691l2307P56685
$$ 1091393 949972 713039 435610 169036 6363 -97357 -343073 -715764 -748071 8614
36369H614J219825O30072o51505j360551p60569M32594R19217L96886k44921k86606
$$ 8614 1228439 1858511 1207006 -153545 -914114 -481520 437697 834583 589662 303056
36359C03056q7101l05140p43597n97270L20279J219764J307123O59146n1558l51069
$$ 303056 215955 -89185 -832782 -1430052 -1109773 109991 1417114 2076260 2024702 1673633
36349A673633k39224N4252K52710Q7209m84981j062047j067657m11242K74699
$$ 1673633 1434409 1488661 1741371 1828580 1343599 281552 -786105 -1197347 -922648
36340i22648K87869k87463o29564j73656O75950J037895O01603r8447l95177j72361
$$ -922648 -634779 -922242 -1551806 -1725462 -1049512 -11617 589986 491539 96362 -75999
36330g5999J93158K99033M7498k87784k97039N9816K59404j23765o52134m93452
$$ -75999 117159 416192 463690 175906 -121133 -61317 198087 74322 -577812 -1071264
36320a071264K79735N98000m7965p27135m23242L71139L96939l84507p10269J8565
$$ -1071264 -791529 -193529 -241494 -968629 -1391871 -1020732 -623793 -1008300 -1718569 -1700004
36310a700004Q17841O09937k59558o59976k44187L36287M67984J77335j75085
$$ -1700004 -882163 -272226 -531784 -1191760 -1435947 -1099660 -631676 -454341 -629426
36301f29426k74864K9655N65796Q00803L41529m85265q64559m09245L71661O51198
$$ -629426 -904290 -874635 -308839 491964 833493 348228 -516331 -925576 -553915 97283
36291I7283K16382l19093k54595L39773O80142K54289m82297o75920j84361L08729
$$ 97283 313665 -5428 -260023 79750 759892 1014181 531884 -144036 -328397 -19668
36281a9668K71463p8273k86866k77376j62270J17306N54425P83609M68191j81315
$$ -19668 251795 173522 -113344 -390720 -552990 -435684 118741 902350 1370541 1189226
36271A189226o29886o19268k74095J68083M17138J88316l90697o63912k03057
$$ 1189226 559340 -59928 -334023 -165940 251198 439514 48817 -615095 -818152
36262h18152N18133P12844L57803Q0473J06004N1256k02146k28541J03224K63130
$$ -818152 -300019 412825 770628 851101 957105 1008361 806215 577674 680898 944028
36252I44028m8695l10829n4247K34347j62001r09325r38872n820Q86848Q39645
$$ 944028 895333 584504 530257 764604 602603 -306722 -1245594 -1251414 -364566 475079
36242D75079J63736k36205p4381K13617K58178R6555j47861l99617m33856n6470
$$ 475079 638815 402610 328229 541846 800024 896579 748718 349101 -84755 -141225
36232a41225L91155K44230m53400o59452L20278J550835J400794k34984j577979
$$ -141225 249930 494160 40760 -618692 -298414 1252421 2653215 2418231 840252
36223H40252j223671Q0331O37394J38683k45851J47031N90695L18330k68608l43191
$$ 840252 -383419 -303088 334306 472989 227138 374169 964864 1283194 1014586 671395
36213F71395Q5753L58214J96247j23601l93062o37822p71019o40117l79850k31313
$$ 671395 757148 1115362 1311609 1188008 794946 157124 -613895 -1254012 -1633862 -1865175
36203a865175o2451M10027R36478Q69993J24750n56522n37829j3011M79184P67098
$$ -1865175 -1927626 -1517599 -581121 288872 413622 -142900 -680729 -693740 -214556 552542
36193E52542Q83339O61828O4267m05246k56367J70034J01947m80893p70242l67113
$$ 552542 1435881 2097709 2161976 1756730 1500363 1670397 1772344 1291451 521209 154096
36183A54096J23729Q5384j67072Q893M95341O15200K01434k14384k53315j23032
$$ 154096 277825 363209 196137 205030 700371 1315571 1517005 1302621 1049306 926274
36173I26274j12981j84500k36429l38281m81390m51239j70166J15587J82458J12932
$$ 926274 813293 628793 392364 54083 -427307 -878546 -1048712 -933125 -750667 -637735
36163f37735Q2473J19737J98906K85446J97181k17564o50094n36559J01038N20408
$$ -637735 -555262 -435525 -236619 48827 246008 28444 -621650 -1158209 -1057171 -536763
36153e36763K74352j57675j61020J35102L20460N04536R03657J063185M23715
$$ -536763 -262411 -420086 -581106 -446004 -125544 378992 1282649 2345834 2769549
36144B769549n61701q70748m33433j99252n65730p95565l59637J47693N1736k70153
$$ 2769549 2207848 1337100 903667 704415 138685 -656880 -1016517 -868824 -817088 -1087241
36134a087241q0493M76364O57359L02442n1718p9378R80k9573p7356k7479M3217
$$ -1087241 -1167734 -691370 -34011 268431 216713 137335 138315 108742 31386 3907 47124
36123D7124P707j69488l82685l67426M0612N10488M78938K5306o2932M91041P99434
$$ 47124 54831 -114657 -497342 -864768 -824156 -313668 165270 190576 127644 618685 1418119
36112A418119Q5818r20888q66013K14185Q83765L91340l49327k71456L03833L32811
$$ 1418119 1503937 583049 -282964 -68779 814986 1206326 856999 585543 889376 1222187
36102A222187l57901r19769o85167Q8806O43948N17243p5275m67652k39683K56498
$$ 1222187 864286 -55483 -740650 -651844 -7896 509347 434072 -33580 -273263 -16765
36092a6765K95787k40311o60849m09591K11398N55378M67515K14128o7401l42371
$$ -16765 279022 38711 -622138 -1031729 -820331 -264953 202562 416690 349289 6918
36082F918l55420Q2513N81201N24725l1681l62650r6436K88582K42857o1037j31188
$$ 6918 -348502 -265989 315212 839937 808256 445606 349170 637752 880609 819572 688384
36071F88384k934j23401n10467o26477k24901K07417J98644O8680M04124R59624
$$ 688384 685450 562049 51582 -574895 -799796 -592379 -393735 -325055 79069 1038693
36061A038693Q08285k58065j175439r38858J9177M74179J44796q6027K87883N79666
$$ 1038693 1846978 1588913 413474 -525384 -506207 -32028 112768 26741 314624 894290
36051H94290R2805o36867n62706K99623Q80397N78262l2053k18507j24027l31628
$$ 894290 987095 350228 -212478 87145 967542 1545804 1513751 1295244 1171217 839589
36041H39589q56554j141881q86785l72185K6964K27833K70585J52569k750O7384
$$ 839589 -16965 -1158846 -2045631 -2417816 -2390852 -2163019 -1892434 -1739865 -1742615 -1675231
36031a675231L85047O04378N17969M14514N71697O58946K04968m53620m20943
$$ -1675231 -1290184 -685806 -167837 246677 818374 1477320 1682288 1228668 807725
36022H07725L73911P77974p9365j425510j719598o25087O62349J024943O05376
$$ 807725 1181636 1959610 1880245 454735 -1264863 -1889950 -1227601 -202658 402718
36013D02718J94875J19340J55464J20743O4055M0128L7833N4357N2641k4436o3876
$$ 402718 597593 716933 872397 993140 1057195 1097323 1135156 1189513 1242154 1217718 1153842
36002A153842J77879O56364Q86779M74537l52962r93587j118733q33684l49441
$$ 1153842 1331721 1988085 2874864 3349401 2996439 2002852 884119 50435 -299006
35993b99006J59006M16624J60942m64775q83247o52588N0826O83820R67699J025163
$$ -299006 -140000 276624 437566 -27209 -910456 -1563044 -1512218 -828398 139301 1164464
35983A164464R06488L65164o02573j292296r56164N4316M88901j45960q05156
$$ 1164464 2070952 2436116 1833543 541247 -414917 -360601 128300 -17660 -822816
35974h22816l92796N54604O33265k78838q22832k29372N98449N85332M9738l0002
$$ -822816 -1215612 -661008 -27743 -306581 -1129413 -1358785 -760336 -175004 -125266 -155268
35964a55268M28005P28634O27481M92240M36324J58831l55390o81866n81190k61305
$$ -155268 272737 1001371 1628852 2121092 2557416 2716247 2360857 1678991 1097801 836496
35954H36496q052M844l55946r33946j085630l37242Q01409J296361Q84677K98286
$$ 836496 828444 833288 477342 -456604 -1542234 -1879476 -1078067 218294 1102971 1401257
35944A401257J34472J62920m6465m17957o20528n81778m38671k88559k04460k13947
$$ 1401257 1535729 1698649 1652184 1234227 613699 31921 -406750 -695309 -899769 -1113716
35934a113716j36067K34169O85414P19346K40491k80726m61553l99169k68389
$$ -1113716 -1249783 -1015614 -330200 389146 629637 348911 -112642 -511811 -780200
35925g80200j6769K90585K95033j16270m43152j50007N78559R90004N95651l28789
$$ -780200 -796969 -506384 -211351 -327621 -770773 -920780 -342221 647783 1243434 914645
35915I14645j009892q98060k14749L00586L10675K47916M53618M49085k15794
$$ 914645 -95247 -993307 -1208056 -907470 -596795 -348879 104739 553824 338030
35906C38030q29233l54785P56531R49594n8288p64317k71528L57712P6070l49668
$$ 338030 -491203 -845988 -89457 860137 801849 37532 -233996 123716 199786 -149882
35896a49882O8568M75599m04829j681226j341642M36121J313766L56280o45100
$$ -149882 -81314 394285 -10544 -1691770 -3033412 -2597291 -1283525 -927245 -1572345
35887a572345j47915Q47183O98446k65847n67751L7048N56297N36393L99960L10115
$$ -1572345 -1720260 -873077 -174631 -440478 -1008229 -971181 -414884 121509 521469 831584
35877H31584j2620m10637l28788J95126M75157K15813j44768k15066q7269R3858
$$ 831584 818964 408327 79539 274665 749822 965635 820867 605801 518532 612390
35867F12390L43735M88251K05823l98083p70501o42263l32473j78116j07219M5101
$$ 612390 956125 1444376 1650199 1252116 481615 -160648 -493121 -671237 -778456 -733355
35857g33355K09125K81945L31476M19413M81017M77685M00076J04770m82504r71370
$$ -733355 -524230 -242285 89191 508604 989621 1467306 1867382 1972152 1489648 518278
35847E18278p85588J2311O28130M94262p8889m45470m09364j75834Q1303K31456
$$ 518278 -267310 -254999 373131 867393 788504 343034 -66330 -242164 -160861 70595
35837G0595R9948k30757l18451L4064L66460K28977k9657K28390Q04036Q07063
$$ 70595 170543 -60214 -378665 -344601 21859 250836 221179 449569 1253605 2060668
35827B060668M123p28439o14414j8332J95241j24561m25394l90852k19206l4463
$$ 2060668 2064791 1336352 721938 703606 898847 774286 348892 -41960 -261166 -295629
35817b95629L32864Q19326R31145M12125k58548m40164j77104l3165j90454k20927
$$ -295629 37235 856561 1787706 2199831 1941283 1501119 1324015 1290850 1100396 879469
35807H79469J47806N09266L19177l36748q65115q91729n36434p9488K81628L79215
$$ 879469 1027275 1536541 1855718 1518970 653855 -237874 -774308 -853796 -572168 -192953
35797a92953J52121j70159k68646j62876j28876j84479o8338K03140K56712J5961
$$ -192953 -40832 -210991 -479637 -642513 -771389 -955868 -1024206 -821066 -564354 -548393
35787e48393j02525P9332J67526J361J15612P40266J011437J70059r45652q73009
$$ -548393 -650918 -571586 -404060 -402699 -287087 453179 1464616 1634675 689023 -183986
35777a83986K02927N93674k98697j048046m75817N59842O55111j3880l14804n3646
$$ -183986 18941 612615 313918 -734128 -1209945 -650103 5008 -8872 -323676 -377322
35767c77322J31371J71215M26651N47561l4256o98056l08538P24894P71272l73102
$$ -377322 -245951 -74736 351915 899476 865220 167164 -141374 583520 1354792 981690
35757I81690r57923o4095Q58235L59918o66087n63019L47595M42249m48030q74549
$$ 981690 23767 -40328 817907 1177825 511738 -51281 296314 738563 290533 -584016
35747e84016k25305M40165K81473j26408k9328L10623L42764J94893J78805N8094
$$ -584016 -809321 -369156 -87683 -214091 -243419 67204 409968 604861 783666 841760
35737H41760m36897q75998o45642R4604N98679N23360K15610P2663M8541j26621
$$ 841760 404863 -471135 -1116777 -1022173 -423494 99866 315476 388139 436680 310059
35727C10059m93330p67233o65085k61741Q9690K23767L31929N28347N59499K55328
$$ 310059 -183271 -950504 -1615589 -1877330 -1787640 -1563873 -1231944 -703597 -144098 111230
35717A11230n0901j0861J15983j00917m55955m40560k02471l32029p35704o56589
$$ 111230 60329 49468 165451 64534 -391421 -831981 -1034452 -1366481 -2102185 -2758774
35707b758774M3940N64189M08052N2292j7033m8442k97555l88741j9997M19000
$$ -2758774 -2714834 -2150645 -1742593 -1690301 -1707334 -1755776 -2053331 -2442072 -2462069 -2043069
35697b043069N56873O75207J002800J102400O70063K10061J23595r3442p98079
$$ -2043069 -1486196 -810989 191811 1294211 1964274 2174335 2297930 2204488 1406409
35688A406409j162225m13931N61750L39783p43573j029743j57468M69580P5874
$$ 1406409 244184 -169747 392003 731786 -11787 -1041530 -1198998 -729418 -653544
35679f53544l25665J70244P94048M43560n05204q74740m64491m0440M3350J74416
$$ -653544 -979209 -808965 -14917 428643 -76561 -951301 -1415792 -1456232 -1412882 -1238466
35669a238466N49367P71419N04370k3658l50331l31214k25108k95164l86324o6193
$$ -1238466 -689099 82320 586690 563032 212701 -118513 -343621 -638785 -1025109 -1091302
35659a091302O66063J109048P24620O768j60640J67935J55458l61763n73482q0322
$$ -1091302 -425239 683809 1408429 1415197 1254557 1422492 1577950 1216187 642705 562383
35649E62383M20065K74258j96865m35109m62055l72744J25749R50047J231017
$$ 562383 982448 1256706 1059841 624732 162677 -210067 -84318 865729 2096746
35640B096746N16059l36344l66080O7705P6739k00428l7171L53443O1990r15647
$$ 2096746 2612805 2276461 1910381 1978086 2054825 1854397 1817226 2170669 2232659 1317012
35630A317012j569388j372030p74853j87218M33301Q79809O96529J02863r7810
$$ 1317012 -252376 -1624406 -2399259 -2586477 -2153176 -1273367 -576838 -473975 -571785
35621e71785K21276L21413q3371l58259j44147M4552q8868J4410O41328J003462
$$ -571785 -350509 -29096 -112467 -470726 -614873 -570321 -659189 -644779 -3451 1000011
35611A000011M21384m49142n26479R5350M01874j6382n77743o96056m05432m3779
$$ 1000011 1421395 972253 445774 541124 942998 926616 348873 -347183 -752615 -796394
35601g96394J19851o868j81778O1339P38702J105496N22252n70123j080535n65113
$$ -796394 -676543 -683411 -865189 -803850 -65148 1040348 1562600 992477 -88058 -653171
35591f53171L82471R43420Q25184K72064k48072l79473k01937j42484l56979m66824
$$ -653171 -270700 672720 1497904 1769968 1521896 1142423 940486 798002 441023 -25801
35581b5801k18680k4410l20476p07757m26113M44382R92104P41709K33479J28368
$$ -25801 -244481 -268891 -589367 -1297124 -1723237 -1278855 -286751 454958 688437 816805
35571H16805L12724K33776k63197q00351r86251p98571m99419k99287j34179J53361
$$ 816805 1129529 1363305 1100108 299757 -686494 -1485065 -1984484 -2283771 -2417950 -2264589
35561b264589M12155K49634k94792n01830J41790J055967J188875M62650j03181
$$ -2264589 -1852434 -1602800 -1897592 -2399422 -2257632 -1201665 -12790 449860 346679
35552C46679J23386M75419K1423r72588j287039l81633Q01689R39943n4014r23470
$$ 346679 470065 945484 966907 -5681 -1292720 -1674353 -872664 67279 13265 -910205
35542i10205o15862M56434J049803P16914J73456L3462j1948l42073n05605K3805
$$ -910205 -1526067 -1069633 -19830 697084 870540 904002 892054 549981 44376 68181
35532F8181P01636N42284k92635o09169J5533N89093K34929n54787p91786m01091
$$ 68181 769817 1312101 1019466 410297 425830 1014923 1249852 695065 -96721 -497812
35522d97812l2747N8017J74028M35444N56737L49383l2832l56898m64514k10369
$$ -497812 -530559 -472542 -298514 136930 693667 1043050 1010218 653320 188806 -21563
35512b1563L88448R34382R16615K92608m15291o96659n68229l99258l36209j41887
$$ -21563 366885 1301267 2217882 2510490 2095199 1398540 830311 431053 94844 -47043
35502d7043K71798L97615l06616j366526j449787m3744J569355J772118O85785
$$ -47043 224755 622370 315754 -1050772 -2500559 -2544303 -974948 797170 1482955
35493A482955j64320o6193J77990r5895l62506q8105J98015q4050l92603J0432
$$ 1482955 1318635 1252442 1430432 1334537 972031 883926 1081941 997891 605288 615720
35483F15720O17973L59990o33613j143698o44171R8718K89718M2425j32284k8710
$$ 615720 1233693 1593683 960070 -183628 -827799 -729081 -439363 -396938 -529222 -557932
35473e57932K63111N02721L57371j77421m97132j19167M76683M79754L9782J69
$$ -557932 -294821 207900 565271 387850 -109282 -228449 248234 727988 767770 767939
35463G67939M30790N27565P9837j62391O7643l5315q65347j448697q41097M06181
$$ 767939 1198729 1726294 1806131 1643740 1711383 1676068 810721 -637976 -1479073 -1072892
35453a072892J126115J145869J004292O93649j33669j045239j104510k41692O03992
$$ -1072892 53223 1199092 2203384 2897033 2763364 1718125 613615 371923 975915
35444I75915P44915L48292j99810p12299r25631n83816N7118M35683M52855M26082
$$ 975915 1720830 2069122 1869312 1157013 231382 -352434 -295316 140367 593222 1019304
35434A019304L37227j08287o71751p06265k24513N3628o5530O4397O54225R28860
$$ 1019304 1356531 1248244 576493 -129772 -354285 -300657 -366187 -301790 352435 1281295
35424A281295M54459J3173K93456N87354r0549j225528j440925o01897N0333j45239
$$ 1281295 1735754 1748927 2042383 2629737 2539188 1313660 -127265 -729162 -678829 -824068
35414h24068m74466k68981R0563J23004J57164N52282Q25538M38604j17295K4774
$$ -824068 -1298534 -1567515 -1476952 -1353948 -1196784 -644502 181036 619640 502345 527119
35404E27119O89298Q53147J87474m86461m30277P9905L57288K47825P0591J4426
$$ 527119 1216417 2069564 2257038 1770577 1340300 1420205 1777493 2025318 2095909 2110335
35394B110335O231l3653j24243k75255l88964k73776L8888J70708j58504o80432
$$ 2110335 2116566 2082913 1958670 1683415 1294451 1020675 1059563 1230271 1071767 391335
35384C91335q21250l46832M04348Q59765O54620j06618q26375q23723p1998N83553
$$ 391335 -429915 -776747 -372399 487366 1141986 1035368 208993 -614730 -686728 -103175
35374a03175L17183n87993r66072k12079R07965J189197M40315m14415n76075
$$ -103175 214008 -373985 -1340057 -1552136 -644171 545026 985341 570926 -5149
35365e149k39412q1038k72193l80261j25546J92764J64794j44741l48816k91121
$$ -5149 -244561 -325599 -597792 -978053 -1103599 -910835 -746041 -890782 -1239598 -1530719
35355a530719j16500J08738M32385O56664M28974j20031l20323R6244M53707O9066
$$ -1530719 -1647219 -1538481 -1106096 -449432 -20458 -140489 -460812 -364568 89139 158205
35345A58205o39352p07025q3023L43503K10323J98064P16869J019104L51825o96766
$$ 158205 -481147 -1188172 -1271195 -927692 -717369 -519305 197564 1216668 1568493 871727
35335H71727r38165k87709K57467K09651J43926N05051Q06433M77220j85267m87199
$$ 871727 -66438 -354147 -96680 112971 256897 761948 1568381 2045601 1860334 1373135
35325A373135l24165j44598k09204l85013m90501m03307J7847O75718J025298
$$ 1373135 1048970 904372 695168 310155 -180346 -583653 -565806 109912 1135210
35316A135210O12968j97939n31140j09947L93855K96460k47575o27466o41348
$$ 1135210 1748178 1550239 1019099 909152 1303007 1599467 1351892 724426 83078
35307H3078n39222m10662p0875M02398N24044O8913m54787l93788J49779M48835
$$ 83078 -456144 -866806 -937681 -535283 -11239 57674 -397113 -790901 -641122 -192287
35297a92287J79956j56959m6252K60411J89915k08480l27613M7934M30603L98852
$$ -192287 -12331 -169290 -215542 44869 234784 26304 -301309 -253375 177228 576080
35287E76080J63317J05271J83469J43766k3505j96528l83055m99910k44258L44314
$$ 576080 739397 844668 1028137 1171903 1148398 951870 568815 68905 -175353 168961
35277A68961N67857k8873p38631n16166M01707O90267j16956r23697p40976o9523
$$ 168961 736818 707945 -30686 -546852 -145145 545122 428166 -495531 -1236507 -1306030
35267a306030R5870j94066k32140K3105P4720j2675K75886Q21664R31324M96970
$$ -1306030 -1210160 -1404226 -1636366 -1613261 -1538541 -1551216 -1275330 -453666 477658 974628
35257I74628J28673N0575j47441m90771m08338J15775K40785l28906o46940N192
$$ 974628 1103301 1153876 1006435 515664 107326 223101 463886 134980 -511960 -506768
35247e06768Q32228O65550k77079q18116n52529r4713J21184K34270K75393R4246
$$ -506768 325460 991010 713931 -104185 -656714 -751427 -630243 -395973 -120580 -26334
35237b6334m6885K57726O75440M74185j78744k83449L80754P52781Q0634r05011
$$ -26334 -73219 184507 859947 1334132 1155388 871939 1252693 2005474 2086108 1181097
35227A181097j062313l65462L41079N53410L61398o5254n11828n41470J0119N38590
$$ 1181097 118784 -246678 94401 647811 1009209 943955 432127 -109343 -99224 439366
35217D39366L11537m89000r44891n90243J03494M58157L43822J09381J07303L98352
$$ 439366 750903 261903 -682988 -1273231 -1169737 -711580 -367758 -258377 -151074 247278
35207B47278P16266O93364K75770j47859k04856k0473l1963m11375q77283j015134
$$ 247278 963544 1656908 1932678 1784819 1579963 1559490 1527527 1116152 238869 -776265
35197g76265o45058K0388M88742M40397J45072J42530M24335L78142k33246p75894
$$ -776265 -1421323 -1400935 -912193 -471796 -326724 -184194 240141 618283 385037 -390857
35187c90857o53808k04088q4924k07506n0292K57708R4918m58115n44699J14328
$$ -390857 -1044665 -1248753 -1333677 -1541183 -1591475 -1333767 -1238849 -1696964 -2241663 -2127335
35177b127335O60518L57744k69245j89391O54628J299294J064283L06642k27052
$$ -2127335 -1466817 -1109073 -1378318 -1567709 -913081 386213 1450496 1757138 1530086
35168A530086l47801m21028o18698n82001J6887Q37152J141064O61672j39553
$$ 1530086 1182285 761257 142559 -439442 -422555 414597 1555661 2217333 2077780
35159B077780o91212p92578m44733K35522P33584M23125m51209p34545Q5841R22604
$$ 2077780 1386568 593990 149257 384779 1118363 1541488 1090279 355734 441575 1364179
35149A364179N13660p23755j294057p30740N2529L67497M65497N55973L51270
$$ 1364179 1877839 1154084 -139973 -870713 -818184 -450687 14810 570783 922053
35140I22053q0174j27757K53591K78726l31348p54490l96865J48720J60370j00760
$$ 922053 841879 714122 967713 1246439 915091 160601 -236264 -87544 72826 -27934
35130b7934r6793J8300l5867N8884M75557N50565j56287q32064n58580J59049
$$ -27934 -124727 -106427 -142294 -83410 392147 942712 786425 -45639 -604219 -445170
35120d45170K43017j54105r5651L16053J41546n18803n02960L75780Q57309K62845
$$ -445170 -202153 -356258 -451909 -135856 5690 -513113 -1016073 -640293 217016 479861
35110D79861m46175l08943J99558K05473j51828k75872k37693l79716m40914k7253
$$ 479861 33686 -275257 -75699 129774 -22054 -297926 -535619 -915335 -1356249 -1383502
35100a383502N18170N98896L44774K78944L32601M1721m94446p03876n04734l78702
$$ -1383502 -865332 -266436 78338 357282 689883 731604 237158 -466718 -971452 -1350154
35090a350154m64533l34620J73110N65633M21954K4420o5738K31902M73612K72826
$$ -1350154 -1814687 -2149307 -1976197 -1410564 -988610 -964190 -1029928 -798026 -324414 -51588
35080e1588k67422o76821o18379k52122q882k714Q3064M08527O13484L41471j54365
$$ -51588 -319010 -995831 -1614210 -1866332 -1875214 -1877928 -1794864 -1386337 -772853 -431382 -585747
35069e85747l39128j41349P5713J50607K21518K38778m5285m88207n10038R4923
$$ -585747 -924875 -1066224 -990511 -839904 -618386 -379608 -424893 -913100 -1423138 -1328215
35059a328215P36183P69285L34267M8267Q6311N4798k51579m55426j72175L40423
$$ -1328215 -592032 177253 511520 559787 646098 700896 449317 -6109 -178284 162139
35049A62139M62620N8436l20596k01377J36484O3010m69598q29038o08873j86093
$$ 162139 624759 683195 362599 161222 297706 360716 -108882 -937920 -1546793 -1732886
35039a732886r1463k03847n3898K90249K68625k04613m55457k2012N97351O28783
$$ -1732886 -1824349 -2028196 -2082094 -1791845 -1523220 -1727833 -2183290 -2205302 -1607951 -979168
35029i79168J18121k11836m2164J99999J23459p0356n2706N7841m5181k98626
$$ -979168 -861047 -1072883 -1115047 -915048 -791589 -861945 -914651 -856810 -901991 -1200617
35019a200617l61530j26991J92328L96134M11416J83951j94911l35476N4877O21786
$$ -1200617 -1562147 -1689138 -1496810 -1100676 -689260 -505309 -700220 -1035696 -980819 -359033
35009c59033O66982J01205l72509k30663J72391K01162j58110m14369l17769m1623
$$ -359033 307949 409154 36645 -194018 -21627 179535 21425 -392944 -710713 -752336
34999g52336K14354L86833M17756L12294K22521J80512n0801n13482p22209k96855
$$ -752336 -537982 -151149 266607 578901 801422 981934 931133 417651 -304558 -601413
34989f01413L18808M03466N9025J2953L55192L38291l58963j014302r28136l85163
$$ -601413 -282605 120861 179886 192839 548031 886322 527359 -486943 -1415079 -1800242
34979a800242r656K19239O24710R49886O06954l31661j047971r13844q3594Q18818
$$ -1800242 -1809898 -1590659 -965949 -16063 590891 259230 -788741 -1702585 -1786179 -967361
34969i67361J231729R32703J72195m39091m52477k4196L06587K03747k19896n78797
$$ -967361 264368 1197071 1369266 930175 477698 453502 760089 963836 743940 165143
34959A65143n14377m2956K97794L612n60405m12446O30869J411458R11407k53645
$$ 165143 -349234 -392190 -94396 -90784 -651189 -1063635 -432766 978692 1890099 1636454
34949A636454o66774r9336L39244p715m59529k17101M12278N76261J12760l69155
$$ 1636454 969680 870344 1209588 1201873 742344 525243 937521 1513782 1626542 1257387
34939A257387l71812J2451M04795N72487N35764M08686K05641j35608n21322o88396
$$ 1257387 885575 898026 1302821 1875308 2411072 2819758 3025399 2889791 2368469 1680073
34929A680073n69252m26143m06228k92960j0980P7259j17648M3568Q58376J281811
$$ 1680073 1110821 684678 278450 -14510 -25490 51769 -65879 -22311 836065 2117876
34919B117876K10998j483149j708598j07751J315316J090665K25763K35537O73804
$$ 2117876 2328874 845725 -862873 -970624 344692 1435357 1661120 1896657 2570461
34910B570461J59301j115468j660599j030362k29314Q4103K49082M02085J33095
$$ 2570461 2729762 1614294 -46305 -1076667 -1305981 -1221878 -972796 -570711 -437616
34901d37616l69541k33967N56266Q12488m3908r65203q37158n4338L29766J89668
$$ -437616 -807157 -1041124 -484858 327630 283722 -681481 -1518639 -1572977 -1243211 -1053543
34891a053543J27059L28303N38920O75752O44831P1001r53201j411117o26497
$$ -1053543 -926484 -598181 -59261 616491 1261322 1332323 379122 -1031995 -1658492
34882a658492N12445O71698j2653l45372n7085M1482k14142l1483O73104Q49562
$$ -1658492 -1146047 -474349 -487002 -832374 -889459 -847977 -1062119 -1093602 -420498 429064
34872D29064J22117m18293l7183L62527j54787q52815n61314K83645L62013l18511
$$ 429064 551181 132888 95705 458232 303445 -549370 -1110684 -827039 -465026 -783537
34862g83537n07111K04853Q83189Q77479N69828K98965j63120o97355o05502J80831
$$ -783537 -1290648 -1085795 -202606 674873 1244701 1543666 1380546 683191 77689 258520
34852B58520O94999L33819k37525j97313K26945L28142M863l73083n94890n40619
$$ 258520 953519 1287338 1049813 852500 1079445 1407587 1412450 1039367 444477 -96142
34842i6142p8164M70125M36219j21407k74982K55997M46097l23074r63404l34964
$$ -96142 -174306 295819 732038 610631 335649 591646 1037743 714669 -248735 -583699
34832e83699P28989O27986m15699p71208j09459K36869k55388m24043L90823J051001
$$ -583699 145290 773276 357577 -413631 -523090 -286221 -541609 -965652 -574829 476172
34822D76172M93848n10389o43530k5705K98056R8671j6567J36675J33562j92869
$$ 476172 970020 459631 -183899 -209604 88452 187123 170556 307231 440793 247924
34812B47924n37328o40554m39809M5203M92166L45499l62752p32483j47844P62074
$$ 247924 -289404 -929958 -1369767 -1324564 -832398 -486899 -849651 -1582134 -1729978 -967904
34802i67904R85422M87505k0327k21226k87957k19343N7518K18083P798j28194
$$ -967904 17518 505023 484696 263470 -24487 -243830 -186312 31771 39569 -88625
34792h8625K48880N87235R9976p61249p77976J52163Q33152N98562J03561r545
$$ -88625 160255 747490 847466 86217 -691759 -539596 293556 892118 995679 986134
34782I86134l6987k89030l36310R6659L65970j40140r18618j019310l47575M11451
$$ 986134 949147 660117 323807 420466 786436 646296 -272322 -1291632 -1639207 -1227756
34772a227756Q12810R23753Q28418M89667K0459l40287m67343l53621p9854P7570
$$ -1227756 -414946 508807 1337225 1826892 1847351 1507064 1039721 686100 606246 683816
34762F83816j35000m52792k81359L81540P58859L75429k48097m44386l67946n04449
$$ 683816 548816 96024 -185335 196205 955064 1330493 1082396 638010 270064 -234385
34752b34385p06489m63813J68963O47026P65305P50628O47512K65519k75523n22057
$$ -234385 -940874 -1404687 -1235724 -588698 176607 927235 1574747 1840266 1564743 1042686
34742A042686k85474J31869L30402J51676k83425o23004n53210k35972j61765
$$ 1042686 757212 889081 1219483 1371159 1087734 464730 -88480 -324452 -486217
34733d86217l54455k60192K14694K89238m04788q85515j81399R87984J162069
$$ -486217 -840672 -1100864 -886170 -596932 -1001720 -1887235 -2068634 -1080650 81419
34724H1419L73100l6612K96446K80254n53764j117307n87990K38640L36214K3188
$$ 81419 454519 417907 714353 994607 440843 -676464 -1264454 -1025814 -689600 -666412
34714f66412J09637M33359L93586J95604L67423N81253J56946o18976q34572l93818
$$ -666412 -556775 -123416 270170 465774 833197 1414450 1571396 952420 117848 -275970
34704b75970k6346j622Q0848K58145N3251n12673p48669l67043J24799L20692
$$ -275970 -302316 -303938 -223090 35055 88306 -424367 -1173036 -1540079 -1415280 -1094588
34694a094588L82035L90288R3964l76035l75395K33612O85815M37063p992K6330
$$ -1094588 -712553 -322265 -228301 -604336 -979731 -746119 -60304 376759 368767 395097
34684C95097K93701J07619n02595q22484m41391L33008R14976R06782L10070l98370
$$ 395097 688798 796417 293822 -528662 -970053 -637045 277931 1184713 1494783 1096413
34674A096413o24482l59302k08090m59206n97306j67234L77562L12625k37211
$$ 1096413 471931 112629 -95461 -554667 -1151973 -1319207 -941645 -629020 -866231
34665h66231n12499k32178J92478M16154M59517L29682N95k53152j35653Q2503
$$ -866231 -1378730 -1610908 -1418430 -1002276 -542759 -213077 -212482 -465634 -601287 -518784
34655e18784q1443m06849j95634M93477P29560J59244l10161J13079P72563M67782
$$ -518784 -600227 -1007076 -1202710 -709233 20327 179571 -130590 -17511 755052 1222834
34645A222834p10691j393883p70905L84551P83859J74826n65875o17098p5590
$$ 1222834 512143 -881740 -1652645 -1268094 -484235 -309409 -875284 -1492382 -1567972
34636a567972L73384L46758J01725N3006K27677L48039K65088P4175p8746o0948
$$ -1567972 -1194588 -847830 -746105 -693099 -465422 -117383 147705 221880 143134 82186
34626H2186K23750N51296L15225p23765j716907j461629j2805J162819J017780
$$ 82186 305936 857232 1172457 448692 -1268215 -2729844 -2742649 -1579830 -562050
34617e62050K32892J08094P13412R78947L64317m54518o41643k14963K53649M22682
$$ -562050 -329158 -221064 492348 1471295 1835612 1381094 739451 524488 778137 1200819
34607A200819L27567O8628l01806o77872q86372p87828l95226N8827K61598J42079
$$ 1200819 1528386 1597014 1295208 617336 -269036 -1056864 -1452090 -1393263 -1131665 -989586
34597i89586n3435j26388j76650k97397k71708R1682N18360N76139K98296P3404
$$ -989586 -1043021 -1169409 -1346059 -1643456 -1915164 -1823482 -1305122 -728983 -430687 -357283
34587c57283K1888l5903p0199J23908L65574J97314k91211l93804J57349O74241
$$ -357283 -335395 -371298 -441497 -317589 47985 245299 -45912 -439716 -282367 391874
34577C91874M89993p5485k90000j26942j13988l01030j59494M41150Q56231N51733
$$ 391874 881867 806382 516382 389440 275452 -25578 -185072 256078 1112309 1664042
34567A664042j14897l75900m7695L23452K17268k67595o32592o03268l80597k77414
$$ 1664042 1549145 1173245 1125550 1449002 1666270 1398675 766083 162815 -217782 -495196
34557d95196k54321k657N08622Q28512N72771J0350k13154Q8076M07221K36546
$$ -495196 -749517 -752174 -243552 584960 1157731 1168081 954927 1043003 1450224 1686770
34547A686770l10437p52863q53435o85105k78752L78931R99888J076564N01774
$$ 1686770 1376333 623470 -229965 -915070 -1193822 -814891 184997 1261561 1763335
34538A763335k03893n31642n80374o85269p07268k20902O36000J090988P13929
$$ 1763335 1559442 1027800 447426 -237843 -945111 -1166013 -530013 560975 1274904
34529A274904k5027m79782o59755q80968r59462m30348N00533R08986K97388o69645
$$ 1274904 1249877 770095 110340 -770628 -1730090 -2160438 -1659905 -750919 -453531 -1123176
34519a123176r17165k17694O13357P06251P9369m72969l33828K51376N66477L85839
$$ -1123176 -2040341 -2258035 -1644678 -938427 -859058 -1332027 -1665855 -1414479 -848002 -462163
34509d62163J84876K94175L26121j28989o12766k98739O94784J228004N97316
$$ -462163 -277287 16888 343009 214020 -398746 -697485 -2701 1225303 1822619
34500A822619n06321q58705j48929P97717J023281L64851n15414q50444n55104
$$ 1822619 1316298 457593 308664 1106381 2129662 2494513 1979099 1128655 573551
34491E73551k57172m13116o20060k23164N80439R02332M29242k04360m45037m16009
$$ 573551 316379 -96737 -716797 -939961 -359522 542810 972052 767692 322655 -93354
34481i3354k26581L67974J088383Q98397m71477j607205j166314Q3838L54498
$$ -93354 -319935 48039 1136422 2034819 1563342 -43863 -1210177 -1126339 -771841
34472g71841m30402o19612M07126J217998O78511k60385k21785L81998K42193
$$ -771841 -1202243 -1821855 -1414729 -196731 481780 221395 -390 381608 623801
34463F23801n08761n07734M91034J093487M17813n92639o94377j40358k6963n20986
$$ 623801 115040 -392694 98340 1191827 1609640 1017001 322624 182266 155303 -365683
34453c65683p83050l89785J43755K94474J78448Q4999K6608J7745K40975O11970
$$ -365683 -1148733 -1538518 -1394763 -1100289 -921841 -836842 -810234 -792489 -551514 60456
34443F0456O55568J69761m01562o05662n55578m82693k23841K95071N58760J86714
$$ 60456 716024 885785 484223 -121439 -677017 -1159710 -1383551 -1088480 -529720 -343006
34433c43006k35885O1587P03705O66937J772j58954N01182Q54240J41844p55271
$$ -343006 -578891 -517304 186401 853338 855110 696156 1197338 2051578 2193422 1438151
34423A438151p02917j9111K21644j20781l61529l12669l62882m83295k35263K82606
$$ 1438151 735234 716123 937767 816986 455457 142788 -220094 -703389 -938652 -656046
34413f56046M48887J18981k11541k72318k64777k17810J01367N40882O07714L02472
$$ -656046 -207159 -88178 -299719 -572037 -836814 -1054624 -953257 -412375 195339 497811
34403D97811J65063L13310J99394l90782q09897m47054L55318O95052J24711r46140
$$ 497811 662874 976184 1175578 784796 -25101 -472155 -116837 578215 702926 -243214
34393b43214j602292j142170K04994J325493J389198Q09510N04905N01802J40974
$$ -243214 -1845506 -2987676 -2782682 -1457189 -67991 741519 1246424 1748226 1889200
34384A889200m99908n38736J91219P05276L70668k09215l72819m56639r23182
$$ 1889200 1389292 850556 1041775 1747051 2117719 1908504 1535685 1079046 155864
34375A55864j293008q52872J53064Q76191R76841O88848K13407k76816m42260
$$ 155864 -1137144 -1990016 -1836952 -960761 16080 704928 918335 641519 199259
34366A99259k22888r0441l14410m70123k19732M4238j3828M2491N28691P78427
$$ 199259 -23629 -114070 -428480 -898603 -1118335 -1074097 -1087925 -1045434 -516743 261684
$$ [...]
##END NTUPLES=NMR SPECTRUM
##END=
