##TITLE=31Pdec_PHBP2507
 CDCl3, 24 sc
 25.7.2019
##JCAMPDX= 6.0         $$ Bruker NMR JCAMP-DX V2.0
##DATA TYPE= NMR SPECTRUM
##DATA CLASS= NTUPLES
##ORIGIN= UXNMR, Bruker Analytische Messtechnik GmbH
##OWNER= root
$$ XWIN-NMR		Version 3.5
$$ Thu Jul 25 15:32:15 2019 Russian Standard Time (UT+4h)  she@DPX200
##.OBSERVE FREQUENCY= 81.013821
##.OBSERVE NUCLEUS= ^31P
##.ACQUISITION MODE= SIMULTANEOUS
##.ACQUISITION SCHEME= undefined
##.AVERAGES= 24
##.DIGITISER RES= 17
##SPECTROMETER/DATA SYSTEM= spect
##.PULSE SEQUENCE= zgpg30
##.SOLVENT NAME= CDCl3
##.SHIFT REFERENCE= (INTERNAL, CDCl3, 0, 182.463)
##AUDIT TRAIL= $$ (NUMBER, WHEN, WHO, WHERE, WHAT)
$$ ##TITLE= Audit trail, XWIN-NMR		Version 3.5
$$ ##JCAMPDX= 5.01
$$ ##ORIGIN= Bruker BioSpin GmbH
$$ ##OWNER= she
$$ F:/spectra/data/she/nmr/P31/1/pdata/1/auditp.txt
$$ ##AUDIT TRAIL=  $$ (NUMBER, WHEN, WHO, WHERE, WHAT)
(   1,<2019-07-25 15:31:04.60 +0400>,<she>,<DPX200>,
      <created by zg, POWCHK disabled, PULCHK disabled
       configuration hash MD5:
       00 E9 B6 7A A2 85 ED C7 34 08 36 98 17 FE 4E 26
       data hash MD5: 32K
       BF 5E 3F 3E 00 50 9F 23 B6 96 0D 23 FD 29 53 93>)
(   2,<2019-07-25 15:31:10.76 +0400>,<she>,<DPX200>,
      <Start of raw data processing
       efp BC_mod = 2 LB = 1 FT_mod = 6 PKNL = 1 PHC0 = -416.964 PHC1 = 148.4 SI = 64K 
       data hash MD5: 64K
       B6 4F 3C 5D 07 6B 62 4E F9 F0 17 DF 28 9E 78 39>)
(   3,<2019-07-25 15:31:40.68 +0400>,<she>,<DPX200>,
      <pk PHC0 = 47.4866 PHC1 = -97 
       data hash MD5: 64K
       0E 39 31 C6 39 76 B7 64 E3 42 29 41 97 F4 22 6A>)
(   4,<2019-07-25 15:31:45.31 +0400>,<she>,<DPX200>,
      <abs ABSG = 5 
       data hash MD5: 64K
       4A 82 F5 BE 4A 08 43 E8 96 86 F3 AC 47 7A 6B CF>)
$$ ##END=
$$ 
$$ hash MD5
$$ F7 81 97 F7 FE 29 DD 9D 8F 16 07 EA 3F C3 54 B8
##$RELAX= 
##$RELAX= 
##$RELAX= 
##$RELAX= 
##$RELAX= 
##$RELAX= 
##$RELAX= 
##$RELAX= 
$$ Bruker specific parameters
$$ --------------------------
##$DU= <F:/spectra>
##$EXPNO= 1
##$NAME= <P31>
##$PROCNO= 1
##$TYPE= <nmr>
##$USER= <she>
##$AMP= (0..31)
100 100 100 100 100 100 100 100 100 100 100 100 100 100 100 100 100 100 
100 100 100 100 100 100 100 100 100 100 100 100 100 100 
##$AQSEQ= 0
##$AQ_mod= 1
##$AUNM= <au_zg>
##$AUTOPOS= <>
##$BF1= 81.014009
##$BF2= 200.13
##$BF3= 200.13
##$BF4= 200.13
##$BF5= 200.13
##$BF6= 200.13
##$BF7= 200.13
##$BF8= 200.13
##$BYTORDA= 1
##$CFDGTYP= 0
##$CFRGTYP= 5
##$CHEMSTR= <none>
##$CNST= (0..31)
1 1 145 1 1 1 1 1 1 1 1 1 1 1 1 1 1 1 1 1 1 1 1 1 1 1 1 1 1 1 1 1 
##$CPDPRG= <waltz16>
##$CPDPRG1= <>
##$CPDPRG2= <waltz16>
##$CPDPRG3= <>
##$CPDPRG4= <mlev>
##$CPDPRG5= <mlev>
##$CPDPRG6= <mlev>
##$CPDPRG7= <mlev>
##$CPDPRG8= <mlev>
##$CPDPRGB= <>
##$CPDPRGT= <>
##$D= (0..31)
0 1 0 0 0 0 0 0 0 0 0 0.03 2e-05 3e-06 0 0 0 0 0 0 0 0 0 0 0 0 0 0 0 0 
0 0 
##$DATE= 1564054264
##$DBL= (0..7)
120 120 120 11 120 120 24 19 
##$DBP= (0..7)
150 150 150 150 150 150 150 150 
##$DBP07= 0
##$DBPNAM0= <>
##$DBPNAM1= <>
##$DBPNAM2= <>
$$ [...]
##$SUBNAM3= <"">
##$SUBNAM4= <"">
##$SUBNAM5= <"">
##$SUBNAM6= <"">
##$SUBNAM7= <"">
##$SUBNAM8= <"">
##$SUBNAM9= <"">
##$SW= 369.568048894756
##$SWIBOX= (0..15)
0 1 3 0 0 0 0 0 0 0 0 0 0 0 0 0 
##$SW_h= 29940.119760479
##$TD= 32768
##$TD0= 1
##$TE= 0
##$TE2= 300
##$TE3= 300
##$TEG= 300
##$TL= (0..7)
0 120 53 12 22 120 120 120 
##$TP= (0..7)
150 150 150 150 150 150 150 150 
##$TP07= 0
##$TPNAME0= <>
##$TPNAME1= <>
##$TPNAME2= <>
##$TPNAME3= <>
##$TPNAME4= <>
##$TPNAME5= <>
##$TPNAME6= <>
##$TPNAME7= <>
##$TPOAL= (0..7)
0.5 0.5 0.5 0.5 0.5 0.5 0.5 0.5 
##$TPOFFS= (0..7)
0 0 0 0 0 0 0 0 
##$TUNHIN= 0
##$TUNHOUT= 0
##$TUNXOUT= 0
##$USERA1= <user>
##$USERA2= <user>
##$USERA3= <user>
##$USERA4= <user>
##$USERA5= <user>
##$V9= 5
##$VALIST= <valist>
##$VCLIST= <CCCCCCCCCCCCCCC>
##$VD= 0
##$VDLIST= <DDDDDDDDDDDDDDD>
##$VPLIST= <PPPPPPPPPPPPPPP>
##$VTLIST= <TTTTTTTTTTTTTTT>
##$WBST= 1024
##$WBSW= 4
##$XGAIN= (0..3)
0 0 0 0 
##$XL= 0
##$YL= 0
##$YMAX_a= 11434
##$YMIN_a= -7239
##$ZGOPTNS= <>
##$ZL1= 120
##$ZL2= 120
##$ZL3= 120
##$ZL4= 120
##$ABSF1= 182.463
##$ABSF2= -187.1042
##$ABSG= 5
##$ABSL= 3
##$ALPHA= 0
##$AQORDER= 0
##$ASSFAC= 0
##$ASSFACI= 0
##$ASSFACX= 0
##$ASSWID= 0
##$AUNMP= <proc_1d>
##$AZFE= 0.1
##$AZFW= 0.5
##$BCFW= 0
##$BC_mod= 2
##$BYTORDP= 0
##$COROFFS= 0
##$CY= -3
##$DATMOD= 1
##$DC= 0
##$DFILT= <>
##$DTYPP= 0
##$F1P= 0
##$F2P= 0
##$FCOR= 1
##$FTSIZE= 65536
##$FT_mod= 6
##$GAMMA= 0
##$GB= 0
##$INTBC= 1
##$INTSCL= 5.30512e-09
##$ISEN= 30
##$LB= 1
##$LEV0= 0
##$LPBIN= 0
##$MAXI= 10000
##$MC2= 0
##$MEAN= 0
##$ME_mod= 0
##$MI= 50
##$NCOEF= 0
##$NC_proc= -6
##$NLEV= 6
##$NOISF1= 182.463
##$NOISF2= 159.3651
##$NSP= 0
##$NTH_PI= 0
##$NZP= 0
##$OFFSET= 182.463
##$PC= 4
##$PHC0= -369.4774
##$PHC1= 51.39999
##$PH_mod= 1
##$PKNL= yes
##$PPARMOD= 0
##$PSCAL= 0
##$PSIGN= 0
##$REVERSE= no
##$SF= 81.0140089999434
##$SI= 65536
##$SIGF1= 159.3651
##$SIGF2= -187.1042
##$SINO= 113.3802
##$SIOLD= 16384
##$SREGLST= <1H.CDCl3>
##$SSB= 0
##$STSI= 65536
##$STSR= 0
##$SW_p= 29940.119760479
##$SYMM= 0
##$S_DEV= 0
##$TDeff= 32768
##$TDoff= 0
##$TI= <>
##$TILT= no
##$TM1= 0
##$TM2= 0
##$TOPLEV= 0
##$USERP1= <user>
##$USERP2= <user>
##$USERP3= <user>
##$USERP4= <user>
##$USERP5= <user>
##$WDW= 1
##$XDIM= 65536
##$YMAX_p= 274961993
##$YMIN_p= -90729229
$$ End of Bruker specific parameters
$$ ---------------------------------
##NTUPLES= NMR SPECTRUM
##VAR_NAME=  FREQUENCY,     SPECTRUM/REAL,   SPECTRUM/IMAG
##SYMBOL=    X,             R,               I
##VAR_TYPE=  INDEPENDENT,   DEPENDENT,       DEPENDENT
##VAR_FORM=  AFFN,          ASDF,            ASDF
##VAR_DIM=   65536,         65536,           65536
##UNITS=     HZ,            ARBITRARY UNITS, ARBITRARY UNITS
##FACTOR=    0.456856943014862, 1,           1
##FIRST=     14782.0589164792, 0,            0
##LAST=      -15158.0608439998, 0,           0
##MIN=       -15158.0608439998, -90729229,   0
##MAX=       14782.0589164792, 274961993,    0
$$ Real data points
##PAGE= N=1
##DATA TABLE= (X++(R..R)), XYDATA
$$ [...]
42047f36841J402638J234717L58760p67789j421019r39711K26102O29766l24102
$$ -636841 765797 2000514 2359274 1591485 170466 -769245 -543143 86623 -237479
42038b37479j380167j030775M42811J353287Q03188k65979m08662M07775P96572
$$ -237479 -1617646 -2648421 -2205610 -852323 -49135 -315114 -723776 -316001 480571
42029D80571k319p68981O2906J746862J770131n10943k522206j947975j305N65238
$$ 480571 478252 -290729 -227823 1519039 3289170 2778227 256021 -1691954 -1693259 -1128021
42019a128021m71717r79987j07420P03943M19528j20846k7037J61036l53613j227084
$$ -1128021 -1599738 -2579725 -2687145 -1983202 -1563674 -1684520 -1711557 -1550521 -1904134 -3131218
42009c131218j475010o13317R48164K026364J480105k40954j034162J52597J485934
$$ -3131218 -4606228 -5219545 -4271381 -2245017 -764912 -1005866 -2040028 -1887431 -401497
42000d01497Q29845q84840j233461l38639l07370j073637l86936J732480K312086
$$ -401497 428348 -456492 -1689953 -2028592 -2335962 -3409599 -3796535 -2064055 248031
41991B48031L19927j391667p47991L62510j93780j047784j13129J496080J475470
$$ 248031 567958 -823709 -1571700 -1209190 -1402970 -2450754 -2563883 -1067803 407667
41982D07667K71669j35932J57492l05058j234832j219793n06065k84597q4666
$$ 407667 679336 543404 700896 395838 -838994 -2058787 -2564852 -2849449 -2934115
41973b934115J202367K491237J803291j05083o04638N03718P82225n77659j521794
$$ -2934115 -1731748 759489 2562780 2457697 1853059 2356777 3139002 2561343 1039549
41964A039549p96036K02245K23663L4998K47126j56876j566945k249858r24157
$$ 1039549 243513 445758 669421 704419 951545 794669 -772276 -3022134 -3946291
41955c946291R16435J107404j02742q56666m96147K23027R31077J817457K350225
$$ -3946291 -3029856 -1922452 -2025194 -2881860 -3378007 -3154980 -2223903 -406446 1943779
41946A943779J554177k74364j460544r58846M36885J287730J176513O36617k5402
$$ 1943779 3497956 3223592 1763048 804202 1241087 2528817 3705330 4341947 4316545
41937D316545r55165j835099j726301m33143P08902M37990n12551m86688L27337
$$ 4316545 3361380 1526281 -200020 -633163 75739 513729 1178 -485510 -158173
41928a58173J12665j256760j436242N90554K218284R41043j431941j251423J269777
$$ -158173 -45508 -1302268 -2738510 -2147956 70328 1011371 -420570 -1671993 -402216
41919d02216K257299J70134j801224n70336K329437L060702O68889k149098k805829
$$ -402216 1855083 2025217 223993 -346343 1983094 5043796 5712685 3563587 757758
41910G57758j584100n24008o78934j114223m98547Q64709J357546M61197l27805
$$ 757758 -826342 -1350350 -2029284 -3143507 -3642054 -2777345 -1419799 -958602 -1286407
41901a286407K25742J092638O15420q12434j428715q07091j7418M39111Q73959
$$ -1286407 -1060665 31973 647393 -165041 -1593756 -2400847 -2418265 -1979154 -1105195
41892a105195R56995J75582m68081M46856K012287J875283L9843r88488l45473
$$ -1105195 -148200 27382 -440699 6157 2018444 3893727 3933570 2945082 2599609
41883B599609n9946j152881j656204k69252R70315P9817j291149n55301J430388
$$ 2599609 2539663 1386782 -269422 -538674 431641 511458 -779691 -1334992 95396
41874I5396J854201O03112J15779J057506J381827L5410j246242q29761K93467
$$ 95396 1949597 2552709 2668488 3725994 5107821 5143231 3896989 3067228 3360695
41865C360695J91303j201043k253510j862496m57880Q40197J298111R35221L61956
$$ 3360695 3551998 2350955 97445 -1765051 -2222931 -1382734 -84623 850598 1212554
41856A212554K86918Q39381J278020O76348q22722j746467r59899N16158M67634
$$ 1212554 1499472 2338853 3616873 4293221 3470499 1724032 764133 1280291 1747925
41847A747925j381952k610571j437747O51592J238870N60443M93407R86010L53313
$$ 1747925 365973 -2244598 -3682345 -3030753 -1791883 -1231440 -738033 247977 601290
41838F01290j285085j940751j220364p35755o95786N27047K628795K814035M62976
$$ 601290 -683795 -2624546 -3844910 -4580665 -5276451 -4749404 -2120609 693426 1156402
41829A156402j252794m33310M43951q84776k229979p64582J789401J809705m22644
$$ 1156402 -96392 -529702 -85751 -970527 -3200506 -3965088 -2175687 -365982 -788626
41820g88626j657756j004780l05819j28158O72628J841560J829640Q14101L35659
$$ -788626 -2446382 -3451162 -3756981 -3885139 -3212511 -1370951 458689 1272790 1608449
41811A608449K45989p08785j694488p62861J186731J210268p56577j645069m44583
$$ 1608449 1854438 1145653 -548835 -1311696 -124965 1085303 328726 -1316343 -1760926
41802a760926L13541o87140j202757M32294K238771J837237O0737q48807n13110
$$ -1760926 -1447385 -2134525 -3337282 -2904988 -666217 1171020 1231757 382950 -130160
41793a30160Q2297N51807Q06682L28527p52009j215468n53244J64899P8402l36515
$$ -130160 -47863 503944 1310626 1639153 887144 -328324 -881568 -716669 -638267 -974782
41783i74782n77411p79942n13046R94364K756930K497451Q8385j873467j891637
$$ -974782 -1552193 -2332135 -2845181 -1850817 906113 3403564 3491949 1618482 -273155
41774b73155j366248j440474r73736O66945J666585P77283k73860K59241J116684
$$ -273155 -1639403 -3079877 -4053613 -3386668 -1720083 -942800 -1216660 -957419 159265
41765A59265M68616q03916r66561n93730r84737j169065L79512K387098K350505
$$ 159265 627881 -176035 -1142596 -1736326 -2721063 -3890128 -3510616 -1123518 1226987
41756A226987N66303m94101k24731k88110j248489j677377q12759K74644N29413
$$ 1226987 1793290 1299189 1074458 786348 -462141 -2139518 -2952277 -2677633 -2148220
41747b148220J18173l75118n28269K992R28084J163576L43108l93926k42434m256
$$ -2148220 -2030047 -2405165 -2933434 -2930442 -2002358 -838782 -495674 -889600 -1132034 -1136290
41737a136290j77412L89850K046421K597623N80788j654454j233090N87486N80415
$$ -1136290 -1313702 -923852 1122569 3720192 4300980 2646526 1413436 2000922 2581337
41728B581337j076364j591879p04232o29143j321455m53865J645624J782318m40102
$$ 2581337 1504973 -86906 -791138 -1420281 -2741736 -3195601 -1549977 232341 -207761
41719b07761j367056O74299K423444J029407j471756j760918k09736O46791K09914
$$ -207761 -1574817 -900518 1522926 2552333 1080577 -680341 -890077 -243286 -33372
41710c3372l69198o39475p31713l29204L55394K06378o40399l01163J556190K290841
$$ -33372 -402570 -1042045 -1773758 -2102962 -1747568 -1541190 -2181589 -2482752 -926562 1364279
41700A364279K65557k096140j773064L55388J248577K89069p28656r09278p56146
$$ 1364279 1629836 -466304 -2239368 -1883980 -635403 -346334 -1074990 -1984268 -2740414
41691b740414l24372N33494R05653J72642l07502P78290K041336J337797n86327
$$ -2740414 -3064786 -2531292 -1625639 -1452997 -1760499 -982209 1059127 2396924 1810597
41682A810597j190397j52872O13718M75979O00819J108674P04775n88539j095191
$$ 1810597 620200 467328 1081046 1557025 2157844 3266518 3971293 3382754 2287563
41673B287563l58863J29806m05350r54693q41061p07526q68576p89711o38512
$$ 2287563 1928700 2058506 1653156 698463 -142598 -850124 -1718700 -2508411 -3146923
41664c146923j152893j570770j69966K471532L398664J560446l85603l4213J379614
$$ -3146923 -4299816 -5870586 -6040552 -3569020 -170356 1390090 1004487 970274 2349888
41655B349888J435858L10928j84887J07794j92231j326885j972375j312439L7635
$$ 2349888 3785746 4096674 3911787 4019581 3827350 2500465 528090 -784349 -746714
41646g46714J093559J341579P22183k55973o33186l5652P05335O14613j80082
$$ -746714 346845 1688424 2410607 2154634 1521448 1485796 2191131 2805744 2625662
41637B625662q47108r44308n11638L17913J136801J234550L77258p88733j447170
$$ 2625662 1778554 834246 322608 640521 1777322 3011872 3389130 2600397 1153227
41628A153227j220089p5298J413428J766033M2241k192562k194829P7591J545875
$$ 1153227 -66862 -142160 1271268 3037301 3079542 886980 -1307849 -1230258 315617
41619C15617N23261p51228J02373J653804J207488n31475p11713P30956J034673
$$ 315617 838878 87650 190023 1843827 3051315 2519840 1808127 2539083 3573756
41610C573756o05628j789428j080233j00377k22978k10541R85152J651529K2324
$$ 3573756 2968128 1178700 98467 -1910 -224888 -435429 549723 2201252 2223576
41601B223576k201748j779166J393447L970030L415587O34262j826166k566029
$$ 2223576 21828 -1757338 -363891 3606139 7021726 7655988 5829822 3263793
41593C263793j866794o78197J73016L20177l3067m05063m98301k93604R4881M04912
$$ 3263793 1396999 718802 891818 1211995 1178928 773865 275564 -18040 76841 481753
41583D81753K78037l75703j173775j569412j246100k88921P04940Q79441J00635
$$ 481753 759790 384087 -789688 -2359100 -3605200 -3894121 -3189181 -2309740 -2209105
41574b209105m77470K97960J788840K196271J092946n4428k87078m61563j287407
$$ -2209105 -2686575 -2388615 -599775 1596496 2689442 2635014 2347936 1886373 598966
41565E98966j720953p64530N15992N85650o009K72182J039698N93496q72267j190255
$$ 598966 -1121987 -1886517 -1370525 -784875 -790884 -518702 520996 1114492 242225 -948030
41555i48030K39343J249240K26696j403220j372284L07949J893295K400531K023579
$$ -948030 -708687 540553 767249 -635971 -2008255 -1700306 192989 2593520 4617099
41546D617099R07225q64749k371396k355446p61362J060887J772361J191979J70804
$$ 4617099 5524324 4659575 2288179 -67267 -828629 232258 2004619 3196598 3367402
41537C367402k89741P999K06392m98164j498001j391841j37430O12818j01555
$$ 3367402 3077661 3085660 3292052 2793888 1295887 -95954 -233384 379434 277879
41528B77879j095730r00522J19834P19123P71833Q81606Q62196K12487n30052
$$ 277879 -817851 -1718373 -1598539 -879416 -107583 774023 1636219 1848706 1318654
41519A318654n18842j38469k11660k93856M09057J073907M57441m27789M09118
$$ 1318654 799812 661343 449683 155827 564884 1638791 2096232 1668443 2077561
41510B077561K017210J098726k645135n070633l274069K05127J329321K65935
$$ 2077561 4094771 5193497 2548362 -2522271 -5796340 -5591213 -4261892 -3995957
41502c995957N6447J347732K048536J479599J229370J714531J242079o40284j801497
$$ -3995957 -3939510 -2591778 -543242 936357 2165727 3880258 5122337 4482053 2680556
41493B680556r17186K56208k49579j447281j161811M39736J330344Q63553L13055
$$ 2680556 1763370 2019578 1769999 322718 -839093 -399357 930987 1794540 2107595
41484B107595L79145K51712m81675q09651m2233P44941J68156j331027k029525
$$ 2107595 2486740 2738452 2256777 1447126 1404893 2149834 2317990 986963 -1042562
41475a042562j309971l04812J5500K54731J294097K319188J505388j145518k953210
$$ -1042562 -2352533 -2657345 -2641845 -2387114 -1093017 1226171 2731559 1586041 -1367169
41466a367169j597331J640497L095276J267172j278905j352175O96164J737304
$$ -1367169 -2964500 -1324003 1771273 3038445 1759540 407365 1103529 2840833
41458B840833L36415j412272j102797N40166R21337n33231j637903p54584R28251
$$ 2840833 3177248 1764976 662179 1202345 2123682 1590451 -47452 -802036 126215
41449A26215J350177M71374k20062k69870n52057j171584r40667M91620J556481
$$ 126215 1476392 1947766 1727704 1457834 905777 -265807 -1206474 -714854 841627
41440H41627Q51937p83516j472505q28972l1001J84088K78939P29120J231943
$$ 841627 1693564 910048 -562457 -1391429 -1422430 -1238342 -959403 -230283 1001660
41431A001660J311963Q67827p4356j404821k515952k537647j318877K81757J312110
$$ 1001660 2313623 3181450 3107094 1702273 -813679 -3351326 -4670203 -4388446 -3076336
41422c076336J571459J444180J298310J196383R40892L74251k28383l47467r3890
$$ -3076336 -1504877 -60697 1237613 2433996 3374888 3749139 3520756 3173289 3079399
41413C079399l94151j673732k838197k491941q76568M55375P32434N54321M35071
$$ 3079399 2685248 1011516 -1826681 -4318622 -5195190 -4739815 -4007381 -3453060 -3017989
41404c017989J39896k42779P376Q42702J025191j5218j003925n58225P97471J513717
$$ -3017989 -2878093 -3120872 -3113496 -2270794 -1245603 -1260821 -2264746 -2822971 -2025500 -511783
41394e11783J197375O46550K25823l78657r36738o15627N66062J326852O90831
$$ -511783 685592 1332142 1557965 1179308 242570 -373057 193005 1519857 2210688
41385B210688p28822j515001j089327j41832L64205K50661J14479L83186O73771
$$ 2210688 1481866 -33135 -1122462 -1264294 -900089 -649428 -534949 -151763 522008
41376E22008M09114j64354k88609l3983l22303j214087j340184J8999J330128
$$ 522008 931122 766768 478159 444176 121873 -1092214 -2432398 -2413399 -1083271
41367a083271P22545j131503j755874l30458J332865J529108O80794k9636m89861
$$ -1083271 -360726 -1492229 -3248103 -3578561 -2245696 -716588 -35794 -65430 -555291
41358e55291j041448j210007l62966J008593J782792J539286N42243r60398k382207
$$ -555291 -1596739 -2806746 -3169712 -2161119 -378327 1160959 1703202 742804 -1639403
41349a639403k443123o13316J449928J531749o1528p54733N65720J864025J025905
$$ -1639403 -4082526 -4695842 -3245914 -1714165 -1775693 -2530426 -1964706 -100681 925224
41340I25224r34393j388679R7854J384635R85894j51170n26899k26510k67342
$$ 925224 -9169 -1397848 -1299994 84641 1070535 919365 392466 165956 -101386
41331a01386p89721r90204m90555J23697J72571k05667j82253P56676J921955
$$ -101386 -891107 -1881311 -2371866 -2248169 -2075598 -2281265 -2463518 -1706842 215113
41322B15113J842495L4784j936871k022598k66022J216963J008069p7072o66705
$$ 215113 2057608 2092392 155521 -1867077 -2133099 -916136 91933 14861 -651844
41313f51844o84026o57659m82113p0056r0664o46501l52899J478965K777158J148302
$$ -651844 -1335870 -1993529 -2475642 -2545698 -2636362 -3282863 -3635762 -2156797 620361 1768663
41303A768663k183146l504581j712109L94744M37274n87451p37014k5035O59672
$$ 1768663 -414483 -3919064 -5631173 -5236429 -4799155 -5386606 -6123620 -6148655 -5488983
41294e488983J421932K312914K140239K88162j636981j879589j024304n45020
$$ -5488983 -4067051 -1754137 386102 674264 -962717 -2842306 -3866610 -4411630
41286d411630j81456J028114K209669J688018o9506j035666p76604n53563n17670
$$ -4411630 -4593086 -3564972 -1355303 332715 263209 -772457 -1549061 -2102624 -2620294
41277b620294N07796K248091K673647J170157l70672n09843j17890k64695l81473
$$ -2620294 -2112498 135593 2809240 3979397 3608725 3098882 2980992 2716297 2334824
41268B334824J70763N84274J36292l64467j64485j15968j013368j736058r31010
$$ 2334824 2505587 3089861 3226153 2861686 2697201 2581233 1567865 -168193 -1099203
41259a099203M75642M69921r37394j758203r91930K42681O51257L09063p2964
$$ -1099203 -623561 -153640 -1091034 -2849237 -3841167 -3598486 -2947229 -2638166 -2711130
41250b711130k31359k71490l19430n40350r25505j036699n69507m2084j51334
$$ -2711130 -2942489 -3213979 -3533409 -4073759 -4999264 -6035963 -6605470 -6647554 -6798888
41241f798888n25704l2634J524442K877221K823487J632558M73831q4066m48299
$$ -6798888 -7324592 -7357226 -5832784 -2955563 -132076 1500482 1974313 1890247 1441948
41232A441948j043122j517365j159316Q1604J342587J739560J221021K99846o75374
$$ 1441948 398826 -1118539 -2277855 -2196251 -853664 885896 2106917 2406763 1731389
41223A731389j481944j649895r68144j82330j72388m45829L19974J966973K507379
$$ 1731389 249445 -1400450 -2368594 -2550924 -2723312 -3169141 -2849167 -882194 1625185
41214A625185Q51326j392958j991273r80670j50560k95911m83841J44282J193080
$$ 1625185 2476511 1083553 -907720 -1888390 -2038950 -2334861 -2818702 -2674420 -1481340
41205a481340J780240J504782N00790p15438j368039j035932j93651L42397L72577
$$ -1481340 298900 1803682 2304472 1589034 220995 -814937 -1008588 -666191 -293614
41196b93614K43276J30704K9610J52028O04464Q95065M96750k80958o69065m76315
$$ -293614 -50338 80366 109976 262004 866468 1761533 2258283 1977325 1308260 831945
41186H31945q6883K85031O04993N91501P4515m97095o63270o78664q19140n46570
$$ 831945 745062 1030093 1635086 2226587 2301102 1804007 1140737 462073 -357067 -903637
41176i03637N14828J342609P34042n65109o34184P15713J554614O94137p34069
$$ -903637 -388809 953800 1687842 1122733 488549 1204262 2758876 3453013 2718944
41167B718944j170690n94568J65716P29323R17667M37256l19585l47881K25778
$$ 2718944 1548254 953686 1119402 1848725 2766392 3203648 2884063 2536182 2761960
41158B761960j52008j843674k594222n26142K544968L076091O71782j415071r53969
$$ 2761960 2609952 766278 -1827944 -2354086 190882 3266973 3938755 2523684 1569715
41149A569715M43584K76241j038576j211447J07215P86552m50761k074653k011432
$$ 1569715 2013299 2289540 1250964 39517 146732 933284 482523 -1592130 -3603562
41140c603562n57061L09951q9632l61723O33684K021815K166689Q03693r17199
$$ -3603562 -4160623 -3850672 -3940304 -4302027 -3668343 -1646528 520161 1323854 406655
41131D06655j940048j977484j090823L93903J630803J810275J089823L25420j20847
$$ 406655 -1533393 -3510877 -4601700 -4207797 -2576994 -766719 323104 648524 527677
41122E27677o02385j193616j267941l52103J119801K137433J925139N36063r72996
$$ 527677 -74708 -1268324 -2536265 -2888368 -1768567 368866 2294005 2830068 1857072
41113A857072j266001k14105P25007L53234n83988o29898P2681K71874n938L56422
$$ 1857072 591071 376966 1101973 1455207 871219 241321 314002 585876 579938 936360
41103I36360R32644j95808k878917l896879j301761K226227K696077J67912j764260
$$ 936360 1869004 1673196 -1205721 -5102600 -6404361 -4178134 -1482057 -1314145 -3078405
41094c078405j157695L15048O46400J73888J25756M41419L26573j51922k03100
$$ -3078405 -4236100 -3921052 -3274652 -3100764 -2975008 -2533589 -2207016 -2358938 -2562038
41085b562038M79207J376919J695713R72773l76569j030815m0863J675106K011577
$$ -2562038 -2082831 -705912 989801 1962574 1586005 555190 514327 2189433 4201010
41076D201010K44085j947701k563774j568315l78254J91987M85154Q91021J235744
$$ 4201010 4445095 2497394 -66380 -1634695 -2012949 -1820962 -1335808 -444787 790957
41067G90957J315555J232153R98439M01387n00634j196825j312633j058861q55504
$$ 790957 2106512 3338665 4337104 4738491 4237857 3041032 1728399 669538 -185966
41058a85966p93110p16070n51673k25791M77135J493692K089459J510495Q3273
$$ -185966 -979076 -1695146 -2246819 -2472610 -1995475 -501783 1587676 3098171 3181444
41049C181444r54963r21334l69772m4555Q8669K34340j778q43264j397461o69992
$$ 3181444 2226481 1305147 935375 890820 979489 1213829 1212051 368787 -1028674 -1698666
41039a698666P34746J169768K04356q65030q98794j24992P73575J543005J891571
$$ -1698666 -963920 205848 410204 -454826 -1353620 -1478612 -705037 837968 2729539
41030B729539J330634Q5854q49879j083942j171474j194674m42148Q04210Q71253
$$ 2729539 4060173 4146027 3296148 2212206 1040732 -153942 -596090 208120 1079373
41021A079373o75906j649744k60153J823655J643448o48870k007367r03356Q65034
$$ 1079373 403467 -1246277 -1506430 317225 1960673 1311803 -695564 -1598920 -733886
41012g33886J147454J46802o36919n75832r6338K40602Q5528n47569j076032r68628
$$ -733886 413568 560370 -76549 -652381 -748719 -508117 -422589 -970158 -2046190 -3014818
41002c014818o28778p69232r89415k08641J393205K263053J644984N00894k04375
$$ -3014818 -3643596 -4412828 -5402243 -5610884 -4217679 -1954626 -309642 191252 -13123
40993a3123p20194j297543j153132K21902J671838J522797k75803k001885j959978
$$ -13123 -733317 -2030860 -3183992 -2962090 -1290252 232545 -43258 -2045143 -4005121
40984d005121p1009J963006K007280k89970k602227k250460M71588K570593K203150
$$ -4005121 -4076130 -2113124 -105844 -395814 -2998041 -5248501 -4776913 -2206320 -3170
40975c170O61072j20335k34276o80789j104175m86572P37923J071235J68605p48777
$$ -3170 657902 537567 303291 -377498 -1481673 -1968245 -1230322 -159087 9518 -739259
40965g39259n78950N80117J770633J808479J73524j886947k063343L9099J706749
$$ -739259 -1318209 -738092 1032541 2841020 3014544 1127597 -935746 -896647 810102
40956H10102N62054j795969j839617P42264K604198J654163k72982o16129L67625
$$ 810102 1372156 -423813 -2263430 -1521166 1083032 2737195 2464213 1848084 2215709
40947B215709P93736J58299o02633r65588j106289j024644p13882o05222p34596
$$ 2215709 3009445 3167744 2565111 1599523 493234 -531410 -1245292 -1850514 -2585110
40938b585110k29940J172344J986761Q88045r74232j383924l11536K82559k41173
$$ -2585110 -2815050 -1642706 344055 1232100 257868 -1126056 -1437592 -1155033 -1396206
40929a396206l76127O33970J390904Q40939P7866K07404K75133q32451k016372
$$ -1396206 -1772333 -1138363 252541 1093480 1171346 1378750 1653883 821432 -1194940
40920a194940j736418q91136j280881k027351o35837K480300L875056K201407
$$ -1194940 -2931358 -3822494 -5103375 -7130726 -7766563 -5286263 -1411207 790200
40912G90200K17707K24284O44028n55568j846605p77053J355962J270146q16301
$$ 790200 1007907 1232191 1876219 1320651 -525954 -1303007 52955 1323101 506800
40903E06800j435102L74695J490258p3651j910375j164733J007796J461793j89563
$$ 506800 -928302 -553607 936651 863000 -1047375 -2212108 -1204312 257481 67918
40894F7918j464113q60485M77307Q67319J69565n23423l05720O49991J244492
$$ 67918 -1396195 -2256680 -1779373 -912054 -742489 -1265912 -1571632 -921641 322851
40885C22851O80048l48152l60507Q06911J616095R83099l18610j074448j241782
$$ 322851 1002899 654747 294240 1101151 2717246 3700345 3381735 2307287 1065505
40876A065505j240993q32950J09181P20915L45692k30563o5380K36989l97329
$$ 1065505 -175488 -1008438 -899257 -178342 167350 -63213 -128593 108396 -288933
40867b88933j392781j176684L09498J354079Q19035n35176j253725p61405L86005
$$ -288933 -1681714 -2858398 -2548900 -1194821 -375786 -910962 -2164687 -2926092 -2540087
40858b540087J121596P72058j79144n62436j15138J88947o0970J84018J456337
$$ -2540087 -1418491 -646433 -825577 -1388013 -1503151 -1314204 -1375174 -1191156 265181
40849B65181K208763Q93596j371329k151816j103686n4356n9731m01827l99212
$$ 265181 2473944 3367540 1996211 -155605 -1259291 -1313647 -1373378 -1775205 -2174417
40840b174417k40091Q6208Q71341J554837J216140L04903J72806Q11706Q64508
$$ -2174417 -2414508 -2328300 -1456959 97878 1314018 1618921 1791727 2603433 3467941
40831C467941O278n85981l61124p5405r6108J1411j0875q45913j585330n11198
$$ 3467941 3474219 2888238 2527114 2451709 2355601 2367012 2356137 1510224 -75106 -586304
40821e86304J570313J639785q13618k369847p38132J582350J144846j267577k231059
$$ -586304 984009 2623794 1810176 -559671 -1297803 284547 1429393 161816 -2069243
40812b069243q48622P10644R47465M66213N5402j90791K7414Q79069J314211K64491
$$ -2069243 -2917865 -2207221 -1259756 -793543 -738141 -928932 -901518 -22449 1291762 1556253
40802A556253j273477j348189j05325L85660n33963j132029j83027J160062J361118
$$ 1556253 282776 -1065413 -1170738 -785078 -1319041 -2451070 -2634097 -1474035 -112917
40793a12917P62355N90889P81538K22462j165468j852782o26654J523394K261216
$$ -112917 649438 1240327 2021865 2244327 1078859 -773923 -1400577 122817 2384033
40784B384033Q10814q48651n80819Q24206Q07152r55385j976181r62952J35841
$$ 2384033 3194847 2346196 1765377 2589583 3396735 2441350 465169 -497783 -361942
40775c61942m23676j124725N4203J796661J406550o14451j296847m0211O76804
$$ -361942 -785618 -1910343 -1856140 -59479 1347071 732620 -564227 -604438 72366
40766G2366l44440j215084m32374O76632M00253o63657q99646p9890Q57971J232825
$$ 72366 -272074 -1487158 -1919532 -1242900 -842647 -1506304 -2405950 -2485840 -1627869 -395044
40756c95044Q32386j73233q25608j19137J266668J368696l13210j968111k059510
$$ -395044 437342 264109 -561499 -680636 586032 1954728 1641518 -326593 -2386103
40747b386103j176597m80210O1868Q08994J282389J051995O10019L90942J01738
$$ -2386103 -3562700 -4042910 -3981042 -3172048 -1889659 -837664 -227645 163297 265035
40738B65035k13879J09228P84388M14452j112109j932948j123361k52993n07243
$$ 265035 51156 160384 944772 1359224 247115 -1685833 -2809194 -3062187 -3569430
40729c569430m90719R88886K135969R65152q86902m51598J638882K092392L02588
$$ -3569430 -4060149 -3071263 -935294 29858 -857044 -1308642 330240 2422632 2725220
40720B725220r58896l55015J87607o54373j299149l52555Q52879O94232o6002
$$ 2725220 1766324 1411309 1598916 944543 -354606 -707161 145718 839950 773948
40711G73948l4858K87499j61418p14269k44648M37345k06372j539855j406175
$$ 773948 739090 1026589 865171 150902 -93746 343599 137227 -1402628 -2808803
40702b808803M85450J994773J662718N07159N6723J56069k15558r40824q27145
$$ -2808803 -2323353 -328580 1334138 1841297 1898020 2054089 1838531 897707 70562
40693G0562N72681K141125K414627J186884l74552j077945r01512p11873r80777
$$ 70562 643243 2784368 5198995 6385879 6011327 4933382 4031870 3319997 2339220
40684B339220j173126n73598N43670R39908k44115k238502l022344j355064J553745
$$ 2339220 1166094 592496 1136166 2076074 1831959 -406543 -3428887 -4783951 -3230206
40675c230206L008885J842016j63127n64508O14066J218655J62840j210075j308437
$$ -3230206 -221321 1620695 1457568 893060 1507126 2725781 2888621 1678546 370109
40666C70109m11078K49469M11547O09167P49186K11408p31592p82119O75368K393696
$$ 370109 -40969 208500 620047 1229214 1978400 2189808 1458216 676097 1351465 3745161
40656C745161K370526J04250k554407l130698j239243Q37804P91916r08016j816602
$$ 3745161 6115687 6219937 3665530 534832 -704411 133393 925309 17293 -1799309
40647a799309q98674L46771N23235M41248J373733K463506J694460r32320k935866
$$ -1799309 -2697983 -2351212 -1827977 -1386729 -12996 2450510 4144970 3212650 276784
40638B76784k381836j50681J353141J003751j03758k36708Q50954J617688P61225
$$ 276784 -2105052 -2255733 -902592 101159 -2599 -239307 611647 2229335 2990560
40629B990560q26684j105810Q2290N29768j025921k693235k056493K34968J516588
$$ 2990560 2163876 1058066 1140356 1670124 644203 -2049032 -4105525 -3870557 -2353969
40620b353969R64870J66289J87144M25728M53476O88273Q77295J46437r59741
$$ -2353969 -1389099 -1222810 -1035666 -609938 -156462 531811 1409106 1555543 595802
40611E95802p99265M20908N94716n23255m81505J414483K010366p77817l830891
$$ 595802 -203463 217445 812161 288906 -192599 1221884 3232250 2454433 -1376458
40602a376458l111277N0643J069637p10339j415874Q78556L417133L392821J544840
$$ -1376458 -4487735 -4437092 -3367455 -4077794 -5493668 -4615112 -1197979 2194842 3739682
40593C739682k29906j558934k265298j368480O56212J283598l02063j329052L41678
$$ 3739682 3509776 1950842 -314456 -1682936 -1026724 256874 -45189 -1374241 -1032563
40584a032563K478462J811080q28554j982347r27027q5542n88379q57164R9434
$$ -1032563 1445899 3256979 2428425 446078 -480949 -566491 -1154870 -2012034 -1912600
40575a912600J012740Q07086K77587K92025K85145l71267j056814r91761m29596
$$ -1912600 -899860 -92774 184813 476838 761983 390716 -666098 -1657859 -2087455
40566b087455O2376M42834O52347K94497m76347p15430K8199J010691J372102
$$ -2087455 -2025079 -1582245 -929898 -635401 -1111748 -1827178 -1798979 -788288 583814
40557E83814J133728P52901M73950L74304K63188m80652j953357k748973j395855
$$ 583814 1717542 2470443 2944393 3318697 3581885 3101233 1147876 -1601097 -2996952
40548b996952J174600K332493J269914p1119k03930j11150q99521j529521o80257
$$ -2996952 -1822352 510141 1780055 1708936 1505006 1393856 494335 -1035186 -1715443
40539a715443P37641R95425L23744J78845N61803K32717q43020j363480r25810
$$ -1715443 -977802 17623 341367 520212 1082015 1314732 471712 -891768 -1817578
40530a817578n15474o27046n43556K26975J149176J568542J367514O87032j2782
$$ -1817578 -2333052 -2960098 -3503654 -3276679 -2127503 -558961 808553 1495585 1482803
40521A482803J32270J222381J707727J64373k296828l108418j702765r2493J64306
$$ 1482803 1615073 2837454 4545181 4709554 2412726 -695692 -2398457 -2490950 -2326644
40512b326644l05771m08693j35500K96395J084837J774906J221744m13625j258260
$$ -2326644 -2632415 -3041108 -3176608 -2880213 -1795376 -20470 1201274 787649 -470611
40503d70611m14170N64210J69034o95959m68705M00455M84167j7522J50423Q31340
$$ -470611 -884781 -320571 -151537 -847496 -1316201 -915746 -431579 -449101 -298678 532662
40493E32662P67431M1972R660P38075O51763p80638j878489j125435O78662J570603
$$ 532662 1300093 1342065 1351725 2089800 2741563 1960925 82436 -1042999 -364337 1206266
40483A206266P88024p61703j680281j198430K34813J128492L87454j202003j708305
$$ 1206266 1994290 1232587 -447694 -1646124 -1411311 -282819 104635 -1097368 -2805673
40474b805673m66356J173585J766256J384526Q74398N77153M51192N24465N05207
$$ -2805673 -3272029 -2098444 -332188 1052338 1926736 2503889 2955081 3479546 3984753
40465C984753j93227j311943j554222m17749O90798K76619j083020j660370j028837
$$ 3984753 3791526 2479583 925361 507612 1198410 1475029 392009 -1268361 -2297198
40456b297198j64997M62128J269912K089854J966992P73499l97108r09626j320754
$$ -2297198 -2462195 -2000067 -730155 1359699 3326691 4100190 3703082 2793456 1472702
40447A472702j875011j701250m47545N72595J62070p90503n92439O47606J290962
$$ 1472702 -402309 -2103559 -2551104 -1978509 -1816439 -2606942 -3199381 -2551775 -1260813
40438a260813P41573R4000J42530L50343K19307K07947N77820O28354J2433l23020
$$ -1260813 -519240 -425240 -282710 67633 286940 494887 1072707 1701061 1713494 1390474
40428A390474L36388R63776K32315j185299j401472j77306P19656K73575l29503
$$ 1390474 1726862 2690638 2922953 1737654 336182 158876 878532 1152107 822604
40419H22604K18292J199772J031900k52999j051596n02422M02851K43768j020173
$$ 822604 1040896 2240668 3272568 3019569 1967973 1465551 1868402 2112170 1091997
40410A091997k021681j501571L15345J852393J829639P29893J31963M99525N01370
$$ 1091997 -929684 -2431255 -2115910 -263517 1566122 2296015 2427978 2927503 3428873
40401C428873q68178k382642k021209P7258J556209R48363m86084o91669M39181
$$ 3428873 2560695 178053 -1843156 -1765898 -209689 738674 252590 -439079 102
40392A02J243363O59528o05815j199612o19348N43216J324396J166927K98714
$$ 102 1243465 1902993 1297178 97566 -521782 21434 1345830 2512757 2811471
40383B811471n12772p43997o41664p54292j029890q10317J39921J058563J086163
$$ 2811471 2298699 1554702 913038 158746 -871144 -1681461 -1541540 -482977 603186
40374F03186M84210K83847O64355N23375p61306j898041j176779Q76483J832543
$$ 603186 1087396 1371243 2035598 2558973 1797667 -100374 -1277153 -400670 1431873
40365A431873O92933o43691j94808J215020J403923J76503p20451n28212k65997
$$ 1431873 2124806 1481115 1286307 2501327 3905250 4081753 3361302 2833090 2567093
40356B567093n41352o57659l69708n23632j171337r98093K93284R42827r0312
$$ 2567093 2025741 1368082 998374 474742 -696595 -1694688 -1401404 -458577 -548889
40347e48889j132057l97031J056543J208140N37373R24416J979082J498587n76939
$$ -548889 -1680946 -2077977 -1021434 186706 724079 1648495 3627577 5126164 4549225
40338D549225j700009p03123N14400K28309o38360n71633O9585J36934l37792
$$ 4549225 2849216 2146093 2660493 2888802 2250442 1678809 1748394 1885328 1547536
40329A547536o40941n97103k37305M75724Q11620k10339j669042j199163J198238
$$ 1547536 906595 309492 72187 547911 1359531 1149192 -519850 -1719013 -520775
40320e20775K208502m7524k688271k090637P81888K195072J235826N4050m53381
$$ -520775 1687727 1640203 -1048068 -3138705 -2356817 -161745 1074081 1128131 674750
40311F74750j278200j934673n73538J994939K347997k31188k115891p81836J447458
$$ 674750 -603450 -2538123 -3111661 -1116722 1231275 1000087 -1115804 -1897640 -450182
40302d50182J394096j83857o23201J57081L79214L4733N30592J541190J275765
$$ -450182 943914 760057 136856 293937 673151 707884 1238476 2779666 4055431
40293D055431l26994j314102p44742J90372K82184l11446r56500j197906m93552
$$ 4055431 3728437 2414335 1669593 1859965 2142149 1830703 874203 -323703 -817255
40284h17255J136391K251026J399895o55010j766148j352381p38762o24121l00690
$$ -817255 319136 2570162 3970057 3315047 1548899 196518 -542244 -1166365 -1467055
40275a467055L37850K05398q58992j378519n63236M33471N34153K51675J35597
$$ -1467055 -1129205 -923807 -1782799 -3161318 -3724554 -3291083 -2756930 -2505255 -2369658
40266b369658m28297j476774j360888P60059K811937K349443J31435j113631p28759
$$ -2369658 -2797955 -4274729 -5635617 -4875558 -2063621 285822 417257 -696374 -1425133
40257a425133m67811j107329j315987k58108J007557J481649J550060J434123
$$ -1425133 -1892944 -3000273 -4316260 -4574368 -3566811 -2085162 -535102 899021
40249H99021K97570j739883k474034m35069K311797K360446m74915k870333k352710
$$ 899021 1196591 -543292 -3017326 -3452395 -1140598 1219848 744933 -2125400 -4478110
40240d478110k9811J584834J744646J387777J143459Q42586M41404J36247k69498
$$ -4478110 -4507921 -2923087 -1178441 209336 1352795 2195381 2636785 2773032 2503534
40231B503534j049819j664062j198301J83268J188689J088346N66096M51763M86342
$$ 2503534 1453715 -210347 -1408648 -1225380 -36691 1051655 1617751 2069514 2555856
40222B555856O5336n13049n42916k63679n68932j326649j146949N99775K383109
$$ 2555856 2621192 2108143 1565227 1301548 732616 -594033 -1740982 -1141207 1241902
40213A241902K132413J1761j504707p22880R73342Q88170j263498k755344j453409
$$ 1241902 3374315 3386076 1881369 1158489 2131831 3020001 1756503 -998841 -2452250
40204b452250J224054K172572O84308r78974r78514p2526J62725l19988n63792
$$ -2452250 -1228196 944376 1628684 649710 -328804 -401330 -238605 -558593 -1122385
40195a122385l20453L6335N38456J314808J793086J371782M58502k11071p58961
$$ -1122385 -1442838 -1406503 -868047 446761 2239847 3611629 4070131 3859060 3100099
40186C100099j527119j874671j063062R3207R6890q92624j275042n41887K15873
$$ 3100099 1572980 -301691 -1364753 -1271546 -1174656 -2067280 -3342322 -3884209 -3668336
40177c668336N31801J286070K504522K396009p4277l039869l702039j711904O72752
$$ -3668336 -3136535 -1850465 654057 3050066 2975789 -64080 -3766119 -5478023 -4805271
40168d805271J355020L35180p89439n11464J153660K519787J927253k19108j790794
$$ -4805271 -3450251 -3115071 -3904510 -4415974 -3262314 -742527 1184726 965618 -825176
40159h25176j463138K4094J282306J701229J144711k33142j206128k05192K114230
$$ -825176 -2288314 -2264220 -981914 719315 1864026 1630884 424756 219564 2333794
40150B333794K772447M34895k190035j941341K21359Q03415r15125k120656j058820
$$ 2333794 5106241 5541136 3351101 1409760 1631119 2434534 1519409 -601247 -1660067
40141a660067N16768M38426o72703q25611K32461R64965L84326q81982j625196
$$ -1660067 -1143299 -704873 -1377576 -2203187 -1970726 -1005761 -621435 -1503417 -3128613
40132c128613j285309k26332P04177R24245O24366M22408N67838P92785Q38258
$$ -3128613 -4413922 -4640254 -3936077 -3011832 -2387466 -1965058 -1397220 -604435 233823
40123B33823O83856L46734o1964j84039J58371M98059K54315l68332o00260j63756
$$ 233823 917679 1264413 1202449 1018410 1176781 1674840 1929155 1560823 960563 796807
40113G96807M36102O02980J43713p65771j593324j622011o28272P82921J860722
$$ 796807 1232909 1835889 1979602 1213831 -379493 -2001504 -2629776 -1846855 13867
40104A3867K300945J846985J63714k149462l317972k270111j02646J377754J793756
$$ 13867 2314812 4161797 4325511 2176049 -1141923 -3412034 -3514680 -2136926 -343170
40095c43170J708707J043132l23016j252815p39186J8106p68169k187719j641217
$$ -343170 1365537 2408669 2085653 832838 93652 111758 -656411 -2844130 -4485347
40086d485347Q53410K295945J253565j63893l5718N12814n1083p11156Q4080J360207
$$ -4485347 -3631937 -1335992 -82427 -246320 -282038 230776 179693 -531463 -447383 912824
40076I12824J121524l37794j063607n42725R3072L62993P42871J005247L49166
$$ 912824 2034348 1696554 632947 90222 183294 546287 1289158 2294405 2643571
40067B643571q34881j185969n05767n9003n28013j105251r17517j16301P49711
$$ 2643571 1808690 622721 116954 57951 -470062 -1575313 -2492830 -2609131 -1859420
40058a859420J369125J411521O49231l36788m45927N43823J488638J153003l87128
$$ -1859420 -490295 921226 1570457 1233669 787742 1331565 2820203 3973206 3586078
40049C586078j824597j963500r91459l45408r45784j769460j120226O87239J406973
$$ 3586078 1761481 -202019 -1193478 -1538886 -2484670 -4254130 -5374356 -4687117 -3280144
40040c280144J86834r16843j4464J634752J607141Q4992o64209L8786N78472j108
$$ -3280144 -3093310 -4010153 -4024617 -2389865 -782724 -697732 -1361941 -1323155 -744683 -745791
40030g45791o43332l60908K77591M59505L56889L08573Q5363l35787l96321K4197
$$ -745791 -1389123 -1750031 -1472440 -1012935 -656046 -347473 -262110 -597897 -994218 -970021
40020i70021K23822j52718n07954l18265J31305M19891N29216M46595J34571K3551
$$ -970021 -746199 -898917 -1406871 -1725136 -1593831 -1173940 -644724 -198129 -63558 -40007
40010d0007M88171Q06808k6075j354922j376575K4685Q00500j16437j082847m43175
$$ -40007 448164 1254972 1228897 -126025 -1502600 -1477915 -677415 -793852 -1876699 -2319874
40000b319874P69519O20609n15194o45521N64203J320743N22035p48724r94456
$$ -2319874 -1550355 -929746 -1444940 -2090461 -1526258 -205515 316520 -432204 -1426660
39991a426660k40549M45648N31272M49492P85799J451051J694353R67139k87179
$$ -1426660 -1667209 -1221561 -690289 -240797 545002 1996053 3690406 4657545 4370366
39982D370366j077924j133426j082187j173312p36425M77020J341087P70566n49612
$$ 4370366 3292442 2159016 1076829 -96483 -832908 -355888 985199 1755765 1206153
39973A206153j035653m25748J34948Q9282J82893R06738J438447Q09358o17003
$$ 1206153 170500 -255248 -120300 -31018 151875 1058613 2497060 3306418 2689415
39964B689415j507696j038509L93020J609178J561044K08695j250805j480869
$$ 2689415 1181719 143210 536230 2145408 3706452 3915147 2664342 1183473
39956A183473n96617r5232p76188j433116n11984J390143K016213N89598r57681
$$ 1183473 586856 491624 -284564 -1717680 -2229664 -839521 1176692 1766290 808609
39947H08609p23284M30023L58719r07703j237927M9455R72318J75202o78091L55424
$$ 808609 85325 515348 874067 -33636 -1271563 -1222108 -249790 -74588 -752679 -397255
39937c97255J958452J327533j223662k336257n93619J317372O40387j503956k055538
$$ -397255 1561197 2888730 1665068 -671189 -1264808 52564 692951 -811005 -2866543
39928b866543m03861J273900J366924N09747n5831j27260j10605p5854J43308
$$ -2866543 -3270404 -1996504 -629580 -119833 -175664 -302924 -413529 -489383 -346075
39919c46075M62374O00930M11932m305l99888n96836o45203o36943m50665m3679
$$ -346075 116299 717229 1129161 1124856 724968 128132 -517071 -1154014 -1604679 -1648358
39909a648358J33016l22986q17503k77843J119554J777681Q26157n29486o57574
$$ -1648358 -1515342 -1838328 -2655831 -2933674 -1814120 -36439 789718 260232 -397342
39900c97342K91759Q36990K65704p51998j305175j040483m7741J172772J749345
$$ -397342 -105583 731407 997111 245113 -1060062 -2100545 -2148286 -975514 773831
39891G73831J185405r842r54964j385717j486202j178190l27484O31132J001562
$$ 773831 1959236 1949394 994430 -391287 -1877489 -3055679 -3383163 -2752031 -1750469
39882a750469O15867j36565p34408o38719L55966J402086J125596l91855j189774
$$ -1750469 -1134602 -1271167 -2005575 -2644294 -2288328 -886242 239354 -152501 -1342275
39873a342275m9149J530475J420576k0830p53320k99953l7929m67866m90276K66811
$$ -1342275 -1391424 139051 1559627 1538797 785477 485524 447595 -20271 -510547 -243736
39863b43736N79131j36316o11039J62425J144339Q34016m71885j242382p86363
$$ -243736 335395 199079 -411960 -249535 894804 1728820 1256935 14553 -771810
39854g71810K73878J043961J035848K80490n75711p18932j64001K15054m2277
$$ -771810 -497932 546029 1581877 1862367 1286656 567724 403723 618777 576500
39845E76500l82435k40500J66557M39072N29877K68645o93476j946403k313831
$$ 576500 194065 -46435 120122 559194 1089071 1357716 664240 -1282163 -3595994
39836c595994j396664j53905O63576J507950K628083K908416J393599r25961k232201
$$ -3595994 -4992658 -5146563 -4482987 -2975037 -346954 2561462 3955061 3029100 796899
39827G96899k159089j625543r48756L42172J977610K726690K010615P06469k9725
$$ 796899 -1362190 -2987733 -3936489 -3594317 -1616707 1109983 3120598 3827067 3797342
39818C797342r2013l00658j280438k529379k601260o98716J812946K452316P28199
$$ 3797342 3705329 3404671 2124233 -405146 -3006406 -3705122 -1892176 560140 1288339
39809A288339r28851l55875J319253J373413n56570k103372j577784R9311J176640
$$ 1288339 359488 3613 1322866 2696279 2139709 36337 -1541447 -1442136 -265496
39800b65496J209331Q27550N59963N32843N57924J54409q10129j422322o20814
$$ -265496 943835 1771385 2331348 2864191 3422115 3576524 2766395 1344073 723259
39791G23259J066175J767441O03175j202357j936004j245579k6373O68596K59123
$$ 723259 1789434 3556875 4160050 2957693 1021689 -223890 -250263 418333 677456
39782F77456r70978j797139j192460K60032J004678O20210J06790J2437j52711
$$ 677456 -293522 -2090661 -3283121 -3023089 -2018411 -1398201 -1291411 -1278974 -1431685
39773a431685l19372M23034J730535J650793l09421j714752o52541J094027P14958
$$ -1431685 -1751057 -1328023 402512 2053305 1743884 29132 -623409 470618 1185576
39764A185576j147269j489443J91096J309553N49354l46991L8998N29044q9133
$$ 1185576 38307 -1451136 -1260040 49513 598867 251876 290874 819918 730785
39755G30785p09216o7658O74522k14133j894672k038061l65800J121568J210982
$$ 730785 21569 -46089 628433 414300 -1480372 -3518433 -3884233 -2762665 -1551683
39746a551683P10328N25732M19929J52405K18988P08546P06226k64321j122802
$$ -1551683 -841355 -315623 104306 256711 475699 1184245 1890471 1626150 503348
39737E03348n30310J160831K081124R10499j616011l276372k462107Q4099J839334
$$ 503348 -26962 1133869 3214993 4125492 2509481 -766891 -3228998 -3144899 -1305565
39728a305565J221677n95595j275950l16795O77091N50133m5348j59497Q2730
$$ -1305565 -83888 -679483 -1955433 -2272228 -1595137 -1045004 -1090352 -1249849 -1167119
39719a167119L39120Q99477J656116J474758q1156j434245r81208L75344M79009
$$ -1167119 -827999 71478 1727594 3202352 3121196 1686951 705743 1081087 1560096
39710A560096p62895j336568l99147N08319J08087o81948n47904M5540q7818o95889
$$ 1560096 797201 -539367 -938514 -430195 -322108 -1004056 -1551960 -1506420 -1594238 -2290127
39700b290127n76450L04246O86159n0403j016933j059836n6915J172444J668027
$$ -2290127 -2866577 -2562331 -1876172 -1926575 -2943508 -4003344 -4060259 -2887815 -1219788
39691a219788J029697j67757p61176l03677K67140r2744r26105q99711J21515
$$ -1219788 -190091 -357848 -1119024 -1422701 -1155561 -1248305 -2174410 -3074121 -2952606
39682b952606Q24994N05306J43620P54297J643536J359106j13970j164277n54263
$$ -2952606 -2127612 -1622306 -1478686 -724389 919147 2278253 2164283 1000006 445743
39673D45743J108672K059821J212895o98352j731439q13932P35046N51307j517807
$$ 445743 1554415 3614236 4827131 4128779 2397340 1583408 2318454 2869761 1351954
39664A351954k675782q47208J996431K176025m76370k269677r94283J079996J042832
$$ 1351954 -1323828 -2171036 -174605 2001420 1525050 -744627 -1738910 -658914 383918
39655C83918k74981k80480P70706M27502j366134j859243q2724J455162Q72415
$$ 383918 108937 -171543 599163 1026665 -339469 -2198712 -2281436 -826274 46141
39646D6141k40389J03843R49510N26312l69406J7969Q85787J42023j592866j587535
$$ 46141 -194248 -90405 859105 1385417 1016011 1033980 1919767 2061790 468924 -1118611
39636a118611M40860J638680N21590q91217o95993j08016r51546k275190j800179
$$ -1118611 -677751 960929 1482519 591302 -104691 -212707 -1164253 -3439443 -5239622
39627e239622M90130K414750K627982J707130N51754n60644j283537j047113j1575
$$ -5239622 -4749492 -2334742 293240 2000370 2552124 1991480 707943 -339170 -350745
39618c50745P65132N60248j04829j06884Q91909J860081J387584n52584k221683
$$ -350745 414387 974635 869806 762922 1654831 3514912 4902496 4349912 2128229
39609B128229k118896r63315o22627j360873j656751p98498J41117L86167O10044
$$ 2128229 9333 -953982 -1576609 -2937482 -4594233 -5392731 -5251614 -4865447 -4255403
39600d255403J155192J036176l4317n03504N31539J457346O99620m96643j49254
$$ -4255403 -3100211 -2064035 -2098352 -2601856 -2070317 -612971 86649 -409994 -559248
39591e59248J016682Q89686l14001o25618j2842l37310j679187j870483k12407
$$ -559248 457434 1347120 1033119 407501 394659 57349 -1621838 -3492321 -3704728
39582c704728J266964J142066N32743O59391R10756N95696L62544N00872m9767
$$ -3704728 -2437764 -1295698 -762955 -103564 807192 1402888 1765432 2266304 2216537
39573B216537j483617j932853k26707J896591K164643Q61388k70567q14568j408658
$$ 2216537 732920 -1199933 -1426640 469951 2634594 3495982 3225415 2410847 1002189
39564A002189j839768j422235n03298J29206N75969J068138R38116J3573j82309
$$ 1002189 -837579 -2259814 -2763112 -2633906 -2057937 -989799 -51683 -38110 -220419
39555b20419J323723K644606J424772j282695k294492j074038k63191j223884
$$ -220419 1103304 3747910 5172682 3889987 1595495 521457 258266 -965618
39547i65618k042701r64564P68120J049581K4339n70828K9074J114848J730410
$$ -965618 -3008319 -3972883 -3204763 -2155182 -2130843 -2701671 -2672597 -1557749 172661
39538A72661J312465j77147j859123k332323j225514K32954P66071M91192K86746
$$ 172661 1485126 1307979 -551144 -2883467 -4108981 -3876027 -3109956 -2618764 -2332018
39529b332018M64310O84253O00274J20646m28177k35387J050038K209447J549677
$$ -2332018 -1867708 -1183455 -583181 -462535 -890712 -1126099 -76061 2133386 3683063
39520C683063n24720j542414l50243J097768N94514j093097j582671m52637N59616
$$ 3683063 3158343 1615929 1265686 2363454 2957968 1864871 282200 -170437 389179
39511C89179M63547N9450M0887l1222m09274m56828M0534K40447k45361m08250
$$ 389179 852726 912176 953063 921841 512567 55739 96273 336720 91359 -316891
39501c16891N46353J601751J204541m11965j468407j035068R349N28582N13463
$$ -316891 229462 1831213 3035754 2623789 1155382 120314 129663 658245 1171708
39492A171708M60695L11068j81632n70089j64055P45971J005630J52060q79920
$$ 1171708 1632403 1943471 1761839 1191750 1027695 1773666 2779296 2931356 2051436
39483B051436j017939m19102P717j1325J8497L15790N07841M35294M55317O51483
$$ 2051436 1033497 614395 622112 610787 629284 945074 1452915 1888209 2343526 2995009
39473B995009M76382l30754j054615q64348j6066M32033l6410q19406q74548L25825
$$ 2995009 3471391 3140637 2086022 1221674 1205608 1637641 1601231 781825 -92723 233102
39463B33102K244708L354647K269307n19663k483302j662561P14850J466263m48490
$$ 233102 2477810 5832457 8101764 7582101 5098799 3436238 4151088 5617351 5168861
39454E168861k431499j713268Q48936J941412K68950j890546j931145j73301J132716
$$ 5168861 2737362 1024094 1873030 3814442 4083392 2192846 261701 88400 1221116
39445A221116J028115O07902Q02932Q93105j47764j758025k268755j101591M01380
$$ 1221116 2249231 2857133 3660065 4553170 4405406 2647381 378626 -722965 -321585
39436c21585O61567j80114n67487L80404J732190J936734O67421j001839j970597
$$ -321585 339982 159868 -407619 -27215 1704975 3641709 4309130 3307291 1336694
39427A336694k019949j421627m26247N53610Q99981M59467j37990l01243k42254
$$ 1336694 -683255 -2104882 -2531129 -1977519 -1077538 -618071 -756061 -1057304 -1299558
39418a299558m28435o87859m90177K06333J024370J721468J987533J219400m82668
$$ -1299558 -1727993 -2415852 -2906029 -2699696 -1675326 46142 2033675 3253075 2770407
39409B770407j580925p67045Q60349R62675n79673j300457J32855J850761J725462
$$ 2770407 1189482 422437 1282786 2245461 1665788 365331 498186 2348947 4074409
39400D074409N87633N81426J548060J365668n31360k182908j893837k75798R68758
$$ 4074409 4662042 5243468 6791528 8157196 7625836 5442928 3549091 3273293 4242051
39391D242051J010921J74713p41038r93958m55350J87822L59444M98726J207303
$$ 4242051 5252972 5427685 4686647 3692689 3237339 3425161 3784605 4283331 5490634
39382E490634J870005J375786Q7605l11259Q54671K347038K783826K227668J666925
$$ 5490634 7360639 8736425 8824030 8512771 9367442 11714480 14498306 16725974 18392899
39373A8392899J864571K956131M306991M755452L996007L505530M755068O815723
$$ 18392899 20257470 23213601 27520592 32276044 36272051 39777581 44532649 51348372
39365E1348372P663896P862494J0509733J6771413K3846641K8661618L1269276
$$ 51348372 59012268 66874762 77384495 94155908 118002549 146664167 177933443
39358A77933443L2625191L0988187K3383725J0031447n010039j7530985k5827785
$$ 177933443 210558634 241546821 264930546 274961993 269951954 252420969 226593184
39351B26593184k9970130l0361562k7596916k2775573j7507659j3638740j2213318
$$ 226593184 196623054 166261492 138664576 115889003 98381344 84742604 72529286
39344G2529286j2148129j0926971p556941l915108k209307k287235k710635l114079
$$ 72529286 60381157 49454186 41897245 37982137 35772830 33485595 30774960 27660881
39336B7660881l694215l594998k118370p53306j453379l220988l037474l46132
$$ 27660881 23966666 20371668 18253298 17499992 16046613 12825625 9788151 9442019
39328I442019J953040J583791l39047j514014j402497q57005m45472l25255n69180
$$ 9442019 11395059 12978850 12639803 11125789 9723292 8866287 8420815 8095560 7526380
39319G526380o99721k2138R04659M69798j518242k970699k199896k32534P88211
$$ 7526380 6826659 6804521 7709180 8178978 6660736 3690037 1490141 1257607 2045818
39310B045818N17692L50290J030004J657521J053118p07813k259838k242968p56153
$$ 2045818 2563510 2913800 3943804 5601325 6654443 5946630 3686792 1443824 687671
39301F87671O01231N63848k44967l65429L19540O81332L46299O1558Q2868j22399
$$ 687671 1288902 1852750 1607783 1242354 1561894 2243226 2589525 2651083 2733951 2611552
39291B611552l96560P7155R28273P31539m65905q27454K52636R95873K52214n50747
$$ 2611552 2214992 2292147 3220420 3951959 3486054 2658600 2911236 3907109 4159323 3608576
39281C608576j7741P56806K55847p85730r11729n40223p44498q75787J12698J174844
$$ 3608576 3590835 4347641 4603488 3817758 2906029 2365806 1621308 745521 858219 2033063
39271B033063O75692n33728l47411R13872R95964l36839q53564L31716J314514
$$ 2033063 2708755 2175027 1827616 2741488 3737452 3400613 2547049 2878765 4193279
39262D193279N14261j176557k258762k546613k273019j177926M29031J281955
$$ 4193279 4707540 3530983 1272221 -1274392 -3547411 -4725337 -4296306 -3014351
39254c014351Q94766L78220O32191R79314N16737k68976j97126J004726K421543
$$ -3014351 -2119585 -1741365 -1109174 -129860 386877 117901 -79225 925501 3347044
39245C347044K753211J297212j103912k285145j061978R34675J163738l53052
$$ 3347044 6100255 7397467 6293555 4008410 2946432 3881107 5044845 4691793
39237D691793j290444o33567J88512N7134l35786m14369p35652j096919q9428
$$ 4691793 3401349 2767782 2956294 3013428 2677642 2263273 1527621 430702 341274
39228C41274K090023K843634J014964q17242k12164J087388n2591k832885l449496
$$ 341274 2431297 5274931 6289895 5472653 5260489 6347877 6295286 3462401 12905
39219A2905q56281J769223J744413J76521n09880o3709J02537m78454q33478k41473
$$ 12905 -843376 925847 2670260 2846781 2336901 2273192 2375729 1897275 1063797 822324
39209H22324O68776O66108n57481j782990j456753M00037J985685J788415K82750
$$ 822324 1491100 2157208 1599727 -183263 -1640016 -1239979 745706 2534121 2816871
39200B816871r46482j107488n39797J90593O67867N79166Q3514j91709r4891k18503
$$ 2816871 1870389 762901 223104 413697 1081564 1660730 1744244 1552535 1457644 1239141
39190A239141o65831n65901L52640Q80937J71552p33187o23010j56887m65004
$$ 1239141 573310 7409 360049 1240986 1412538 679351 56341 -100546 -565550
39181e65550r09999l48222M19409m7040q54718L003J812371J724872n63710j998659
$$ -565550 -1475549 -1823771 -1404362 -1451402 -2306120 -2303117 -490746 1234126 670416 -1328243
39171a328243r13585N78503L72860m41927j90127K57142m95199j297512l06087
$$ -1328243 -2241828 -1663325 -1290465 -1732392 -1922519 -1665377 -2160576 -3458088 -3764175
39162c764175J496958J593031n4254j115169o80243j74038l89715k53310Q19781
$$ -3764175 -2267217 -674186 -728440 -1843609 -2523852 -2697890 -3087605 -3340915 -2521134
39153b521134J620501J197264L89025J94971J39713m62074q43842J02495J770345
$$ -2521134 -900633 296631 685656 880627 1020340 558266 -285576 -183081 1587264
39144A587264K387346J393119j0608p27365j009807j446866j696001j056747J64299
$$ 1587264 3974610 5367729 5357121 4629756 3619949 2173083 477082 -579665 -415366
39135d15366Q18174M83182M3662L36285R12560Q08527N0379n02553n74839o82657
$$ -415366 402808 885990 929652 1265937 2178497 2987024 3037403 2534850 1960011 1277354
39125A277354q91557n37795M11889Q66067K19527n29978k83364L48494K2508j022080
$$ 1277354 385797 -151998 259891 1125958 1345485 815507 532143 880637 903145 -118935
39115a18935j098291M39444K137941K247031O27894j477627k716364k316051m36563
$$ -118935 -1217226 -777782 1360159 3607190 4235084 2757457 41093 -2274958 -2711521
39106b711521J582519K071218Q05305o15854p54744o4919J08134m12162o82626
$$ -2711521 -1129002 942216 1747521 1131667 376923 312004 420138 7976 -674650
39097f74650l66509p4868L3070N83831J487002J472243M2640j243262p40706P87209
$$ -674650 -1041159 -1116027 -1082957 -499126 987876 2460119 2502759 1259497 518791 1306000
39087A306000J160924r6078j255909j029139p1046N42156P73435Q53389M74812
$$ 1306000 2466924 2370846 1114937 85798 14752 556908 1330343 2183732 2658544
39078B658544k99909n77190j09062n781q02762j128181J59535J724915J576371
$$ 2658544 2358635 1781445 1672383 1666602 863840 -264341 -104806 1620109 3196480
39069C196480J71178n04935k49075n16071j336469j165803J039K53485p95078
$$ 3196480 3367658 2862723 2613648 2097577 761108 -404695 -403656 -150171 -945249
39060i45249j048799M07674J470271N48128o35063N406J342754J028863o14347
$$ -945249 -1994048 -1586374 -116103 432025 -203038 -197632 1145122 2173985 1559638
39051A559638j448339j008144l60148M74586J950820K617075O46355k444305l082257
$$ 1559638 111299 -896845 -1256993 -782407 1168413 3785488 4431843 1987538 -1094719
39042a094719j026905J18014j159555j571838J464955M836627L756764j006581
$$ -1094719 -2121624 -2003610 -3163165 -4735003 -3270048 1566579 5323343 4316762
39034D316762l831909j890616J498088K088071K98145m64955P74169J555496J37131
$$ 4316762 484853 -1405763 92325 2180396 2478541 2013586 2787755 4343251 4480382
39025D480382j856786j990108n57292J39381o97891j509064j065707r6734M52021
$$ 4480382 2623596 633488 76196 215577 -482314 -1991378 -3057085 -3153819 -2701798
39016b701798J002748J915923J958332K4436k475692k915188q62366J513702K330849
$$ -2701798 -1699050 216873 2175205 2199641 -276051 -3191239 -4053605 -2539903 -209054
39007b09054J688894N42446m61364q43586m75414r5488l43984l98740Q27408K332781
$$ -209054 1479840 2022286 1560922 717336 241922 146434 -197550 -596290 231118 2563899
38997B563899J981662m4735j150422k72614O02850m5735q32439k28728O25362
$$ 2563899 4545561 4500826 3350404 3077790 3680640 3634905 2802466 2573738 3199100
38988C199100J66816n05470M55612K008818J497084j070346k864558k277131n85129
$$ 3199100 3365916 2860446 3316058 5324876 6821960 5751614 2887056 609925 24796
38979B4796N44770Q52206M78512n60007j341479n74274J139597J535391k9118
$$ 24796 569566 1421772 1900284 1340277 -1202 -575476 564121 2099512 2070394
38970B070394j459148j070264J00319M41672L65066R70261J609950R35963n00225
$$ 2070394 611246 -459018 -358699 82973 448039 1418300 3028250 3964213 3463988
38961C463988q56048J57660J011033Q43643L75757K20571Q0604k4465N18121J359879
$$ 3463988 2607940 2765600 3776633 4620276 4996033 5216604 5297208 5272743 5790864 7150743
38951G150743J081142m51501j285844k54996Q87712J8833j879705k126966o09840
$$ 7150743 8231885 7780384 6494540 6239544 7127256 7146089 5266384 3139418 2529578
38942B529578N4483j178488k090382r11088P72288P03722l66617j27722J375260
$$ 2529578 2584061 1405573 -684809 -1595897 -823609 -119887 -486504 -614226 761034
38933G61034J976582J087958M32421Q65378J055885J53593n63246m5740M52934
$$ 761034 2737616 3825574 4257995 5123373 6179258 6332851 5769605 5723865 6176799
38924F176799n66092k076119j813037L09680J938311J377387m87918j595228j053483
$$ 6176799 5610707 3534588 1721551 2031231 3969542 5346929 4859011 3263783 2210300
38915B210300K00734N73091m86493j803734j792960n05623L99045N734o30657
$$ 2210300 2411034 2984125 2497632 693898 -1099062 -1604685 -1205640 -1199906 -1830563
38906a830563l06986M48367M68511m7609n1639N08026Q43173Q22125P89758L57124
$$ -1830563 -2137549 -1689182 -1220671 -1268280 -1319919 -811893 31280 853405 1643163 2000287
38896B000287r08145j897479j067737Q00700J087512q52308k405457j301914J245996
$$ 2000287 1092142 -805337 -1873074 -1072374 15138 -837170 -3242627 -4544541 -3298545
38887c298545K431908J549424J74376m51237n06460m54610l80851m49023p49434
$$ -3298545 -866637 682787 857163 405926 -100534 -555144 -935995 -1385018 -2134452
38878b134452o07703P67274K684395L163366J345452j128247j965320r46061J20318
$$ -2134452 -2742155 -1974881 709514 3872880 5218332 4090085 2124765 1178704 1299022
38869A299022k2333o12437l63925N09494P16184o4536o95789k84910O44916J118239
$$ 1299022 1276689 664252 300327 809821 1526005 1461469 765680 480770 1125686 2243925
38859B243925R61039M95602j91498r01435j009612m51461l05966j234160k005923
$$ 2243925 3204964 3700566 3509068 2607633 1598021 1146560 840594 -393566 -2399489
38850b399489j086385P54452J250281M6529o81507M61963K062659K165739R36933
$$ -2399489 -3485874 -2731422 -1481141 -1434612 -2116119 -1654156 408503 2574242 3511175
38841C511175k51890j028366j724258j899763r71861K29347L20340m17882m06185
$$ 3511175 3259285 2230919 506661 -1393102 -2364963 -2135616 -1815276 -2233158 -2639343
38832b639343N98536J017906P2222q23575k60980R58661J182924M99177L17284
$$ -2639343 -2040807 -1022901 -950679 -1774254 -2035234 -1076573 106351 605528 922812
38823I22812Q06745N80956q12622j796284j046864M18764P16627j86327p09424
$$ 922812 1729557 2310513 1497891 -298393 -1345257 -926493 -209866 -396193 -1105617
38814a105617k06107L18164Q4805l83306m43816k11055K63027J281319K274270
$$ -1105617 -1311724 -993560 -908755 -1292061 -1735877 -1946932 -1683905 -402586 1871684
38805A871684J790394k19687j591453q57606M23525R7727j079061p71850Q81701
$$ 1871684 3662078 3442391 1850938 993332 1416857 1514584 435523 -336327 545374
38796E45374J396404Q6283q23443M6353J019701K47940j363006j775729p96087
$$ 545374 1941778 2028061 1204618 1250971 2270672 2518612 1155606 -620123 -1416210
38787a416210K24887M95893J15479p05528j399527r57508O12573J662635J030956
$$ -1416210 -1191323 -695430 -579951 -1285479 -2685006 -3642514 -3029941 -1367306 -336350
38778c36350j68113k81052L43864K32361n80071p00527J87397Q94779P21734K55623
$$ -336350 -504463 -785515 -441651 -209290 -789361 -1489888 -1302491 -407712 314022 569645
38768E69645M6801o8450j37229P8121K05447m99806j660921j752623j54948J715837
$$ 569645 616446 547996 410767 488888 694335 194529 -1466392 -3219015 -3373963 -1658126
38758a658126J999284N29602j114434j306946J57684J944897K380075J079650
$$ -1658126 341158 870760 -243674 -1550620 -1392936 551961 2932036 4011686
38750D011686n96823j010091k6241R90001P47163p62450k332740k499746q81864
$$ 4011686 3414863 2404772 2378531 3368532 4115695 3353245 1020505 -1479241 -2361105
38741b361105J084882J413965J2994j076870n68971K13281l27363j136207k3145
$$ -2361105 -1276223 137742 150736 -926134 -1495105 -1281824 -1609187 -2745394 -2768539
38732b768539K520290L486731J564805j059064j879010j149283o38133p85402
$$ -2768539 -248249 3238482 4803287 3744223 1865213 715930 77797 -707605
38724g07605n96073L45818J093716N64031j073723k342212j860982k1296J196875
$$ -707605 -1303678 -957860 135856 699887 -373836 -2716048 -4577030 -4598326 -3401451
38715c401451P22106M905Q74981K442027K143633j72460j591462l08612J776914
$$ -3401451 -2679345 -2674440 -1799459 642568 2786201 2613741 1022279 713667 2490581
38706B490581K009009O05824m60323p13939j126960j699549j385765k55101L02939
$$ 2490581 4499590 5105414 4645091 3931152 2804192 1104643 -281122 -536223 -233284
38697b33284k03218o20070j09316N54378L82464k00626r3062O73554Q45526k67755
$$ -233284 -436502 -1056572 -1165888 -611510 -229046 -429672 -522734 150820 996346 728591
38687G28591j581561j339716O03020K196736J478699q59978k154627j141039N02439
$$ 728591 -852970 -2192686 -1589666 607070 2085769 1225791 -928836 -2069875 -1567436
38678a567436O41697l84527n76534O17888J592517J064260j82776p07181n25674
$$ -1567436 -925739 -1310266 -1886800 -1268912 323605 1387865 1205089 497908 -27766
38669b7766p39911j470870j409618J78521J919442J824276P6909r36333J40336
$$ -27766 -767677 -2238547 -3648165 -3469644 -1550202 274074 350983 -585350 -445014
38660d45014J598676J070595r11761j596105q8712J339343P00819q65677j075220
$$ -445014 1153662 2224257 1312496 -283609 -372321 967022 1667841 802164 -273056
38651b73056J06789Q48231M50342M6884M12346P70301K16402q48518j289586o05294
$$ -273056 -166267 681964 1132306 1179190 1591536 2361837 2578239 1729721 440135 -165159
38641a65159O22634J254527N38337j035871j960767j324612J7982N47125P8319
$$ -165159 457475 1712002 2250339 1214468 -746299 -2070911 -2052929 -1505804 -1427485
38632a427485k40489J89347O31457L46192k85939m71004r8079M02828P19278O42874
$$ -1427485 -1667974 -1478627 -847170 -500978 -786917 -1257921 -1356000 -953172 -233894 408980
38622D08980p3021j187528j681949p92274P35659J218232J30443j043718o69324
$$ 408980 335959 -851569 -2533518 -3325792 -2590133 -1371901 -1241458 -2285176 -2954500
38613b954500P57827J158896k20628j593651j100091M40976O73882p53799j584296
$$ -2954500 -2196673 -1037777 -1258405 -2852056 -3952147 -3511171 -2837289 -3591088 -5175384
38604e175384l33150J418567J306046m19445j325160j21264J917686K812087J996875
$$ -5175384 -5508534 -4089967 -2783921 -3203366 -4528526 -4649790 -2732104 79983 2076858
38595B076858M46834m63592j16698P22024N62498r14081k029323j138026Q89312
$$ 2076858 2523692 2060100 1943402 2665426 3227924 2313843 284520 -853506 35806
38586C5806J558870J25057j411869j144963K60599Q20541k0252j000617r06113
$$ 35806 1594676 1719733 307864 -837099 -576500 244041 223789 -776828 -1682941
38577a682941K03635J470265K100832J712122M73954q58559j443641j149217o88717
$$ -1682941 -1479306 -9041 2091791 3803913 4277867 3419308 1975667 826450 137733
38568A37733p54829j101043p87126N15554J796534J780182N94807l67335l92025
$$ 137733 -617096 -1718139 -2505265 -1989711 -193177 1587005 2181812 1814477 1422452
38559A422452l12414r00450j382505o49954P23549J087215J14257q43539q94464
$$ 1422452 1110038 209588 -1172917 -1822871 -1099322 -12107 102150 -741389 -1635853
38550a635853o47107p00495n13442L99409J287649J236814O22475M03115N33888
$$ -1635853 -2282960 -2983455 -3496897 -3097488 -1809839 -573025 49450 452565 986453
38541I86453K35794m76482p19929j88527L89738M37662K12129o0250p78951j961094
$$ 986453 1222247 745765 25836 -162691 227047 664709 876838 816588 37637 -1923457
38531a923457k373409q49753J662654K641058J076552r97074j012465Q04372J938202
$$ -1923457 -4296866 -5146619 -3483965 -842907 233645 -763429 -1775894 -971522 966680
38522I66680J118184k85348o92057m06046l07242j0409J052308J800308P89455
$$ 966680 2084864 1799516 1107459 701413 394171 383762 1436070 3236378 4025833
38513D025833j139680j648150m24909K10161j110224k564822j736405R59137K901170
$$ 4025833 2886153 1238003 813094 1023255 -86969 -2651791 -4388196 -3429059 -527889
38504e27889K518644O10603j087652j502634o61319M93968Q15100J02260o56798
$$ -527889 1990755 2601358 1513706 11072 -650247 -156279 658821 761081 104283
38495A04283o38081k56038k72904m63176j13031N59620N92343j74924p49528l76491
$$ 104283 -533798 -789836 -1062740 -1525916 -1638947 -1079327 -486984 -661908 -1411436 -1787927
38485a787927N14570J053428J009216P34111M15659j39276r69571j504031r82112
$$ -1787927 -1273357 -219929 789287 1523398 1939057 1799781 830210 -673821 -1655933
38476a655933M95629J640537J235659l32123j435566j185680l13126J35805J02232
$$ -1655933 -1160304 480233 1715892 1383769 -51797 -1237477 -1550603 -1414798 -1312566
38467a312566M3048M2712J13873N90235J329867J252388k01906j678986j293993
$$ -1312566 -1269518 -1226806 -1112933 -522698 807169 2059557 1857651 178665 -1115328
38458a115328P73266K345860J987440N02786n35366o66967m82357n19016p83982
$$ -1115328 -342062 2003798 3991238 4494024 3958658 3291691 2809334 2290318 1506336
38449A506336r00896m19771N99916J243945O18995p92305j403695m66042R50603
$$ 1506336 605440 185669 785585 2029530 2648525 1856220 452525 -13517 937086
38440I37086J326814M60338n90061q50416k67760M47379M61175l84289j196974
$$ 937086 2263900 2724238 2134177 1283761 1016001 1463380 1924555 1540266 343292
38431C43292r02351L04816R79600K75773q74869j052819k80486K01392j40103
$$ 343292 -559059 -254243 725357 1001130 126261 -926558 -1207044 -1005652 -1145755
38422a145755l86553L89015J617181J772970L13068j451548j795061o97467J58647
$$ -1145755 -1532308 -1143293 473888 2246858 2559926 1108378 -686683 -1384150 -1225503
38413a225503k19463o21883N08379K372266K630097R03771n34935l30854k12294
$$ -1225503 -1444966 -2066849 -1558470 813796 3443893 4347664 3812729 3481875 3269581
38404C269581j917016l730241k713006M76151K024867M21254j459455p43502J566956
$$ 3269581 1352565 -2377676 -5090682 -4614531 -2589664 -2168410 -3627865 -4371367 -2804411
38395b804411K793905K507848K009670J417151r5407j832766j958118l97360Q21680
$$ -2804411 -10506 2497342 4507012 5924163 5828756 3995990 2037872 1640512 2462192
38386B462192M94518l74996o05826m92943o65588p77575k82284N29992J028619
$$ 2462192 2956710 2581714 1975888 1482945 817357 39782 -242502 287490 1316109
38377A316109R47488K01814r77011j488246l38238J444434J558594k13769j299987
$$ 1316109 2263597 2465411 1488400 154 -338084 1106350 2664944 2451175 1151188
38368A151188j14459J451568J044040m64977o12664O44139J165399J42266j205499
$$ 1151188 1036729 2488297 3532337 3067360 2454696 3098835 4264234 4406500 3201001
38359C201001k047965k498600j962356K88298K641104K115631j304917l859269
$$ 3201001 1153036 -1345564 -3307920 -3019622 -378518 1737113 432196 -3427073
38351c427073k768389L76707K343890K298509J434110L99449p94829j456828q76029
$$ -3427073 -6195462 -5818755 -3474865 -1176356 257754 657203 -137626 -1594454 -2470483
38342b470483K43225O32943L05512K00710M93055N83308L74531K85571K72071
$$ -2470483 -2227258 -1594315 -1288803 -1088093 -595038 -11730 362801 648372 920443
38333I20443k7872l93147k79085K01716M20699J69365k41095n28557m98968R27
$$ 920443 892571 499424 220339 422055 842754 1012119 771024 242467 -256501 -255574
38323b55574O01641M45837o42505j617187j503356o21328Q9084K42377q7999p47457
$$ -255574 346067 791904 149399 -1467788 -2971144 -3592472 -3503388 -3261011 -3349010 -4096467
38313d096467j109193l23773J254129J984442J139216l9245l75603l43640m54669
$$ -4096467 -5205660 -5529433 -4275304 -2290862 -1151646 -1190891 -1566494 -1910134 -2364803
38304b364803J29214J658791K255493N46522j662941j867131o58627k27355l34493
$$ -2364803 -2235589 -576798 1678695 2225217 562276 -1304855 -1963482 -2190837 -2525330
38295b525330P87068K320804J605691r85955j915220Q660J793842J241094Q4274
$$ -2525330 -1738262 582542 2188233 1202278 -712942 -704282 1089560 2330654 2414928
38286B414928K78151N59931p40149k262320j902605m27782J16221n1129N27957
$$ 2414928 2693079 3253010 2512861 250541 -1652064 -2079846 -1963625 -2014754 -1486797
38277a486797J228430J97283k012238k640214p13347J566634J892892M83616q64459
$$ -1486797 -258367 -61084 -2073322 -4713536 -5426883 -3860249 -1967357 -1483741 -2348200
38268b348200r71801l5113R12568J024328N71971O00003J281362J449626M63817
$$ -2348200 -3320001 -3355114 -2442546 -1418218 -846247 -246244 1035118 2484744 2948561
38259B948561n69911n56310k54314q53191j687387j215793L31659J191833O57608
$$ 2948561 2378650 1822340 1568026 714835 -972552 -2188345 -1856686 -664853 -7245
38250g245l42268j042003j451369j282389r4333J354055J602915N97561k44939
$$ -7245 -349513 -1391516 -2842885 -4125274 -4219607 -2865552 -1262637 -665076 -910015
38241i10015k48524j23896j79751K68215J131552J032306m53052j600098q66741
$$ -910015 -1158539 -1282435 -1462186 -1193971 -62419 969887 516835 -1083263 -1950004
38232a950004P62712J174975J09494o87766j9725J286097J626135N61501q39306
$$ -1950004 -1187292 -12317 97177 -590589 -610314 675783 2301918 2863419 2024113
38223B024113j305407p08107L5350L03533N11045J165282J760036J394487J60308
$$ 2024113 718706 10599 45949 349482 860527 2025809 3785845 5180332 5340640
38214E340640r92577j570948j761281j535210p02252J55592Q8362o57116p50273
$$ 5340640 4348063 2777115 1015834 -519376 -1221628 -1066036 -977674 -1634790 -2385063
38205b385063J71263Q68366M97958o8487J95151P45592M57698m76343q49607j85696
$$ -2385063 -2213800 -1345434 -847476 -915963 -720812 24780 482478 6135 -843472 -1029168
38195a029168Q63535J550420J565249Q33597l50917j198652j203466q48464q28374
$$ -1029168 -165633 1384787 2950036 3783633 3432716 2234064 1030598 182134 -646240
38186f46240q90630l45583N03542N64495k72453o58310L68306J840592J961923
$$ -646240 -1536870 -1882453 -1378911 -814416 -1086869 -1745179 -1376873 463719 2425642
38177B425642M14436j199533j280067j2348J073975R57760L9112p13441r01164
$$ 2425642 2840078 1640545 360478 348130 1422105 2379865 2418977 1705536 804372
38168H04372o70613r3946P38169J208263N79022q91880j884951j433555P610J208830
$$ 804372 133759 39813 777982 1986245 2565267 1673387 -211564 -1645119 -1637509 -428679
38158d28679J484462J039639L87479j23993l86526n02501o16726o31032l06275
$$ -428679 1055783 2095422 2482901 2358908 1972382 1469881 853155 222123 -84152
38149h4152K13373L47829j39744o32058l42460O59375J471418J306520J63362
$$ -84152 129221 477050 337306 -294752 -637212 22163 1493581 2800101 2963463
38140B963463j243453j919184j240064L14469J223521L61805j515029k334837
$$ 2963463 1720010 -199174 -1439238 -1124769 98752 460557 -1054472 -3389309
38132c389309j085466R07234J624664Q50213J32036L38585M58666n10332j543517
$$ -3389309 -4474775 -3567541 -1942877 -1092664 -960628 -622043 -163377 -673709 -2217226
38123b217226q51579J236801K328043J219064m78430q00454q4484J66253j01698
$$ -2217226 -3068805 -1832004 496039 1715103 1236673 436219 351735 517988 416290
38114D16290J43404O68194J24263j372675j867703m41497J261714J384120L53116
$$ 416290 559694 1227888 1352151 -20524 -1888227 -2329724 -1068010 316110 669226
38105F69226j62590K62077O89429N17954M2715l46320n34753n11139n41430j056515
$$ 669226 506636 768713 1458142 1976096 2018811 1672491 1137738 626599 85169 -971346
38095i71346j691640j204883O68180K147940J618493J82342J55572J393454J417532
$$ -971346 -2662986 -3867869 -3199689 -1051749 566744 749086 904658 2298112 3715644
38086C715644m93993j836516p03939J130566R69839n68410o74648J004116J716811
$$ 3715644 3221651 1385135 681196 1811762 2781601 2213191 1538543 2542659 4259470
38077D259470l8668k141664k054224l70688N61322J59806k59331q3482j2542k09237
$$ 4259470 4220802 2079138 24914 -345774 215548 375354 116023 32541 19999 -189238
38067a89238J58309J146474J517498O58071m15388p48657q11342j189224j170905
$$ -189238 -30929 1115545 2633043 3291114 2875726 2127069 1315727 126503 -1044402
38058a044402K0838J476183J560069J72937j249774j664900j151248p4946J151211
$$ -1044402 -1023564 452619 2012688 2185625 935851 -729049 -1880297 -1955243 -804032
38049h04032J683758R88332p9371k30587K80155Q2620q69072r98711K91756J439480
$$ -804032 879726 1868058 1788687 1558100 1838255 1920875 1051803 53092 344848 1784328
38039A784328J050701m4436k66346L17540M44753k43024r56968j243398j393349
$$ 1784328 2835029 2790593 2524247 2841787 3286540 3043516 2086548 843150 -550199
38030e50199j403314o72827R08508K272001K075665K06997j837398k300131j045609
$$ -550199 -1953513 -2626340 -1717832 554169 2629834 2836831 999433 -1300698 -2346307
38021b346307K21479L9502r68042j183940m78630j71639n65525l33151J023061
$$ -2346307 -2124828 -2085326 -3053368 -4237308 -4715938 -4887577 -5453102 -5786253 -4763192
38012d763192J897427R72519n84867q50347N0433N63655L44006M22602J090946
$$ -4763192 -2865765 -1893246 -2478113 -3328460 -3278027 -2714372 -2370366 -1947764 -856818
38003h56818J391516P82537j25358o60763p77068n78052j75672K4533j35809L0001
$$ -856818 534698 1317235 1191877 531114 -245954 -824006 -999678 -975145 -1110954 -1080953
37993a080953J015943J843847J225159k48773p58195r8113L2517j009630j577884
$$ -1080953 -65010 1778837 3003996 2755223 1997028 1898915 1931432 921802 -656082
37984f56082m66071R06178N70923r56879j476069l04934R96559J018810J93272
$$ -656082 -1122153 -215975 354948 -601931 -2078000 -2382934 -1386375 -367565 -174293
37975a74293k18453J74093P05178O77377J59890j55453J80151P05063N36989l86418
$$ -174293 -392746 -218653 486525 1163902 1323792 1168339 1348490 2053553 2590542 2204124
37965B204124j056288p21933M0566J71286l55701o44519l63117k11124o53448
$$ 2204124 1147836 425903 466469 637755 282054 -362465 -725582 -936706 -1590154
37956a590154r78420k60443J131243J751543Q65476n78581j064774k28712R13534
$$ -1590154 -2568574 -2829017 -1697774 53769 919245 340664 -724110 -952822 -39288
37947c9288J222378N06089n29647r65486l70690P34451J190952M79275m37598
$$ -39288 1183090 1689179 1159532 194046 -176644 557807 1748759 2228034 1790436
37938A790436k53184P79608J085866R8180q49111n65859K30572K27505l72653
$$ 1790436 1537252 2316860 3402726 3500906 2651795 2085936 2316508 2544013 2171360
37929B171360m17275J03287L2912r79394j798903j297075L75929K086453K582822
$$ 2171360 1754085 1857372 1890284 910890 -888013 -2185088 -1809159 277294 2860116
37920B860116J290970q99212j970167r46795O03654M73161j132493k003153j226194
$$ 2860116 4151086 3251874 1281707 334912 938566 1411727 279234 -1723919 -2950113
37911b950113j74704Q6018L23762J196277J669234P76416m71635n69328Q0135
$$ -2950113 -3124817 -3038799 -2715037 -1518760 150474 926890 455255 -114073 -33938
37902c3938n4187j029127j327930k62759J030766J270992N62398j63742m15809
$$ -33938 -88125 -1117252 -2445182 -2707941 -1677175 -406183 156215 -7527 -423336
37893d23336l58556k64001k20592k22285k42493j93106N8265M82060O98305L03184
$$ -423336 -781892 -1045893 -1266485 -1488770 -1731263 -1924369 -1866104 -1384044 -685739 -382555
37883c82555m13777n30450K26744P70518J10775q82534m88552J138699J826851
$$ -382555 -796332 -1326782 -1100038 -329520 -218745 -1101279 -1589831 -451132 1375719
37874A375719M52327j371238j606870n12726J98921l3302k94553L4017N48730
$$ 1375719 1828046 456808 -1150062 -1662788 -1463867 -1497169 -1791722 -1757705 -1208975
37865a208975P34324N25946J2396n63729o12193J97641J217449J426277O73453
$$ -1208975 -474651 51295 63691 -500038 -1112231 -914590 302859 1729136 2402589
37856B402589l06225r34887j170865j030711n02358Q2679K57182M5063j30835
$$ 2402589 2096364 1161477 -9388 -1040099 -1542457 -1459778 -1202596 -1157533 -1288368
37847a288368j25804j48947k22340j07299K04847M18447M50408O12903J063427
$$ -1288368 -1414172 -1563119 -1785459 -1892758 -1687911 -1269464 -819056 -206153 857274
37838H57274J299779N53228j119231k353042j736133K08973J170865l0330j566514
$$ 857274 2157053 2710281 1591050 -761992 -2498125 -2289152 -1118287 -1148617 -2715131
37829b715131j056908Q18907J255808k89530j206605R7638J726786J454297P2212
$$ -2715131 -3772039 -2953132 -1697324 -1986854 -3193459 -3095821 -1369035 85262 157474
37820A57474m13936o6401j60379m99725j09679M47226M0360n31716K82376J627812
$$ 157474 -256462 -322863 -483242 -982967 -1092646 -645420 -605060 -1136776 -854400 773412
37810G73412J135241j118205k434824j618424m65717m23457m39005O67451J975802
$$ 773412 1908653 790448 -1644376 -3262800 -3728517 -4151974 -4590979 -3923528 -1947726
37801a947726K070881J139811J29197p58367j549228j740919j092326j28077P60746
$$ -1947726 123155 1262966 1392163 633796 -915432 -2656351 -3748677 -3876754 -3116008
37792c116008J514446J438317j93140k137890j976559K63860J627958N96926n61392
$$ -3116008 -1601562 -163245 -356385 -2494275 -4470834 -4206974 -2579016 -1982090 -2543482
37783b543482M20207K130991K021108N38751j66620j07992q24504j865340j279741
$$ -2543482 -2123275 7716 2028824 2567575 2400955 2292963 1468459 -396881 -1676622
37774a676622O54818J407840J79086r60737m74819O88383J272909J392581J101691
$$ -1676622 -1021804 386036 565122 -395615 -870434 -182051 1090858 2483439 3585130
37765C585130l45931k518009l170501j197404J383851J981702O62705o64051j047975
$$ 3585130 3239199 721190 -2449311 -3646715 -2262864 -281162 381543 -282508 -1330483
37756a330483q13973j25297Q87695J210319P0536j298326r09343R02275J541066
$$ -1330483 -2144456 -2269753 -1382058 -171739 -101203 -1399529 -2308872 -1406597 134469
37747A34469j60838k032046j451513J057623K569898J546525n70205j574705j018754
$$ 134469 -26369 -2058415 -3509928 -2452305 117593 1664118 1093913 -480792 -1499546
37738a499546p643N37727N37823K03418j79441l6038R79869K096826J922649K22578
$$ -1499546 -1507189 -969462 -431639 -228221 -407662 -443700 536169 2632995 4555644 4778222
37728D778222j532812j912353j163246m75135k35849Q4451O84853J073656R23009
$$ 4778222 3245410 1333057 169811 -305324 -541173 -456722 228131 1301787 2224796
37719B224796M65202j5176m10232n22030k60776q3768m60613q76915k88541J177325
$$ 2224796 2689998 2674822 2264590 1742560 1481784 1398016 937403 60488 -228053 949272
37709I49272J894098O78238j558745k722333j780868L41844J871359J831513P47340
$$ 949272 2843370 3521608 1962863 -759470 -2540338 -2198494 -327135 1504378 2251718
37700B251718r2255j29936j33516r57667k037951j937217l67168J293838J756451
$$ 2251718 2159463 2029527 1896011 938344 -1099607 -3036824 -3403992 -2110154 -353703
37691c53703J169530L38109l98766q54350n13568O63560J607016J309511J94062
$$ -353703 815827 1153936 755170 -99180 -612748 50812 1657828 2967339 3161401
37682C161401n86276p17367n90197j44156Q22175J488694P37325q50005j312670
$$ 3161401 2575125 1857758 1267561 1123405 1945580 3434274 4171599 3321594 2008924
37673B008924j23096Q49547N0038j471285j741472p70506j87343n74830r00831
$$ 2008924 1885828 2735375 2785413 1314128 -427344 -1197850 -1385193 -1960023 -2860854
37664b860854n26825j06600j06901P8364Q03922J203126N60918k73948p4985P60127
$$ -2860854 -3387679 -3494279 -3601180 -3522816 -2718894 -1515768 -954850 -1228798 -1303783 -543656
37654e43656P82390j32555m84245M22338J130632O7635j976643k677502j207379
$$ -543656 238734 106179 -378066 44272 1174904 1242539 -734104 -3411606 -4618985
37645d618985P92134J457413Q28447J54344k3426j03836k23647k2713L79793L39595
$$ -4618985 -3826851 -2369438 -1540991 -1386647 -1410073 -1513909 -1737556 -1760269 -1380476 -1040881
37635a040881n8448J21928Q90374P13339j074733k380449q64472K179651K950151
$$ -1040881 -1099329 -977401 -87027 626312 -448421 -2828870 -3693342 -1513691 1436460
37626A436460M84521j763849r77742R34408O49497j135836r37480J596207K752734
$$ 1436460 1920981 157132 -820610 113798 763295 -372541 -1310021 286186 3038920
37617C038920M65446k390528k246122J28378J304880L26156o39712k25299K88985
$$ 3038920 3504366 1113838 -1132284 -1003906 300974 627130 -12582 -237881 51104
37608E1104m18644j373145q36367R34472J844303O96065j243371j818979o39421
$$ 51104 -367540 -1740685 -2577052 -1642580 201723 897788 -345583 -2164562 -2803983
37599b803983N75543L89235m69400l88281O09716R77940J51523o37985m65089
$$ -2803983 -2228440 -1839205 -2308605 -2696886 -2087170 -1109230 -957707 -1595692 -2060781
37590b060781o0128k11875k68166N24429J321840P70983r29674k331801k480026
$$ -2060781 -2120909 -2332784 -2600950 -2076521 -754681 16302 -913372 -3245173 -5725199
37581e725199j329042O63918K231363J808023j28910o29640J737483L886985K109205
$$ -5725199 -7054241 -6390323 -4158960 -2350937 -2479847 -3109487 -1372004 2514981 4624186
37572D624186k029063l342548m83414K316128J897554M18639P62453J468198k82575
$$ 4624186 2595123 -747425 -1230839 1085289 2982843 3401482 4163935 5632133 5349558
37563E349558l207302l540462r30309J179617Q51140j71150l0979O00758N04579
$$ 5349558 2142256 -1398206 -2328515 -1148898 -297758 -468908 -499887 100871 605450
37554F05450J5055k14080o16054j440429j579102j81658J597046J914529O48677
$$ 605450 620505 406425 -209629 -1650058 -3229160 -3410818 -1813772 100757 749434
37545G49434p62134j374582j391646j032118l9852J435056K395062J979209N31097
$$ 749434 -12700 -1387282 -2778928 -3811046 -3850898 -2415842 -20780 1958429 2489526
37536B489526p07185q85699l11415J15868O5025P2910N68564J000736M81189q22271
$$ 2489526 1782341 896642 585227 701095 766120 839030 1407594 2408330 2889519 2067248
37526B067248j631780j133179k3196M63678J61004k0299M41179Q93687M85563
$$ 2067248 435468 -697711 -720907 -257229 -96225 -116524 324655 1218342 1703905
37517A703905n27430r92375l25939P43833J132928O97228J48015n6335j22575
$$ 1703905 1176475 184100 -141839 601994 1734922 2432150 2580165 2523830 2401255
37508B401255k64373l03570j43268p0930k67433m70159m24014k07379J46940P32210
$$ 2401255 2136882 1833312 1690044 1619114 1351681 881522 457508 250129 397069 1129279
37498A129279J108108L96488j235931k023003p04650J344958J563122l28066j881950
$$ 1129279 2237387 2633875 1397944 -625059 -1329709 15249 1578371 1250305 -631645
37489f31645j340414Q2947K82519o51329q81233K92265J592025J787859J128858
$$ -631645 -1972059 -1889112 -1606593 -2257922 -3139155 -2846890 -1254865 532994 1661852
37480A661852L59378m49107j291926j414447k47069J304722J704882Q32646L5454
$$ 1661852 2021230 1572123 280197 -1134250 -1381319 -76597 1628285 2460931 2496385
37471B496385L6203O0695n02736r32558n99902l31619r52069j435905l27959J552117
$$ 2496385 2532588 2593283 2090547 1157989 558087 226468 -725601 -2161506 -2489465 -937348
37461i37348J904895L65123j049957j182261j096299j470313j104822N32910J574001
$$ -937348 967547 1332670 282713 -899548 -1995847 -3466160 -4570982 -4038072 -2464071
37452b464071N86186p73777l49751R01388P29399k41314M34658K338379K292783
$$ -2464071 -1877885 -2651662 -3001413 -2100025 -1370626 -1611940 -1177282 1161097 3453880
37443C453880m07193k489269j713028j24672l27406j289519n53192J328231J626232
$$ 3453880 3046687 557418 -1155610 -1280282 -1607688 -2897207 -3450399 -2122168 -495936
37434d95936j58059j563327q11792J077880K174689J882640P63170n66581j649558
$$ -495936 -653995 -2217322 -3029114 -1951234 223455 2106095 2869265 2302684 653126
37425F53126k055627j634352o81196K90837Q26913P53882L12085j54840o12816
$$ 653126 -1402501 -3036853 -3718049 -3427212 -2600299 -1846417 -1534332 -1689172 -2301988
37416b301988r58882m90380J141390K508664J616593r78652k222145q31032N97498
$$ -2301988 -3260870 -3751250 -2609860 -101196 1515397 536745 -1685400 -2516432 -1918934
37407a918934l74336j912075p23412K350822L186289O52173j665675r50405R80185
$$ -1918934 -2293270 -4205345 -4928757 -2577935 608354 1260527 -405148 -1355553 -375368
37398c75368J082895l76852j115643p11781m76376n57292J14665J356600J670805
$$ -375368 707527 330675 -784968 -1496749 -1973125 -2530417 -2415752 -1059152 611653
37389F11653P93897J68586M21341L36459q05435j594866n51317J347843J793774
$$ 611653 1405550 1574136 1995477 2331936 1526501 -68365 -619682 728161 2521935
37380B521935L16314j172038j011210L22474J312208J267013M38226q10040j938104
$$ 2521935 2838249 1666211 655001 977475 2289683 3556696 3994922 3184882 1246778
37371A246778j912536k44684J699830J737981l65326k312126k144127o28143K70415
$$ 1246778 -665758 -910442 789388 2527369 2162043 -150083 -2294210 -2922353 -2651938
37362b651938L22343Q36103J964474K143989O33926j039695j132694k6872O01253
$$ -2651938 -2329595 -1493492 470982 2614971 3248897 2209202 1076508 1049636 1650889
37353A650889K08332k19254J41722R67947J491869J325770M79905p31564j606067
$$ 1650889 1859221 1639967 1781689 2749636 4241505 5567275 6047180 5315616 3709549
37344C709549j452190l80014O46772P77817O4512q25350j349262j314468o79651
$$ 3709549 2257359 1877345 2524117 3301934 3366446 2541096 1191834 -122634 -802285
37335h02285L83146J233382J075460j27871j344618j564282j064169r41885j348502
$$ -802285 -419139 814243 1889703 1761832 417214 -1147068 -2211237 -3153122 -4501624
37326d501624j094241M77777K111739K141289Q26609n7934K24675O13118K11424
$$ -4501624 -5595865 -5118088 -3006349 -865060 -38451 -96385 128290 741408 952832
37317I52832m00038m25190j99576l59453n75086j47112P39860J321122J331454
$$ 952832 552794 127604 -71972 -431425 -1006511 -1153623 -413763 907359 2238813
37308B238813R05832o1586j433487k169513j388412R6191N70923j92028o08635
$$ 2238813 3144645 3083059 1649572 -519941 -1908353 -1812162 -1241239 -1433267 -2041902
37299b041902L44241J644654J765308P30017k46340n47852o14754q43113r40005
$$ -2041902 -1697661 -53007 1712301 2442318 2195978 1648126 1033372 190259 -749746
37290g49746n61157K567J64483j33646k97162J20639P31002P63854J79519j74149
$$ -749746 -1310903 -1308336 -1143853 -1277499 -1574661 -1454022 -723020 40834 220353 46204
37280D6204K32337P88934O88233K23709K74916P24366N11293n48931j173851n09767
$$ 46204 278541 1067475 1755708 1979417 2254333 2978699 3489992 2941061 1767210 1257443
37270A257443L46490k06951j830902k487180j145109Q59418J589537Q00320k01032
$$ 1257443 1603933 1396982 -433920 -2921100 -4066209 -3206791 -1617254 -816934 -1017966
37261a017966m56260k40895j16831N2309P20575J758050K470012K391580J646552
$$ -1017966 -1474226 -1715121 -1831952 -1779643 -1059068 698982 3168994 5560574 7207126
37252G207126N75531n61150j465674j815618j573966j017901l99292R9529J26614
$$ 7207126 7782657 7221507 5755833 3940215 2366249 1348348 949056 1048585 1175199
37243A175199n19429j223791r87241J08148O88614l7082j022990r09372k8928
$$ 1175199 655770 -568021 -1555262 -1447114 -758500 -795582 -1818572 -2727944 -2756872
37234b756872L37754J03113J99598N56163J00082j005975j051588N37981J950038
$$ -2756872 -2419118 -2316005 -2116407 -1560244 -1460162 -2466137 -3517725 -2979744 -1029706
37225a029706J574310L49484O4713N66121M40182l69236o20142j02265N5084n12696
$$ -1029706 544604 894088 958801 1524922 1965104 1595868 975726 873461 928545 415849
37215D15849p88111k32577L29365K37216k0857p376j70978o68931o37430K99765
$$ 415849 -372262 -604839 -275474 -38258 -59115 -66491 -237469 -906400 -1543830 -1244065
37205a244065R01426k382j481769j603096j42132J185192J096111R8232o08649
$$ -1244065 -342639 -345021 -1826790 -3429886 -3572018 -2386826 -1290715 -1192483 -1801132
37196a801132m78481L38894J294225J466360K39760j577198k158660q34413Q29172
$$ -1801132 -2279613 -1940719 -646494 819866 1059626 -517572 -2676232 -3510645 -2681473
37187b681473R46839j50736l52227J250217K868858K167018o56188k866391k387288
$$ -2681473 -1734634 -1885370 -2237597 -987380 1881478 4048496 3392308 525917 -1861371
37178a861371k15293R24398j00213j671144j603749K99045K260261K575403J175120
$$ -1861371 -2076664 -1152266 -1252479 -2923623 -4527372 -4228327 -1968066 607337 1782457
37169A782457n54130j114351k57040P79715O71661l10441o56442J71374Q86736
$$ 1782457 1228327 113976 -143064 636651 1308312 997871 341429 512803 1399539
37160A399539L90107m37209j47882Q68773R82174n2515p86391m51148M0827j38973
$$ 1399539 1789646 1352437 1204555 2073328 3055502 3002987 2216596 1765448 1806275 1667302
37150A667302m99288l41583K27978R54294J746905J822310J76837k279747k906878
$$ 1667302 1168014 826431 1054409 2008703 3755608 5577918 5754755 3475008 568130
37141E68130r49098Q34096n4056k080555k039594M6637J213353K43335q89454
$$ 568130 -380968 453128 399072 -1681483 -3721077 -3674440 -2461087 -2217752 -3107206
37132c107206n50452L09373L41431r878K49664Q73629J052969P26108L00063N7712
$$ -3107206 -3657658 -3348285 -3006854 -3016732 -2767068 -1893439 -840470 -114362 185701 243413
37122B43413L84019J394792J957175O41093j787810k639689r82035Q28099N78824
$$ 243413 627432 2022224 3979399 4620492 2832682 192993 -789042 39057 617881
37113F17881o85684p23471L66851Q17097K53947j79298q2486j8653R6651P58058
$$ 617881 -67803 -791274 -424423 392674 646621 467323 384837 366184 462835 1220893
37103A220893J299281O15770o52083p41326L21275N53933p84170j874805j070590
$$ 1220893 2520174 3135944 2483861 1742535 2063810 2617743 1833573 -41232 -1111822
37094a111822P83480J838932J682419J090454L81634o59818j700714j860505q44496
$$ -1111822 -328342 1510590 3193009 4283463 4665097 4005279 2304565 444060 -400436
37085d00436N33088J116869N71644k60331l05955M11518Q68745O54453O34995
$$ -400436 132652 1249521 1821165 1560834 1254879 1666397 2535142 3189595 3824590
37076C824590J376915J844344P55046j478682l319168l899192l068317o92347
$$ 3824590 5201505 7045849 7800895 6322213 3003045 -896147 -3964464 -4656811
37068d656811K380825L684670J775006j108676j550766K69684J152884M9625p28743
$$ -4656811 -2275986 1408684 3183690 2075014 524248 793932 1946816 1996441 1267698
37059A267698Q576K93248j105788k136482r65780Q43772J124616N78988P67483
$$ 1267698 1276274 1569522 463734 -1672748 -2638528 -1794756 -670140 -91152 676331
37050F76331Q55180n59259k115578j509541M87379J058981k71519j322572r25672
$$ 676331 1531511 972252 -1143326 -2652867 -2165488 -1106507 -1378026 -2700598 -3626270
37041c626270m7930N58687J106805J223449K43411r00595n58294Q01282J091369
$$ -3626270 -3674200 -3115513 -2008708 -785259 -541848 -1442443 -2000737 -1199455 -108086
37032a08086L1928m82817L16508J015075P20727K79637J59229l81032j225716
$$ -108086 -76158 -558975 -242467 772608 1493335 1772972 1932201 1551169 325453
37023C25453r81928M08497J001104r6432j248099j045703l33514j92939r7421
$$ 325453 -656475 -247978 753126 656694 -591405 -1637108 -1970622 -2163561 -2260982
37014b260982M51032N40374k84532p42433n2569N16763O4472q7524R97968J575866
$$ -2260982 -1809950 -1269576 -1554108 -2296541 -2349110 -1832347 -1767875 -1855399 -857431 718435
37004G18435J00309j544335p68553J283020J479117r3376m77867Q45080J005810
$$ 718435 818744 -725591 -1494144 -211124 1267993 1174617 696750 1541830 2547640
36995B547640j144276k739436j435883Q56868J124794j83160m69132N91655Q75257
$$ 2547640 1403364 -1336072 -2771955 -1915087 -790293 -973453 -1442585 -850930 24327
36986B4327m17966j565950j289398o14276p69720j025656j50566J151153J156130
$$ 24327 -393639 -1959589 -3248987 -3863263 -4632983 -5658639 -5809205 -4658052 -3501922
36977c501922M4642j19664J359544K541364J811035L46637J9212L09136m24640
$$ -3501922 -3457280 -3576944 -2217400 323964 2134999 2481636 2500848 2809984 2385344
36968B385344j574417j033832Q42161J150334r07199k288578o50709J981515K337723
$$ 2385344 810927 -222905 619256 1769590 862391 -1426187 -2076896 -95381 2242342
36959B242342O53133l81792m0396k2833j098800k028410j871746j127521l55583
$$ 2242342 2895475 2513683 2473287 2450454 1351654 -676756 -2548502 -3676023 -4031606
36950d031606M52594R57676O70911K19591P32454J822070J888455O27961n23878
$$ -4031606 -3579012 -2621336 -1950425 -1730834 -998380 823690 2712145 3340106 2816228
36941B816228p56853q51156j263473j134539r3976O36179J07880p48352o41588
$$ 2816228 2059375 1208219 -55254 -1189793 -1283769 -647590 -539710 -1288062 -1929650
36932a929650P4237K62547J499K11974P31460L16665j245918k269690j127627
$$ -1929650 -1855413 -1592866 -1591367 -1379393 -647933 -331268 -1577186 -3846876 -4974503
36923d974503J467121K967145J893883l80143j313146k87420R66542J062080O98091
$$ -4974503 -3507382 -540237 1353646 973503 -339643 -627063 339479 1401559 2099650
36914B099650R66343J257856L31620j331627j972547j091281O3467N31620O41390
$$ 2099650 3065993 4323849 4655469 3323842 1351295 260014 323481 855101 1496491
36905A496491P79953O01965q6466p65284r47322o68332r6548N12959N63225j74850
$$ 1496491 2276444 2878409 2791943 2026659 1079337 411005 314457 827416 1390641 1215791
36895A215791p62069j97909Q33873P31712n59659j419197j045470m61971o11300
$$ 1215791 453722 255813 1089686 1821398 1261739 -157458 -1202928 -1664899 -2276199
36886b276199r54432n96306L71671J168659J063777k25859j806458j634813J075137
$$ -2276199 -3230631 -3826937 -3455266 -2286607 -1222830 -1448689 -3255147 -4889960 -3814823
36877c814823L772463L077670n40439l025666k150811q2750M17970k76003l40423
$$ -3814823 -42360 3035310 2494871 -530795 -2681606 -2764356 -2346386 -2622389 -2962812
36868b962812L09736N05348K634n65340p91848l16079J162370K679025K436835
$$ -2962812 -2653076 -2147728 -2145094 -2710434 -3502282 -3818361 -2655991 23034 2459869
36859B459869N08231p47703j39044O18852M4596o31205q7170L66226q09935k275960
$$ 2459869 2968100 2220397 2081353 2700205 2744801 2113596 2026426 2392652 1582717 -693243
36849f93243j867148j24877R31962J031720R32117J26190j692451k440515l64071
$$ -693243 -2560391 -2685268 -1753306 -721586 210531 336721 -1355730 -3796245 -4160316
36840d160316K304956K074241l92695j445735l29378K73746o46564j129693m52654
$$ -4160316 -1855360 218881 -173814 -1619549 -1948927 -1675181 -2321745 -3451438 -3904092
36831c904092l70774j238527r39188J019051K145862J250181M35403J025066J062245
$$ -3904092 -4274866 -5513393 -6452581 -5433530 -3287668 -2037487 -1602084 -577018 485227
36822D85227q94374k756166k297233p59796l14501l31379R07580K685739K936467
$$ 485227 -409147 -3165313 -5462546 -6222342 -6536843 -6868222 -5960642 -3274903 -338436
36813c38436J519026n8217j027897j385877p98302N21969J129620L63620l76150
$$ -338436 1180590 1122373 94476 -1291401 -2089703 -1567734 -438114 -74494 -450644
36804d50644o1976Q1464r13556j468336j61843J310534Q42521k29131O18843K410405
$$ -450644 -512620 -431156 -1344712 -2813048 -2974891 -1664357 -821836 -1050967 -432124 1978281
36794A978281K044663m27055j807114r18086k5696o77211j521038j086675J55326
$$ 1978281 4022944 3595889 1788775 870689 844993 167782 -1353256 -2439931 -2284605
36785b284605J315916K100048J725010n00114k897060k527385N53595K888378
$$ -2284605 -968689 1131359 2856369 2356255 -540805 -3068190 -2514595 373783
36777C73783K422133Q91967K73249r6349j115672j595535o61456J0837j025266
$$ 373783 2795916 3687883 3961132 3864783 2749111 1153576 492120 502957 -522309
36768e22309k070259r75590R75054R86678o61071j195399J20964J274455J221528
$$ -522309 -2592568 -3568158 -2593104 -1606426 -2267497 -3462896 -3341932 -2067477 -845949
36759h45949J176022J665806J203346r38679k889606k585637n08654J242400J495959
$$ -845949 330073 1995879 3199225 2260546 -629060 -3214697 -3723351 -2480951 -984992
36750i84992N94430n73040j147414o66708L51153Q06377M62410J76826L31904
$$ -984992 -390562 -963602 -2111016 -2777724 -2426571 -1620194 -1157784 -980958 -649054
36741f49054K15362l95514l83533Q61137J922991J173966p10945j673767j189739
$$ -649054 -433692 -829206 -1212739 -351602 1571389 2745355 2034410 360643 -829096
36732h29096n23552l00389K46061J290528J563859L91372q86772p61460J81876
$$ -829096 -1352648 -1653037 -1406976 -116448 1447411 1838783 952011 190551 372427
36723C72427K01185r46403j648751p23335R99778J729808Q57371k79285J43693
$$ 372427 573612 -372791 -2021542 -2744877 -1745099 -15291 842080 562795 706488
36714G06488K051564K922195O17269l212675m189583o62570L494046L457951k12754
$$ 706488 2758052 5680247 6297516 3084841 -1104742 -1767312 1726734 5184685 4971931
36705D971931k425537n60774K320196K303159m1578j349064p17219l75198j530909
$$ 4971931 2546394 1985620 4305816 6608975 6567397 5218333 4501114 4125916 2595007
36696B595007k412128j294220O53524J131872J13229l85746L95160Q02904m58822
$$ 2595007 182879 -1111341 -457817 674055 787284 401538 796698 1599602 1140780
36687A140780j985237j574457L65677J259271K17841o41447L94545J868569J505916
$$ 1140780 -844457 -2418914 -2053237 -793966 -576125 -1217572 -823027 1045542 2551458
36678B551458j47110p34990Q6677M28945m31727j111029r17991r08857j308140
$$ 2551458 2404348 1669358 1756035 2184980 1753253 642224 -275767 -1184624 -2492764
36669b492764n82979J488130K404058O49979j391503p91212J359338J638663n08213
$$ -2492764 -3075743 -1587613 816445 1466424 74921 -716291 643047 2281710 1773497
36660A773497k302878j961926n87450L71656Q84127J093469O71915R8879N23248
$$ 1773497 -529381 -2491307 -3078757 -2707101 -1822974 -729505 -57590 41289 564537
36651E64537J624208J549119j84746j585732j011012N69498J288037Q91728K72702
$$ 564537 2188745 3737864 3553118 1967386 956374 1525872 2813909 3705637 3978339
36642C978339k64190q68324j170289p81660k22686k74970q04104j010286m37052
$$ 3978339 3714149 2845825 1675536 893876 671190 396220 -407884 -1418170 -1855222
36633a855222P83691K062701K323253Q03359j506655k339542r36428P59276P88193
$$ -1855222 -1071531 991170 3314423 4117782 2611127 271585 -664843 94433 882626
$$ [...]
##END NTUPLES=NMR SPECTRUM
##END=
