##TITLE=31Pdec_PHBF2805
 CDCl3, 24 sc
 28.5.2019
##JCAMPDX= 6.0         $$ Bruker NMR JCAMP-DX V2.0
##DATA TYPE= NMR SPECTRUM
##DATA CLASS= NTUPLES
##ORIGIN= UXNMR, Bruker Analytische Messtechnik GmbH
##OWNER= root
$$ XWIN-NMR		Version 3.5
$$ Tue May 28 16:24:01 2019 Russian Standard Time (UT+4h)  she@DPX200
##.OBSERVE FREQUENCY= 81.013821
##.OBSERVE NUCLEUS= ^31P
##.ACQUISITION MODE= SIMULTANEOUS
##.ACQUISITION SCHEME= undefined
##.AVERAGES= 24
##.DIGITISER RES= 17
##SPECTROMETER/DATA SYSTEM= spect
##.PULSE SEQUENCE= zgpg30
##.SOLVENT NAME= DMSO
##.SHIFT REFERENCE= (INTERNAL, DMSO, 0, 182.463)
##AUDIT TRAIL= $$ (NUMBER, WHEN, WHO, WHERE, WHAT)
$$ ##TITLE= Audit trail, XWIN-NMR		Version 3.5
$$ ##JCAMPDX= 5.01
$$ ##ORIGIN= Bruker BioSpin GmbH
$$ ##OWNER= she
$$ F:/spectra/data/she/nmr/P31/1/pdata/1/auditp.txt
$$ ##AUDIT TRAIL=  $$ (NUMBER, WHEN, WHO, WHERE, WHAT)
(   1,<2019-05-28 16:23:05.39 +0400>,<she>,<DPX200>,
      <created by zg, POWCHK disabled, PULCHK disabled
       configuration hash MD5:
       00 E9 B6 7A A2 85 ED C7 34 08 36 98 17 FE 4E 26
       data hash MD5: 32K
       C2 27 62 63 56 B7 B7 C9 A2 A8 8F 85 CE 78 8D A7>)
(   2,<2019-05-28 16:23:08.03 +0400>,<she>,<DPX200>,
      <Start of raw data processing
       efp BC_mod = 2 LB = 1 FT_mod = 6 PKNL = 1 PHC0 = -1786.065 PHC1 = 19.39899 SI = 64K 
       data hash MD5: 64K
       19 34 88 37 98 C5 72 8D D1 3D AE 60 1F B1 5C 66>)
(   3,<2019-05-28 16:23:24.04 +0400>,<she>,<DPX200>,
      <pk PHC0 = -16.0087 PHC1 = 0 
       data hash MD5: 64K
       19 39 F5 94 92 0D B2 1A 51 45 7C 91 BB 78 92 21>)
(   4,<2019-05-28 16:23:27.85 +0400>,<she>,<DPX200>,
      <abs ABSG = 5 
       data hash MD5: 64K
       8E 51 B9 4E AA 0E 20 47 49 B9 FB C0 3A F0 5F E9>)
$$ ##END=
$$ 
$$ hash MD5
$$ 02 F2 B3 99 1B 10 89 3E B3 F3 80 BE 8C 5A C7 43
##$RELAX= 
##$RELAX= 
##$RELAX= 
##$RELAX= 
##$RELAX= 
##$RELAX= 
##$RELAX= 
##$RELAX= 
$$ Bruker specific parameters
$$ --------------------------
##$DU= <F:/spectra>
##$EXPNO= 1
##$NAME= <P31>
##$PROCNO= 1
##$TYPE= <nmr>
##$USER= <she>
##$AMP= (0..31)
100 100 100 100 100 100 100 100 100 100 100 100 100 100 100 100 100 100 
100 100 100 100 100 100 100 100 100 100 100 100 100 100 
##$AQSEQ= 0
##$AQ_mod= 1
##$AUNM= <au_zg>
##$AUTOPOS= <>
##$BF1= 81.014009
##$BF2= 200.13
##$BF3= 200.13
##$BF4= 200.13
##$BF5= 200.13
##$BF6= 200.13
##$BF7= 200.13
##$BF8= 200.13
##$BYTORDA= 1
##$CFDGTYP= 0
##$CFRGTYP= 5
##$CHEMSTR= <none>
##$CNST= (0..31)
1 1 145 1 1 1 1 1 1 1 1 1 1 1 1 1 1 1 1 1 1 1 1 1 1 1 1 1 1 1 1 1 
##$CPDPRG= <waltz16>
##$CPDPRG1= <>
##$CPDPRG2= <waltz16>
##$CPDPRG3= <>
##$CPDPRG4= <mlev>
##$CPDPRG5= <mlev>
##$CPDPRG6= <mlev>
##$CPDPRG7= <mlev>
##$CPDPRG8= <mlev>
##$CPDPRGB= <>
##$CPDPRGT= <>
##$D= (0..31)
0 1 0 0 0 0 0 0 0 0 0 0.03 2e-05 3e-06 0 0 0 0 0 0 0 0 0 0 0 0 0 0 0 0 
0 0 
##$DATE= 1559046184
##$DBL= (0..7)
120 120 120 11 120 120 24 19 
##$DBP= (0..7)
150 150 150 150 150 150 150 150 
##$DBP07= 0
##$DBPNAM0= <>
##$DBPNAM1= <>
##$DBPNAM2= <>
$$ [...]
##$SUBNAM3= <"">
##$SUBNAM4= <"">
##$SUBNAM5= <"">
##$SUBNAM6= <"">
##$SUBNAM7= <"">
##$SUBNAM8= <"">
##$SUBNAM9= <"">
##$SW= 369.568048894756
##$SWIBOX= (0..15)
0 1 3 0 0 0 0 0 0 0 0 0 0 0 0 0 
##$SW_h= 29940.119760479
##$TD= 32768
##$TD0= 1
##$TE= 0
##$TE2= 300
##$TE3= 300
##$TEG= 300
##$TL= (0..7)
0 120 53 12 22 120 120 120 
##$TP= (0..7)
150 150 150 150 150 150 150 150 
##$TP07= 0
##$TPNAME0= <>
##$TPNAME1= <>
##$TPNAME2= <>
##$TPNAME3= <>
##$TPNAME4= <>
##$TPNAME5= <>
##$TPNAME6= <>
##$TPNAME7= <>
##$TPOAL= (0..7)
0.5 0.5 0.5 0.5 0.5 0.5 0.5 0.5 
##$TPOFFS= (0..7)
0 0 0 0 0 0 0 0 
##$TUNHIN= 0
##$TUNHOUT= 0
##$TUNXOUT= 0
##$USERA1= <user>
##$USERA2= <user>
##$USERA3= <user>
##$USERA4= <user>
##$USERA5= <user>
##$V9= 5
##$VALIST= <valist>
##$VCLIST= <CCCCCCCCCCCCCCC>
##$VD= 0
##$VDLIST= <DDDDDDDDDDDDDDD>
##$VPLIST= <PPPPPPPPPPPPPPP>
##$VTLIST= <TTTTTTTTTTTTTTT>
##$WBST= 1024
##$WBSW= 4
##$XGAIN= (0..3)
0 0 0 0 
##$XL= 0
##$YL= 0
##$YMAX_a= 105225
##$YMIN_a= -112982
##$ZGOPTNS= <>
##$ZL1= 120
##$ZL2= 120
##$ZL3= 120
##$ZL4= 120
##$ABSF1= 182.463
##$ABSF2= -187.1042
##$ABSG= 5
##$ABSL= 3
##$ALPHA= 0
##$AQORDER= 0
##$ASSFAC= 0
##$ASSFACI= 0
##$ASSFACX= 0
##$ASSWID= 0
##$AUNMP= <proc_1d>
##$AZFE= 0.1
##$AZFW= 0.5
##$BCFW= 0
##$BC_mod= 2
##$BYTORDP= 0
##$COROFFS= 0
##$CY= -3
##$DATMOD= 1
##$DC= 0
##$DFILT= <>
##$DTYPP= 0
##$F1P= 0
##$F2P= 0
##$FCOR= 1
##$FTSIZE= 65536
##$FT_mod= 6
##$GAMMA= 0
##$GB= 0
##$INTBC= 1
##$INTSCL= 5.30512e-09
##$ISEN= 30
##$LB= 1
##$LEV0= 0
##$LPBIN= 0
##$MAXI= 10000
##$MC2= 0
##$MEAN= 0
##$ME_mod= 0
##$MI= 50
##$NCOEF= 0
##$NC_proc= -3
##$NLEV= 6
##$NOISF1= 182.463
##$NOISF2= 159.3651
##$NSP= 0
##$NTH_PI= 0
##$NZP= 0
##$OFFSET= 182.463
##$PC= 4
##$PHC0= -1802.074
##$PHC1= 19.39899
##$PH_mod= 1
##$PKNL= yes
##$PPARMOD= 0
##$PSCAL= 0
##$PSIGN= 0
##$REVERSE= no
##$SF= 81.0140089999434
##$SI= 65536
##$SIGF1= 159.3651
##$SIGF2= -187.1042
##$SINO= 113.3802
##$SIOLD= 16384
##$SREGLST= <1H.CDCl3>
##$SSB= 0
##$STSI= 65536
##$STSR= 0
##$SW_p= 29940.119760479
##$SYMM= 0
##$S_DEV= 0
##$TDeff= 32768
##$TDoff= 0
##$TI= <>
##$TILT= no
##$TM1= 0
##$TM2= 0
##$TOPLEV= 0
##$USERP1= <user>
##$USERP2= <user>
##$USERP3= <user>
##$USERP4= <user>
##$USERP5= <user>
##$WDW= 1
##$XDIM= 65536
##$YMAX_p= 422630034
##$YMIN_p= -1950853
$$ End of Bruker specific parameters
$$ ---------------------------------
##NTUPLES= NMR SPECTRUM
##VAR_NAME=  FREQUENCY,     SPECTRUM/REAL,   SPECTRUM/IMAG
##SYMBOL=    X,             R,               I
##VAR_TYPE=  INDEPENDENT,   DEPENDENT,       DEPENDENT
##VAR_FORM=  AFFN,          ASDF,            ASDF
##VAR_DIM=   65536,         65536,           65536
##UNITS=     HZ,            ARBITRARY UNITS, ARBITRARY UNITS
##FACTOR=    0.456856943014862, 1,           1
##FIRST=     14782.0589164792, 0,            0
##LAST=      -15158.0608439998, 0,           0
##MIN=       -15158.0608439998, -1950853,    0
##MAX=       14782.0589164792, 422630034,    0
$$ Real data points
##PAGE= N=1
##DATA TABLE= (X++(R..R)), XYDATA
$$ [...]
$$ plain form
42747 218459 338619 282637 38203 -207371 -312241 -299352 -205018 -1677 243117 315281
42737 315281 106595 -204583 -363417 -331298 -241808 -169601 -100040 -52639 -61454 -63736 35240
42726 35240 193775 266469 205202 103765 44313 32135 95678 303330 619494 864352 906680
42715 906680 817878 746036 701145 576629 358704 185793 156233 176777 98534 -45168 -64592
42704 -64592 105190 278948 262597 118593 54740 105138 92554 -84998 -298809 -376488 -301034
42693 -301034 -150054 22798 140096 64555 -236604 -563911 -669314 -533705 -349077 -272951
42683 -272951 -320262 -444389 -574771 -596699 -446666 -233662 -130509 -137770 -93316 70290
42673 70290 228042 259197 194903 112497 25970 -38093 7489 170824 302466 281670 196913
$$ packed form
42747B18459J20160n5982k44434k45574j04870J2889R4334K03341K44794P2164
42737C15281k08686l11178j58834L2119Q9490P2207O9561M7401q815k282R8976
42726C5240J58535P2694o1267j01437n9452j2178O3543K07652L16164K44858M2328
42715I06680q8802p1842m4891j24516k17925j72911k9560K0544p8243j43702j9424
42704f4592J69782J73758j6351j44004o3853N0398j2584j77552k13811p7679P5454
42693c01034J50980J72852J17298p5541l01159l27307j05403J35609J84628P6126
42683b72951m7311j24127j30382k1928J50033K13004J03153p261M4454J63606
42673G0290J57752L1155o4294q2406q6527o4063M5582J63335J31642k0796q4757
$$ plain form
42662 196913 209404 304108 326560 236465 169483 228098 339096 369553 301424 238433 281317
42651 281317 422928 543939 523188 387618 315044 419063 572590 552317 335705 117066
42641 117066 22208 -26375 -102658 -116239 7613 130943 74125 -97294 -157811 -57938 35481
42630 35481 42423 92163 273119 462284 527283 537869 625467 752953 787928 718841 631864
42619 631864 535950 384708 233772 194548 237781 221156 130959 120248 258636 411336 445346
42608 445346 407455 394294 371191 250177 67478 -46115 -34167 44852 114375 131259 69415
42597 69415 -60389 -179326 -194280 -87036 83890 254461 394797 496471 554476 562011
42587 562011 524141 485352 499859 519892 377731 3886 -375153 -438029 -185191 47059
$$ packed form
42662A96913J2491R4704K2452r0095o6982N8615J10998L0457o8129o2991M2884
42651B81317J41611J21011k0751j35570p2574J04019J53527k0273k16612k18639
42641A17066r4858m8583p6283j3581J23852J23330n6818j71419o0517R9873R3419
42630C5481O942M9740J80956J89165O4999J0586Q7598J27486L4975o9087q6977
42619F31864r5914j51242j50936l9224M3233j6625r0197j0711J38388J52700L4010
42608D45346l7891j3161k3103j21014j82699j13593J1948P9019O9523J6884o1844
42597F9415j29804j18937j4954J07244J70926J70571J40336J01674N8005P535
42587E62011l7870l8789J4507K0033j42161l73845l79039o2876K52838K32250
$$ plain form
42577 47059 54093 17543 152942 329218 281802 57986 -35125 127705 367201 514870 602707
42566 602707 698178 768302 778576 753035 671718 466575 180894 -16460 -36402 46522 150395
42555 150395 260612 308172 179450 -59712 -152520 3131 183705 172320 77325 112212
42545 112212 217715 167402 -42948 -192897 -194802 -175428 -175443 -44157 263351 514217 478894
42534 478894 231547 20455 -41921 -5780 102382 306889 542992 647305 524380 238875
42524 238875 -67479 -275839 -314513 -186859 -11250 44440 -77324 -267982 -387727 -409819
42514 -409819 -392674 -360160 -283144 -170797 -109241 -173783 -326848 -433879 -388692 -223006 -85365
42503 -85365 -92354 -195453 -226264 -95670 90161 160305 94416 32247 74929 170064 223649
$$ packed form
42577D7059P034l6550J35399J76276m7416k23816r3111J62830K39496J47669Q7837
42566F02707R5471P0124J0274k5541q1317k05143k85681j97354j9942Q2924J03873
42555A50395J10217M7560j28722k39162r2808J55651J80574j1385r4995L4887
42545A12212J05503n0313k10350j49949j905J9374j5J31286L07508K50866l5323
42534D78894k47347k11092o2376L6141J08162K04507K36103J04313j22925k85505
42524B38875l06354k08360l8674J27654J75609N5690j21764j90658j19745k2092
42514d09819J7145L2514P7016J12347O1556o4542j53065j07031M5187J65686J37641
42503h5365o989j03099l0811J30594J85831P0144o5889o2169M2682R5135N3585
$$ plain form
42492 223649 230382 221967 160794 -13580 -266343 -492255 -639741 -714075 -673696 -452471 -118615
42481 -118615 111266 99462 -47112 -119898 -58459 29420 46998 -5384 -113227 -296500 -525896
42470 -525896 -667841 -590030 -311857 -10727 127366 62233 -77587 -120344 -17754 109993
42460 109993 110146 -36398 -218675 -340148 -381474 -318203 -97000 228272 441683 390918 220540
42449 220540 208809 367496 398789 126616 -221848 -323305 -198712 -128564 -209793 -253689
42439 -253689 -133551 14273 22721 -71244 -140911 -160832 -157421 -104349 -5315 33952 -36797
42428 -36797 -81205 41539 244019 320883 225111 70998 -73040 -207235 -263418 -161316
42418 -161316 -3542 -2519 -166698 -242758 -38371 342453 639668 677755 433851 27593
$$ packed form
42492B23649O733q415o1173j74374k52763k25912j47486p4334M0379K21225L33856
42481a18615K29881j1804j46574p2786O1439Q7879J7578n2382j07843j83273k29396
42470e25896j41945P7811K78173L01130J38093o5133j39820m2757J02590J27747
42460A09993J53j46544j82277j21473m1326O3271K21203L25272K13411n0765j70378
42449B20540j1731J58687L1293k72173l48464j01457J24593P0148q1229m3896
42439b53689J20138J47824Q448r3965o9667j9921L411N3072R9034L9267p0749
42428c6797m4408J22744K02480P6864r5772j54113j44038j34195n6183J02102
42418a61316J57774J023j64179p6060K04387L80824K97215L8087k43904m06258
$$ plain form
42408 27593 -302406 -372558 -270648 -244746 -330057 -296168 -59806 100190 -57390 -323142
42398 -323142 -301839 17545 250908 156656 -92137 -219067 -182400 -96393 -11435 73502 100096
42387 100096 13791 -114748 -166155 -148110 -170603 -241492 -218358 -29098 164480 148886 -31812
42376 -31812 -93854 123872 443570 578494 476219 315502 241914 259258 338520 453930
42366 453930 502020 362293 91830 -90554 -78098 6682 39419 86018 252448 468177
42356 468177 568364 527088 476465 517476 604631 610548 461126 227988 85739 113344 163914
42345 163914 58311 -112907 -80949 174069 329853 170927 -103495 -196587 -127002 -97462
42335 -97462 -126057 -80625 32532 93004 116486 216079 345917 335927 177850 45374 20555
$$ packed form
42408B7593l29999p0152J01910K5902q5311L3889K36362J59996j57580k65752
42398c23142K1303L19384K33363r4252k48793j26930L6667Q6007Q4958Q4937K6594
42387A00096q6305j28539n1407J8045k2493p0889K3134J89260J93578j5594j80698
42376c1812o2042K17726L19698J34924j02275j60717p3588J7344P9262J15410
42366D53930M8090j39727k70463j82384J2456Q4780L2737M6599J66430K15729
42356D68177J00187m1276n0623M1011Q7155N917j49422k33138j42249K7605N0570
42345A63914j05603j71218L1958K55018J55784j58926k74422r3092O9585K9540
42335i7462k8595M5432J13157O0472K3482R9593J29838r990j58077j32476k4819
$$ plain form
42324 20555 12373 -39388 -78650 -68064 -31589 37221 136006 149925 -13882 -219429 -255453
42313 -255453 -171423 -202341 -357434 -371231 -122630 166927 245224 107679 -114161 -309769
42303 -309769 -356960 -176073 85506 157760 30784 -15750 135588 243020 106053 -125714
42293 -125714 -238093 -270982 -314243 -241596 55031 354473 341312 38507 -260409 -387523
42283 -387523 -382083 -287261 -131820 -36900 -87445 -155248 -76949 67030 86200 6508 -2933
42272 -2933 39143 -35094 -198005 -225153 -66683 59378 2462 -141804 -251369 -330390 -354604
42261 -354604 -202665 122908 394222 427681 322124 291975 364701 376822 216254 -35496
42251 -35496 -187626 -119874 101633 274860 254675 85496 -80990 -146949 -102766 10664
$$ packed form
42324B0555q182n1761l9262J0586L6475O8810R8785J3919j63807k05547l6024
42313b55453Q4030l0918j55093j3797K48601K89557P8297j37545k21840j95608
42303c09769m7191J80887K61579P2254j26976m6534J51338J07432j36967k31767
42293a25714j12379l2889m3261P2647K96627K99442j3161l02805k98916j27114
42283c87523N440R4822J55441R4920n0545o7803P8299J43979J9170p9692r441
42272b933M2076p4237j62911k7148J58470J26061n6916j44266j09565p9021k4214
42261c54604J51939L25573K71314L3459j05557l0149P2726J2121j60568k51750
42251c5496j52130O7752K21507J73227k0185j69179j66486o5959M4183J13430
$$ plain form
42241 10664 88195 7936 -187758 -262752 -92188 108384 55135 -192225 -324514 -229102 -81777
42230 -81777 -16084 23592 78701 97356 112465 244904 456916 538834 414204 226163 59243
42219 59243 -158874 -391238 -421007 -196270 19084 9113 -125189 -229741 -359071 -553408
42209 -553408 -619615 -420635 -171877 -142070 -233108 -181514 -28794 -26980 -167331 -192858 -71411
42198 -71411 -79651 -346456 -640700 -731364 -687698 -679592 -699429 -640664 -495219 -328014 -164837
42187 -164837 -18049 63192 51727 -22238 -139004 -300244 -441278 -450049 -319325 -163542
42177 -163542 -41830 98202 238308 212516 -58086 -367930 -424227 -197379 57519 109447
42167 109447 -37095 -240126 -405318 -508055 -505311 -339582 -62355 120138 21799 -292897
$$ packed form
42241A0664P7531q0259j95694p4994J70564K00572n3249k47360j32289R5412J47325
42230h1777O5693L9676N5109J8655J5109J32439K12012Q1918j24630j88041j66920
42219E9243k18117k32364k9769K24737K15354r971j34302j04552j29330j94337
42209e53408o6207J98980K48758K9807r1038N1594J52720J814j40351k5527J21447
42198g1411q240k66805k94244r0664M3666Q106j9837N8765J45445J67205J63177
42187a64837J46788Q1241j1465p3965j16766j61240j41034q771J30724J55783
42177a63542J21712J40032J40106k5792k70602l09844n6297K26848K54898N1928
42167A09447j46542k03031j65192j02737K744J65729K77227J82493r8339l14696
$$ plain form
42157 -292897 -534245 -483422 -198735 109354 310987 384404 318337 139888 -6586 27484
42147 27484 195137 298327 241930 119195 35252 -15973 -63211 -74298 -19287 72585 154988
42136 154988 185142 104382 -88539 -246416 -201249 -5092 110249 48586 -43925 -38593 -1069
42125 -1069 -18459 -40218 -19225 -32995 -107516 -88498 118867 324505 289833 83422 -34973
42114 -34973 -10316 -19663 -135625 -219518 -174631 -81245 -29426 -6186 5871 -3929 31963 210778
42102 210778 449731 514896 337783 124849 62209 85366 46163 -63423 -177599 -280836
42092 -280836 -321975 -165658 188709 466845 400260 68342 -218832 -302167 -255100 -164583
42082 -164583 -53708 10230 -44857 -140074 -132002 -71546 -164993 -427637 -587273 -433191 -92326
$$ packed form
42157b92897k41348N0823K84687L08089K01633P3417o6067j78449j46474L4070
42147B7484J67653J03190n6397j22735q3943n1225m7238j1087N5011R1872Q2403
42136A54988L0154q0760j92921j57877M5167J96157J15341o1663r2511N332L7524
42125a069j7390k1759K0993j3770p4521J9018K07365K05638l4672k06411j18395
42114c4973K4657r347j15962q3893M4887R3386N1819K3240J2057r800L5892J78815
42102B10778K38953O5165j77113k12934o2640K3157l9203j09586j14176j03237
42092b80836m1139J56317L54367K78136o6585l31918k87174q3335M7067R0517
42082a64583J10875O3938n5087r5217Q072O0456r3447k62644j59636J54082L40865
$$ plain form
42071 -92326 154713 191900 85801 -83668 -262038 -368715 -351475 -267202 -210813 -187666 -130938
42060 -130938 -16275 108371 183540 178290 97915 -7096 -68676 -63811 -16551 62338 173843
42049 173843 274299 318140 362733 505562 693719 750212 646600 575935 653811 726853 633298
42038 633298 489982 511978 666134 741108 695375 693996 818450 966009 1047589 1078270 1047341
42027 1047341 896901 671624 510613 448453 396030 352115 440164 675354 889555 974766
42017 974766 1021155 1112580 1158372 1055597 877657 773273 784234 852502 884494 739922 333500
42006 333500 -145760 -317495 -78549 192449 101811 -250473 -468841 -428781 -349886 -377738
41996 -377738 -417185 -398017 -405249 -460623 -428776 -263625 -139139 -188065 -279593 -226878 -90718
$$ packed form
42071i2326K47039L7187j06099j69469j78370j06677J7240Q4273N6389K3147N6728
42060a30938J14663J24646P5169n250q0375j05011o1580M865M7260P8889J11505
42049A73843J00456M3841M4593J42829J88157N6493j03612p0665P7876P3042r3555
42038F33298j43316K1996J54156P4974m5733j379J24454J47559Q1580L0681l0929
42027A047341j50440k25277j61011o2160n2423m3915Q8049K35190K14201Q5211
42017I74766M6389R1425M5792j02775j77940j04384J0961O8268L1992j44572m06422
42006C33500m79260j71735K38946K70998r0638l52284k18368M0060P8895k7852
41996c77738l9447J9168p232n5374L1847J65151J24486m8926r1528N2715J36160
$$ plain form
41985 -90718 -81945 -221705 -300246 -195872 -65971 -124205 -326510 -417834 -281232 -98355 -84528
41974 -84528 -173542 -120848 116800 296155 229862 36576 -59452 -32233 -9938 -34189 -31706
41963 -31706 32394 123253 213555 261568 176872 -40207 -191248 -96246 122164 167210 -35933
41952 -35933 -275402 -385097 -422073 -471225 -490794 -438745 -369466 -305458 -170337 52726 244188
41941 244188 331325 404188 535203 622629 555713 428275 434201 612160 824784 949042 978016
41930 978016 965817 962100 980685 978516 902263 783874 712640 675406 535377 246879 -14452
41919 -14452 -43817 143242 353412 444688 419527 353005 328928 400373 526406 595018 580110
41908 580110 602553 746207 899579 907882 816117 802089 886661 874959 631014 290056 115972
$$ packed form
41985i0718Q773j39760p8541J04374J29901n8234k02305r1324J36602J82877J3827
41974h4528q9014N2694K37648J79355o6293j93286r6028K7219K2295k4251K483
41963c1706O4100R0859R0302M8013q4696k17079j51041R5002K18410M5046k03143
41952c5933k39469j09695l6976m9152j9569N2049O9279O4008J35121K23063J91462
41941B44188Q7137P2863J31015Q7426o6916j27438N926J77959K12624J24258K8974
41930I78016j2199l717J8585k169p6253j18389p1234l7234j40029k88498k61331
41919a4452k9365J87059K10170R1276k5161o6522k4077P1445J26033O8612j4908
41908E80110K2443J43654J53372Q303r1765j4028Q4572j1702k43945l40958j74084
$$ plain form
41897 115972 201118 381913 450018 390931 362743 452554 550028 526977 446564 454550 522574
41886 522574 491421 359291 300576 348520 302608 72594 -112062 -16785 256313 445414
41876 445414 497910 536474 568481 472668 228862 -37668 -206190 -205893 1094 309069 448229
41865 448229 288428 71230 107280 331971 427879 317450 229374 298671 413200 477080
41855 477080 526001 538696 425851 261042 232514 307056 249802 49457 -21280 113237 160988
41844 160988 -35085 -184416 -8600 299254 395129 305999 278045 305385 192887 -32835
41834 -32835 -145084 -91757 -25407 -3841 38801 69291 11994 -6435 205533 522628 588153
41823 588153 321331 22750 -91907 -144065 -268668 -348121 -245596 -61166 33813 31881
$$ packed form
41897A15972Q5146J80795O8105n9087k8188Q9811R7474k3051q0413P986O8024
41886E22574l1153j32130n8715M7944m5912k30014j84656R5277K73098J89101
41876D45414N2496L8564L2007r5813k43806k66530j68522K97K06987L07975J39160
41865D48229j59801k17198L6050K24691R5908j10429q8076O9297J14529O3880
41855D77080M8921J2695j12845j64809k8528P4542n7254k00345p0737J34517M7751
41844A60988j96073j49331J75816L07854R5875q9130k7954K7340j12498k25722
41834c2835j12249N3327O6350K1566M2642L0490n7297j8429K11968L17095O5525
41823E88153k66822k98581j14657n2158j24603p9453J02525J84430R4979j932
$$ plain form
41813 31881 -8251 -122166 -328658 -499032 -504004 -384821 -252455 -138547 -61123 -87377 -189721
41802 -189721 -192487 -29760 89166 -31614 -246952 -257795 -40121 147305 135549 -2777
41792 -2777 -149529 -255528 -248828 -59379 205349 303307 156449 -45589 -106027 -37304 49533
41781 49533 115278 154684 125593 38435 16322 142040 315419 377104 320768 274680 311044
41770 311044 375611 384537 303074 145038 -23511 -90077 12877 208615 322972 248194 39327
41759 39327 -141529 -156871 -1137 186601 242553 143766 26861 21725 123155 264649 436998
41748 436998 644749 805472 814068 693531 569670 490714 383048 214624 92678 128079
41738 128079 269067 348028 270852 105519 -9674 -7036 66607 123454 125819 87121 8521
$$ packed form
41813C1881m0132j13915k06492j70374m972J19183J32366J13908P7424k6254j02344
41802a89721k766J62727J18926j20780k15338j0843K17674J87426j1756j38326
41792b777j46752j05999O700J89449K64728R7958j46858k02038o0438O8723Q6837
41781D9533O5745L9406k9091q7158k2113J25718J73379O1685n6336m6088L6364
41770C11044O4567Q926q1463j58036j68549o6566J02954J95738J14357p4778k08867
41759C9327j80856j5342J55734J87738N5952r8787j16905n136J01430J41494J72349
41748D36998K07751J60723Q596j20537j23861p8956j07666j68424j21946L5401
41738A28079J40988P8961p7176j65333j15193K638P3643N6847K365l8698p8600
$$ plain form
41727 8521 -115567 -213463 -154364 73534 284825 312078 238759 270294 409699 450027 307941
41716 307941 160684 165949 231264 200479 119551 139004 253148 332305 361162 441035 555686
41705 555686 532341 294884 1988 -153247 -172054 -188344 -259440 -321089 -315584 -271358 -245567
41694 -245567 -242561 -213838 -120840 20983 163044 272976 339343 335687 233228 74994 -17607
41683 -17607 29979 143578 182818 108629 13968 1187 82503 193621 255481 225775 129217
41672 129217 31777 -36080 -99697 -162849 -175751 -133550 -131348 -230798 -332884 -294029 -126015
41661 -126015 33133 103487 90001 -22175 -221549 -337544 -166776 218699 484566 440786
41651 440786 259834 187949 221384 223187 202067 263901 374779 389715 288866 190206 126104
$$ packed form
41727H521j24088r7896N9099K27898K11291K7253p3319L1535J39405M0328j42086
41716C07941j47257N265O5315l0785q0928J9453J14144P9157K8857P9873J14651
41705E55686k3345k37457k92896j55235j8807j6290p1096o1649N505M4226K5791
41694b45567L006K8723R2998J41823J42061J09932O6367l656j02459j58234r2601
41683a7607M7586J13599L9240p4189r4661j2781Q1316J11118O1860k9706r6558
41672A29217r7440o7857o3617o3152j2902M2201K202r9450j02086L8855J68014
41661a26015J59148P0354j3486j12176j99374j15995J70768L85475K65867m3780
41651D40786j80952p1885L3435J803k1120O1834J10878J4936j00849r8660o4102
$$ plain form
41640 126104 -5852 -230788 -404209 -409108 -316317 -255716 -227114 -150017 -40100 -9082 -86345
41629 -86345 -142436 -42531 169894 303767 237361 59029 -42563 -5795 42586 -33240 -195013
41618 -195013 -280346 -209523 -72874 2976 18100 79360 239234 412424 469670 372571 183025
41607 183025 -22332 -187145 -248659 -169451 -21882 41749 -42683 -171381 -207389 -128379 11001
41596 11001 174939 319966 361848 286106 218810 256368 297266 200564 40584 837 58611
41585 58611 19630 -128947 -171142 -35500 55313 -58219 -208409 -174162 -15335 76066 92338
41574 92338 143286 193725 117380 -44492 -104798 2242 152809 219840 182381 77892 -17794
41563 -17794 -2321 130339 232423 197354 133409 190830 308906 324626 247912 205544 178008
$$ packed form
41640A26104j31956k24936j73421m899R2791O0601K8602P7097J09917L1018p7263
41629h6345n6091R9905K12425J33873o6406j78332j01592L6768M8381p5826j61773
41618a95013q5333P0823J36649P5850J5124O1260J59874J73190N7246r7099j89546
41607A83025k05357j64813o1514P9208J47569O3631q4432j28698l6008P9010J39380
41596A1001J63938J45027M1882p5742o7296L7558M0898r6702j59980l9747N7774
41585E8611l8981j48577m2195J35642R0813j13532j50190L4247J58827R1401J6272
41574I2338N0948N0439p6345j61872o0306J07040J50567O7031l7459j04489r5686
41563a7794J5473J32660J02084l5069o3945N7421J18076J5720p6714m2368k7536
$$ plain form
41552 178008 49898 -105409 -69277 166682 348403 320372 199600 120022 43614 -70747
41542 -70747 -130580 -72696 17430 74518 179555 393290 607931 683012 605588 430149 205479
41531 205479 40532 61752 193682 170674 -89571 -308073 -214809 70962 234386 197265
41521 197265 129379 133715 164256 204836 299114 409103 431523 358037 272222 206916 141515
41510 141515 98528 96485 63726 -36516 -64511 109627 334858 336145 121031 -35211 -28016
41499 -28016 -58163 -250491 -432798 -451523 -448589 -608102 -832408 -918801 -900239 -929313 -930681
41488 -930681 -691727 -281525 -52598 -145540 -278675 -180109 11138 -12470 -258068 -465574
41478 -465574 -521364 -559728 -646711 -632951 -427219 -212235 -228708 -467314 -729092 -902856
$$ packed form
41552A78008j28110j55307L6132K35959J81721k8031j20772p9578p6408j14361
41542g0747n9833N7884R0126N7088J05037K13735K14641P5081p7424j75439k24670
41531B05479j64947K1220J31930k3008k60245k18502R3264K85771J63424l7121
41521A97265o7886M336L0541M0580R4278J09989K2420p3486q5815o5306o5401
41510A41515m2987k043l2759j00242k7995J74138K25231J287k15114j56242P195
41499b8016l0147j92328j82307j8725K934j59513k24306q6393J8562k9074j368
41488i30681K38954M10202K28927r2942j33135R8566J91247k3608k45598k07506
41478d65574n5790l8364q6983J3760K05732K14984j6473k38606k61778j73764
$$ plain form
41468 -902856 -1019344 -1087350 -1061640 -980858 -972812 -1068325 -1129187 -1026195 -804719 -615946 -550346
41457 -550346 -589804 -667543 -724947 -745081 -759430 -792161 -801362 -731274 -610724 -516204 -445909
41446 -445909 -345358 -268958 -367402 -647709 -882951 -869306 -672722 -507129 -456066 -446192 -429049
41435 -429049 -434344 -458930 -439430 -354025 -255931 -191204 -159391 -160404 -204770 -264424 -273659 -191348
41423 -191348 -22961 206293 447521 610246 612816 462052 245758 46117 -110407 -226968
41413 -226968 -293619 -277903 -163156 -11867 45956 -38441 -118757 -6533 253581 405981
41403 405981 323546 157499 64333 -26762 -218545 -392718 -376962 -248213 -220188 -300781 -326837
41392 -326837 -302529 -404989 -622146 -687988 -491620 -291140 -356638 -603140 -759669 -741225
$$ packed form
41468i02856j16488o8006K5710Q0782Q046r5513o0862J02992K21476J88773O5600
41457e50346l9458p7739n7404k0134j4349l2731r201P0088J20550R4520P0295
41446d45909J00551P6400r8444k80307k35242J3645J96584J65593N1063R874J7143
41435d29049n295k4586J9500Q5405R8094O4727L1813j013m4366n9654r235Q2311
41423a91348J68387K29254K41228J62725K570j50764k16294j99641j56524j16561
41413b26968o6651J5716J14747J51289N7823q4397q0316J12224K60114J52400
41403D05981q2435j66047r3166r1095j91783j74173J5756J28749K8025q0593k6056
41392c26837K4308j02460k17157o5842J96368K00480o5498k46502j56529J8444
$$ plain form
41382 -741225 -655216 -558084 -420914 -284544 -254565 -336447 -409073 -374118 -247408 -116965 -81070
41371 -81070 -188189 -358954 -418004 -297301 -157708 -198340 -386605 -505670 -450564 -338634
41361 -338634 -312391 -364042 -401591 -383922 -329550 -267078 -235284 -275804 -373978 -449790 -446454 -385657
41349 -385657 -305950 -204577 -85783 -10486 -33944 -129505 -231335 -316481 -383650 -394690 -324515
41338 -324515 -241559 -234631 -265724 -209187 -51974 70980 85053 86404 162783 232421 183005
41327 183005 61550 -25131 -104435 -244990 -341296 -226266 15270 100101 -42018 -167951
41317 -167951 -128712 -110858 -288025 -460057 -305554 130632 468843 467994 244762 41419
41307 41419 -22942 33965 118689 118728 25047 -20223 78855 186940 115263 -76866 -167875 -123804
$$ packed form
41382g41225Q6009R7132J37170J36370K9979q1882p2626L4955J26710J30443L5895
41371h1070j07119j70765n9050J20703J39593m0632j88265j19065N5106J11930
41361c38634K6243n1651l7549J7669N4372O2472L1794m0520r8174p5812L336O0797
41349c85657P9707J01373J18794P5297k3458r5561j01830q5146o7169j1040P0175
41338c24515Q2956O928l1093N6537J57213J22954J4073J351P6379O9638m9416
41327A83005j21455q6681p9304j40555r6306J15030K41536Q4831j42119j25933
41317a67951L9239J7854j77167j72032J54503M36186L38211q49k23232k03343
41307D1419o4361N6907Q4724L9r3681m5270R9078J08085p1677j92129r1009M4071
$$ plain form
41295 -123804 -118680 -201421 -207734 -67505 54375 34832 -16737 17105 52165 -12592 -72397
41284 -72397 24904 217208 314968 265150 153074 10380 -197150 -422101 -541394 -513021
41274 -513021 -408558 -298512 -208500 -166321 -180478 -186063 -122896 -59722 -123417 -290902 -366642
41263 -366642 -215711 65307 273232 339210 367939 448728 510761 423840 205643 29836
41253 29836 -3854 -6998 -115195 -239123 -154661 167552 476757 528706 336704 90965 -54385
41242 -54385 -54620 51196 157342 164609 101438 96016 184389 249127 203663 117411 75576 34036
41230 34036 -75568 -195459 -220396 -152118 -55788 71331 259661 442151 501690 434208 359374
41219 359374 361777 394055 348783 191704 24929 8666 169780 310389 216719 -37312 -142745
$$ packed form
41295a23804N124q2741o313J40229J21880j9543n1569L3842L5060o4757n9805
41284g2397R7301J92304R7760m9818j12076j42694k07530k24951j19293K8373
41274e13021J04463J10046R0012M2179j4157n585O3167O3174o3695j67485p5740
41263c66642J50931K81018K07925O5978K8729Q0789O2033q6921k18197j75807
41253B9836l3690l144j08197j23928Q4462L22213L09205N1949j92002k45739j45350
41242e4385k35J05816J06146P267o3171n422Q8373O4738m5464q6252m1835m1540
41230C4036j09604j19891k4937O8278R6330J27119J88330J82490N9539o7482p4834
41219C59374K403L2278m5272j57079j66775j6263J61114J40609r3670k54031j05433
$$ plain form
41208 -142745 43086 308019 383397 276395 188214 237927 398299 582793 661618 514363
41198 514363 214146 40233 147986 341814 347335 191034 110635 191246 312133 379420
41188 379420 384898 291337 94459 -37545 72821 318534 407567 260205 80901 20458
41178 20458 4814 -50201 -81131 -25261 49591 54494 -10448 -108591 -208158 -247373 -187000 -101320
41166 -101320 -78009 -52256 81897 227425 183253 -11799 -95311 14455 103680 42032 2942
41155 2942 158836 394727 502425 465051 371536 223939 15525 -150595 -205970 -249637 -364931
41144 -364931 -437892 -339030 -153028 -28546 73267 250839 390240 294551 44242 -50415
41134 -50415 110511 269044 184371 -45101 -154589 -63501 88328 178624 239724 362425
$$ packed form
41208a42745J85831K64933P5378j07002q8181M9713J60372J84494P8825j47255
41198E14363l00217j73913J07753J93828N521j56301q0399Q0611J20887O7287
41188C79420N478r3561j96878j32004J10366K45713Q9033j47362j79304o0443
41178B0458j5644n5015l0930N5870P4852M903o4942r8143r9567l9215O0373Q5680
41166a01320K3311K5753J34153J45528m4172j95052q3512J09766Q9225o1648l9090
41155B942J55894K35891J07698l7374r3515j47597k08414j66120n5375m3667j15294
41144c64931p2961R8862J86002J24482J01813J77572J39401r5689k50309r4657
41134e0415J60926J58533q4673k29472j09488R1088J51829R0296O1100J22701
$$ plain form
41124 362425 554721 728931 793202 726649 575338 406611 280705 236795 269809 332796
41114 332796 392492 461530 541117 570382 493073 344468 209283 129533 116737 189554 307203
41103 307203 348181 285075 287264 470933 642254 539946 276448 228251 475626 684522
41093 684522 620642 437005 313776 165024 -77151 -212406 -96320 53442 -2827 -108358
41083 -108358 15997 273416 365627 327089 442488 684565 696354 389398 130244 183676
41073 183676 330667 244932 -29850 -208809 -176517 -48092 57827 121530 170442 256847
41063 256847 426566 622315 695803 591337 430534 343707 317374 296821 340460 545112
41053 545112 858443 1077916 1050673 827186 608007 547616 604518 596955 418678 155474
$$ packed form
41124C62425J92296J74210O4271o6553j51311j68727j25906m3910L3014O2987
41114C32796N9696O9038P9587K9265p7309j48605j35185p9750j2796P2817J17649
41103C07203M0978o3106K189J83669J71321j02308k63498m8197K47375K08896
41093F84522o3880j83637j23229j48752k42175j35255J16086J49762n6269j05531
41083a08358J24355K57419R2211l8538J15399K42077J1789l06956k59154N3432
41073A83676J46991q5735k74782j78959L2292J28425J05919O3703M8912Q6405
41063B56847J69719J95749P3488j04466j60803q6827k6333k0553M3639K04652
41053E45112L13331K19473k7243k23487k19179o0391N6902p563j78277k63204
$$ plain form
41043 155474 -45595 -148694 -193969 -167055 -27674 173376 332579 425475 490322 526457
41033 526457 538317 620978 830647 1011682 953745 713085 569337 647411 793824 857963
41023 857963 867229 862746 801270 725635 803352 1048716 1206410 1084820 841709 757234 857014
41012 857014 944458 899789 766168 621273 530614 559890 683195 746061 655975 527506 498766
41001 498766 508440 430958 333689 378206 521125 550718 415522 285259 248749 169806 -69015
40990 -69015 -350687 -462616 -344745 -116957 58299 86634 -1704 -64353 2998 111711
40980 111711 84896 -66037 -122867 17586 167731 121658 -34344 -62808 54039 92107
40970 92107 -69482 -276801 -338331 -279426 -251667 -289191 -289270 -203596 -128110 -176318 -331271 -455939
$$ packed form
41043A55474k01069j03099m5275K6914J39381K01050J59203R2896O4847L6135
41033E26457J1860Q2661K09669J81035n7937k40660j43748P8074J46413O4139
41023H57963R266m483o1476p5635P7717K45364J57694j21590k43111q4475R9780
41012H57014Q7444m4669j33621j44895r0659K9276J23305O2866r0086j28469k8740
41001D98766R674p7482r7269M4517J42919K9593j35196j30263l6510p8943k38821
40990f9015k81672j11929J17871K27788J75256K8335q8338o2649O7351J08713
40980A11711k6815j50933n6830J40453J50145m6073j56002k8464J16847L8068
40970I2107j61589k07319o1530N8905K7759l7524p9Q5674P5486m8208j54953j24668
$$ plain form
40958 -455939 -424140 -237884 -42698 -12075 -168131 -328362 -298274 -117379 -22036 -129853
40948 -129853 -264539 -182746 101213 341625 379593 294459 217784 135031 -39179 -269609
40938 -269609 -398676 -333075 -159647 -52443 -97089 -227566 -321825 -331730 -302562 -283843 -267849
40927 -267849 -228495 -171300 -113028 -59923 -45961 -128905 -276307 -317257 -120739 202296 394337
40916 394337 352096 219991 168764 196654 187451 61458 -176710 -443487 -582038 -465665
40906 -465665 -163405 84355 124119 42389 -2492 -681 -41881 -125615 -148766 -59086 76411
40895 76411 151907 115711 7947 -56035 3888 96605 27022 -223977 -399711 -282634 -13905
40884 -13905 89425 -13941 -49852 133925 327920 280571 74192 -6019 114701 216115
$$ packed form
40958d55939L1799J86256J95186L0623j56056j60231L0088J80895R5343j07817
40948a29853j34686Q1793K83959K40412L7968q5134p6675q2753j74210k30430
40938b69609j29067O5601J73428J07204m4646j30477r4259r905K9168J8719J5994
40927b67849L9354N7195N8272N3105J3962q2944j47402m0950J96518L23035J92041
40916C94337m2241j32105n1227K7890r203j25993k38168k66777j38551J16373
40906d65665L02260K47760L9764q1730m4881J811m1200q3734k3151Q9680J35497
40895G6411P5496l6196j07764o3982N9923R2717o9583k50999j75734J17077K68729
40884a3905J03330j03366l5911J83777J93995m7349k06379q0211J20720J01414
$$ plain form
40874 216115 102955 -154229 -340055 -338291 -194768 -23572 71156 27797 -136635 -326045
40864 -326045 -445828 -478180 -451913 -373765 -246897 -131009 -102280 -149029 -182893 -166430 -147544
40853 -147544 -142328 -78749 86852 277990 388475 393623 313523 161387 12387 12596 185764
40842 185764 319692 204221 -82104 -290425 -342866 -356134 -372811 -313861 -202296 -174940
40832 -174940 -218303 -148086 59983 175676 77767 -43081 -18865 3946 -159837 -374495
40822 -374495 -380890 -208865 -98912 -107453 -89102 -23481 -58762 -219943 -344336 -350157 -334234
40811 -334234 -351282 -313340 -173484 -16362 99399 214328 332011 388258 405320 486536
40801 486536 598971 566512 361551 192147 187523 207303 106833 -15298 -24346 -22690 -181783
$$ packed form
40874B16115j13160k57184j85826J764J43523J71196R4728m3359j64432j89410
40864c26045j19783l2352K6267P8148J26868J15888K8729m6749l3864J6463J8886
40853a47544N216O3579J65601J91138J10485N148q0100j52136j49000K09J73168
40842A85764J33928j15471k86325k08321n2441j3268j6677N8950J11565K7356
40832a74940m3363P0217K08069J15693r7909j20848K4216K2811j63783k14658
40822c74495o395J72025J09953q541J8351O5621l5281j61181j24393n821J5923
40811c34234j7048L7942J39856J57122J15761J14929J17683N6247J7062Q1216
40801D86536J12435l2459k04961j69404m624J9780j00470j22131r048J656j59093
$$ plain form
40790 -181783 -423157 -507881 -372072 -152755 57423 248110 325992 172426 -111161 -253977
40780 -253977 -170676 -54144 -46557 -40354 77052 190394 144834 13654 -18531 63782 140057
40769 140057 190513 287301 384671 339545 160532 37722 78809 196832 315543 492084
40759 492084 736452 889829 821542 604785 363525 100871 -155126 -207341 57220 381018
40749 381018 394505 123881 -49348 60575 241035 292862 327067 496121 699527 771750
40739 771750 765665 823497 912846 915201 865260 878710 919334 852036 676707 510690 379840
40728 379840 226577 103667 155252 382142 594487 637404 539866 419870 355352 366278
40718 366278 430644 507526 599912 749773 906317 900310 674939 441085 429947 569329 606035
$$ packed form
40790a81783k41374q4724J35809K19317K10178J90687P7882j53566k83587j42816
40780b53977Q3301J16532P587O203J17406J13342m5560j31180l2185Q2313P6275
40769A40057N0456R6788R7370m5126j79013j22810M1087J18023J18711J76541
40759D92084K44368J53377o8287k16757k41260k62654k55997n2215K64561L23798
40749C81018J3487k70624j73229J09923J80460N1827L4205J69054K03406P2223
40739G71750o085N7832Q9349K355m9941J3450M0624o7298j75329j66017j30850
40728C79840j53263j22910N1585K26890K12345M2917r7538j19996o4518J0926
40718C66278O4366P6882R2386J49861J56544o007k25371k33854j1138J39382L6706
$$ plain form
40707 606035 495337 440354 552234 699064 733140 678434 636829 652607 701601 695740 518473
40696 518473 198998 -765 134929 456582 631558 597886 569577 627318 640282 619230
40686 619230 768853 1073673 1200055 999456 778467 834409 1019084 1034108 895849 800887
40676 800887 752431 658134 631449 844636 1187344 1399350 1462183 1541057 1610947 1486066 1198857
40665 1198857 1005455 983816 941107 771477 600810 500488 364655 196291 223409 542579
40655 542579 878421 913582 690173 472677 351577 219629 59095 -1311 78991 180031
40645 180031 250999 437186 847728 1296501 1442024 1191945 832485 688626 757401 787513
40635 787513 643853 422688 224531 23680 -169488 -220348 -84165 53869 25826 -63891
$$ packed form
40707F06035j10698n4983J11880J46830L4076n4706m1605J5778M8994n861j77267
40696E18473l19475j99763J35694L21653J74976l3672k8309N7741J2964k1052
40686F19230J49623L04820J26382k00599k20989N5942J84675J5024j38259r4962
40676H00887m8456r4297k6685K13187L42708K12006O2833P8874O9890j24881k87209
40665A198857j93402k1639m2709j69630j70667j00322j35833j68364K7118L19170
40655E42579L35842L5161k23409k17496j21100j31948j60534o0406Q0302J01040
40645A80031P0968J86187M10542M48773J45523k50079l59460j43859O8775L0112
40635G87513j43660k21165j98157k00851j93168n0860J36183J38034k8043q9717
$$ plain form
40625 -63891 -25377 94131 113080 58328 127062 327220 444370 405580 394066 510151 587382
40614 587382 495420 390655 464138 614249 592952 369903 140589 35391 10805 -1136
40604 -1136 31 35547 129456 312439 537927 655286 599641 534681 625886 729769 550065
40593 550065 112238 -185751 -94475 162193 252291 208207 280820 465932 498480 302359
40583 302359 132961 183739 313530 316544 250388 292404 419824 463506 394645 327147 276715
40572 276715 153541 -69 3146 214358 453812 569412 605684 628984 571079 373828
40562 373828 137802 -7729 -57199 -35187 100504 316365 413000 264965 34744 -49522
40552 -49522 -25315 -84286 -215983 -220698 -46340 146158 263301 370929 461229 384771 124917
$$ packed form
40625f3891L8514J19508J8949n4752O8734K00158J17150l8790j1514J16085P7231
40614E87382r1962j04765P3483J50111k1297k23049k29314j05198k4586j1941
40604a136J167L5516R3909J82983K25488J17359n5645o4960R1205J03883j79704
40593E50065m37827k97989R1276K56668R0098m4084P2613J85112L2548j96121
40583C02359j69398N0778J29791L014o6156M2016J27420M3682o8861o7498n0432
40572B76715j23174j53610L215K11212K39454J15600L6272K3300n7905j97251
40562C73828k36026j45531m9470K2012J35691K15861R6635j48035k30221q4266
40552d9522K4207n8971j31697m715J74358J92498J17143J07628R0300p6458k59854
$$ plain form
40541 124917 -72826 5002 259495 426848 394731 252044 121726 72163 133898 285156
40531 285156 432198 468439 351306 122788 -94337 -137137 58076 341188 474734 395826
40521 395826 252061 174812 157273 180127 284632 443827 519250 452798 369584 378959 399506
40510 399506 308198 149365 53702 42017 53098 88097 181121 289102 350103 391842 449230
40499 449230 449752 340154 254385 356967 553456 569495 329625 59772 -21021 75222 227837
40488 227837 351259 345717 120863 -197725 -275149 36192 445379 569799 428784 364719
40478 364719 535833 749299 812859 790586 809077 826282 752117 649301 634116 665394 607203
40467 607203 456185 343507 326220 328288 301099 312052 443671 696707 993929 1184737
$$ packed form
40541A24917j97743P7828K54493J67353l2117j42687j30318m9563O1735J51258
40531B85156J47042L6241j17133k28518k17125m2800J95213K83112J33546p8908
40521C95826j43765p7249j7539K2854J04505J59195P5423o6452q3214R375K0547
40510C99506r1308j58833r5663j1685J1081L4999R3024J07981O1001M1739N7388
40499D49230N22j09598q5769J02582J96489J6039k39870k69853q0793R6243J52615
40488B27837J23422n542k24854l18588p7424L11341M09187J24420j41015o4065
40478C64719J71114K13466O3560k2273J8491J7205p4165j02816j5185L1278n8191
40467F07203j51018j12678j7287K068k7189J0953J31619K53036K97222J90808
$$ plain form
40457 1184737 1080811 644926 146848 -48191 109280 323739 381291 389828 490847 574921
40447 574921 497504 397857 527429 843231 1037457 951334 727298 550386 461218 450516
40437 450516 528204 643908 711356 751049 839590 897717 740170 393778 143601 159426 282780
40426 282780 315089 315292 435223 633428 770833 867980 1028437 1174745 1110200 847305 652922
40415 652922 707124 887638 972826 923646 862223 864150 894102 916183 955943 1024746 1054637
40404 1054637 970316 805393 686202 692067 791255 940636 1172891 1511151 1849296 2016716
40394 2016716 1951210 1732198 1466435 1226655 1072675 1019139 986448 886989 750732 662756
40384 662756 611024 537370 506421 634724 849356 932221 854465 852651 1089105 1445028 1755740
$$ packed form
40457A184737j03926m35885m98078j95039J57471K14459N7552Q537J01019Q4074
40447E74921p7417r9647J29572L15802J94226q6123k24036j76912q9168j0702
40437D50516P7688J15704O7448L9693Q8541N8127j57547l46392k50177J5825J23354
40426B82780L2309K03J19931J98205J37405R7147J60457J46308o4545k62895j94383
40415F52922N4202J80514Q5188m9180o1423J927K9952K2081L9760O8803K9891
40404A054637q4321j64923j19191N865R9188J49381K32255L38260L38145J67420
40394B016716o5506k19012k65763k39780j53980n3536l2691r9459j36257q7976
40384F62756n1732p3654l0949J28303K14632Q2865p7756j814K36454L55923L10712
$$ plain form
40373 1755740 2031795 2294840 2402833 2246540 1969375 1783163 1682285 1536002 1347595
40364 1347595 1208423 1091037 911982 730611 664818 661917 571158 403782 305111 301540 297346
40353 297346 299047 406079 576755 643061 585599 560305 609348 586525 446055 369312 483674
40342 483674 652782 679571 553978 376307 199407 86316 165511 452489 729551 780488
40332 780488 669054 624632 718254 818236 826456 793293 802568 879982 1021410 1194216 1303277
40321 1303277 1262899 1110877 953885 806677 610633 424167 437558 713137 1030936 1119163
40311 1119163 975239 831807 836157 900456 881167 769507 637573 501839 344912 218310
40301 218310 215690 353675 556452 748510 894121 964615 949827 894012 840271 756420 613792
$$ packed form
40373A755740K76055K63045J07993j56293k77165j86212j00878j46283j88407
40364A347595j39172j17386j79055j81371o5793k901r0759j67376r8671l571m194
40353B97346J701J07032J70676O6306n7462k5294M9043k2823j40470p6743J14362
40342D83674J69108K6789j25593j77671j76900j13091P9195K86978K77062N0937
40332G80488j11434m4422R3622R9982Q220l3163R275P7414J41428J72806J09061
40321A303277m0378j52022j56992j47208j96044j86466J3391K75579L17799Q8227
40311A119163j43924j43432M350O4299j9289j11660j31934j35734j56927j26602
40301B18310k620J37985K02777J92058J45611P0494j4788n5815n3741q3851j42628
$$ plain form
40290 613792 516678 609188 832766 932433 774151 523378 420525 496899 611632 657567
40280 657567 612566 484521 337518 295578 389828 473759 424848 351989 436682 627017 686550
40269 686550 536958 355976 305319 350003 420066 577386 883733 1203095 1294174 1096248
40259 1096248 818133 708156 792870 896572 898222 885165 999571 1199980 1292392 1188555
40249 1188555 1005885 886324 846041 847907 878992 883489 765641 557516 440780 492156 562951
40238 562951 540754 547810 695394 828392 771196 678490 826560 1136039 1241011 1030753
40228 1030753 801099 811724 979892 1106694 1164913 1254815 1467203 1875251 2484689 3125307
40218 3125307 3563539 3766070 3868802 3871134 3608467 3084571 2563237 2221014 1957918 1678182
$$ packed form
40290F13792r7114R2510K23578R9667j58282k50773j02853P6374J14733M5935
40280F57567m5001j28045j47003m1940R4250Q3931m8911p2859Q4693J90335N9533
40269F86550j49592j80982n0657M4684P0063J57320L06347L19362R1079j97926
40259A096248k78115j09977Q4714J03702J650j3057J14406K00409R2412j03837
40249A188555j82670j19561m0283J866L1085M497j17848k08125j16736N1376P0795
40238E62951k2197P056J47584J32998n7196r2706J48070L09479J04972k10258
40228A030753k29654J0625J68168J26802N8219Q9902K12388M08048O09438O40618
40218C125307M38232K02531J02732K332k62667n23896n21334l42223k63096k79736
$$ plain form
40208 1678182 1504698 1551079 1720651 1928891 2310925 2989706 3831965 4673553 5599322 6689501
40198 6689501 7594523 7707957 6812548 5345697 3988823 3141563 2780813 2633039 2413701
40189 2413701 2021906 1588002 1312691 1266683 1376545 1557359 1797360 2146739 2664110 3318530
40179 3318530 3910693 4177889 4032556 3616194 3083529 2463320 1799142 1268353 1020885
40170 1020885 1000691 1052490 1112503 1176891 1192132 1123532 1042956 1001691 904479 669282 427029
40159 427029 373188 471274 500019 382022 279293 343352 535858 740437 911974 1046647
40149 1046647 1102474 1033215 872668 739836 744954 869003 945109 827281 592882 481604
40139 481604 589352 736014 716284 566338 467238 487547 570036 700298 916101 1166906
$$ packed form
40208A678182j73484M6381J69572K08240L82034O78781Q42259Q41588R25769J090179
40198F689501R05022J13434q95409j466851j356874q47260l60750j47774k19338
40189B413701l91795m33904k75311m6008J09862J80814K40001L49379N17371O54420
40179C318530N92163K67196j45333m16362n32665o20209o64178n30789k47468
40170A020885k0194N1799O0013O4388J5241o8600q0576m1265r7212k35197k42253
40159D27029n3841R8086K8745j17997j02729O4059J92506K04579J71537J34673
40149A046647N5827o9259j60547j32832N118J24049P6106j17828k34399j11278
40139D81604J07748J46662j9730j49946r9100K0309Q2489J30262K15803K50805
$$ plain form
40129 1166906 1319120 1327755 1297908 1344681 1456784 1520744 1451669 1298809 1212782 1263537 1317928
40118 1317928 1204632 986845 903726 1006981 1058688 888758 649372 559732 587376 587840 602703
40107 602703 768173 1022308 1156567 1119563 1048847 1025707 1003555 964937 952134 937423 836390
40096 836390 660461 514909 455838 473991 571964 713470 763003 647442 509434 511438 568151
40085 568151 502212 387751 452247 670628 781831 738948 801716 1071139 1254584 1086809
40075 1086809 733146 546778 604836 714557 753877 775389 832061 896933 940857 946597 860615
40064 860615 651107 402780 249590 217997 225525 230166 288775 442561 616268 686246 629278
40053 629278 557622 592763 736919 903350 1041133 1153542 1199936 1095659 864577 686772
$$ packed form
40129A166906J52214Q635k9847M6773J12103O3960o9075j52860q6027N0755N4391
40118A317928j13296k17787q3119J03255N1707j69930k39386q9640K7644M64J4863
40107F02703J65470K54135J34259l7004p0716k3140k2152l8618j2803j4711j01033
40096H36390j75929j45552n9071J8153R7973J41506M9533j15561j38008K004N6713
40085E68151o5939j14461O4496K18381J11203m2883O2768K69423J83445j67775
40075A086809l53663j86368N8058J09721L9320K1512N6672O4872M3924N740q5982
40064H60615k09508k48327j53190l1593P528M641N8609J53786J73707O9978n6968
40053F29278p1656L5141J44156J66431J37783J12409M6394j04277k31082j77805
$$ plain form
40043 686772 698239 813995 850562 770951 709848 796132 1034720 1320806 1501071 1483648 1353698
40032 1353698 1290768 1304877 1196294 890918 640951 695938 923587 1011890 940758 953768
40022 953768 1112204 1212030 1182864 1247293 1555707 1915624 2050712 1954341 1825699 1773729
40012 1773729 1729031 1586334 1336199 1088069 994724 1101844 1276342 1363225 1389604 1497653
40002 1497653 1694057 1811105 1732022 1525274 1331283 1223047 1189423 1162483 1072097 954174
39992 954174 946396 1075516 1152139 1031930 864031 864498 948535 861718 612000 461373 499349
39981 499349 543499 500065 510495 659954 824018 899569 929762 917154 782222 599754 592244
39970 592244 766066 836324 664995 499499 586455 794328 841978 712458 619595 696243
$$ packed form
40043F86772J1467J15756L6567p9611o1103Q6284K38588K86086J80265j7423j29950
40032A353698o2930J4109j08583l05376k49967N4987K27649Q8303p1132J3010
40022I53768J58436R9826k9166O4429L08414L59917J35088r6371j28642n1970
40012A773729m4698j42697k50135k48130r3345J07120J74498Q6883K6379J08049
40002A497653J96404J17048p9083k06748j93991j08236l3624k6940r0386j17923
39992I54174p778J29120P6623j20209j67899M67Q4037q6817k49718j50627L7976
39981D99349M4150m3434J0430J49459J64064P5551L0193j2608j34932j82468p510
39970E92244J73822P0258j71329j65496Q6956K07873M7650j29520r2863P6648
$$ plain form
39960 696243 894362 1084869 1128131 968643 760882 760724 1011474 1300835 1487870 1658152
39950 1658152 1877731 2044074 2099294 2140784 2185539 2086354 1840123 1705846 1820126 1962371
39940 1962371 1930732 1896536 2121822 2554092 2991977 3455632 4073049 4734012 5167465 5291822
39930 5291822 5247416 5163900 5104263 5126665 5184248 5079514 4740141 4427459 4450101 4779787
39920 4779787 5161520 5476731 5767830 6030979 6242994 6509719 6961901 7584962 8324444
39911 8324444 9187327 9996925 10249533 9585610 8331706 7239563 6713320 6578140 6543533
39902 6543533 6529962 6509785 6387631 6199008 6211295 6670807 7533955 8490829 9170062 9342560
39892 9342560 9055483 8577921 8139070 7752741 7340003 6888519 6380144 5723366 4942773
$$ packed form
39960F96243J98119J90507M3262j59488k07761j58K50750K89361J87035J70282
39950A658152K19579J66343N5220M1490M4755r9185k46231j34277J14280J42245
39940A962371l1639l4196K25286M32270M37885M63655O17417O60963M33453J24357
39930E291822m4406q3516n9637K2402N7583j04734l39373l12682K2642L29686
39920D779787L81733L15211K91099K63149K12015K66725M52182O23061P39482
39911H324444Q62883Q09598K52608o63923j253904j092143n26243j35180l4607
39902F543533j3571k0177j22154j88623J2287M59512Q63148R56874O79233J72498
39892I342560k87077m77562m38851l86329m12738m51484n08375o56778p80593
$$ plain form
39883 4942773 4312428 4098478 4252572 4526653 4776691 4970047 5028787 4907350 4748200 4739372
39873 4739372 4865453 4965312 4950264 4805133 4490993 4023731 3532163 3085178 2621757 2197725
39863 2197725 2051774 2202394 2263982 1984511 1697882 1841459 2256155 2441568 2338321 2319645
39853 2319645 2478655 2491197 2235424 2013646 2011071 1995194 1758751 1483517 1428914 1543390
39843 1543390 1605579 1540347 1410770 1260423 1113121 1012071 964678 936099 919722 920029 906187
39832 906187 903394 1034425 1297384 1430697 1245774 981976 1035186 1407544 1733448 1795022
39822 1795022 1693604 1556782 1418238 1373258 1507691 1661725 1603500 1461237 1635115 2214073
39812 2214073 2797847 2986447 2780497 2433848 2167533 2095769 2208443 2361894 2435082 2465111
$$ packed form
39883D942773o30345k13950J54094K74081K50038J93356N8740j21437j59150q828
39873D739372J26081R9859j5048j45131l14140m67262m91568m46985m63421m24032
39863B197725j45951J50620O1588k79471k86629J43577M14696J85413j03247j8676
39853B319645J59010J2542k55773k21778k575j5877k36443k75234n4603J14476
39843A543390O2189o5232j29577j50347j47302j01050m7393k8579j6377L07j3842
39832I06187k793J31031K62959J33313j84923k63798N3210L72358L25904O1574
39822A795022j01418j36822j38544m4980J34433J54034n8225j42263J73878N78958
39812B214073N83774J88600k05950l46649k66315p1764J12674J53451P3188L0029
$$ plain form
39802 2465111 2490518 2408389 2202738 2109089 2246058 2311886 2047681 1775729 1971743 2487856
39792 2487856 2809444 2987104 3617181 4818699 5881551 6135162 5646967 4873431 4107797
39783 4107797 3481786 3074466 2787428 2437801 2102358 2046648 2272172 2510551 2668796 2847759
39773 2847759 2944091 2749147 2443948 2438380 2711440 2925151 3197703 4018341 5266353 6094563
39763 6094563 6044521 5552695 5069940 4441098 3546282 2817296 2599100 2594976 2442978 2305739
39753 2305739 2416985 2567842 2527758 2493129 2653563 2775216 2654656 2525466 2599704 2688262
39743 2688262 2675339 2834810 3242388 3436229 3142876 2779013 2725380 2688058 2348883 2061256
39733 2061256 2244157 2612990 2705185 2696754 2981107 3352799 3340670 3022538 2831591 2845559
$$ packed form
39802B465111K5407q2129k05651r3649J36969O5828k64205k71952J96014N16113
39792B487856L21588J77660O30077J201518J062852K53611m88195p73536p65634
39783D107797o26011m07320k87038l49627l35443n5710K25524K38379J58245J78963
39773B847759R6332j94944l05199n568K73060K13711K72552Q20638J248012Q28210
39763F094563n0042m91826m82755o28842q94816p28986k18196m124j51998j37239
39753B305739J11246J50857m0084l4629J60434J21653j20560j29190P4238Q8558
39743B688262j2923J59471M07578J93841k93353l63863n3633l7322l39175k87627
39733B061256J82901L68833R2195q431K84353L71692j2129l18132j90947J3968
$$ plain form
39723 2845559 2873390 2933339 3079414 3105351 2964311 3073277 3647077 4194963 4270466 4218634
39713 4218634 4542761 5071500 5470287 6044250 7244547 8836623 10287069 11469170 12307678
39704 12307678 12434003 12049868 12366605 14162600 16687617 19162327 22481403 27996870
39696 27996870 35683923 45711608 61030902 84867000 114108200 137516034 143320072
39689 143320072 129098645 103648201 79455437 63769318 56128233 52571228 50472940
39682 50472940 49124205 47692230 45290960 43141004 44062267 48754657 54969388 61852359
39674 61852359 72389975 89482265 113454455 147781833 202644102 282460705 367646149
39667 367646149 418396170 405819884 338543002 254212399 186454637 144005036 118162457
$$ packed form
39723B845559K7831N9949J46075K5937j41040J08966N73800N47886P5503n1832
39713D218634L24127N28739L98787N73963J200297J592076J450446J182101Q38508
39704A2307678J26325l84135L16737J795995K525017K474710L319076N515467
39696B7996870P687053J0027685J5319294K3836098K9241200K3407834N804038
39689A43320072j4221427k5450444k4192764j5686119p641085l557005k098288
39682E0472940j348735j431975k401270k149956R21263M692390O214731O882971
39674F1852359J0537616J7092290K3972190L4327378N4862269P9816603Q5185444
39667C67646149N0750021j2576286o7276882q4330603o7757762m2449601k5842579
$$ plain form
39660 118162457 100374006 88149281 80110212 73499012 67531740 64780929 67059104 72240573
39652 72240573 77375148 83374704 93891963 110858070 135749548 175641501 240217596
39645 240217596 324788066 398870978 422630034 381007512 298310461 215578747 156901643
39638 156901643 120483963 95459679 77004142 64909658 57144011 50900916 46500909
39631 46500909 45650419 47294667 48444038 48206367 48290269 50047550 53730414 61032636 75715471
39622 75715471 99254055 125738733 142903672 140519128 119018689 89417325 64000192
39615 64000192 47417195 36889676 28837431 22647186 18708394 16193501 14174684 12988110
39607 12988110 13035433 13431643 13018537 11789287 10340696 8780795 7090550 5765008 5163010
$$ packed form
39660A18162457j7788451j2224725q039069o611200n967272k750811K278175N181469
39652G2240573N134575N999556J0517259J6966107K4891478L9891953O4576095
39645B40217596Q4570470P4082912K3759056m1622522q2697051q2731714n8677104
39638A56901643l6417680k5024284j8455537j2094484p765647o243095m400007
39631D6500909q50490J644248J149371k37671Q3902J757281L682864P302222J4682835
39622G5715471K3538584K6484678J7164939k384544k1500439k9601364k5417133
39615F4000192j6582997j0527519q052245o190245l938792k514893k018817j186574
39607A2988110M7323L96210m13106j229250j448591j559901j690245j325542o01998
$$ plain form
39598 5163010 4832271 4248891 3628560 3330276 3108928 2664918 2316250 2407223 2600848 2439266
39588 2439266 2096281 1941203 1861882 1633431 1463338 1569241 1683291 1537324 1373442 1453830
39578 1453830 1567020 1532305 1646629 2085552 2425482 2348458 2259207 2572212 2935449 2843414
39568 2843414 2511535 2422540 2457466 2214328 1802804 1599664 1551657 1405456 1298700 1449087
39558 1449087 1586973 1380985 1110785 1222682 1524606 1550500 1452381 1768105 2505798 3219425
39548 3219425 3843232 4671910 5556038 5859896 5305831 4290131 3309637 2563929 2122869
39539 2122869 2001986 2031316 2016902 2001676 2072423 2076656 1878104 1676340 1686066 1742095 1633919
39528 1633919 1553362 1759115 2106689 2413594 2944520 3921603 4850376 5013198 4428659 3678671
$$ packed form
39598E163010l30739n83380o20331k98284k21348m44010l48668R0973J93625j61582
39588B439266l42985j55078p9321k28451j70093J05903J14050j45967j63882Q0388
39578A453830J13190l4715J14324M38923L39930p7024q9251L13005L63237r2035
39568B843414l31879q8995L4926k43138m11524k03140m8007j46201j06756J50387
39558A449087J37886k05988k70200J11897L01924K5894r8119L15724P37693P13627
39548C219425O23807Q28678Q84128L03858n54065j015700r80494p45708m41060
39539B122869j20883K9330j4414j5226P0747M233j98552k01764R726N6029j08176
39528A633919q0557K05753L47574L06905N30926R77083R28773J62822n84539p49988
$$ plain form
39518 3678671 3010437 2302078 1698469 1495309 1504294 1300246 1017014 1121503 1470131 1445774
39508 1445774 1053625 981833 1414531 1664282 1285521 768038 733687 1105700 1485710 1781566
39498 1781566 2033102 2094309 1913749 1759726 1810085 1846454 1656486 1419620 1407545 1582531
39488 1582531 1737855 1781447 1690724 1447639 1173014 1062326 1079614 997403 796585 684016
39478 684016 675342 578382 450370 583692 917920 999686 733956 636221 1037636 1541508
39468 1541508 1644444 1456224 1374804 1416368 1343621 1201240 1252534 1515617 1738204 1745705
39458 1745705 1540678 1181738 812740 672780 834809 1058844 1106756 1054075 1098432 1234255
39448 1234255 1332919 1386508 1454882 1504889 1493837 1483693 1510086 1481897 1357039 1254047 1249780
$$ packed form
39518C678671o68234p08359o03609k03160Q985k04048k83232J04489L48628k4357
39508A445774l92149p1792M32698K49751l78761n17483l4351L72013L80010K95856
39498A781566K51536O1207j80560j54023N0359L6369j89968k36866j2075J74986
39488A582531J55324M3592r0723k43085k74625j10688J7288q2211k00818j12569
39478F84016q674r6960j28012J33322L34228Q1766k65730r7735M01415N03872
39468A541508J02936j88220q1420M1564p2747j42381N1294K63083K22587P501
39458A745705k05027l58940l68998j39960J62029K24035M7912n2681M4357J35823
39448A234255R8664N3589O8374N0007j1052j0144K6393k8189j24858j02992m267
$$ plain form
39437 1249780 1252348 1214726 1258545 1420689 1503777 1372687 1181218 1099232 1043128 918033 904841
39426 904841 1206224 1660549 1909644 1862753 1738037 1715132 1776948 1841109 1848607 1764497 1639842
39415 1639842 1603316 1669693 1672657 1521088 1374876 1400124 1505097 1527323 1546327 1758479 2111241
39404 2111241 2308736 2184225 1888007 1687796 1703808 1852407 1979993 2052311 2208228 2550242
39394 2550242 2908630 2984526 2749943 2499451 2440972 2460169 2389912 2270453 2189925 2094232
39384 2094232 1942589 1852527 1893214 1916746 1793846 1638604 1592871 1572143 1460039 1381201
39374 1381201 1514652 1775395 1953510 2049018 2180372 2255413 2052367 1607992 1235778 1127079
39364 1127079 1165110 1168723 1116910 1082407 1104735 1178151 1252473 1233988 1091721 955237 995312
$$ packed form
39437A249780K568l7622M3819J62144Q3088j31090j91469q1986n6104j25095j3192
39426I04841L01383M54325K49095m6891j24716k2905O1816O4161P498q4110j24655
39415A639842l6526O6377K964j51569j46212K5248J04973K2226J9004K12152L52762
39404B111241J97495j24511k96218k00211J6012J48599J27586P2318J55917L42014
39394B550242L58388P5896k34583k50492n8479J9197p0257j19459q0528r5693
39384B094232j51643r0062M0687K3532j22900j55242m5733k0728j12104p8838
39374A381201J33451K60743J78115R5508J31354P5041k03046m44375l72214j08699
39364A127079L8031L613n1813l4503K2328P3416P4322j8485j42267j36484M0075
$$ plain form
39353 995312 1207040 1403469 1421072 1263341 1062330 958364 994081 1090503 1155282 1197149
39343 1197149 1251166 1237355 1060219 828708 755828 825440 822344 737143 813825 1076039 1171797
39332 1171797 917317 652437 737768 984984 964849 666718 443457 442108 503053 550119
39322 550119 675154 838844 848847 674871 490061 371586 230398 57947 -19149 40257
39312 40257 146015 257502 388376 452500 352621 205527 215935 333644 313763 126677
39302 126677 14377 97501 218317 246190 255470 296643 259585 107568 19578 132071 307369
39291 307369 320954 165739 35339 73967 235463 358032 353408 342744 538233 919356
39281 919356 1158893 1031049 750980 666540 740868 668719 429232 320286 425197 475497
$$ packed form
39353I95312K11728J96429J7603j57731k01011j03966L5717R6422O4779M1867
39343A197149N4017j3811j77136k31511p2880O9612l096q5201P6682K62214R5758
39332A171797k54480k64880Q5331K47216k0135k98131k23261j349O0945M7066
39322E50119J25035J63690J0003j73976j84810j18475j41188j72451p7096N9406
39312D0257J05758J11487J30874O4124r9879j47094J0408J17709j9881j87086
39302A26677j12300Q3124J20816K7873R280M1173l7058j52017q7990J12493J75298
39291C07369J3585j55215j30400L8628J61496J22569m624j0664J95489L81123
39281I19356K39537j27844k80069q4440P4328p2149k39487j08946J04911N0300
$$ plain form
39271 475497 364681 375548 669589 923191 794101 477419 430894 705464 908964 777975
39261 777975 469864 271685 274424 399632 562315 710477 796993 794288 728094 681433 742418
39250 742418 895394 979164 855815 631492 573466 757771 947138 912166 734112 654992
39240 654992 738102 840659 859177 833291 820751 820467 846952 968101 1217449 1527061 1779687
39229 1779687 1892946 1846849 1681130 1492444 1391978 1412399 1459999 1411454 1282260 1240469
39219 1240469 1384232 1556194 1508523 1251368 1072231 1145888 1303016 1325029 1308515 1515850
39209 1515850 1946511 2303533 2385238 2288601 2178771 2056317 1850719 1605185 1450494 1450562
39199 1450562 1541845 1602137 1563920 1479604 1448150 1459391 1401504 1281502 1300524 1573062 1899987
$$ packed form
39271D75497j10816J0867K94041K53602j29090l16682m6525K74570K03500j30989
39261G77975l08111j98179K739J25208J62683J48162Q6516k705o6194m6661O0985
39250G42418J52976Q3770j23349k24323n8026J84305J89367l4972j78054p9120
39240F54992Q3110J02557J8518k5886j2540k84K6485J21149K49348L09612K52626
39229A779687J13259m6097j65719j88686j00466K0421M7600m8545j29194m1791
39219A240469J43763J71962m7671k57155j79137P3657J57128K2013j6514K07335
39209A515850M30661L57022Q1705r6637j09830j22454k05598k45534j54691O8
39199A450562R1283O0292l8217q4316l1454J1241n7887j20002J9022K72538L26925
$$ plain form
39188 1899987 2013488 1943850 1910753 1930779 1816420 1546382 1339715 1317470 1363868 1391703
39178 1391703 1472587 1596902 1571416 1320177 1070800 1054863 1187295 1224849 1109838 976126
39168 976126 917377 931872 1033408 1236981 1436370 1434949 1152617 756253 541246 655928
39158 655928 938936 1082988 985358 841890 834625 872736 782346 603019 484006 411074 296738
39147 296738 243017 411039 692115 832785 837399 884898 891644 610514 196167 152821 558431
39136 558431 849609 647360 328318 413815 794519 997351 911123 773922 655033 434621
39126 434621 192865 177873 409257 661102 812219 913459 958351 889102 793038 808321
39116 808321 867854 802534 652655 606135 672316 695942 663201 711928 847820 920119 884594
$$ packed form
39188A899987J13501o9638l3097K0026j14359k70038k06667k2245M6398K7835
39178A391703Q0884J24315k5486k51239k49377j5937J32432L7554j15011j33712
39168I76126n8749J4495J01536K03573J99389j421k82332l96364k15007J14682
39158F55928K83008J44052r7630j43468p265L8111r0390j79327j19013p2932j14336
39147B96738n3721J68022K81076J40670M614M7499O746k81130m14347m3346M05610
39136E58431K91178k02249l19042Q5497L80704K02832q6228j37201j18889k20412
39126D34621k41756j4992K31384K51845J51117J01240M4892o9249r6064J5283
39116H08321N9533o5320j49879m6520O6181K3626l2741M8727J35892P2299l5525
$$ plain form
39105 884594 845245 836746 804075 790961 905582 1093246 1168199 1072074 894207 667494 375914
39094 375914 134054 109292 273064 452422 589963 717319 745205 576122 371054 372898
39084 372898 496580 455564 283933 318829 609487 780153 621142 406914 427015 570606
39074 570606 615265 597097 622473 594411 411826 211624 149740 159149 170700 319668 632056
39063 632056 758735 412279 -103228 -223198 100395 376757 320953 191933 287855 487470
39053 487470 503953 332770 203437 224646 289582 279550 204458 146132 154566 208539 242904
39042 242904 222169 189173 204866 244996 218523 100519 -17677 -36144 53891 210247 418446
39031 418446 664582 858033 868849 684538 485359 490885 718343 950596 979288 827480
$$ packed form
39105H84594l9349q499l2671j3114J14621J87664P4953r6125j77867k26713k91580
39094C75914k41860k4762J63772J79358J37541J27356K7886j69083k05068J844
39084C72898J23682m1016j71631L4896K90658J70666j59011k14228K0101J43591
39074E70606M4659j8168K5376k8062j82585k00202o1884R409J1551J48968L12388
39063F32056J26679l46456n15507j19970L23593K76362n5804j29020R5922J99615
39053D87470J6483j71183j29333K1209O4936j0032p5092n8326Q434N3973L4365
39042B42904k0735l2996J5693M0130k6473j18004j18196j8467R0035J56356K08199
39031D18446K46136J93451J0816j84311j99179N526K27458K32253K8692j51808
$$ plain form
39021 827480 674798 613032 569604 454210 275869 100326 -13222 -4571 165949 437117
39011 437117 654007 705670 616229 483614 389287 381342 462406 557165 566988 497690 464361
39000 464361 533719 635221 663497 586539 414277 160589 -99064 -229100 -181520 -69266
38990 -69266 -7743 43766 185609 388648 518238 512332 427319 328288 239615 195112 228699
38979 228699 298545 311477 250957 206016 240853 303828 312389 275004 266046 304481 327168 297280
38967 297280 285193 393754 618822 833876 925205 906307 881744 931931 1052567 1168253
38957 1168253 1180587 1049445 862168 769561 806448 835668 732766 559397 467446 499866
38947 499866 604264 783964 1073988 1377321 1494016 1361572 1148582 1067853 1187207 1428911
$$ packed form
39021H27480j52682o1766m3428j15394j78341j75543j13548Q651J70520K71168
39011D37117K16890N1663q9441j32615r4327p945Q1064R4759R823o9298l3329
39000D64361O9358J01502K8276p6958j72262k53688k59653j30036M7580J12254
38990f9266O1523N1509J41843K03039J29590n906q5013r9031q8673m4503L3587
38979B28699O9846J2932o0520m4941L4837O2975Q561l7385q958L8435K2687k9888
38967B97280j2087J08561K25068K15054R1329j8898k4563N0187J20636J15686
38957A168253J2334j31142j87277r2607L6887K9220j02902j73369r1951L2420
38947D99866J04398J79700K90024L03333J16695j32444k12990q0729J19354K41704
$$ plain form
38937 1428911 1633632 1615388 1304021 880170 634888 647207 730036 722411 657395 582872 439161
38926 439161 256762 266293 584494 930595 928088 641750 541168 885251 1376402 1547546
38916 1547546 1334480 1096720 1126658 1304030 1292545 983479 621373 479241 533417 563908
38906 563908 492663 447408 497626 525148 430746 301058 258518 284560 314730 372122 456418
38895 456418 439056 274294 208507 517300 1060018 1364822 1209517 879113 744698 800246
38885 800246 778212 565330 298738 124640 60758 87646 199624 323690 327890 185179
38875 185179 34780 4383 48578 50294 9245 3068 1228 -116909 -329412 -421949 -268173
38864 -268173 -32097 47635 -10349 22055 239041 474071 530849 395309 175054 -51383
$$ packed form
38937A428911K04721j8244l11367m23851k45282J2319Q2829p625o5016p4523j43711
38926D39161j82399R531L18201L46101k507k86338j00582L44083M91151J71144
38916A547546k13066k37760K9938J77372j1485l09066l62106j42132N4176L0491
38906E63908p1245m5255N0218K7522r4402j29688m2540K6042L0170N7392Q4296
38895D56418j7362j64762o5787L08793N42718L04804j55305l30404j34415N5548
38885H00246k2034k12882k66592j74098o3882K6888J11978J24066M200j42711
38875A85179j50399l0397M4195J716m1049o177j840j18137k12503r2537J53776
38864b68173K36076P9732n7984L2404K16986K35030N6778j35540k20255k26437
$$ plain form
38854 -51383 -259209 -424773 -500909 -420956 -151162 202725 404774 329792 150664 126821
38844 126821 236174 219051 -2879 -186348 -122681 82686 210706 226848 235405 284304 360318
38833 360318 455707 510212 410830 175825 10207 50870 194336 302191 398730 495189 421324
38822 421324 90868 -221051 -178610 117929 257689 114914 -14429 84466 238317 225175
38812 225175 148645 247400 485162 572912 374188 101331 44016 199297 283755 124743
38802 124743 -78171 -15349 263198 361352 84320 -256223 -250117 81630 380763 431456
38792 431456 295890 77920 -161673 -297770 -231268 -90502 -93760 -214106 -240660 -171579
38782 -171579 -240440 -495059 -663997 -567372 -377778 -302054 -250108 -35628 275204 445010
$$ packed form
38854e1383k07826j65564p6136P9953K69794L53887K02049p4982j79128k3843
38844A26821J09353j7123k21930j83469O3667K05367J28020J6142Q557M8899P6014
38833C60318R5389N4505r9382k35005j65618M0663J43466J07855R6539R6459p3865
38822D21324l30456l11919M2441K96539J39760j42775j29343R8895J53851j3142
38812B25175p6530R8755K37762Q7750j98724k72857n7315J55281Q4458j59012
38802A24743k02914O2822K78547R8154k77032l40543O106L31747K99133N0693
38792D31456j35566k17970k39593j36097O6502J40766l258j20346k6554O9081
38782a71579o8861k54619j68938R6625J89594P5724N1946K14480L10832J69806
$$ plain form
38772 445010 392009 247844 158668 175399 278344 385319 388616 280968 187190 196749 241340
38761 241340 213841 131092 104180 211291 444576 702624 810649 663017 383971 225340
38751 225340 269550 367715 393020 377264 354434 283707 214667 304545 539624 654328 490856
38740 490856 237955 128373 103076 4038 -88422 3390 203954 276356 199959 172550 264734
38729 264734 342208 333818 323172 342429 300766 164259 14004 -109930 -236774 -311264 -211997
38718 -211997 28408 214868 262767 290789 367928 366240 187068 -31276 -82532 40759 186188
38707 186188 261380 283328 272020 228902 196741 229235 300136 323784 274359 224852 251239
38696 251239 335110 382672 329744 210025 106307 46722 -7622 -65254 -65031 18603 102169
$$ packed form
38772D45010n3001j44165q9176J6731J02945J06975L297j07648r3778R559M4591
38761B41340k7499q2749k6912J07111K33285K58048J08025j47632k79046j58631
38751B25340M4210R8165K5305j5756k2830p0727o9040Q9878K35079J14704j63472
38740D90856k52901j09582k5297r9038r2460R1812K00564P2402p6397k7409R2184
38729B64734P7474q390j0646J9257m1663j36507j50255j23934j26844p4490R9267
38718b11997K40405J86460M7899K8022P7139j688j79172k18344n1256J23291J45429
38707A86188P5192K1948j1308m3118l2161L2494P0901K3648m9425m9507K6387
38696B51239Q3871M7562n2928j19719j03718n9585n4344n7632K23Q3634Q3566
$$ plain form
38685 102169 108202 99161 188941 350873 433488 368423 252976 210094 263147 367287 470145
38674 470145 515291 472206 394153 374735 425708 465543 437718 365694 289520 234733 243672 336210
38662 336210 433858 435335 379933 411683 560176 695482 733930 728693 697813 550979 308877
38651 308877 215505 437894 770052 854942 649434 455793 498461 675039 765141 697592
38641 697592 527009 300361 69915 -56517 -5326 159635 310279 398255 454127 487351
38631 487351 483652 481843 542973 624393 590168 406215 242208 287146 507985 695034 732775
38620 732775 711532 751148 837385 900402 942934 975859 908999 662207 360619 258862 445617
38609 445617 763432 1065123 1405170 1890232 2462255 2950999 3263785 3406430 3382528 3207718
$$ packed form
38685A02169O033r041Q9780J61932Q2615o5065j15447m2882N3053J04140J02858
38674D70145M5146m3085p8053j9418N0973L9835k7825p2024p6174n4787Q939R2538
38662C36210R7648J477n5402L1750J48493J35306L8448n237l0880j46834k42102
38651C08877r3372K22389L32158Q4890k05508j93641M2668J76578R0102o7549
38641F97592j70583k26648k30446j26432N1191J64961J50644Q7976N5872L3224
38631D87351l699j809O1130Q1420l4225j83953j64007M4938K20839J87049L7741
38620G32775k1243L9616Q6237O3017M2532L2925o6860k46792l01588j01757J86755
38609D45617L17815L01691L40047M85062N72023M88744L12786J42645k3902j74810
$$ plain form
38599 3207718 2989634 2852804 2780542 2654425 2469244 2387813 2533171 2828292 3121555 3410415
38589 3410415 3847607 4520742 5274354 5783071 5820348 5460859 4990715 4608808 4282104 3942079
38579 3942079 3717417 3810652 4168091 4467523 4510429 4477588 4674992 5123672 5532883 5622651
38569 5622651 5345415 4821944 4194856 3567253 2995437 2508333 2163482 2051887 2185211
38560 2185211 2419869 2587403 2680656 2818988 3054211 3322390 3565557 3752073 3761121 3421246
38550 3421246 2755612 2061087 1623197 1425627 1245068 970321 713771 638032 775180 1011220
38540 1011220 1170574 1120343 865843 563464 400796 446440 615320 755215 760329 643946
38530 643946 524344 508824 583470 649588 644078 555714 368372 123795 18402 238067 644987
$$ packed form
38599C207718k18084j36830p2262j26117j85181q1431J45358K95121K93263K88860
38589C410415M37192O73135P53612N08717L7277l59489m70144l81907l26704l40025
38579C942079k24662R3235L57439K99432M2906l2841J97404M48680M09211Q9768
38569E622651k77236n23471o27088o27603n71816m87104l44851j11595J33324
38560B185211K34658J67534R3253J38332K35223K68179K43167J86516R048l39875
38550C421246o65634o94525m37890j97570j80559k74747k56550p5739J37148K36040
38540A011220J59354n0231k54500l02379j62668M5644J68880J39895N114j16383
38530F43946j19602j5520P4646O6118n510q8364j87342k44577j05393K19665M06920
$$ plain form
38519 644987 836280 626592 287229 170720 287813 428550 504233 531454 443919 207675
38509 207675 11092 47728 202153 255027 296278 554878 876605 830024 389264 48146
38499 48146 99357 240509 135852 -40881 42427 314811 479678 512876 578979 615726 420444
38488 420444 82038 -55521 136582 442738 638632 677236 555380 290195 51278 40500
38478 40500 192088 232443 76059 -76712 -75821 -7408 16974 12995 -17540 -144705 -319449
38467 -319449 -342543 -153264 41009 54360 -37407 -82357 -96350 -148389 -158466 -21495 160787
38456 160787 183497 40710 -57071 28682 202206 283104 211069 67316 -38948 -73449 -95819
38445 -95819 -179862 -301502 -339792 -228618 -74447 -59216 -223997 -400958 -388458 -169303
$$ packed form
38519F44987J91293k09688l39363j16509J17093J40737P5683K7221q7535k36244
38509B07675j96583L6636J54425N2874M1251K58600L21727m6581m40760l41118
38499D8146N1211J41152j04657j76733Q3308K72384J64867L3198O6103L6747j95282
38488D20444l38406j37559J92103L06156J95894L8604j21856k65185k38917j0778
38478D0500J51588M0355j56384j52771Q91O8413K4382l979l0535j27165j74744
38467c19449k3094J89279J94273J3351r1767m4950j3993n2039j0077J36971J82282
38456A60787K2710j42787r7781Q5753J73524Q0898p2035j43753j06264l4501k2370
38445i5819q4043j21640l8290J11174J54171J5231j64781j76961J2500K19155
$$ plain form
38435 -169303 86290 238466 338281 509021 713376 767706 612874 433947 427122 559138
38425 559138 658889 638788 502450 248139 -66649 -256346 -202724 -64125 -87448 -253496
38415 -253496 -327394 -234773 -141743 -147498 -148773 -62521 53052 167214 332185 487831 453354
38404 453354 229832 80644 174561 370771 504164 637658 826034 868426 588862 212029
38394 212029 144369 434827 725540 729429 523618 350839 329145 405827 460478 415936 328771
38383 328771 349964 513436 630623 520248 276972 156098 237255 372952 446027 491306
38373 491306 544100 548214 483833 455283 561824 748460 850936 762831 536417 338007 296823
38362 296823 378872 437602 399989 336050 319816 327068 338914 432887 655916 892366 986086
$$ packed form
38435a69303K55593J52176R9815J70740K04355N4330j54832j78927o825J32016
38425E59138R9751k0101j36338k54311l14788j89697N3622J38599k3323j66048
38415b53496p3898R2621R3030n755j275Q6252J15573J14162J64971J55646l4477
38404D53354k23522j49188R3917J96210J33393J33494J88376M2392k79564l76833
38394B12029o7660K90458K90713L889k05811j72779k1694P6682N4651m4542q7165
38383C28771K1193J63472J17187j10375k43276j20874Q1157J35697P3075M5279
38373D91306N2794M114o4381k8550J06541J86636J02476q8105k26414j98410m1184
38362B96823Q2049N8730l7613o3939j6234P252J1846R3973K23029K36450R3720
$$ plain form
38351 986086 932236 833000 736261 650445 646031 779509 956632 1032221 1027576 1097285 1285463
38340 1285463 1457739 1485493 1378449 1227262 1115109 1079971 1075172 993638 818713 698360
38330 698360 764870 944458 1064129 1071833 1018916 928643 863781 1018708 1494434 2030205 2223689
38319 2223689 2022122 1754381 1673258 1724551 1787547 1851620 1879001 1777032 1625877 1673774
38309 1673774 1965958 2223912 2250037 2207901 2311761 2477750 2524950 2519783 2640353 2847780
38299 2847780 2984242 3087954 3301732 3533610 3541795 3366872 3350681 3633818 3926253 3938386
38289 3938386 3802085 3836490 4047625 4132541 3953557 3757378 3837477 4152735 4423784 4508323
38279 4508323 4503235 4499543 4441187 4303275 4227299 4314312 4405268 4280511 4021213 3935322 4118648
$$ packed form
38351I86086n3850r9236r6739q5816m414J33478J77123P5589m645O9709J88178
38340A285463J72276K7754j07044j51187j12153l5138m799q1534j74925j20353
38330F98360O6510J79588J19671P704n2917r0273o4862J54927M75726N35771J93484
38319B223689k01567k67741q1123N1293O2996O4073K7381j01969j51155M7897
38309A673774K92184K57954K6125m2136J03860J65989M7200n167J20570K07427
38299B847780J36462J03712K13778K31878Q185j74923j6191K83137K92435J2133
38289C938386j36301L4405K11135Q4916j78984j96179Q0099L15258K71049Q4539
38279D508323n088l692n8356j37912p5976Q7013R0956j24757k59298q5891J83326
$$ plain form
38268 4118648 4331483 4365954 4285878 4189790 3992431 3645898 3375560 3429029 3701961 3875273
38258 3875273 3859299 3833808 3865555 3772689 3443889 3058620 2864264 2892336 3010048 3116599
38248 3116599 3159348 3065365 2817136 2557835 2483361 2616035 2771429 2768553 2615542 2469139
38238 2469139 2453206 2543755 2614426 2570237 2429984 2286218 2205663 2186827 2201299 2235930 2273807
38227 2273807 2261023 2138356 1919699 1705178 1577922 1503572 1388895 1243780 1203205 1338383
38217 1338383 1524781 1591096 1544458 1528144 1588668 1634002 1628453 1661870 1764742 1806499 1680716
38206 1680716 1478690 1367696 1380205 1423259 1415860 1318092 1108617 843546 658849 603216
38196 603216 556619 435912 366369 473014 607629 528248 307258 284457 575999 893139
$$ packed form
38268D118648K12835L4471q0076r6088j97359l46533k70338N3469K72932J73312
38258C875273j5974k5491L1747r2866l28800l85269j94356K8072J17712J06551
38248C116599M2749r3983k48229k59301p4474J32674J55394k876j53011j46403
38238B469139j5933R0549P0671m4189j40253j43766q0555j8836J4472L4631L7877
38227B273807j2784j22667k18657k14521j27256p4350j14677j45115m0575J35178
38217A338383J86398O6315m6638j6314O0524M5334n549L3417J02872M1757j25783
38206A680716k02026j10994J2509M3054p399r7768k09475k65071j84697n5633
38196F03216m6597j20707o9543J06645J34615p9381k20990k2801K91542L17140
$$ plain form
38186 893139 949655 816573 726706 729352 733108 741851 821467 908562 869443 724407 620152
38175 620152 581966 485884 310768 228285 352360 548975 614412 534335 436603 371963 297612
38164 297612 234669 265051 354041 343165 190945 82047 188056 423617 571593 576250 558842
38153 558842 581262 568438 481528 406050 410822 450039 470147 495947 543118 566114 571893 656645
38141 656645 829057 934267 887916 844719 949110 1046990 899111 607588 524695 722334
38131 722334 868298 735108 533180 543348 668213 626911 439013 394765 587305 777391
38121 777391 770094 672166 673400 772559 852977 880646 881466 830186 713213 626643 657407 714562
38109 714562 640736 475688 438698 618025 835081 887566 797594 727223 756107 849639 955365
$$ packed form
38186H93139N6516j33082q9867K646L756Q743P9616Q7095l9119j45036j04255
38175F20152l8186r6082j75116q2483J24075J96615O5437q0077r7732o4640p4351
38164B97612o2943L0382Q8990j0876j52220j08898J06009K35561J47976M657j7408
38153E58842K2420j2824q6910p5478M772L9217K0108K5800M7171K2996N779Q4752
38141F56645J72412J05210m6351m3197J04391R7880j47879k91523q2893J97639
38131G22334J45964j33190k01928J0168J24865m1302j87898m4248J92540J90086
38121G77391p297r7928J234R9159Q0418K7669Q20n1280j16973q6570L0764N7155
38109G14562p3826j65048l6990J79327K17056N2485q9972p0371K8884R3532J05726
$$ plain form
38098 955365 1006159 902892 639684 395494 340950 384329 291371 53809 -78453 9651
38088 9651 101695 -14843 -212200 -227259 -66845 40693 36838 106775 334505 530283 508240
38077 508240 353474 274242 312671 351025 330960 315066 344951 357453 267196 73625 -123651
38066 -123651 -187993 -52032 192362 337280 246948 -10120 -250293 -354662 -311501 -147338
38056 -147338 75457 225828 209028 123710 175981 379451 479881 289287 -23226 -141488
38046 -141488 -36487 16829 -131784 -278968 -175018 104656 263600 177831 13727 -27985
38036 -27985 64391 166914 176122 68448 -109328 -261075 -311212 -293441 -331608 -507238 -768776
38025 -768776 -968524 -961847 -703359 -308501 2829 96197 41223 -17946 -53506 -109744 -133272
$$ packed form
38098I55365N0794j03267k63208k44190n4544M3379r2958k37562j32262Q8104
38088I651R2044j16538j97357j5059J60414J07538l855O9937K27730J95778k2043
38077E08240j54766p9232L8429L8354k0065j5894K9885J2502r0257j93571j97276
38066a23651o4342J35961K44394J44918r0332k57068k40173j04369M3161J64163
38056a47338K22795J50371j6800q5318N2271K03470J00430j90594l12513j18262
38046a41488J05001N3316j48613j47184J03950K79674J58944q5769j64104m1712
38036b7985R2376J02523R208j07674j77776j51747n0137J7771l8167j75630k61538
38025g68776j99748O677K58488L94858L11330R3368n4974n9169l5560n6238k3528
$$ plain form
38014 -133272 -24613 148102 183407 42397 -73927 -21122 93334 120818 108016 172131
38004 172131 274552 290968 218907 157332 145520 157889 186308 197179 97477 -104782 -201856
37993 -201856 -34864 231341 288503 96722 -97123 -129906 -83229 -61182 -40640 -6641 -30892
37982 -30892 -122171 -166946 -114355 -72814 -129109 -212550 -240340 -259869 -321646 -332866 -195096
37971 -195096 -13855 -4383 -198218 -374330 -306806 4343 375963 647318 792449 854386
37961 854386 835794 703857 482224 261555 95755 -35246 -120179 -79060 77705 156409
37951 156409 -2551 -271210 -365967 -215860 -33817 -10844 -98983 -135874 -48251 116276
37941 116276 253458 266801 158527 57567 63091 97627 45011 -27665 23530 142195 152515
$$ packed form
38014a33272J08659J72715L5305j41010j16324N2805J14456K7484j2802O4115
38004A72131J02421J6416p2061o1575j1812J2369K8419J0871r9702k02259r7074
37993b01856J66992K66205N7162j91781j93845l2783M6677K2047K0542L3999k4251
37982c0892r1279m4775N2591M1541n6295q3441k7790j9529o1777j1220J37770
37971a95096J81241R472j93835j76112O7524L11149L71620K71355J45131O1937
37961H54386j8592j31937k21633k20669j65800j31001q4933M1119J56765P8704
37951A56409j58960k68659r4757J50107J82043K2973q8139l6891Q7623J64527
37941A16276J37182J3343j08274j00960N524L4536n2616p2676N1195J18665J0320
$$ plain form
37930 152515 108441 259675 600747 766966 531230 126799 -121837 -237554 -410614 -587164
37920 -587164 -544384 -275648 -19705 65187 38950 10108 9193 21920 10620 -76309 -217952
37909 -217952 -307234 -313687 -348454 -452590 -467467 -283736 -75837 -76301 -232898 -320216 -289305
37898 -289305 -251701 -201702 -45698 131817 134020 -7823 -47702 89344 221882 268034 381505
37887 381505 611981 715429 492487 102742 -157970 -231672 -256605 -288500 -274853 -226505
37877 -226505 -213128 -215658 -150830 -43639 -38646 -210594 -450987 -570834 -471155 -213559 31496
37866 31496 107887 -8551 -194193 -289081 -235972 -120086 -72776 -121412 -149691 -61894 24651
37855 24651 -130210 -554195 -950850 -1039879 -896681 -801367 -852850 -932573 -979190 -1053984 -1139342
$$ packed form
37930A52515m4074J51234L41072J66219k35736m04431k48636j15717j73060j76550
37920e87164M2780K68736K55943Q4892k6237k8842r15J2727j1300q6929j41643
37909b17952q9282o453l4767j04136j4877J83731K07899m64j56597q7318L0911
37898b89305L7604M9999J56004J77515K203j41843l9879J37046J32538M6152J13471
37887C81505K30476J03448k22942l89745k60712p3702k4933l1895J3647M8348
37877b26505J3377k530O4828J07191M993j71948k40393j19847R9679K57596K45055
37866C1496P6391j16438j85642r4888N3109J15886M7310m8636k8279Q7797Q6545
37855B4651j54861m23985l96655q9029J43198R5314n1483p9723m6617p4794q5358
$$ plain form
37844 -1139342 -1113192 -963631 -814740 -695194 -502364 -258163 -164734 -299139 -466883 -482577
37834 -482577 -395071 -305931 -183690 -29646 -14520 -223707 -435957 -407350 -251638 -278777
37824 -278777 -542843 -814991 -952406 -1023013 -1072627 -1033050 -902749 -790631 -720603 -590979
37814 -590979 -386629 -236644 -189882 -130004 -14291 -5603 -218495 -486083 -558460 -436707
37804 -436707 -329031 -328520 -317245 -192217 -27581 36999 -35829 -174263 -281892 -287876 -183595
37793 -183595 -59081 -40977 -132362 -166413 193 281830 451468 428126 360193 384538 426568
37782 426568 341397 163215 65008 98529 130560 63676 -21178 -10118 67428 100800 64467
37771 64467 27924 38376 73182 90704 74387 44401 54566 136141 218759 176885 2998
$$ packed form
37844a139342K6150J49561J48891J19546J92830K44201R3429j34405j67744j5694
37834d82577Q7506Q9140J22241J54044J5126k09187k12250K8607J55712k7139
37824b78777k64066k72148j37415p0607m9614L9577J30301J12118P0028J29624
37814e90979K04350J49985M6762N9878J15713Q688k12892k67588p2377J21753
37804d36707J07676N11J1275J25028J64636O4580p2828j38434j07629n984J04281
37793a83595J24514J8104r1385l4051J66606K81637J69638k3342o7933K4345M2030
37782D26568q5171j78182r8207L3521L2031o6884q4854J1060P7546L3372l6333
37771F4467l6543J0452L4806J7522j6317k9986J0165Q1575Q2618m1874j73887
$$ plain form
37760 2998 -145335 -144986 -74256 -78929 -143942 -140782 -68481 -78309 -224298 -336564 -230381 50405
37748 50405 293681 370492 335351 300190 301373 307219 281499 193576 19371 -194247 -291681
37737 -291681 -141530 159466 322468 196513 -24789 -63903 37069 -22365 -324651 -557244
37727 -557244 -435091 -103415 77764 20150 -59985 -37139 -40496 -174977 -302157 -230406 2642
37716 2642 173469 149947 25125 -21310 58522 118309 -17248 -320385 -547931 -517766 -336857
37705 -336857 -248146 -297969 -312794 -206129 -120089 -184708 -301023 -295912 -179114 -94379 -83918
37694 -83918 -60458 9303 41135 -30967 -169494 -304627 -390941 -373908 -212569 11074 103625
37683 103625 -31557 -251456 -322064 -181576 19973 126348 137015 150635 220489 311479
$$ packed form
37760B998j48333L49P0730m673o5013L160P2301r828j45989j12266J06183K80786
37748E0405K43276P6811l5141l5161J183N846k5720q7923j74205k13618r7434
37737b91681J50151L00996J63002j25955k21302l9114J00972n9434l02286k32593
37727e57244J22153L31676J81179n7614q0135K2846l357j34481j27180P1751K33048
37716B642J70827k3522j24822m6435P9832N9787j35557l03137k27546L0165J80909
37705c36857Q8711m9823j4825J06665Q6040o4619j16315N111J16798Q4735J0461
37694h3918K3460O9761L1832p2102j38527j35133q6314J7033J61339K23643R2551
37683A03625j35182k19899p0608J40488K01549J06375J0667J3620O9854R0990
$$ plain form
37673 311479 364292 357572 317460 296055 336745 439393 559544 651658 703607 716078 666916
37662 666916 531001 339720 188141 156204 228721 313956 344500 339051 345368 339881 235231
37651 235231 11436 -209028 -279860 -207454 -138877 -174386 -271047 -345423 -372374 -335631 -188143
37640 -188143 45665 214565 207291 114352 92887 121840 55029 -101087 -152218 1562 220305
37629 220305 331384 326480 262438 123375 -79582 -193085 -78188 176471 351024 372925
37619 372925 364382 431173 534470 576125 505377 340163 177798 170146 369273 590500 556529
37608 556529 222856 -144720 -277659 -205843 -177786 -338966 -575564 -662187 -496690 -180842
37598 -180842 82312 145294 209 -244131 -444572 -502381 -402060 -199878 17767 161890
$$ packed form
37673C11479N2813o720m0112k1405M0690J02648J20151R2114N1949J2471m9162
37662F66916j35915j91281j51579l1937P2517Q5235L0544n449O317n487j04650
37651B35231k23795k20464p0832P2406O8577l5509r6661p4376k6951L6743J47488
37640a88143K33808J68900p274r2939k1465K8953o6811j56116n1131J53780K18743
37629B20305J11079m904o4042j39063k02957j13503J14897K54659J74553K1901
37619C72925q543O6791J03297M1655p0748j65214j62365p652J99127K21227l3971
37608E56529l33673l67576j32939P1816K8057j61180k36598q6623J65497L15848
37598a80842K63154O2982j45085k44340k00441n7809J00321K02182K17645J44123
$$ plain form
37588 161890 150647 -42558 -313412 -462040 -383946 -191155 -62231 -18371 38358 116796
37578 116796 142184 155868 285845 461780 401269 25468 -319077 -263515 96758 337010
37568 337010 230434 -74356 -330055 -415306 -315888 -110571 9871 -95255 -305484 -351428
37558 -351428 -154531 101484 245082 288903 298891 265774 176380 90369 83617 182556 349107
37547 349107 455640 342778 34337 -191173 -131625 22938 -44250 -263292 -256133 66436
37537 66436 348118 320396 141108 43307 -18117 -147190 -234683 -180337 -143418 -277308 -420192
37526 -420192 -362761 -245217 -339275 -563835 -591499 -371926 -171170 -97138 32878 283059
37516 283059 415279 264637 17241 -69005 -11949 8411 -47149 -72397 -20427 41040 35190
$$ packed form
37588A61890j1243j93205k70854j48628P8094J92791J28924M3860N6729P8438
37578A16796K5388J3684J29977J75935o0511l75801l44545N5562L60273K40252
37568C37010j06576l04790k55699q5251R9418K05317J20442j05126k10229m5944
37558c51428J96897K56015J43598M3821R988l3117q9394q6011o752R8939J66551
37547C49107J06533j12862l08441k25510N9548J54563o7188k19042P159L22569
37537F6436K81682k7722j79288r7801o1424j29073q7493N4346L6919j33890j42884
37526d20192N7431J17544r4058k24560k7664K19573K00756P4032J30016K50181
37516B83059J32220j50642k47396q6246N7056K0360n5560k5248N1970O1467n850
$$ plain form
37505 35190 -55457 -180123 -229358 -126684 49701 130500 80128 42856 112409 194556 193025
37494 193025 197084 339028 551550 627005 487612 262094 101971 36600 13144 -24620 -115683
37483 -115683 -252327 -348252 -313207 -185905 -117733 -185462 -289819 -294355 -201152 -108512 -38290
37472 -38290 86019 287179 466551 527481 479246 369340 206816 32216 -32151 72407
37462 72407 212393 226635 167518 196999 276029 199507 -25568 -115653 43227 152652 -61547
37451 -61547 -379307 -363817 4315 307273 284387 119763 82389 183955 315767 456958
37441 456958 566413 484710 172094 -98409 -30305 278429 431947 237807 -94617 -286972
37431 -286972 -326662 -365355 -422036 -352669 -97376 175444 236665 57397 -167973 -254297 -209385
$$ packed form
37505C5190r0647j24666m9235J02674J76385Q0799n0372l7272O9553Q2147j531
37494A93025M059J41944K12522P5455j39393k25518j60123o5371k3456l7764r1063
37483a15683j36644r5925L5045J27302O8172o7729j04357m536R3203R2640P0222
37472c8290J24309K01160J79372O0930m8235j09906j62524j74600o4367J04558
37462G2407J39986J4242n9117K9481P9030p6522k25075r0085J58880J09425k14199
37451f1547l17760J5490L68132L02958k2886j64624l7374J01566J31812J41191
37441D56958J09455q1703l12616k70503O8104L08734J53518j94140l32424j92355
37431b86972l9690l8693n6681O9367K55293K72820O1221j79268k25370q6324M4912
$$ plain form
37420 -209385 -150981 -110821 -13547 169855 354223 454992 486678 502496 511555 518180 574747
37409 574747 701392 788537 692455 449425 302724 449834 801598 1062387 1051198 884548
37399 884548 808692 893783 961828 819753 494330 191454 66500 98954 179183 245496 305968
37388 305968 370318 414655 421902 426073 478731 563685 586387 491952 364875 339093 413991 449604
37376 449604 368174 263237 254357 327369 401562 471395 565656 617041 503860 220961 -88160
37365 -88160 -274455 -286770 -149919 72437 292421 445388 519928 499570 334422 56877
37355 56877 -145355 -114897 46450 90054 -39407 -141177 -69637 58547 53609 -81026 -184791
37344 -184791 -167001 -91476 -62895 -106261 -165625 -194080 -224986 -313461 -396271 -309645 -36606
$$ packed form
37420b09385N8404M0160R7274J83402J84368J00769L1686J5818R059O625N6567
37409E74747J26645Q7145r6082k43030j46701J47110L51764K60789j1189j66650
37399H84548p5856Q5091O8045j42075l25423l02876j24954L2454Q0229O6313O0472
37388C05968O4350M4337P247M171N2658Q4954K2702r4435j27077k5782P4898L5613
37376D49604q1430j04937q880P3012P4193O9833R4261N1385j13181k82899l09121
37365h8160j86295j2315J36851K22356K19984J52967P4540k0358j65148k77545
37355E6877k02232L0458J61347M3604j29461j01770P1540J28184m938j34635j03765
37344a84791J7790P5525K8581m3366n9364k8455l0906q8475q2810Q6626K73039
$$ plain form
37333 -36606 168241 72838 -170466 -175072 156593 480119 446966 99989 -263852 -450441
37323 -450441 -469876 -429879 -457735 -614277 -776902 -723898 -435742 -180760 -184699 -350750 -443736
37312 -443736 -416769 -388011 -405554 -421263 -423728 -425545 -380199 -269751 -207754 -291562 -419918
37301 -419918 -432282 -367821 -396545 -540263 -661851 -703291 -729478 -745549 -679801 -561754 -513004
37290 -513004 -526565 -447784 -223494 6026 112885 112070 47679 -67783 -152167 -92518 39659
37279 39659 14753 -216383 -418607 -430279 -399271 -477417 -497820 -233161 159654 271784 -2788
37268 -2788 -326503 -371470 -174073 34498 133415 124743 8671 -193549 -377821 -454199 -461546
37257 -461546 -485144 -505141 -430794 -258667 -92559 -5784 28269 55026 63892 20207 -81558
$$ packed form
37333c6606K04847r5403k43304m606L31665L23526l3153l46977l63841j86589
37323d50441j9435L9997k7856j56542j62625N3004K88156K54982l939j66051r2986
37312d43736K6967K8758j7543j5709k465j817M5346J10448O1997q3808j28356
37301d19918j2364O4461k8724j43718j21588m1440k6187j6071O5748J18047M8750
37290e13004j3561P8781K24290K29520J06859q15o4391j15462q4384N9649J32177
37279C9659k4906k31136k02224j1672L1008p8146k0403K64659L92815J12130k74572
37268b788l23715m4967J97397K08571R8917q672j16072k02220j84272p6378p347
37257d61546k3598j9997P4347J72127J66108Q6775L4053K6757Q866m3685j01765
$$ plain form
37246 -81558 -213638 -316588 -305848 -151526 31957 66487 -73031 -208913 -190953 -83143
37236 -83143 -27162 -18896 30560 81612 7910 -164163 -263999 -251611 -267730 -342649 -293485 -52475
37224 -52475 129612 26216 -196432 -220824 -64501 -14664 -130548 -153532 36844 198245
37214 198245 97914 -139392 -235940 -137349 -6942 26079 -52053 -206068 -345842 -344715 -209517
37203 -209517 -142594 -280526 -463056 -449836 -298078 -293416 -503266 -632250 -409393 52335
37193 52335 402107 446031 277938 89451 -22106 -70206 -107016 -167259 -238357 -260504 -176253
37182 -176253 -821 159014 176003 19291 -193176 -288826 -212262 -80380 -37187 -84945
37172 -84945 -112709 -70629 -34606 -80991 -177745 -257167 -340645 -502512 -715515 -820886 -703281
$$ packed form
37246h1558j32080j02950J0740J54322J83483L4530j39518j35882J7960J07810
37236h3143N5981Q266M9456N1052p3702j72073r9836J2388j6119p4919M9164K41010
37224e2475J82087j03396k22648k4392J56323M9837j15884k2984J90376J61401
37214A98245j00331k37306r6548R8591J30407L3021p8132j54015j39774J127J35198
37203b09517O6923j37932j82530J3220J51758M662k09850j28984K22857M61728
37193E2335L49772M3924j68093j88487j11557m8100l6810o0243p1098k2147Q4251
37182a76253J75432J59835J6989j56712k12467r5650P6564J31882M3193m7758
37172h4945k7764M2080L6023m6385r6754p9422q3478j61867k13003j05371J17605
$$ plain form
37161 -703281 -454024 -297145 -350392 -502989 -547130 -399474 -166735 -14039 -8401 -96053
37151 -96053 -197567 -287778 -376097 -439982 -427221 -342065 -282756 -333936 -438649 -454911 -354175
37140 -354175 -279829 -356903 -510553 -546876 -374740 -80520 180519 295712 235431 70640
37130 70640 -66096 -115727 -169766 -333465 -545426 -641728 -580711 -478495 -421235 -378940 -323899
37119 -323899 -284968 -239423 -107211 74040 130204 18165 -46365 109874 321087 297509
37109 297509 57195 -96760 -16124 121204 133749 95353 138106 179259 40809 -247100
37099 -247100 -456069 -452457 -314963 -151346 34015 226701 309391 215247 89673 145546
37089 145546 377743 563236 556073 439379 339566 240998 87804 -58736 -114113 -135262 -220541
$$ packed form
37161g03281K49257J56879n3247j52597m4141J47656K32739J52696N638q7652
37151i6053j01514r0211q8319o3885J2761Q5156N9309n1180j04713j6262J00736
37140c54175P4346p7074j53650l6323J72136K94220K61039J15193o0281j64791
37130G0640j36736m9631n4039j63699k11961r6302O1017J02216N7260M2295N5041
37119c23899L8931M5545J32212J81251N6164j12039o4530J56239K11213k3578
37109B97509k40314j53955Q0636J37328J2545l8396M2753M1153j38450k87909
37099b47100k08969L612J37494J63617J85361J92686Q2690r4144j25574N5873
37089A45546K32197J85493p163j16694r9813r8568j53194j46540n5377k1149q5279
$$ plain form
37078 -220541 -300363 -224480 -45188 4034 -142565 -269592 -212892 -103624 -124268 -185363 -55644
37067 -55644 273033 562305 643304 573534 475886 389773 322074 310669 370389 449150 474682
37056 474682 396330 191582 -87739 -285415 -262637 -72063 78367 59891 -59916 -152486
37046 -152486 -183060 -183800 -157410 -81162 32123 132222 176100 156450 112160 110577 170555 201069
37034 201069 86445 -142616 -294934 -226528 -12520 143531 136388 36233 -39122 -59012
37024 -59012 -71090 -109759 -159536 -200624 -249715 -336545 -463240 -607306 -736170 -788054 -687151
37013 -687151 -455122 -271634 -300373 -447870 -441987 -206547 -4185 -94576 -387473 -594736
37003 -594736 -619941 -593880 -577797 -462321 -192522 94975 231407 190132 55804 -72730
$$ packed form
37078b20541p9822P5883J79292M9222j46599j27027N6700J09268k0644o1095J29719
37067e5644L28677K89272Q0999o9770r7648q6113o7699j1405N9720P8761K5532
37056D74682p8352k04748k79321j97676K2778J90574J50430j8476j19807r2570
37046a52486l0574p40K6390P6248J13285J00099M3878j9650m4290j583N9978L0514
37034B01069j14624k29061j52318O8406K14008J56051p143j00155p5355j9890
37024e9012j2078l8669m9777m1088m9091q6830j26695j44066j28864n1884J00903
37013f87151K32029J83488k8739j47497N883K35440K02362r0391k92897k07263
37003e94736k5205K6061J6083J15476K69799K87497J36432m1275j34328j28534
$$ plain form
36993 -72730 -119736 -80225 -51820 -117955 -204717 -178755 -69124 -27196 -74000 -88707 -62528
36982 -62528 -122083 -239793 -192851 58958 225040 113309 -38343 74530 326484 349430
36972 349430 91246 -154364 -223254 -244521 -316241 -344174 -280292 -236461 -249341 -180706 17033
36961 17033 157681 95021 -50693 -101731 -89853 -136753 -209881 -192395 -94842 -9291 64183
36950 64183 155016 157861 -52523 -365106 -506946 -402621 -273291 -320870 -473558 -524430 -392661
36939 -392661 -154726 82543 238696 259514 163486 59411 39983 70714 38466 -100661
36929 -100661 -261871 -312735 -194475 19954 179746 197183 135790 113269 128210 75245 -47755
36918 -47755 -75218 90379 281334 251839 20398 -133935 -29891 205964 334536 281833
$$ packed form
36993g2730m7006L9511K8405o6135q6762K5962J09631M1928m6804j4707K6179
36982f2528n9555j17710M6942K51809J66082j11731j51652J12873K51954K2946
36972C49430k58184k45610o8890k1267p1720k7933O3882M3831j2880O8635J97739
36961A7033J40648o2660j45714n1038J1878m6900p3128J7486R7553Q5551P3474
36950F4183R0833K845k10384l12583j41840J04325J29330m7579j52688n0872J31769
36939c92661K37935K37269J56153K0818r6028j04075j9428L0731l2248j39127
36929a00661j61210n0864J18260K14429J59792J7437o1393k2521J4941n2965j23000
36918d7755k7463J65597J90955k9495k31441j54333J04044K35855J28572n2703
$$ plain form
36908 281833 146306 39439 27440 155048 392336 575486 522622 239619 -61666 -175926
36898 -175926 -85413 76894 176748 162823 63683 -42696 -81498 -53786 -53871 -173803 -377798
36887 -377798 -503324 -422373 -195752 -23077 -18758 -85605 -63820 41123 81178 2205 -85011
36876 -85011 -119606 -222496 -485473 -747426 -767772 -570412 -413659 -418833 -436569 -333555 -206232
36865 -206232 -192305 -233136 -176930 -10657 157892 264687 293796 200832 -1115 -140560
36855 -140560 -64040 106306 87694 -170950 -402745 -385064 -205828 -73236 -24943 34409
36845 34409 132281 231260 351965 513752 589672 411530 45445 -207832 -164771 16560
36835 16560 61287 -73396 -199816 -191230 -124160 -125118 -204907 -292550 -334295 -293916 -140154 73051
$$ packed form
36908B81833j35527j06867j1999J27608K37288J83150n2864k83003l01285j14260
36898a75926R0513J62307R9854j3925r9140j06379l8802K7712q5j19932k03995
36887c77798j25526Q0951K26621J72675M319o6847K1785J04943M0055p8973q7216
36876h5011l4595j02890k62977k61953k0346J97360J56753n174j7736J03014J27323
36865b06232J3927m0831N6206J66273J68549J06795K9109r2964k01947j39445
36855a40560P6520J70346j8612k58644k31795J7681J79236J32592M8293N9352
36845C4409R7872R8979J20705J61787P5920j78142l66085k53277M3061J81331
36835A6560M4727j34683j26420Q586O7070r58p9789q7643m1745M0379J53762K13205
$$ plain form
36823 73051 173635 37164 -228418 -376724 -316493 -208015 -233991 -376098 -480171 -458986
36813 -458986 -353300 -254566 -243177 -344829 -466452 -435762 -206080 27777 36099 -158646
36803 -158646 -334124 -382309 -401950 -457084 -436358 -257277 -58804 -33758 -151951 -211406 -133753
36792 -133753 -52704 -89739 -175876 -165150 -48066 27615 -69764 -311272 -538889 -616140 -535107
36781 -535107 -383614 -239592 -133743 -98536 -176754 -338162 -440787 -348341 -85634 163461
36771 163461 217956 53876 -170987 -229439 -17017 319690 492325 367221 110450 -26733
36761 -26733 -5657 25510 7786 53954 223682 377716 360921 227368 161510 235330 366590
36750 366590 485389 608031 733671 793852 763795 734228 791741 878793 856068 679991 435911
$$ packed form
36823G3051J00584j36471k65582j48306O0231J08478k5976j42107j04073K1185
36813d58986J05686R8734J1389j01652j21623L0690K29682K33857Q322j94745
36803a58646j75478m8185j9641n5134K0726J79081J98473K5046j18193n9455P7653
36792a33753Q1049l7035q6137J0726J17084P5681r7379k41508k27617p7251Q1033
36781e35107J51493J44022J05849L5207p8218j61408j02625R2446K62707K49095
36771A63461N4495j64080k24863n8452K12422L36707J72635j25104k56771j37183
36761b6733K1076L1167j7724M6168J69728J54034j6795j33553o5858P3820J31260
36750C66590J18799J22642J25640O0181l0057k9567N7513Q7052k2725j76077k44080
$$ plain form
36739 435911 201867 -23259 -222378 -288053 -140471 126946 321724 363729 328294 285759
36729 285759 230419 208918 363776 724242 1065660 1146791 1028170 968983 1032081 1007868 767806
36718 767806 468577 294991 200030 67584 -30976 34485 169138 151609 -6567 -48080
36708 -48080 137112 326889 281413 75690 -18346 122868 379223 575231 643217 620578
36698 620578 576602 548721 511075 417089 287285 210817 234179 296733 304560 220466 64647
36687 64647 -105698 -195728 -138885 -5263 42937 -46034 -147513 -151035 -103554 -81474 -47383
36676 -47383 38288 78905 -13707 -120165 -62002 91004 84876 -130619 -297361 -205218 37985
36665 37985 203963 250560 280353 303412 220613 17029 -175824 -238573 -196434 -160149 -187572
$$ packed form
36739D35911k34044k25126j99119o5675J47582K67417J94778M2005l5435m2535
36729B85759n5340k1501J54858L60466L41418Q1131j18621n9187O3098k4213k40062
36718G67806k99229j73586r4961j32446r8560O5461J34653j7529j58176m1513
36708d8080J85192J89777m5476k05723r4036J41214K56355J96008O7986k2639
36698F20578m3976k7881l7646r3986j29804p6468K3362O2554P827q4094j55819
36687F4647j70345r0030N6843J33622M8200q8971j01479l522M7481K2080L4091
36676d7383Q5671M0617r2612j06458N8163J53006o128k15495j66742R2143K43203
36665C7985J65978M6597K9793K3059q2799k03584j92853o2749M2139L6285k7423
$$ plain form
36654 -187572 -239645 -253471 -223783 -191936 -168443 -117918 -41881 -7578 -28000 22083 258221
36643 258221 586600 781991 761279 643894 530689 386246 197864 85196 132050 224353
36633 224353 189510 28210 -110489 -133930 -77476 -10240 27427 10304 -63940 -155266 -211526
36622 -211526 -196916 -80851 126187 301598 291350 128760 49964 190077 387035 423912
36612 423912 345947 347501 428954 401232 222398 97180 174833 326590 322438 114588 -140478
36601 -140478 -262991 -189536 1485 148221 130278 -34183 -236402 -396311 -481916 -460544
36591 -460544 -331838 -179124 -77227 22408 190109 337520 304889 122668 -439 20181
36581 20181 44993 -31642 -121340 -132555 -126873 -151175 -93328 117842 312254 283586 98485
$$ packed form
36654a87572n2073j3826K9688L1847K3493N0525P6037L4303k0422N0083K36138
36643B58221L28379J95391k0712j17385j13205j44443j88382j12668M6854R2303
36633B24353l4843j61300j38699k3441N6454O7236L7667j7123p4244r1326n6260
36622b11526J4610J16065K07038J75411j0248j62590p8796J40113J96958L6877
36612D23912p7965J554Q1453k7722j78834j25218P7653J51757m152k07850k55066
36601a40478j22513P3455J91021J46736j7943j64461k02219j59909q5605K1372
36591d60544J28706J52714J01897R9635J67701J47411l2631j82221j23107K0620
36581B0181K4812p6635q9698j1215N682k4302N7847K11170J94412k8668j85101
$$ [...]
##END NTUPLES=NMR SPECTRUM
##END=
