##TITLE=31Pdec_PH-Gly_TFAA
 CDCl3
 64 sc
 5.2.2024
##JCAMPDX= 6.0         $$ Bruker NMR JCAMP-DX V2.0
##DATA TYPE= NMR SPECTRUM
##DATA CLASS= NTUPLES
##ORIGIN= UXNMR, Bruker Analytische Messtechnik GmbH
##OWNER= root
$$ XWIN-NMR		Version 3.5
$$ Mon Feb  5 14:45:48 2024 Russian Standard Time (UT+4h)  she@DPX200
##.OBSERVE FREQUENCY= 81.013821
##.OBSERVE NUCLEUS= ^31P
##.ACQUISITION MODE= SIMULTANEOUS
##.ACQUISITION SCHEME= undefined
##.AVERAGES= 64
##.DIGITISER RES= 16
##SPECTROMETER/DATA SYSTEM= spect
##.PULSE SEQUENCE= zgpg30
##.SOLVENT NAME= CDCl3
##.SHIFT REFERENCE= (INTERNAL, CDCl3, 0, 248.564)
##AUDIT TRAIL= $$ (NUMBER, WHEN, WHO, WHERE, WHAT)
$$ ##TITLE= Audit trail, XWIN-NMR		Version 3.5
$$ ##JCAMPDX= 5.01
$$ ##ORIGIN= Bruker BioSpin GmbH
$$ ##OWNER= she
$$ F:/spectra/data/she/nmr/P31/1/pdata/1/auditp.txt
$$ ##AUDIT TRAIL=  $$ (NUMBER, WHEN, WHO, WHERE, WHAT)
(   1,<2024-02-05 14:44:32.03 +0400>,<she>,<DPX200>,
      <continue with go, POWCHK disabled, PULCHK disabled
       configuration hash MD5:
       00 E9 B6 7A A2 85 ED C7 34 08 36 98 17 FE 4E 26
       data hash MD5: 32K
       6E E2 3B 02 C8 6B 57 35 55 EB 36 E1 48 72 81 7D>)
(   2,<2024-02-05 14:44:35.00 +0400>,<she>,<DPX200>,
      <Start of raw data processing
       efp BC_mod = 2 LB = 10 FT_mod = 6 PKNL = 1 PHC0 = -12195.5 PHC1 = 155.4885 SI = 64K 
       data hash MD5: 64K
       0A 1B 08 86 9A E0 D4 38 27 09 9C A6 F0 3F C2 D0>)
(   3,<2024-02-05 14:44:59.43 +0400>,<she>,<DPX200>,
      <pk PHC0 = 53.29296 PHC1 = -129.8 
       data hash MD5: 64K
       76 D0 EA 5C CC 4F B7 85 6F 51 BD E4 7C A8 FD C9>)
$$ ##END=
$$ 
$$ hash MD5
$$ CA A4 A1 B7 41 27 BF 3D 79 D8 0A 82 02 09 C3 B8
##$RELAX= 
##$RELAX= 
##$RELAX= 
##$RELAX= 
##$RELAX= 
##$RELAX= 
##$RELAX= 
##$RELAX= 
##$RELAX= 
$$ Bruker specific parameters
$$ --------------------------
##$DU= <F:/spectra>
##$EXPNO= 1
##$NAME= <P31>
##$PROCNO= 1
##$TYPE= <nmr>
##$USER= <she>
##$AMP= (0..31)
100 100 100 100 100 100 100 100 100 100 100 100 100 100 100 100 100 100 
100 100 100 100 100 100 100 100 100 100 100 100 100 100 
##$AQSEQ= 0
##$AQ_mod= 1
##$AUNM= <au_zg>
##$AUTOPOS= <>
##$BF1= 81.014009
##$BF2= 200.13
##$BF3= 200.13
##$BF4= 200.13
##$BF5= 200.13
##$BF6= 200.13
##$BF7= 200.13
##$BF8= 200.13
##$BYTORDA= 1
##$CFDGTYP= 0
##$CFRGTYP= 5
##$CHEMSTR= <none>
##$CNST= (0..31)
1 1 145 1 1 1 1 1 1 1 1 1 1 1 1 1 1 1 1 1 1 1 1 1 1 1 1 1 1 1 1 1 
##$CPDPRG= <waltz16>
##$CPDPRG1= <>
##$CPDPRG2= <waltz16>
##$CPDPRG3= <>
##$CPDPRG4= <mlev>
##$CPDPRG5= <mlev>
##$CPDPRG6= <mlev>
##$CPDPRG7= <mlev>
##$CPDPRG8= <mlev>
##$CPDPRGB= <>
##$CPDPRGT= <>
##$D= (0..31)
0 1 0 0 0 0 0 0 0 0 0 0.03 2e-05 3e-06 0 0 0 0 0 0 0 0 0 0 0 0 0 0 0 0 
0 0 
##$DATE= 1707129772
##$DBL= (0..7)
120 120 120 11 120 120 24 19 
##$DBP= (0..7)
150 150 150 150 150 150 150 150 
##$DBP07= 0
##$DBPNAM0= <>
##$DBPNAM1= <>
##$DBPNAM2= <>
##$DBPNAM3= <>
##$DBPNAM4= <>
##$DBPNAM5= <>
##$DBPNAM6= <>
##$DBPNAM7= <>
##$DBPOAL= (0..7)
0.5 0.5 0.5 0.5 0.5 0.5 0.5 0.5 
$$ [...]
##$SUBNAM2= <"">
##$SUBNAM3= <"">
##$SUBNAM4= <"">
##$SUBNAM5= <"">
##$SUBNAM6= <"">
##$SUBNAM7= <"">
##$SUBNAM8= <"">
##$SUBNAM9= <"">
##$SW= 501.771253377433
##$SWIBOX= (0..15)
0 1 3 0 0 0 0 0 0 0 0 0 0 0 0 0 
##$SW_h= 40650.406504065
##$TD= 32768
##$TD0= 1
##$TE= 0
##$TE2= 300
##$TE3= 300
##$TEG= 300
##$TL= (0..7)
0 120 53 12 22 120 120 120 
##$TP= (0..7)
150 150 150 150 150 150 150 150 
##$TP07= 0
##$TPNAME0= <>
##$TPNAME1= <>
##$TPNAME2= <>
##$TPNAME3= <>
##$TPNAME4= <>
##$TPNAME5= <>
##$TPNAME6= <>
##$TPNAME7= <>
##$TPOAL= (0..7)
0.5 0.5 0.5 0.5 0.5 0.5 0.5 0.5 
##$TPOFFS= (0..7)
0 0 0 0 0 0 0 0 
##$TUNHIN= 0
##$TUNHOUT= 0
##$TUNXOUT= 0
##$USERA1= <user>
##$USERA2= <user>
##$USERA3= <user>
##$USERA4= <user>
##$USERA5= <user>
##$V9= 5
##$VALIST= <valist>
##$VCLIST= <CCCCCCCCCCCCCCC>
##$VD= 0
##$VDLIST= <DDDDDDDDDDDDDDD>
##$VPLIST= <PPPPPPPPPPPPPPP>
##$VTLIST= <TTTTTTTTTTTTTTT>
##$WBST= 1024
##$WBSW= 4
##$XGAIN= (0..3)
0 0 0 0 
##$XL= 0
##$YL= 0
##$YMAX_a= 7163
##$YMIN_a= -5012
##$ZGOPTNS= <>
##$ZL1= 120
##$ZL2= 120
##$ZL3= 120
##$ZL4= 120
##$ABSF1= 0
##$ABSF2= 0
##$ABSG= 0
##$ABSL= 0
##$ALPHA= 0
##$AQORDER= 0
##$ASSFAC= 0
##$ASSFACI= 0
##$ASSFACX= 0
##$ASSWID= 0
##$AUNMP= <proc_1d>
##$AZFE= 0.1
##$AZFW= 0.5
##$BCFW= 0
##$BC_mod= 2
##$BYTORDP= 0
##$COROFFS= 0
##$CY= -3
##$DATMOD= 1
##$DC= 0
##$DFILT= <>
##$DTYPP= 0
##$F1P= 0
##$F2P= 0
##$FCOR= 1
##$FTSIZE= 65536
##$FT_mod= 6
##$GAMMA= 0
##$GB= 0
##$INTBC= 1
##$INTSCL= 6.047779e-11
##$ISEN= 30
##$LB= 10
##$LEV0= 0
##$LPBIN= 0
##$MAXI= 10000
##$MC2= 0
##$MEAN= 0
##$ME_mod= 0
##$MI= 50
##$NCOEF= 0
##$NC_proc= -9
##$NLEV= 6
##$NOISF1= 182.463
##$NOISF2= 159.3651
##$NSP= 0
##$NTH_PI= 0
##$NZP= 0
##$OFFSET= 248.5645
##$PC= 4
##$PHC0= -12142.21
##$PHC1= 25.68849
##$PH_mod= 1
##$PKNL= yes
##$PPARMOD= 0
##$PSCAL= 0
##$PSIGN= 0
##$REVERSE= no
##$SF= 81.0140089999694
##$SI= 65536
##$SIGF1= 159.3651
##$SIGF2= -187.1042
##$SINO= 113.3802
##$SIOLD= 16384
##$SREGLST= <1H.CDCl3>
##$SSB= 0
##$STSI= 65536
##$STSR= 0
##$SW_p= 40650.406504065
##$SYMM= 0
##$S_DEV= 0
##$TDeff= 32768
##$TDoff= 0
##$TI= <>
##$TILT= no
##$TM1= 0
##$TM2= 0
##$TOPLEV= 0
##$USERP1= <user>
##$USERP2= <user>
##$USERP3= <user>
##$USERP4= <user>
##$USERP5= <user>
##$WDW= 1
##$XDIM= 65536
##$YMAX_p= 122460552
##$YMIN_p= -313758899
$$ End of Bruker specific parameters
$$ ---------------------------------
##NTUPLES= NMR SPECTRUM
##VAR_NAME=  FREQUENCY,     SPECTRUM/REAL,   SPECTRUM/IMAG
##SYMBOL=    X,             R,               I
##VAR_TYPE=  INDEPENDENT,   DEPENDENT,       DEPENDENT
##VAR_FORM=  AFFN,          ASDF,            ASDF
##VAR_DIM=   65536,         65536,           65536
##UNITS=     HZ,            ARBITRARY UNITS, ARBITRARY UNITS
##FACTOR=    0.620285442955139, 1,           1
##FIRST=     20137.2065510682, 0,            0
##LAST=      -20513.1999529968, 0,           0
##MIN=       -20513.1999529968, -313758899,  0
##MAX=       20137.2065510682, 122460552,    0
$$ Real data points
##PAGE= N=1
##DATA TABLE= (X++(R..R)), XYDATA
$$ [...]
13242I783023L07485L44518L38134K88533K02070Q7118m7418j90652l28489m45571
13232A0338751n29403n73041n74539n35145m58960l54130k33400j12244m834Q0592
13222G043647J44424J94012K37402K75973L01344K99391K59223J81385Q0161k1695
13212H995267j02859j52301j72357j75243j76287j87989k17139k65193l30826
13203G215073m12442n07839o10011p02282p58329p49710o57230m79053k31418
13194B106759N6832L51858O21578Q40213R89960J060029J045098R45506P69150
13185H786983N32329K57608l0021l05526n44039p21313q17345q22897p45214o08585
13175D981980m47822k97158j79910j04080o5249n3575n9672p6338r7435j17455
$$ plain form
13242 9783023 10090508 10435026 10773160 11061693 11263763 11350881 11303463 11112811 10784322 10338751
13232 10338751 9809348 9236307 8661768 8126623 7667663 7313533 7080133 6967889 6963055 7043647
13222 7043647 7188071 7382083 7619485 7895458 8196802 8496193 8755416 8936801 9016962 8995267
13212 8995267 8892408 8740107 8567750 8392507 8216220 8028231 7811092 7545899 7215073
13203 7215073 6802631 6294792 5684781 4982499 4224170 3474460 2817230 2338177 2106759
13194 2106759 2163591 2515449 3137027 3977240 4967200 6027229 7072327 8017833 8786983
13185 8786983 9319312 9576920 9546899 9241373 8697334 7976021 7158676 6335779 5590565 4981980
13175 4981980 4534158 4237000 4057090 3953010 3887761 3834186 3774514 3698176 3600741 3483286
13165C483286j33340j46312j60667j79549k01175k18630k23063k07953j72731
13156A839866j25081q0751n9319p5861j31992k11686k85718l23507l06177k33274
13146F500j19781J3511J49746K80748M05695N25649O37269P29916P89079Q04658
13136D222990P77650P19168O42467N55402M60070L58764K59289J74084J14249
13127H284133Q3963P9586R3374J18702J53075J96953K49492L05206L54947L90403
13117A0309834M07435M04845L80085L26578K35491J01022p3832k74020m73533
13108A1343905o40982p47663p75197p20752n98832m38239k73329j31983k6548
13099F990380M6366R7527J34535J56340J55372J24317O2636k0185j05049j66978
$$ plain form
13165 3483286 3349946 3203634 3042967 2863418 2662243 2443613 2220550 2012597 1839866
13156 1839866 1714785 1634034 1574715 1498854 1366862 1155176 869458 545951 239774 6500
13146 6500 -113281 -99770 49976 330724 736419 1262068 1899337 2629253 3418332 4222990
13136 4222990 5000640 5719808 6362275 6917677 7377747 7736511 7995800 8169884 8284133
13127 8284133 8368096 8447682 8541056 8659758 8812833 9009786 9259278 9564484 9919431 10309834
13117 10309834 10717269 11122114 11502199 11828777 12064268 12165290 12091458 11817438 11343905
13108 11343905 10702923 9955260 9180063 8459311 7860479 7422240 7148911 7016928 6990380
13099 6990380 7036746 7134273 7268808 7425148 7580520 7704837 7767473 7747288 7642239 7475261
13089G475261j81994j36083l2744J05248K41831L39438L72096L34831K45037J34203
13079H897124L3832l6445p2407q1113p4634o5669o4731p7347j01935j30663j54380
13068H071632j69529j82623k08400k61851l49619m67159o02677p42604q73846
13059D213324r83512j060085j096338j090249j041574r47338q01522o00544l50637
13050c758475p1447K07354M55078O49550P81735Q54137Q76324Q61950Q27946P92860
13040B477012P72464P74575P96865Q28875Q55812Q61482Q30063P48571O10775
13031I556494M20983J95178m1640k61275m39718n63695o33191o57409o45617n98931
13021F331179n09697l69887j83059K8525K27125L72275M36371M14651L24719J97628
$$ plain form
13089 7475261 7293267 7157184 7124440 7229688 7471519 7810957 8183053 8517884 8762921 8897124
13079 8897124 8930956 8894511 8822104 8740991 8666357 8600688 8535957 8458610 8356675 8226012 8071632
13068 8071632 7902103 7719480 7511080 7249229 6899610 6432451 5829774 5087170 4213324
13059 4213324 3229812 2169727 1073389 -16860 -1058434 -2005772 -2807294 -3407838 -3758475
13050 -3758475 -3829922 -3622568 -3167490 -2517940 -1736205 -882068 -5744 856206 1684152 2477012
13040 2477012 3249476 4024051 4820916 5649791 6505603 7367085 8197148 8945719 9556494
13031 9556494 9977477 10172655 10131015 9869740 9430022 8866327 8233136 7575727 6930110 6331179
13021 6331179 5821482 5451595 5268536 5297061 5524186 5896461 6332832 6747483 7072202 7269830
13011G269830O7026l8517r9168j05177n6649L8396J66850L12449M56067N75929
13001H587036O50004O61346O04509M89233L38114J78460L2348q9915j90379k78714
12991A0982042l64803m51970n34192n98854o32837o27732n81947n00650l94902
12982F294155k79581j69582p5853l199N0384R4092J43679K17264L27294M72941
12972G071594O38409P98883R30522J018074J055928J043860R83026Q76572P33249
12963A5150117N68392L99387K39058R2327m2324j68997k90395m04205n01252n67864
12953A4474244n92406n71299n09759m17933l07514j91729q6071n885L8983M8410
12943A1879041L2284P242q629k138K9343P6378J22540J53716J65565J64538J62690
$$ plain form
13011 7269830 7336856 7298339 7199171 7093994 7037345 7075741 7242591 7555040 8011107 8587036
13001 8587036 9237040 9898386 10502895 10992128 11330242 11508702 11541050 11451135 11260756 10982042
12991 10982042 10617239 10165269 9631077 9032223 8399386 7771654 7189707 6689057 6294155
12982 6294155 6014574 5844992 5769139 5765940 5816324 5910416 6054095 6271359 6598653 7071594
12972 7071594 7710003 8508886 9439408 10457482 11513410 12557270 13540296 14416868 15150117
12963 15150117 15718509 16117896 16356954 16449281 16406957 16237960 15947565 15543360 15042108 14474244
12953 14474244 13881838 13310539 12800780 12382847 12075333 11883604 11797533 11791648 11830631 11879041
12943 11879041 11911325 11918567 11909938 11907800 11937143 12013521 12136061 12289777 12455342 12619880 12782570
12932A2782570J69986J88141K08755K16987J99396J51410P9309m763r0790j75690
12922A3725311k61822l51392m41486n22726n81210o01983n73313m91621l65410
12913I534348k14891o5755O0119J51281K06749K30803K27815K01872J61281J22845
12903A0616467J10055J43981K32091L62310N05789O26345O92063O85031O06222
12894A4580354M73622L14171J53378P605j17689k23557l09575l67077l79120l29090
12884A3803022k13381m9476J26470K71285L49675L46237K70866J55208L9925m3423
12874A5056408q7167j09976j44364k16355l29667m63388n82911o56290o66785
12865A1799505o16623n22387m06426k89228j85497j03422m5268q467J2723K5742
$$ plain form
12932 12782570 12952556 13140697 13349452 13566439 13765835 13917245 13996554 13991791 13901001 13725311
12922 13725311 13463489 13112097 12670611 12147885 11566675 10964692 10391379 9899758 9534348
12913 9534348 9319457 9253702 9313821 9465102 9671851 9902654 10130469 10332341 10493622 10616467
12903 10616467 10726522 10870503 11102594 11464904 11970693 12597038 13289101 13974132 14580354
12894 14580354 15053976 15368147 15521525 15529130 15411441 15187884 14878309 14511232 14132112 13803022
12884 13803022 13589641 13540165 13666635 13937920 14287595 14633832 14904698 15059906 15099831 15056408
12874 15056408 14969241 14859265 14714901 14498546 14168879 13705491 13122580 12466290 11799505
12865 11799505 11182882 10660495 10254069 9964841 9779344 9675922 9630654 9622187 9634910 9660652
12855I660652L9587O4955J11801J83673K73029L62770M34114M75057M83562M64823
12845A2554023M26631L77034L24883K80304K52117K43021K46926K51674K45204
12836A5201817K20058J74089J09726L4275m0397j01620j42004j62846j71760j76888
12826A4944450j82823j90709k00848k14588k33812k58720k85903l08167l16228
12817A2752652l01154k56604j81009q0072L1488J31860J99588K23833K10339J77456
12807A2908377J44403J21065J06962R7859R1881Q9782R1961R7578J06518J20403
12797A3976789J40403J64270J86088J98774J96746J77003J38891Q3166J1398p2838
12787A5200690j60289k32875k66198k39454j47559p338J46376K72356L36523L22369
$$ plain form
12855 9660652 9700239 9765194 9876995 10060668 10333697 10696467 11130581 11605638 12089200 12554023
12845 12554023 12980654 13357688 13682571 13962875 14214992 14458013 14704939 14956613 15201817
12836 15201817 15421875 15595964 15705690 15739965 15699568 15597948 15455944 15293098 15121338 14944450
12826 14944450 14761627 14570918 14370070 14155482 13921670 13662950 13377047 13068880 12752652
12817 12752652 12451498 12194894 12013885 11933813 11965301 12097161 12296749 12520582 12730921 12908377
12807 12908377 13052780 13173845 13280807 13378666 13470547 13560329 13652290 13749868 13856386 13976789
12797 13976789 14117192 14281462 14467550 14666324 14863070 15040073 15178964 15262130 15273528 15200690
12787 15200690 15040401 14807526 14541328 14301874 14154315 14146977 14293353 14565709 14902232 15224601
12777A5224601K35069R7855n7969k04911l27319m22176m93538n45080n75775n81258
12767A2349499n59227n14205m57390m01584l55315l20934k97593k85241k84962
12758H873048k95416l09681l16618l05597k69886k06237j13621N104J39664K71977
12748G472737L81518M52919M80086M64853M12942L30635K23390R6369m3295j83694
12738A0088460l07629l96426m36810m26672l76187l03346k26114j55565r4715
12729G364996m3824p054O819q539m8404r4876j23652j15259o4308J7587J06181
12718F989667J74138K01153J79985J16589K5551p6472j76743k69446l54535m33094
12708F376793n02043n51539n67412n38506m64816l60157k46460j43971o4911j3798
$$ plain form
12777 15224601 15459670 15557525 15499556 15294645 14967326 14545150 14051612 13506532 12930757 12349499
12767 12349499 11790272 11276067 10818677 10417093 10061778 9740844 9443251 9158010 8873048
12758 8873048 8577632 8267951 7951333 7645736 7375850 7169613 7055992 7061096 7200760 7472737
12748 7472737 7854255 8307174 8787260 9252113 9665055 9995690 10219080 10315449 10272154 10088460
12738 10088460 9780831 9384405 8947595 8520923 8144736 7841390 7615276 7459711 7364996
12729 7364996 7321172 7314118 7320937 7312398 7263994 7169118 7045466 6930207 6865899 6883486 6989667
12718 6989667 7163805 7364958 7544943 7661532 7687083 7610611 7433868 7164422 6809887 6376793
12708 6376793 5874750 5323211 4755799 4217293 3752477 3392320 3145860 3001889 2936978 2923180
12698B923180Q780L167l0441r1386j75724k72352l62746m27487m55638m48189
12688F71164m11969l50152k58840j32795K5669K03018L79067N35469O61491P54191
12678B076313Q15029Q46307Q48773Q20494P57675O58025N24698L67299J98612
12669G913225K9840j31605k80397m09941n11035n74502n96032n79089n33028m68078
12659C859358l91853l10053k29366j58529j05872p5450o5100o8138p7357q8375
12649B289265j00236j14189j33232j63030k11427k83939l77299m76819n61160
12640a32066o11656o19802n88840n30304m58270l83319l07905k25771j27064o326
12630c991323J32694K78876M19711N45968O52433P36093P94025Q22070Q14985
$$ plain form
12698 2923180 2931960 2935127 2904686 2813300 2637576 2365224 2002478 1574991 1119353 671164
12688 671164 259195 -90957 -349797 -482592 -456923 -253905 125162 660631 1322122 2076313
12678 2076313 2891342 3737649 4586422 5406916 6164591 6822616 7347314 7714613 7913225
12669 7913225 7943065 7811460 7531063 7121122 6610087 6035585 5439553 4860464 4327436 3859358
12659 3859358 3467505 3157452 2928086 2769557 2663685 2588235 2523135 2454997 2377640 2289265
12649 2289265 2189029 2074840 1941608 1778578 1567151 1283212 905913 429094 -132066
12640 -132066 -743722 -1363524 -1952364 -2482668 -2940938 -3324257 -3632162 -3857933 -3984997 -3991323
12630 -3991323 -3858629 -3579753 -3160042 -2614074 -1961641 -1225548 -431523 390547 1205532
12621A205532P68917O85460N74623M54042L44448K63258K18862K08098K18796
12612D942036K36531K51477K60951K67037K72475K78121K82667K83777K79771
12603G354843K71236K61266K53702K50516K50748K51977K52637K52351K49751
12594I649027K40430K18419J80974J32349Q2298L9864P631j9277m9825r2690j52998
12583A0236202k30280l18029m06361m87346n59070o24418o85432p38462p74342
12574E412462p82737p56834o95856o05540m97222l85698k86324k12334j72259
12565A017658j66571j84461k04806k04531j71122j10113m0760J7315N5817P9256
12555H7682R6989J14085J28433J34923J32039J25488J26588J46598J90336K52343
$$ plain form
12621 1205532 1974449 2659909 3234532 3688574 4033022 4296280 4515142 4723240 4942036
12612 4942036 5178567 5430044 5690995 5958032 6230507 6508628 6791295 7075072 7354843
12603 7354843 7626079 7887345 8141047 8391563 8642311 8894288 9146925 9399276 9649027
12594 9649027 9889457 10107876 10288850 10421199 10503497 10543361 10550992 10531715 10481890 10389200 10236202
12583 10236202 10005922 9687893 9281532 8794186 8235116 7610698 6925266 6186804 5412462
12574 5412462 4629725 3872891 3177035 2571495 2074273 1688575 1402251 1189917 1017658
12565 1017658 851087 666626 461820 257289 86167 -23946 -64706 -47391 8426 87682
12555 87682 184671 298756 427189 562112 694151 819639 946227 1092825 1283161 1535504
12545A535504L17793L68206L89945L81681L56530L36895L44232L89271M67424
12536D887481N60426O41982O85093O69306N86034M39687K44403J9301k14192m32654
12526H086867o11816p31123p79902p60775o87869n81745m64522l56585k73843
12517B838687k24766k08252k13882k25167k25068k02086j54080q7153r982P1948
12507A360199J56952K42177L18319L70090L83304L53409K88730K05865J20620
12498C799665M0902l4226j09791j88338k65511l30051l68201l70237l35227k71355
12488A567630j92358j12952m5297L309L1359M1993M0031K9507J3698l029j4160
12477A359731j2177R063N2425J16825J97401K85974L72081M45440M99898N36533
$$ plain form
12545 1535504 1853297 2221503 2611448 2993129 3349659 3686554 4030786 4420057 4887481
12536 4887481 5447907 6089889 6774982 7444288 8030322 8470009 8714412 8733713 8519521 8086867
12526 8086867 7475051 6743928 5964026 5203251 4515382 3933637 3469115 3112530 2838687
12517 2838687 2613921 2405669 2191787 1966620 1741552 1539466 1385386 1298233 1288251 1360199
12507 1360199 1517151 1759328 2077647 2447737 2831041 3184450 3473180 3679045 3799665
12498 3799665 3840567 3806341 3696550 3508212 3242701 2912650 2544449 2174212 1838985 1567630
12488 1567630 1375272 1262320 1217023 1220332 1251691 1293684 1333715 1363222 1376920 1373891 1359731
12477 1359731 1347554 1356617 1409042 1525867 1723268 2009242 2381323 2826763 3326661 3863194
12467C863194N62688N86405O10264O29323O34153O15704N68759M93460L95737
12458H959687K86821J81416R4862L9978K3980M5775R5019J54411K05228K33969
12448A0321146K37079K21440J99897J83716J76305J72494J63686J44346J14639
12439A1934748P8756M2640J3809J456J3586N1803J08019J66371K09019K22093
12429A2842300J98994J40409N1637o1007j91822l33607m73748n93382o72809p00589
12419A0206376o79616o25167n56159m86062m19177l52643k80587j97409j00117
12410F509439R593J24481K33575L26350L96926M45742M77676M97442N05448M97567
12400A0024239M69138M19087L50194K66387J71334O9550l3173j32194k26302l15865
$$ plain form
12467 3863194 4425882 5012287 5622551 6251874 6886027 7501731 8070490 8563950 8959687
12458 8959687 9246508 9427924 9522786 9562764 9586744 9632519 9727538 9881949 10087177 10321146
12448 10321146 10558225 10779665 10979562 11163278 11339583 11512077 11675763 11820109 11934748
12439 11934748 12013504 12056144 12069953 12071409 12084995 12136798 12244817 12411188 12620207 12842300
12429 12842300 13041294 13181703 13233340 13172333 12980511 12646904 12173156 11579774 10906965 10206376
12419 10206376 9526760 8901593 8345434 7859372 7440195 7087552 6806965 6609556 6509439
12410 6509439 6519032 6643513 6877088 7203438 7600364 8046106 8523782 9021224 9526672 10024239
12400 10024239 10493377 10912464 11262658 11529045 11700379 11769929 11736756 11604562 11378260 11062395
12390A1062395l98060m64777n06089n16249m97294m58463m13084l74399l50848
12381G083132l41912l37315l21675k82822k18476j36557m9325L3722J08775J75121
12371E712668K30524K69412K85656K77014K46420J98763J36800O1030k6293j17713
12361G274281k01996k69901l19836l59110l99180m47049m98307n37836n48983
12352C692083n24702m71841m05839l40769k81704k22860j51261n4229P2277K19021
12342A530176L66135M91636N79741O23278O20437N71407M79628L56262K21680
12333E840380R9939R257m4526o7392p1445o8766o8039p4226q9870j16460j54815
12322E194037k04520k62804l23043l73825m00833l92695l47721k75466j90893
$$ plain form
12390 11062395 10664335 10199558 9693469 9177220 8679926 8221463 7808379 7433980 7083132
12381 7083132 6741220 6403905 6082230 5799408 5580932 5444375 5395050 5428772 5537547 5712668
12371 5712668 5943192 6212604 6498260 6775274 7021694 7220457 7357257 7418287 7391994 7274281
12361 7274281 7072285 6802384 6482548 6123438 5724258 5277209 4778902 4241066 3692083
12352 3692083 3167381 2695540 2289701 1948932 1667228 1444368 1293107 1238878 1311155 1530176
12342 1530176 1896311 2387947 2967688 3590966 4211403 4782810 5262438 5618700 5840380
12333 5840380 5940319 5949576 5905050 5837658 5766213 5697447 5629408 5555182 5465312 5348852 5194037
12322 5194037 4989517 4726713 4403670 4029845 3629012 3236317 2888596 2613130 2422237
12313B422237j05867k5184N0681J20237J78140K16935K31763K24880K06825J92814
12303C713461J95910K20646K60361K99649L20725L10446K64221J85831Q5660k0371
12293E836539j12568j72744j91867j74405j35257r0921n0523j1485L8119J11611
12283E046499K14390L39150M68413N81584O61190O95857O81444O21537N26276
12274I836340M08286K77254J36942j3116j72538l35554m89761o18179p02930p29662
12264G597082o92306n96722m60615l09066j67872n7946Q122K8106J1165k3080
12254E336868m8929m2779P182R4774J97491K85465L31877L19279K41409J03517
12244F826154p7570k75069m56497n89552o48471o20522n11072l43988j55387J6862
$$ plain form
12313 2422237 2316370 2291186 2341867 2462104 2640244 2857179 3088942 3313822 3520647 3713461
12303 3713461 3909371 4130017 4390378 4690027 5010752 5321198 5585419 5771250 5856910 5836539
12293 5836539 5723971 5551227 5359360 5184955 5049698 4958777 4908254 4896769 4934888 5046499
12283 5046499 5260889 5600039 6068452 6650036 7311226 8007083 8688527 9310064 9836340
12274 9836340 10244626 10521880 10658822 10645706 10473168 10137614 9647853 9029674 8326744 7597082
12264 7597082 6904776 6308054 5847439 5538373 5370501 5312555 5320677 5348783 5359948 5336868
12254 5336868 5287939 5245160 5252342 5347116 5544607 5830072 6161949 6481228 6722637 6826154
12244 6826154 6748584 6473515 6017018 5427466 4778995 4158473 3647401 3303413 3148026 3164888
12234C164888J42833K05579K01405J37774L1276r4066k09948k89575l14378k77868
12224B697920j84683m6739J20175K98098M68335O14218P24397P93999Q22121Q07691
12214G115532P48235O43729N02004L39362J74210J8574j25378k61422l92098n14282
12204H248466o20366p03182p60554p96451q18659q35021q50146q63310q67853
12195A132924q53196q10153p37565o45686n52562m74371m15754l66596l07135
12186d030094k17845q8786P5086K54221M20498N46881O15967O23433N76407M89921
12176g34311L83285K76063J83605J14152O8922M4330L4767L5648M6174O9864J11131
12165F33630J69598K36580K97401L39000L57777L61286L61359L63722L62829L46021
$$ plain form
12234 3164888 3307721 3513300 3714705 3852479 3883755 3789689 3579741 3290166 2975788 2697920
12224 2697920 2513237 2466498 2586673 2884771 3353106 3967324 4691721 5485720 6307841 7115532
12214 7115532 7863767 8507496 9009500 9348862 9523072 9541646 9416268 9154846 8762748 8248466
12204 8248466 7628100 6924918 6164364 5367913 4549254 3714233 2864087 2000777 1132924
12195 1132924 279728 -530425 -1267990 -1913676 -2466238 -2940609 -3356363 -3722959 -4030094
12186 -4030094 -4247939 -4336725 -4261639 -4007418 -3586920 -3040039 -2424072 -1800639 -1224232 -734311
12176 -734311 -351026 -74963 108642 222794 291716 336046 370813 406461 452635 522499 633630
12165 633630 803228 1039808 1337209 1676209 2033986 2395272 2756631 3120353 3483182 3829203
12155C829203L02737K31723J43293N7935J972k88O3368J85155L36084M73480N55819
12144F180481N59363M87754L67990K34926J14937J8924n3375j04012j30522j27349
12134G549117r3502m0105Q724K2563k5992j54401l65989o46541r62640j265757
12124D025477j503730j635573j642436j530134j323770j058607p71273m93350
12116e933396k47720m7644J01702K00720K53737K68664K56457K29051J96513J65530
12106d556386J40263J24551J23087J39737J73764K17409K58231K85626K96780
12097b796938K97470K97424L03737L16278L27393L26139L04725K63066K08554
12088a52152J52159J04348P2698O0521O5937Q2438J01761J17609J27997J35536
$$ plain form
12155 3829203 4131940 4363663 4506956 4564891 4566863 4566575 4629943 4815098 5151182 5624662 6180481
12144 6180481 6739844 7227598 7595588 7830514 7945451 7964375 7911000 7806988 7676466 7549117
12134 7549117 7455615 7415510 7424234 7446797 7420805 7266404 6900415 6253874 5291234 4025477
12124 4025477 2521747 886174 -756262 -2286396 -3610166 -4668773 -5440046 -5933396
12116 -5933396 -6181116 -6228760 -6127058 -5926338 -5672601 -5403937 -5147480 -4918429 -4721916 -4556386
12106 -4556386 -4416123 -4291572 -4168485 -4028748 -3854984 -3637575 -3379344 -3093718 -2796938
12097 -2796938 -2499468 -2202044 -1898307 -1582029 -1254636 -928497 -623772 -360706 -152152
12088 -152152 7 104355 177053 237574 303511 385949 487710 605319 733316 868852
12078H68852J46224J67017K01851K47645K93598L25838L34837L19687K85826K39482
12068C430857J85351J29692Q3929O2512P5156J19902J82512K41675K75698K67711
12058E054995K09513J04723k9923j67481k78941l44163l59964l39889l04856k70408
12048C273606k39136k03216j54389r3282l1139J6582L9300L6896J9529L178L653
12037B671582L1347Q8580J69977K64148L54525M20292M40366M00828L01265J55459
12027E298369j3048j76446l06861l80482l82488l11060j78066o065J76874L42573
12017D063300M66629N30365N22559M42817L05128J36868k8923j63678k49229k78031
12007E747805k51952j82920r3139j0654L9695M4876O910o0101j36650k05088k55046
$$ plain form
12078 868852 1015076 1182093 1383944 1631589 1925187 2251025 2585862 2905549 3191375 3430857
12068 3430857 3616208 3745900 3829829 3892341 3967497 4087399 4269911 4511586 4787284 5054995
12058 5054995 5264508 5369231 5339308 5171827 4892886 4548723 4188759 3848870 3544014 3273606
12048 3273606 3034470 2831254 2676865 2583583 2552444 2569026 2608326 2645222 2664751 2667929 2671582
12037 2671582 2702929 2791509 2961486 3225634 3580159 4000451 4440817 4841645 5142910 5298369
12027 5298369 5285321 5108875 4802014 4421532 4039044 3727984 3549918 3543853 3720727 4063300
12017 4063300 4529929 5060294 5582853 6025670 6330798 6467666 6438743 6275065 6025836 5747805
12007 5747805 5495853 5312933 5219794 5209140 5248835 5293711 5300621 5240520 5103870 4898782 4643736
11996D643736k85027k99544l03915l00356k87654k63134k24099j67793r1521N284
11986B425977J17611K32225L28299L82510L77701L11466J99750P2919l3894r1690
11976D322874q5957k0374Q5079K01141K98294L53569L52999K91370J72135Q211
11966E979341j78303l59903n10783o13951o64500o67971o36707n87231n38471
11957A221521n08484n09325n42859o00324o65213p17539p38349p14585o43199
11948d418356n32069l95985k48964r6932O4701K46807M57971O96282R45544J177435
11938b103566J359304J465321J486337J432791J328259J197262J054572R01829
11930H122109P32617N42637L38549J39418l0580j52850k20721k38396k16309j68245
$$ plain form
11996 4643736 4358709 4059165 3755250 3454894 3167240 2904106 2680007 2512214 2420693 2425977
11986 2425977 2543588 2775813 3104112 3486622 3864323 4175789 4375539 4448458 4414564 4322874
11976 4322874 4236917 4216543 4301622 4502763 4801057 5154626 5507625 5798995 5971130 5979341
11966 5979341 5801038 5441135 4930352 4316401 3651901 2983930 2347223 1759992 1221521
11957 1221521 713037 203712 -339147 -939471 -1604684 -2322223 -3060572 -3775157 -4418356
11948 -4418356 -4950425 -5346410 -5595374 -5692306 -5627605 -5380798 -4922827 -4226545 -3281001 -2103566
11938 -2103566 -744262 721059 2207396 3640187 4968446 6165708 7220280 8122109
11930 8122109 8854726 9397363 9735912 9875330 9844750 9691900 9471179 9232783 9016474 8848229
11920H848229j11535o7141n6577r5901j89684l27836m86442o32786p33993p67399
11910E378935p28314o30496m98379l55805k18162r1462K3608J26930K16658K89919
11900C513432L45205L84164M11125M30618M44916M53522M54625M47118M31426
11891G316151M08641L78732L39530K87615K20450J37966M2635o1440j69324k75264
11881H625692l71723m47660m87737m74940l97496k57129p3351J19500K81186L76430
11871F892772L84044L02550J51062l5308k14829l50192m17390m10213l40031k31130
11861E731335j12268p145P1875J23786J54130J69613J75231J73744J65651J48682
11851F794634J17397O4263j7138j27819k60833m02876n39738o62265p68859q62618
$$ plain form
11920 8848229 8736694 8669553 8612976 8517075 8327391 7999555 7513113 6880327 6146334 5378935
11910 5378935 4650621 4020125 3521746 3165941 2947779 2856317 2879925 3006855 3223513 3513432
11900 3513432 3858637 4242801 4653926 5084544 5529460 5982982 6437607 6884725 7316151
11891 7316151 7724792 8103524 8443054 8730669 8951119 9089085 9131720 9070280 8900956 8625692
11881 8625692 8253969 7806309 7318572 6843632 6446136 6189007 6115656 6235156 6516342 6892772
11871 6892772 7276816 7579366 7730428 7695120 7480291 7130099 6712709 6302496 5962465 5731335
11861 5731335 5619067 5611922 5683797 5807583 5961713 6131326 6306557 6480301 6645952 6794634
11851 6794634 6912031 6976294 6959156 6831337 6570504 6167628 5627890 4965625 4196766 3334148
11841C334148r44848j009072j039971j018977r34245p89662o07281m20566k60934
11832c691408j44831o9000j6356L2625R0861J62029K42424L23214L91370M31053
11822b248019M27950L76219K83716J70352N9110l4399j06785j64494k18310k78498
11812a733158l50730m31827n07111n52680n43544m64381l17590j24405Q2301K70630
11802d672495M21647N34688O23580P06488P94992Q87174R66580J006192R76032
11793B244878Q53089O31180L27261j8883l52154o15229p64133p81106o78328m89663
11783C56912k55034o551K37283M69023O84400Q73430J016510J090291J080422
11774E546686R90344Q37820O43117M20633J80574o4000k93850m87748o30457p17904
$$ plain form
11841 3334148 2389300 1380228 340257 -678720 -1612965 -2402627 -3009908 -3430474 -3691408
11832 -3691408 -3836239 -3905239 -3921595 -3888970 -3798109 -3636080 -3393656 -3070442 -2679072 -2248019
11822 -2248019 -1820069 -1443850 -1160134 -989782 -930672 -965071 -1071856 -1236350 -1454660 -1733158
11812 -1733158 -2083888 -2515715 -3022826 -3575506 -4119050 -4583431 -4901021 -5025426 -4943125 -4672495
11802 -4672495 -4250848 -3716160 -3092580 -2386092 -1591100 -703926 262654 1268846 2244878
11793 2244878 3097967 3729147 4056408 4037525 3685371 3070142 2306009 1524903 846575 356912
11783 356912 101878 95327 332610 801633 1486033 2359463 3375973 4466264 5546686
11774 5546686 6537030 7374850 8017967 8438600 8619174 8555174 8261324 7773576 7143119 6425215
11764F425215p55963p54595p22273o64228n84079m86126l76945k66068j65238
11755A649700q5628l4420j3455k1059n4891j13255j94221k93674m03990n14603
11745g9496o14898o97956p62518q11369q47061q67813q66288q32006p55627o32225
11735g767257m62219k51154j0016K44302M90133P04124Q65040R57189R73514R17999
11725c338345Q06039O61673N11949L79933K78765K09720J65786J38609J23779
11716f2092J21227J31809J53923J82897K13055K40230K62259K77071K80707K68077
11706B069163K36131J86126J22586N0638k4696r6004j50659j72206j47740p7470
11696A995869K1130J19238J89159K14455J92175J29262L8286o5475j66611k52432
$$ plain form
11764 6425215 5669252 4914657 4192384 3528156 2944077 2457951 2081006 1814938 1649700
11755 1649700 1564072 1529652 1516197 1495138 1440247 1326992 1132771 839097 435107 -79496
11745 -79496 -694394 -1392350 -2154868 -2966237 -3813298 -4681111 -5547399 -6379405 -7135032 -7767257
11735 -7767257 -8229476 -8480630 -8490646 -8246344 -7756211 -7052087 -6187047 -5229858 -4256344 -3338345
11725 -3338345 -2532306 -1870633 -1358684 -978751 -699986 -490266 -324480 -185871 -62092
11716 -62092 59135 190944 344867 527764 740819 981049 1243308 1520379 1801086 2069163
11706 2069163 2305294 2491420 2614006 2664644 2639948 2543944 2393285 2221079 2073339 1995869
11696 1995869 2016999 2136237 2325396 2539851 2732026 2861288 2899574 2834099 2667488 2415056
11686B415056l15099l52370l66970l64290l48740l21134k79535k23138j55971
11677c12191q7923l2675k892l695k7700n5898o5303l8910K7934J27193K42155
11666b29905L52959M41644M95833N10993M91747M51650M09495L81678L74237L80466
11656D060797L86537L80766L59440L26119K87380K49482K17250J93532J78566
11647F639869J70632J68497J73155J86059K04637K19511K17085J86879J28691
11638H295015N4022k0113q0801j24427j53066j65885j54241j05577j3049J16089
11628G647967K58375L79621M46392M39103L60013K31414Q5637m6593j43954j97334
11618I460641k08630j86824j43057q7611l0033J9826N2917O4398N6578L9166K6633
$$ plain form
11686 2415056 2099957 1747587 1380617 1016327 667587 346453 66918 -156220 -312191
11677 -312191 -400114 -432789 -435681 -439376 -467076 -522974 -588277 -627187 -599253 -472060 -229905
11666 -229905 123054 564698 1060531 1571524 2063271 2514921 2924416 3306094 3680331 4060797
11656 4060797 4447334 4828100 5187540 5513659 5801039 6050521 6267771 6461303 6639869
11647 6639869 6810501 6978998 7152153 7338212 7542849 7762360 7979445 8166324 8295015
11638 8295015 8349037 8328924 8248123 8123696 7970630 7804745 7650504 7544927 7531878 7647967
11628 7647967 7906342 8285963 8732355 9171458 9531471 9762885 9848522 9801929 9657975 9460641
11618 9460641 9252011 9065187 8922130 8834519 8804486 8824312 8877229 8941627 8998205 9037371 9064004
11607I064004L3188O6173J20349J77334K12393K05924J53424O8735k0925q5969
11597I994630j06671q0731k2389M5409R9884J23346J04370L8943o6784j94953
11587I935054l19645m15634m67194m71232m33254l59983k54426j16751M9847K32377
11577G379159M05444N36283N96748N76397M88617L65420K43808J51564R9311Q0995
11567A0923746Q0583Q0694O8691L8084j2901q1532j58270k25405k61180k48995
11557A0203515j86084q5723K8307J31511K07545K52485K73787K85881L04876L43430
11547A1759530M06003M85867N66435O27779O55058O43580N97804N26466M38496
11538A6707018L42283K46925J62418R7811N9013M7923O2302R5434J36711J74933
$$ plain form
11607 9064004 9097192 9163365 9283714 9461048 9673441 9879365 10032789 10101524 10080599 9994630
11597 9994630 9887959 9807228 9784839 9830248 9930132 10053478 10157848 10196791 10130007 9935054
11587 9935054 9615409 9199775 8732581 8261349 7828095 7468112 7213686 7096935 7146782 7379159
11577 7379159 7784603 8320886 8917634 9494031 9982648 10348068 10591876 10743440 10842751 10923746
11567 10923746 11004329 11085023 11153714 11191798 11178897 11097365 10939095 10713690 10452510 10203515
11557 10203515 10017431 9931708 9960015 10091526 10299071 10551556 10825343 11111224 11416100 11759530
11547 11759530 12165533 12651400 13217835 13845614 14500672 15144252 15742056 16268522 16707018
11538 16707018 17049301 17296226 17458644 17556455 17615468 17663391 17725693 17821127 17957838 18132771
11528A8132771K02882K18909K23850K16988J95814J59322J10476N5149o48n2659
11518A9462854r9060j41073j83138k31237k89356l56332m25887m90416n46077
11509A6700278n95273o44308o97668p53190q01722q31675q35475q13650p74383
11500I952934p29720o91849o70822o72146o92779p18299p25764o92489o04978
11491C754088m62228k73691n6636J64415L58609M93979N47212N13250M08666K66167
11481E713831J23012R218n9786q4704p8853o0749m4679l3181j5894K3701R7186
11470E589102K02593L23268M33886N08953N29561M87413L86787K43797Q1504p7680
11460H709184k18010l31251m12875m57070m54544l95779k79279j19512N2806K00673
$$ plain form
11528 18132771 18335653 18554562 18778412 18995400 19191214 19350536 19461012 19516161 19515513 19462854
11518 19462854 19363794 19222721 19039583 18808346 18518990 18162658 17736771 17246355 16700278
11509 16700278 16105005 15460697 14763029 14009839 13208117 12376442 11540967 10727317 9952934
11500 9952934 9223214 8531365 7860543 7188397 6495618 5777319 5051555 4359066 3754088
11491 3754088 3291860 3018169 2961533 3125948 3484557 3978536 4525748 5038998 5447664 5713831
11481 5713831 5836843 5846061 5786275 5701571 5622718 5561969 5517290 5484109 5468215 5491916 5589102
11470 5589102 5791695 6114963 6548849 7057802 7587363 8074776 8461563 8705360 8786864 8709184
11460 8709184 8491174 8159923 7747048 7289978 6835434 6439655 6160376 6040864 6093670 6294343
11450F294343K94944L23542K91829K16982J20545K1242p0667j55164k38648l25972
11440F772976m12726m83263n17430n03311m47653l75484l18107k97382l16097
11431C101523l58935m01400m20791m03879l48729k62013j55253m2518O0856J40165
11421I09026J84362J89065J58014J02062L5887k6100p2282r3470q1162k7836O8809
11410A346375J99838L42891M67719N47042N65000N17837M09590K50202N8491j35933
11400D569052k98846m04600m47333m42013m14805l89399l77118l74889l69904
11391A050145l46820k93966k07235r1703L9414J68755K80383L64148M16892M41077
11381A821090M42854M30810M15005M05443M09741M30450M62688M93224N02956
$$ plain form
11450 6294343 6589287 6912829 7204658 7421640 7542185 7563427 7492760 7337596 7098948 6772976
11440 6772976 6360250 5876987 5359557 4856246 4408593 4033109 3715002 3417620 3101523
11431 3101523 2742588 2341188 1920397 1516518 1167789 905776 750523 708005 768861 909026
11421 909026 1093388 1282453 1440467 1542529 1578416 1552316 1480034 1386564 1305402 1277566 1346375
11410 1346375 1546213 1889104 2356823 2903865 3468865 3986702 4396292 4646494 4704985 4569052
11400 4569052 4270206 3865606 3418273 2976260 2561455 2172056 1794938 1420049 1050145
11391 1050145 703325 409359 202124 110421 149835 318590 598973 963121 1380013 1821090
11381 1821090 2263944 2694754 3109759 3515202 3924943 4355393 4818081 5311305 5814261
11372E814261M73475L94980K70381J13381n6110k14777l37561m02521l99359l35227
11362E320923k31595j13774r00R7511J78587K40885K81094K94768K80529K44609
11352F592637K02118J73391J76680K20182K97134L87246M64734N08484N08165
11343I530771M63808L81870K71854J44386R032j28415k66879m07105n46400o75326
11333H777596p79472q44507q60061q20349p24636n80699m08806k39538j03219
11324C416309j7093K1090L0234L7301O7106J32571K28056L30454M10362M48393
11314E104783M46208M24493M09290M16362M43668M75202M91182M76793M25114
11305I113095L35370K10251N5092j20761l02097m67960n95405o65836o70524o12348
$$ plain form
11372 5814261 6287736 6682716 6953097 7066478 7010368 6795591 6458030 6055509 5656150 5320923
11362 5320923 5089328 4975554 4974654 5072165 5250752 5491637 5772731 6067499 6348028 6592637
11352 6592637 6794755 6968146 7144826 7365008 7662142 8049388 8514122 9022606 9530771
11343 9530771 9994579 10376449 10648303 10792689 10801721 10673306 10406427 9999322 9452922 8777596
11333 8777596 7998124 7153617 6293556 5473207 4748571 4167872 3759066 3519528 3416309
11324 3416309 3399216 3420306 3450540 3487841 3554947 3687518 3915574 4246028 4656390 5104783
11314 5104783 5550991 5975484 6384774 6801136 7244804 7720006 8211188 8687981 9113095
11305 9113095 9448465 9658716 9713808 9593047 9290950 8822990 8227585 7561749 6891225 6278877
11295F278877n03594l62136k08063o1405N9510J39473J68186J42891P1431k6246
11285E698924j20730j80869j84135j24441j3014J27607K71665L95501M79578N10348
11275F860434M83655M07292K99095J80183O6820l4677j27301k17261l06099l86597
11265G225544m45861m73025m65090m26967l67706k97183k24376j55652r3076l5363
11255D241245J7639O0897Q5281Q3461N5161P713m7107r6749j30916j43998j35597
11244C997030j07764o1158N151Q9226J82061K68994L36368L78301L99292M11758
11234E899259M29775M61851N06922N56646O02101O38710O65401O80137O77655
11225A1118457O52442O04432N41896M78020M23114L78696L38407K94596K44488
$$ plain form
11295 6278877 5775283 5413147 5205084 5143679 5203189 5342662 5510848 5653739 5725170 5698924
11285 5698924 5578194 5397325 5213190 5088749 5075735 5203342 5475007 5870508 6350086 6860434
11275 6860434 7344089 7751381 8050476 8230659 8297479 8262802 8135501 7918240 7612141 7225544
11265 7225544 6779683 6306658 5841568 5414601 5046895 4749712 4525336 4369684 4276608 4241245
11255 4241245 4258884 4319781 4405062 4488523 4543684 4551397 4504290 4407541 4276625 4132627 3997030
11244 3997030 3889266 3828108 3833259 3922485 4104546 4373540 4709908 5088209 5487501 5899259
11234 5899259 6329034 6790885 7297807 7854453 8456554 9095264 9760665 10440802 11118457
11225 11118457 11770899 12375331 12917227 13395247 13818361 14197057 14535464 14830060 15074548
11216A5074548J91000J38821Q9769M0477j6929r1680j89903l10985m46715n83002
11206A3895401p01860p82215q01310p39680n89652l62521q8090J94937M52269
11197A0477279O62905Q19557R23195R77081R83760R44868Q62210P39039N81203
11188A7971097L97609J99352k288j97254l75998n27834o41625p10071p34739p27694
11178A4650555p08604o98664p12511p49806p91525q06693p68472o69542n26260
11169H218478l69961k32498j34127p8024n2364l8107j7754K0302Q2874J73969
11159G572788K92949M29653N62461O63770P10902O95119O23028N11132L79264
11150A2441066K47053J32578N0137O784M83K1922N8890J00078J36249J59026J59466
$$ plain form
11216 15074548 15265548 15404369 15494138 15534615 15517686 15426006 15236103 14925118 14478403 13895401
11206 13895401 13193541 12411326 11610016 10870336 10280684 9918163 9830073 10025010 10477279
11197 10477279 11140184 11959741 12882936 13860017 14843777 15788645 16650855 17389894 17971097
11188 17971097 18368706 18568058 18565770 18368516 17992518 17464684 16823059 16112988 15378249 14650555
11178 14650555 13941951 13243287 12530776 11780970 10989445 10182752 9414280 8744738 8218478
11169 8218478 7848517 7616019 7481892 7403868 7351504 7313397 7295643 7315945 7398819 7572788
11159 7572788 7865737 8295390 8857851 9521621 10232523 10927642 11550670 12061802 12441066
11150 12441066 12688119 12820697 12870834 12877618 12878101 12900023 12958913 13058991 13195240 13354266 13513732
11139A3513732J28757O1475m0476j65964k96295m10222m90842n31665n38451n25211
11129A0704838n06817m93129m87859m91247n03202n24559n55879n94880o34327
11120E912939o62043o63552o26513n45343m24368k77919j26727Q041J09977J69464
11110B873956J83004J52500Q6162l08q5267j46588j68378j44685p8446K2247J47169
11099B841366K85111M24272N53265O62708P46632Q02984Q32997Q39609Q25687
11090H814631P92893P41559O71168N80889M69939L37890J85195J3946j71446l64001
11080A2072663n54296p30756q80550r91826j056980j075066j051602r96251r20671
11071C814665q38068p63598p13115o98721p22292p70786q17241q28349p75430
$$ plain form
11139 13513732 13642489 13703964 13663488 13497524 13201229 12791007 12300165 11768500 11230049 10704838
11129 10704838 10198021 9704892 9217033 8725786 8222584 7698025 7142146 6547266 5912939
11120 5912939 5250896 4587344 3960831 3415488 2991120 2713201 2586474 2594515 2704492 2873956
11110 2873956 3056960 3209460 3295622 3295314 3210047 3063459 2895081 2750396 2671950 2694197 2841366
11099 2841366 3126477 3550749 4104014 4766722 5513354 6316338 7149335 7988944 8814631
11090 8814631 9607524 10349083 11020251 11601140 12071079 12408969 12594164 12608110 12436664 12072663
11080 12072663 11518367 10787611 9907061 8915235 7858255 6783189 5731587 4735336 3814665
11071 3814665 2976597 2212999 1499884 801163 78871 -691915 -1509156 -2337505 -3112935
11062c112935o43604m35413j68576J29607M28100O96791R10465J052744J119222
11053b3599J118359J069453R97820R27095Q70071Q23028P69387O92643N89966
11044G834223M76113L74929L05163K70352K58284K48850K24339J75628J01966
11035A0269847P326j01917k16862l25979m17492m83473n22882n41398n48071n50904
11025F568195n54163n58346n61211n57944n41185n03158m40079l55777k61536
11016B234796j72178j00964n5436l5162l1699l1424k1243M716M0957P1924P8314
11005A982601M4977l3227j49270k85657m19608n29890o02263o31231o18645n70941
10995a813154m96072m00728k89391j66475m0142P5411J61577K00867J84835J20718
$$ plain form
11062 -3112935 -3756539 -4191952 -4360528 -4230921 -3802821 -3106030 -2195565 -1142821 -23599
11053 -23599 1094760 2164213 3162033 4089128 4959199 5782227 6551614 7244257 7834223
11044 7834223 8310336 8685265 8990428 9260780 9519064 9767914 9992253 10167881 10269847
11035 10269847 10277173 10175256 9958394 9632415 9214923 8731450 8208568 7667170 7119099 6568195
11025 6568195 6014032 5455686 4894475 4336531 3795346 3292188 2852109 2496332 2234796
11016 2234796 2062618 1961654 1906218 1871056 1839357 1807933 1786690 1791406 1832363 1904287 1982601
11005 1982601 2027578 1994351 1845081 1559424 1139816 609926 7663 -623568 -1242213 -1813154
10995 -1813154 -2309226 -2709954 -2999345 -3165820 -3205962 -3130551 -2968974 -2768107 -2583272 -2462554
10985b462554L1788n1093j02431j11303q1861k7369L6783R7488J45168J73140
10975b352244J77426J58573J23931Q6586O0068N2637O5642R5672J36584J79355
10965a215770K12008K23209K09380J80404J57853J64631K11917K92103L81996
10956H17731M53918M88668M84252M55713M25379M09149M08319M11828M04904L76310
10946E136171L20823K39169J37912K9221p0656j44765j80728j76244j40508q7843
10936E062552k6596M7267J44868K71038M14134N47400O40436O72852O42506N65263
10926H981720M67026L72017K93235K30201J74368J17437N7097j747m8828p1921
10916A0570605o1217j3577O5792J65578K72858L76172M65219N28744N54261N31405
$$ plain form
10985 -2462554 -2430766 -2481859 -2584290 -2695593 -2777454 -2804823 -2768040 -2670552 -2525384 -2352244
10975 -2352244 -2174818 -2016245 -1892314 -1805728 -1745660 -1693023 -1627381 -1531709 -1395125 -1215770
10965 -1215770 -1003762 -780553 -571173 -390769 -232916 -68285 143632 435735 817731
10956 817731 1271649 1760317 2244569 2700282 3125661 3534810 3943129 4354957 4759861 5136171
10946 5136171 5456994 5696163 5834075 5863296 5792640 5647875 5467147 5290903 5150395 5062552
10936 5062552 5035956 5083223 5228091 5499129 5913263 6460663 7101099 7773951 8416457 8981720
10926 8981720 9448746 9820763 10113998 10344199 10518567 10636004 10693101 10691354 10642526 10570605
10916 10570605 10509388 10495811 10561603 10727181 11000039 11376211 11841430 12370174 12924435 13455840
10906A3455840M56948L37122J85076J5605j58313l24920m70546n77841o28204
10897A2290767o08239n16580l66596j82974N445J72776L00896L81758M16904M14018
10887A2308175L82130L28355K57754J75309Q7770L845o7528j19367j47338j48788
10877A3060317j22740p2413p455N8560J14843J58526J94012K28361K67144L12404
10867A4191559L61918M09353M45762M62103M52122M15569L60928L05094K67887
10858A7672295K62983K89916L31571L59156L43213K66018J28676n0959k47092
10849A9355777m34879n94904p13976p85323q09137p91896p43418o73134n88151
10840A3220959m93706l94211k93505j95001j02821k2884L7850P3690Q1804O2143
$$ plain form
10906 13455840 13912788 14249910 14434986 14450591 14292278 13967358 13496812 12918971 12290767
10897 12290767 11682528 11165948 10799352 10616378 10621823 10794599 11095495 11477253 11894157 12308175
10887 12308175 12690305 13018660 13276414 13451723 13539493 13543338 13475810 13356443 13209105 13060317
10877 13060317 12937577 12865164 12857709 12916269 13031112 13189638 13383650 13612011 13879155 14191559
10867 14191559 14553477 14962830 15408592 15870695 16322817 16738386 17099314 17404408 17672295
10858 17672295 17935278 18225194 18556765 18915921 19259134 19525152 19653828 19602869 19355777
10849 19355777 18920898 18325994 17612018 16826695 16017558 15225662 14482244 13809110 13220959
10840 13220959 12727253 12333042 12039537 11844536 11741715 11718831 11756681 11830371 11912175 11974318
10830A1974318J6896m9436j29654k13602k88164l38871l54662l34145k88511k38090
10820I756079k04629k03985k41793l12665m02590m93176n65209o00422n83444
10811F148166n05851l70861j95116n783J66052K93513L60371L62746L06004K00976
10801F760217O3293q5531k19676l14732l54333l34013k60962j50298j9406J17313
10791E201872K51132L78972N01447O19278P28522Q17314Q67163Q58698P78401
10782A1002799O23449M03980J42560j29826l80174n79561p07435p54856p26924
10773H894012o41886n24902l98938k78424j69381p4314K940N5939P8040O6419
10763G009505K5629l1056q4569j18054j26515j20990j22519j49374k06881k86516
$$ plain form
10830 11974318 11991214 11941778 11812124 11598522 11310358 10971487 10616825 10282680 9994169 9756079
10820 9756079 9551450 9347465 9105672 8793007 8390417 7897241 7332032 6731610 6148166
10811 6148166 5642315 5271454 5076338 5070555 5236607 5530120 5890491 6253237 6559241 6760217
10801 6760217 6823510 6737979 6518303 6203571 5849238 5515225 5254263 5103965 5084559 5201872
10791 5201872 5453004 5831976 6333423 6952701 7681223 8498537 9365700 10224398 11002799
10782 11002799 11626248 12030228 12172788 12042962 11662788 11083227 10375792 9620936 8894012
10773 8894012 8252126 7727224 7328286 7049862 6880481 6806167 6809107 6865046 6943086 7009505
10763 7009505 7035134 7004078 6919509 6801455 6674940 6553950 6431431 6282057 6075176 5788660
10753E788660l72940m52118n14933n55632n68209n44203m73633l48984j70783
10744A787225M8023K82339N01085O76208P89640Q36298Q24949P77556P24476O94431
10734G942230P03921P52547Q25508Q99407R48816R54092R09295Q25062P22473
10725A5483351O21268N30895M49940L71999K91832K08043J23498M5661j4021m4286
10715A8068180m0851j0354L2635P3148J01721J15061J12893R4405N7185m02p5437
10704A8528184j59648k43772l23397l99788m73929n38788n76888n66348m92843
10695A4752783l60734j95867l7238P7520J23804R3491q255j68015l67596n85026
10685A3324867p94282r66378j074100j099202j037733r00144p06979m83365k54821
$$ plain form
10753 5788660 5415720 4963602 4448669 3893037 3324828 2780625 2306992 1958008 1787225
10744 1787225 1835248 2117587 2618672 3294880 4084520 4920818 5745767 6523323 7247799 7942230
10734 7942230 8646151 9398698 10224206 11123613 12072429 13026521 13935816 14760878 15483351
10725 15483351 16104619 16635514 17085454 17457453 17749285 17957328 18080826 18126487 18112466 18068180
10715 18068180 18027329 18016975 18049610 18122758 18224479 18339540 18452433 18546838 18604023 18603621 18528184
10704 18528184 18368536 18124764 17801367 17401579 16927650 16388862 15811974 15245626 14752783
10695 14752783 14392049 14196182 14158944 14236464 14360268 14453759 14445504 14277489 13909893 13324867
10685 13324867 12530585 11564207 10490107 9390905 8353172 7453028 6746049 6262684 6007863
10676F007863m4701J27648K48970L13985L25694K93647K32069J59284R6491O2638
10666G823588O6472J01633J49485J87983K00716J81240J31902N9817k6129j15131
10656H761576j92995k43108k50777k07902j15357J6084J64716K99079L85327L99987
10646I016630L40692K27239R2497l0217j16536j55424j49934j14946p1277l7687
10636I001037k5037l5691o7264j17099j84271k67757l61826m52292n18020n38191
10626F433589n00790m07315k72546j21039J8729J21984J74655J76623J40738Q9644
10616E854272N1963N7450J30189K80206M96409P46043R84109J169323J276915
10607A1046879J301513J252348J147283J008399Q58358P17726O03899N29129M95115
$$ plain form
10676 6007863 5963162 6090810 6339780 6653765 6979459 7273106 7505175 7664459 7760950 7823588
10666 7823588 7890060 7991693 8141178 8329161 8529877 8711117 8843019 8902836 8876707 8761576
10656 8761576 8568581 8325473 8074696 7866794 7751437 7767521 7932237 8231316 8616643 9016630
10646 9016630 9357322 9584561 9677058 9646841 9530305 9374881 9224947 9110001 9038724 9001037
10636 9001037 8976000 8940309 8873045 8755946 8571675 8303918 7942092 7489800 6971780 6433589
10626 6433589 5932799 5525484 5252938 5131899 5150628 5272612 5447267 5623890 5764628 5854272
10616 5854272 5906235 5963685 6093874 6374080 6870489 7616532 8600641 9769964 11046879
10607 11046879 12348392 13600740 14748023 15756422 16614780 17332506 17936405 18465534 18960649
10598A8960649M87892M80614M45842L69546K57502J31135J6035p0915j29408j74430
10588B0774462k26784l01034l96899m98221n81127o28051o38737o29694o22705
10579A6251210o31294o53735o75014o75732o43268n78303m92251l99063l09506
10570A1193044k31116j70014j31212j18180j32423j71499k26231k81127l19121
10561I412121l26358k94016k19255j07330K7832J67413K93638L93694M60305M89787
10551A0297831M78317M19102L04817J35607p3778k94505m91499o33180o98499
10542I444213o79871n82191m19742k13433J1277K27600M12290N50138O36441O77179
10532A0063901O85854O76404O56427O27088N89674N51227N23540N17694N39298
$$ plain form
10598 18960649 19448541 19929155 20374997 20744543 21002045 21133180 21149215 21078300 20948892 20774462
10588 20774462 20547678 20246644 19849745 19351524 18770397 18142346 17503609 16873915 16251210
10579 16251210 15619916 14966181 14291167 13615435 12972167 12393864 11901613 11502550 11193044
10570 11193044 10961928 10791914 10660702 10542522 10410099 10238600 10012369 9731242 9412121
10561 9412121 9085763 8791747 8572492 8465162 8492994 8660407 8954045 9347739 9808044 10297831
10551 10297831 10776148 11195250 11500067 11635674 11561896 11267391 10775892 10142712 9444213
10542 9444213 8764342 8182151 7762409 7548976 7560253 7787853 8200143 8750281 9386722 10063901
10532 10063901 10749755 11426159 12082586 12709674 13299348 13850575 14374115 14891809 15431107
10523A5431107N86451O50410P18502P77256Q13524Q15163P73771O86508N51867
10514B1804559L62834J07243k22806o22195j072111j545019k011283k447989k848159
10505A1505074l224212l604399m027893m540536n188042o009999p043328q332036
10497c0465371r929256j1888999j4258879j7072182k0318345k3882051k7466862
10490a55281945l0527486l2251831l1683120k8062146k1294513j2225695k432163
10483c13758899O409544J3160678J7472716J9615956K0139189J9605086J8465912
10476a98889818J7032822J5493536J3952583J2467987J1070549R775444Q595478
10469a10501419P547885O647676N897626N286370M791539M381573M019623L673469
$$ plain form
10523 15431107 16017558 16667968 17386470 18163726 18977250 19792413 20566184 21252692 21804559
10514 21804559 22167393 22274636 22051830 21429635 20357524 18812505 16801222 14353233 11505074
10505 11505074 8280862 4676463 648570 -3891966 -9080008 -15090007 -22133335 -30465371
10497 -30465371 -40394627 -52283626 -66542505 -83614687 -103933032 -127815083 -155281945
10490 -155281945 -185809431 -218061262 -249744382 -277806528 -299101041 -311326736 -313758899
10483 -313758899 -307349355 -294188677 -276715961 -257100005 -236960816 -217355730 -198889818
10476 -198889818 -181856996 -166363460 -152410877 -139942890 -128872341 -119096897 -110501419
10469 -110501419 -102953534 -96305858 -90408232 -85121862 -80330323 -75948750 -71929127 -68255658
10461f8255658L325111K972314K623789K293349J993839J731485J505166J311899
10453e0498706J152531J032719R61179R47514R97065J102697J240596J375717
10445d1688688J473341J509440J477009J387656J266462J140952J031357R48599
10437c1453872Q97591Q79225Q88952R15581R43516R58282R52517R27986Q90663
10428b3199559Q41992P74762O78459N49986M01109K57785J52181J11263J47233
10419a9284789K54176M11211N88516P53490Q77110R39972R34946Q64942P38759
10410a2921667N69041L73002J73655j177j24216j77907j61524q9129K1243J57342
10400a2181337L13036M81379O49309P98768R12079R77387R91795R61106Q96628
$$ plain form
10461 -68255658 -64930547 -61958233 -59334444 -57041095 -55047256 -53315771 -51810605 -50498706
10453 -50498706 -49346175 -48313456 -47352277 -46404763 -45407698 -44305001 -43064405 -41688688
10445 -41688688 -40215347 -38705907 -37228898 -35841242 -34574780 -33433828 -32402471 -31453872
10437 -31453872 -30556281 -29677056 -28788104 -27872523 -26929007 -25970725 -25018208 -24090222 -23199559
10428 -23199559 -22357567 -21582805 -20904346 -20354360 -19953251 -19695466 -19543285 -19432022 -19284789
10419 -19284789 -19030613 -18619402 -18030886 -17277396 -16400286 -15460314 -14525368 -13660426 -12921667
10410 -12921667 -12352626 -11979624 -11805969 -11807146 -11931362 -12109269 -12270793 -12359922 -12338679 -12181337
10400 -12181337 -11868301 -11386922 -10737613 -9938845 -9026766 -8049379 -7057584 -6096478 -5199850
10391e199850Q11246P17154O25244N44808M82931M43736M27166M27582M34013
10382b85970M33584M16756L81512L34559K89256K60579K58816K85246L32454L88675
10372C095467M42976M88442N22158N42257N43898N17340M50537L35705J76142
10363G114922j1347k01128l68571m98813n88481o40378o56798o36937n79156m85760
10353B447553l67548k45367j46016r2835r5768j46949k24755l04493l70360m21679
10343C1783m68847n21241n75980o15655o15742n56184m30889k51455m4149J58275
10333c890084L25950M38827M89668M83298M32526L52252K54852J48761L9233p0647
10323i95364j78473k80106l68331m35037m75542m90660m84823m63226m31251l95621
$$ plain form
10391 -5199850 -4388604 -3671450 -3046206 -2501398 -2018467 -1574731 -1147565 -719983 -285970
10382 -285970 147614 564370 945882 1280441 1569697 1830276 2089092 2374338 2706792 3095467
10372 3095467 3538443 4026885 4549043 5091300 5635198 6152538 6603075 6938780 7114922
10363 7114922 7103575 6902447 6533876 6035063 5446582 4806204 4149406 3512469 2933313 2447553
10353 2447553 2080005 1834638 1688622 1595787 1500019 1353070 1128315 823822 453462 31783
10343 31783 -437064 -958305 -1534285 -2149940 -2765682 -3321866 -3752755 -4004210 -4048359 -3890084
10333 -3890084 -3564134 -3125307 -2635639 -2152341 -1719815 -1367563 -1112711 -963950 -924717 -995364
10323 -995364 -1173837 -1453943 -1822274 -2257311 -2732853 -3223513 -3708336 -4171562 -4602813 -4998434
10313d998434l64442l44892l40168l47908l60492l65821l47591k86805j67378
10304g923931J4844K45767M95313P27408R10784J025253J063683J031965R46916
10295a461998Q30994P05258N83999M72941L70231K68991J61324M2995q3668k10902
10285A680165l29668m33060n16447n75693o06945o09038n86042n46283m97321
10276c020332m40283l68515k72862j50570j0889J27667K46323L33688L86334M03888
10266b765551L84714L26144K28340R8793m4810j75072k60412k75352k11393q2113
10256b776712Q1285K41660L68236M43765M65236M40213L81272L00301K05094J00397
10246B50747p677j08666j90062k43127k66893k67596k55686k43315k42294k61128
$$ plain form
10313 -4998434 -5362876 -5707768 -6047936 -6395844 -6756336 -7122157 -7469748 -7756553 -7923931
10304 -7923931 -7909087 -7663320 -7168007 -6440599 -5529815 -4504562 -3440879 -2408914 -1461998
10295 -1461998 -631004 74254 658253 1131194 1501425 1770416 1931740 1974735 1891067 1680165
10285 1680165 1350497 917437 400990 -174703 -781648 -1390686 -1976728 -2523011 -3020332
10276 -3020332 -3460615 -3829130 -4101992 -4252562 -4263451 -4135784 -3889461 -3555773 -3169439 -2765551
10266 -2765551 -2380837 -2054693 -1826353 -1727560 -1772370 -1947442 -2207854 -2483206 -2694599 -2776712
10256 -2776712 -2695427 -2453767 -2085531 -1641766 -1176530 -736317 -355045 -54744 150350 250747
10246 250747 243070 134404 -55658 -298785 -565678 -833274 -1088960 -1332275 -1574569 -1835697
10236a835697l01951l59938m25776m88557n36599n57143n38075m72998l66958
10227e883692k38116j12703j4932M2971O5235O9360P7569J07271J64218K40199
10217e482620L16118L70185L88072L69419L26865K78928K41834K24296K26286
10208b740617K41088K59648K75121K85151K90943K94705K97339K97133K89915
10199b09574K71520K42150K09540J87915J92629K33423L09077M04960M94767N47622
10189B884029N39377M63359L34634J84681M8709m8003r7694j08292r4714o9964
10179D036122m1734j4655O586J7921J9652J8321K3640M3014P8887J30114J93754
10168D511622K63780L27922L67019L59386K88501J49750m7143k80431n21036p37421
$$ plain form
10236 -1835697 -2137648 -2497586 -2923362 -3411919 -3948518 -4505661 -5043736 -5516734 -5883692
10227 -5883692 -6121808 -6234511 -6249443 -6206472 -6141237 -6071877 -5994308 -5887037 -5722819 -5482620
10217 -5482620 -5166502 -4796317 -4408245 -4038826 -3711961 -3433033 -3191199 -2966903 -2740617
10208 -2740617 -2499529 -2239881 -1964760 -1679609 -1388666 -1093961 -796622 -499489 -209574
10199 -209574 61946 304096 513636 701551 894180 1127603 1436680 1841640 2336407 2884029
10189 2884029 3423406 3886765 4221399 4406080 4454789 4406786 4309092 4200800 4106086 4036122
10179 4036122 3994388 3979733 3986319 4004240 4023892 4042213 4065853 4108867 4187754 4317868 4511622
10168 4511622 4775402 5103324 5470343 5829729 6118230 6267980 6220837 5940406 5419370 4681949
10158D681949r00648r90754j002876r48812q51150p32819o08895m85941l68532
10149b208478k67226k00575j87685k35412l29679m37295n16650n30457m55433
10140e368890k87415m1444K53093N60149Q44034J074067J227933J294360J274091
10131H29978J178292J025382Q37515O36987M43032K70212J28477K3428m3852p6176
10121E253275p8017n3452o057N9799J37965K19999K94833L50067L76308L72522
10111F927242L47775L17283K95276K88926K95844L05757L05831K87373K50595
10102I621902K05178J66684J49853J60469J88952K10682J95557J22801p816j75727
10092A0838535l50109n04049o23290p05336p51999p62374p31139o51911n22612
$$ plain form
10158 4681949 3781301 2790547 1787671 838859 -12291 -745110 -1354005 -1839946 -2208478
10149 -2208478 -2475704 -2676279 -2863964 -3099376 -3429055 -3866350 -4383000 -4913457 -5368890
10140 -5368890 -5656305 -5697749 -5444656 -4884507 -4040473 -2966406 -1738473 -444113 829978
10131 829978 2008270 3033652 3871167 4508154 4951186 5221398 5349875 5373303 5329451 5253275
10121 5253275 5175258 5121806 5115749 5175548 5313513 5533512 5828345 6178412 6554720 6927242
10111 6927242 7275017 7592300 7887576 8176502 8472346 8778103 9083934 9371307 9621902
10102 9621902 9827080 9993764 10143617 10304086 10493038 10703720 10899277 11022078 11014262 10838535
10092 10838535 10488426 9984377 9361087 8655751 7903752 7141378 6410239 5758328 5235716
10083E235716l50243j53175M1045K03325L13185L65461L69408L41687K98682K52423
10073F917514K10129J75036J47414J26313J11653J04344J03072J00801Q5932M9273
10063H131481q279p3682j27091j51018j38103r3880l3442K5665O9799R1415Q8227
10052G781092O2816K3120j9494n6456q8451j25576j79480k53416l38176m16597
10042F389382m72199m95379m84510m44215l83783l16066k55428k14475k00815
10033C122512k15094k51194k99080l49463l96902m38329m68635m78828m59595
10024b34608m06759l23170k16309r5746K6524J34579K10014K37768K13219J45458
10014c09030N4254l7000j07211j39612j21873m8061P7395K37857M08664N66025
$$ plain form
10083 5235716 4885473 4732298 4773343 4976668 5289853 5655314 6024722 6366409 6665091 6917514
10073 6917514 7127643 7302679 7450093 7576406 7688059 7792403 7895475 7996276 8082208 8131481
10063 8131481 8123202 8049520 7922429 7771411 7633308 7539428 7505986 7531651 7601450 7692865 7781092
10052 7781092 7843908 7867028 7847534 7791078 7702627 7577051 7397571 7144155 6805979 6389382
10042 6389382 5917183 5421804 4937294 4493079 4109296 3793230 3537802 3323327 3122512
10033 3122512 2907418 2656224 2357144 2007681 1610779 1172450 703815 224987 -234608
10024 -234608 -641367 -964537 -1180846 -1276592 -1250068 -1115489 -905475 -667707 -454488 -309030
10014 -309030 -254776 -291776 -398987 -538599 -660472 -708533 -631138 -393281 15383 581408
10004E81408O94724P89655Q51513Q81571Q80085Q48504P92132P20023O41796N63391
9994H244802M84387L98808K99658J85307O4155m5883j24231j58056j50267j19586
9984I079094r2446r2084j30927k07966l09591m13126m93330n30192n14276m47830
9974E847326l43141k19593r8740K133P4228J15939J28260J12321P1127J1912n5226
9963E646546j21867j84410k42336k93530l32007l50949l48121l28113k99140k67488
9953B878585k34260j96738j53166j06981o6059l6454j6233L853L2800P1952J13466
9942B290765J43679J47762J14643M2452n7704j62638k42791k70370k27736j14348
9932A663714N0347K30199L81508M65550M60666L68992K14122L0960j46440k94428
$$ plain form
10004 581408 1276132 2065787 2917300 3798871 4678956 5527460 6319592 7039615 7681411 8244802
9994 8244802 8729189 9127997 9427655 9612962 9677117 9631234 9507003 9348947 9198680 9079094
9984 9079094 8986648 8894564 8763637 8555671 8246080 7832954 7339624 6809432 6295156 5847326
9974 5847326 5504185 5284592 5185852 5187985 5262213 5378152 5506412 5618733 5689860 5701772 5646546
9963 5646546 5524679 5340269 5097933 4804403 4472396 4121447 3773326 3445213 3146073 2878585
9953 2878585 2644325 2447587 2294421 2187440 2121381 2084927 2068694 2072547 2105347 2177299 2290765
9942 2290765 2434444 2582206 2696849 2739301 2681597 2518959 2276168 2005798 1778062 1663714
9932 1663714 1714061 1944260 2325768 2791318 3251984 3620976 3835098 3866058 3719618 3425190
9922C425190m05472m89007n65630o56911p77754r35344j131724j366045j637063
9913d539760j946741k302320k715899l205121l795954m521548n413505o491320
9905c4932168p755810r182327j0706260j2200178j3447253j4124717j3835675
9898a16184388j2235243r232455n141910o36870L508877O725540Q801473R832443
9890a14562533J0066275R767953R153375Q374633P530276O683797N877588N137205
9882e1971431M472761L884155L366316K909975K502919K137300J817144J556381
9874b9324480J368500J258095J219563J239652J299457J375611J442130J474277
9866a8647195J454723J379610J259361J111942R53243P91447O27596M59746K87922
$$ plain form
9922 3425190 3019718 2530711 1965081 1308170 530416 -404928 -1536652 -2902697 -4539760
9913 -4539760 -6486501 -8788821 -11504720 -14709841 -18505795 -23027343 -28440848 -34932168
9905 -34932168 -42687978 -51870305 -62576565 -74776743 -88223996 -102348713 -116184388
9898 -116184388 -128419631 -137652086 -142793996 -143430866 -139921989 -133196449 -124394976 -114562533
9890 -114562533 -104496258 -94728305 -85574930 -77200297 -69670021 -62986224 -57108636 -51971431
9882 -51971431 -47498670 -43614515 -40248199 -37338224 -34835305 -32698005 -30880861 -29324480
9874 -29324480 -27955980 -26697885 -25478322 -24238670 -22939213 -21563602 -20121472 -18647195
9866 -18647195 -17192472 -15812862 -14553501 -13441559 -12488316 -11696869 -11069273 -10609527 -10321605
9857a0321605J18186l6452j59915k40043k74335k70935k43883k05113j58331r9272
9847a1891698k1091Q1206K10622L68972N54461P57514R59588J136097J260939
9838f583390J311311J273347J147428R49578P07084M50309K04622j4292k00127
9829g54130l51773m68832n50033n94218o01653n75010n21188m53162l88368l41736
9819e600103l17061l03655k82094k35830j61117o9234J9364Q4922J17315J20113
9809f627380J07470R5002R0485R1315R0149Q2995P2771O6850P2186R1730J22963
9798e643464J57741J83344J85470J53623Q7376k83q5836j43639j55458j17106
9788e378232m0656M8224J18397J44966J19023M9870m1132j30817k02873k50588
$$ plain form
9857 -10321605 -10203419 -10239871 -10399786 -10639829 -10914164 -11185099 -11428982 -11634095 -11792426 -11891698
9847 -11891698 -11912789 -11831583 -11620961 -11251989 -10697528 -9940014 -8980426 -7844329 -6583390
9838 -6583390 -5272079 -3998732 -2851304 -1901726 -1194642 -744333 -539711 -554003 -754130
9829 -754130 -1105903 -1574735 -2124768 -2718986 -3320639 -3895649 -4416837 -4869999 -5258367 -5600103
9819 -5600103 -5917164 -6220819 -6502913 -6738743 -6899860 -6969094 -6949730 -6864808 -6747493 -6627380
9809 -6627380 -6519910 -6424908 -6334423 -6243108 -6152959 -6069964 -5997193 -5930343 -5858157 -5766427 -5643464
9798 -5643464 -5485723 -5302379 -5116909 -4963286 -4875910 -4876193 -4962029 -5105668 -5261126 -5378232
9788 -5378232 -5418888 -5370664 -5252267 -5107301 -4988278 -4938408 -4979540 -5110357 -5313230 -5563818
9778e563818k72973k68281k31483j58554n3116P1611J97427L07992L93055M49213
9768e128927M78646M86854M79927M62548M38029M10180L85117L70889L74344L97206
9758h45187M34278M74942N06499N17495N00768M56287L92424L23938K67177K35083
9748C263704K33935K62070L10174L63190M03272M12875L77637K89556J50481k5753
9738F041141k14676l87011n17301n91289o07769n74048m99034l89738k53096r9620
9728A907559N6076J98964L17918M06667M61466M79228M58615M02257L16647K09616
9718E215013Q8344m1022j74520l13180m63206o28924q01321r52012j040322j031436
9708a42586r14741p10995m63926k21650j9185J29056K25755K81610L06601L05200
$$ plain form
9778 -5563818 -5836791 -6105072 -6336555 -6495109 -6548225 -6476614 -6279187 -5971195 -5578140 -5128927
9768 -5128927 -4650281 -4163427 -3683500 -3220952 -2782923 -2372743 -1987626 -1616737 -1242393 -845187
9758 -845187 -410909 64033 570532 1088027 1588795 2045082 2437506 2761444 3028621 3263704
9748 3263704 3497639 3759709 4069883 4433073 4836345 5249220 5626857 5916413 6066894 6041141
9738 6041141 5826465 5439454 4922153 4330864 3723095 3149047 2650013 2260275 2007179 1907559
9728 1907559 1963635 2162599 2480517 2887184 3348650 3827878 4286493 4688750 5005397 5215013
9718 5215013 5303357 5262335 5087815 4774635 4311429 3682505 2881184 1929172 888850 -142586
9708 -142586 -1057327 -1768322 -2232248 -2453898 -2473083 -2344027 -2118272 -1836662 -1530061 -1224861
9698a224861K76950K21770J45998O3779q047n7756q3360r1268r0606q6947p8805
9687a013153n8200j4573N9673J63677K84533L98284M76816M97961M53110L48913
9677A597041K04267M5751r7491j99972k46170k34099j74134q4079J6504J10085
9667I37703J83032K27599K45565K51149K68386L21287M21597N61870P17285Q53267
9657D988740R34410R32732Q35198O49061M01787J34009j12403l06372m35232n05504
9647G516426n36828n51609n64848n78911n85003n69446n20793m34928l16901j79294
9637B677865l7873R3088K02773K82719L25293L24312K77211J86359N8722r4566
9627D295903k57764m10366n29280n94023n93445n31029m25283l03653j92489j08665
$$ plain form
9698 -1224861 -947911 -726141 -580143 -516364 -524411 -582167 -665527 -756795 -847401 -934348 -1013153
9687 -1013153 -1071353 -1085926 -1026253 -862576 -578043 -179759 297057 795018 1248128 1597041
9677 1597041 1801308 1847059 1749568 1549596 1303426 1069327 895193 811114 827618 937703
9667 937703 1120735 1348334 1593899 1845048 2113434 2434721 2856318 3418188 4135473 4988740
9657 4988740 5923150 6855882 7691080 8340141 8741928 8875937 8763534 8457162 8021930 7516426
9647 7516426 6979598 6427989 5863141 5284230 4699227 4129781 3608988 3174060 2857159 2677865
9637 2677865 2639992 2733080 2935853 3218572 3543865 3868177 4145388 4331747 4390469 4295903
9627 4295903 4038139 3627773 3098493 2504470 1911025 1379996 954713 651060 458571 349906
9617C49906n7035l3037k6897k7293k4671j4114L876K5672M8041O9976R2120J15680
9605E22224J42611J76609K23009K86625L68786M65920N70927O75990P74216Q58542
9595E065459R19214R42729R14107Q22172O65281M54257K10636l8774k68007m56216
9585I230858n90182o65768o87918o68218o20910n59881m97673m44918m08495l89192
9575C697703l81597l77685l72410l67394l69575l85686m17240m60218n08422n55831
9565d98355n95634o18880o16457n83475n21744m38450l43378k47226j60629r2350
9555d716578m7088k5148k4801m5268q7293j50189k27143l02273l52190l52503
9545f330474k87062j56120K0387K06940L63718M61300M92251M73279M36315M13672
$$ plain form
9617 349906 292871 259834 232937 205644 180973 166859 170735 196407 244448 314424 406544 522224
9605 522224 664835 841444 1064453 1351078 1719864 2185784 2756711 3432701 4206917 5065459
9595 5065459 5984673 6927402 7841509 8663681 9328962 9783219 9993855 9955081 9687074 9230858
9585 9230858 8640676 7974908 7286990 6618772 5997862 5437981 4940308 4495390 4086895 3697703
9575 3697703 3316106 2938421 2566011 2198617 1829042 1443356 1026116 565898 57476 -498355
9565 -498355 -1093989 -1712869 -2329326 -2912801 -3434545 -3872995 -4216373 -4463599 -4624228 -4716578
9555 -4716578 -4763666 -4788814 -4813615 -4858883 -4946176 -5096365 -5323508 -5625781 -5977971 -6330474
9545 -6330474 -6617536 -6773656 -6753269 -6546329 -6182611 -5721311 -5229060 -4755781 -4319466 -3905794
9535c905794M25857M77603N61048O61406P61787Q46687R04310R27415R13024Q62045
9525C435388P78956O70601N44175M05941K61648J17594j8745j38337k30835k87122
9515E539264l04422k90520k63253k45359k57828l13486m11007n31773o44175p15812
9505A561629p26912o76371n77929m51217l14161j79892n7337M6929J27716J81556
9495a065989K07534K07700J87241J54861J22479J02490J02383J19796J42574J55547
9485D36616J50280J31176J13332J13075J36722J74394K03286J99381J50390O1023
9475A869675n2267j71110k81204l72025m34694m61972m49742l97633l08871j90980
9465a250823n6597P8095J97962K93732L63362M08986M31752M28283L91495L15736
$$ plain form
9535 -3905794 -3479937 -3002334 -2441286 -1779880 -1018093 -171406 732904 1660319 2573343 3435388
9525 3435388 4214344 4884945 5429120 5835061 6096709 6214303 6195558 6057221 5826386 5539264
9515 5539264 5234842 4944322 4681069 4435710 4177882 3864396 3453389 2921616 2277441 1561629
9505 1561629 834717 158346 -419583 -870800 -1184961 -1364853 -1422190 -1375261 -1247545 -1065989
9495 -1065989 -858455 -650755 -463514 -308653 -186174 -83684 18699 138495 281069 436616
9485 436616 586896 718072 831404 944479 1081201 1255595 1458881 1658262 1808652 1869675
9475 1869675 1817408 1646298 1365094 993069 558375 96403 -353339 -750972 -1059843 -1250823
9465 -1250823 -1307420 -1229325 -1031363 -737631 -374269 34717 466469 894752 1286247 1601983
9455A601983K03552P0142n7817j50004j84383j57301q5096M734Q7553J51523J97401
9444A682287K30121K49726K48524K15444J43122L2264j08751k67031m27974n76566
9434A421166o98140p79671q11366p87728p08237n78748m13405k34578o8168O4747
9424c594128J55013K06602K31486K41815K43593K34544K06925J53992P6393j5483
9414a859248j04270j70777j98043j73458r0707M7005K23813M11951N79402P02414
9404f31918P75681Q12885Q36690Q64644Q99259R26661R22930Q64602P38703N48216
9394G558353L10759N1646k04966m42629o53788q35031r79455j072143j093677
9385B639069j030697q86693o85672m66568k71888j35529p3149p7486j21483j70244
$$ plain form
9455 1601983 1805535 1875677 1817860 1667856 1483473 1326172 1241076 1245810 1333363 1484886 1682287
9444 1682287 1912408 2162134 2410658 2626102 2769224 2801488 2692737 2425706 1997732 1421166
9434 1421166 723026 -56645 -868011 -1655739 -2363976 -2942724 -3356129 -3590707 -3658875 -3594128
9424 -3594128 -3439115 -3232513 -3001027 -2759212 -2515619 -2281075 -2074150 -1920158 -1843765 -1859248
9414 -1859248 -1963518 -2134295 -2332338 -2505796 -2596503 -2549498 -2325685 -1913734 -1334332 -631918
9404 -631918 143763 956648 1793338 2657982 3557241 4483902 5406832 6271434 7010137 7558353
9394 7558353 7869112 7920758 7715792 7273163 6619375 5784344 4804889 3732746 2639069
9385 2639069 1608372 721679 36007 -430561 -702449 -837978 -911127 -988613 -1110096 -1280340
9375a280340j97145j94635j73174j50576j40735j48425j70410j99510k29127k56719
9365c140796k84190l14167l44782l67762l71989l49895l01773k35166j59876q1913
9355e952309m66Q9369J89191K90258L72866M14271M01153L38765K50654J69049
9345c437199J21817J23277J72457K57395L61219M66594N57578O20026O41811O13710
9335D98685N31305L97984K27838M5447j19881k44032l16601l42704l37614l18629
9325B1798k98990k85737k80686k82925k91358l05817l26261l50987l75558l92962
9315c169483l94310l70148l13740k26169j19443j3112P5027J37496J78894K11237
9305d003751K48030L00329L73948M66791N68023O61025P28651P57251P38063O67794
$$ plain form
9375 -1280340 -1477485 -1672120 -1845294 -1995870 -2136605 -2285030 -2455440 -2654950 -2884077 -3140796
9365 -3140796 -3424986 -3739153 -4083935 -4451697 -4823686 -5173581 -5475354 -5710520 -5870396 -5952309
9355 -5952309 -5952775 -5863406 -5674215 -5383957 -5011091 -4596820 -4195667 -3856902 -3606248 -3437199
9345 -3437199 -3315382 -3192105 -3019648 -2762253 -2401034 -1934440 -1376862 -756836 -115025 498685
9335 498685 1029990 1427974 1655812 1701259 1581378 1337346 1020745 678041 340427 21798
9325 21798 -277192 -562929 -843615 -1126540 -1417898 -1723715 -2049976 -2400963 -2776521 -3169483
9315 -3169483 -3563793 -3933941 -4247681 -4473850 -4593293 -4606405 -4531378 -4393882 -4214988 -4003751
9305 -4003751 -3755721 -3455392 -3081444 -2614653 -2046630 -1385605 -656954 100297 838360 1506154
9295A506154N50046L96169K22694M5257j26823k90199m40800n66515o46832o61485
9285a2334o02167m78337l12999j32143M4880K09257L60959N03713O38602P58133
9275I77564Q44168Q73029Q26662P03242N20023L07103R6794q5509k25887l21572
9265D515617l76965l98792l93517l67592l27789k79062k21410j49860n9558M7122
9255A988194J57103K50111L07220L18816K87201K23614J43205O1284q337n3947
9245C674464o6555m1208K0920J11082K14281L13799L96499M55783M91377N07386
9235F077828N10280N07608N07056N14669N31539N50797N58538N39642M84647L92770
9225A1175374K70788J31223q716j30055k18570k71568k98786l15396l31751l47380
$$ plain form
9295 1506154 2056200 2452369 2675063 2720320 2593497 2303298 1862498 1295983 649151 -12334
9285 -12334 -614501 -1092838 -1405837 -1537980 -1493100 -1283843 -922884 -419171 219431 977564
9275 977564 1821732 2694761 3521423 4224665 4744688 5051791 5148585 5063076 4837189 4515617
9265 4515617 4138652 3739860 3346343 2978751 2650962 2371900 2150490 2000630 1941072 1988194
9255 1988194 2145297 2395408 2702628 3021444 3308645 3532259 3675464 3736748 3728411 3674464
9245 3674464 3607909 3566701 3587621 3698703 3912984 4226783 4623282 5079065 5570442 6077828
9235 6077828 6588108 7095716 7602772 8117441 8648980 9199777 9758315 10297957 10782604 11175374
9225 11175374 11446162 11577385 11568669 11438614 11220044 10948476 10649690 10334294 10002543 9655163
9215I655163l53234l39677l04136k53934k04081j72313j73542k15242k95047m00851
9205F943106n12251o02995o46236o23708n35100m00685k53816j27358m1886q68
9195C198203O903N76oK0343O8858J42580K27674L02345L43869L36575K76758J73346
9183E098024M5849p9283j74444k18899k06771j50874p9067k3502p705l8489j06571
9172D058268j93963k82999l62998m33081n00368n73493o54289p33424p94266q22835
9162a293448q15853p79789p20993o35394n07401l20656p3237K13968N02094P49185
9152c681524R25814J022722J047970J018191R51187Q63447P70116O82931O05911
9143D206765N33098M51825L50157K24117Q1148o1616j84020k71902l23601l49841
$$ plain form
9215 9655163 9301929 8962252 8658116 8404182 8200101 8027788 7854246 7639004 7343957 6943106
9205 6943106 6430855 5827860 5181624 4557916 4022816 3622131 3368315 3240957 3199071 3198203
9195 3198203 3205106 3205682 3205676 3226019 3294877 3437457 3665131 3967476 4311345 4647920 4924678 5098024
9183 5098024 5143873 5064590 4890146 4671247 4464476 4313602 4234535 4211033 4203328 4164839 4058268
9172 4058268 3864305 3581306 3218308 2785227 2284859 1711366 1057077 323653 -470613 -1293448
9162 -1293448 -2109301 -2889090 -3610083 -4245477 -4752878 -5073534 -5146771 -4932803 -4430709 -3681524
9152 -3681524 -2755710 -1732988 -685018 333173 1284360 2147807 2917923 3600854 4206765
9143 4206765 4739863 5191688 5541845 5765962 5847110 5785494 5601474 5329572 5005971 4656130
9133D656130l67628l92933m36232n01078n83666o72754p51226q00068q03135p50115
9123a402705o37178m67607k54254k1614J97065L68854M71094M95234M43449L23838
9113d83824J50139n4374k54809m10248m87202m74222l88134k66777j52407p6059
9103b897917n0361p0838j21494j81580k32041k59574k56771k19703j46329l7198
9093d473806J02801K63245M28260N78859O98128P77355Q19034Q34630Q38695Q42527
9083A709728Q49396Q52755Q39015P94774P14851O05997M83376L61643K46573J34019
9073G592127J8399r5370j87008k28495j99170r7882N4725K23481L70837M67868
9063G919512M99238M61179L56850J94824q554k27666m31507n91811o90047p19059
$$ plain form
9133 4656130 4288502 3895569 3459337 2958259 2374593 1701839 950613 150545 -652590 -1402705
9123 -1402705 -2039883 -2507490 -2761744 -2783358 -2586293 -2217439 -1746345 -1251111 -807662 -483824
9113 -483824 -333685 -388059 -642868 -1053116 -1540318 -2014540 -2402674 -2669451 -2821858 -2897917
9103 -2897917 -2948278 -3019116 -3140610 -3322190 -3554231 -3813805 -4070576 -4290279 -4436608 -4473806
9093 -4473806 -4371005 -4107760 -3679500 -3100641 -2402513 -1625158 -806124 28506 867201 1709728
9083 1709728 2559124 3411879 4250894 5045668 5760519 6366516 6849892 7211535 7458108 7592127
9073 7592127 7610526 7515156 7328148 7099653 6900483 6802601 6857326 7080807 7451644 7919512
9063 7919512 8418750 8879929 9236779 9431603 9423049 9195383 8763876 8172065 7482018 6762959
9053F762959o80292n81306m37096k72740j21019j2165L8702L7377N883k8331m2568
9042D669404k4593K6644J03728J93849K79823L40369L53892L06804K01624N9038
9032F510582q7425k01204k53947k34995j54624l8117Q6313J98134K88537L58869
9022F472123M16512M69570N21072N65369N89269N76757N13621L90316K04882l3149
9012A0686342l00700n64700p90771r52127j034423j036173r66737q43011o84852
9003C512848n10434l33741j64676r740J28654K53363L71516M90487O13215P36020
8993E087512Q49683R41680R97464J001195R38183Q00018N89799L23578K6429k74261
8983A1281280n54186p94066r79191j099188j149586j134473j067634r69921q62933
$$ plain form
9053 6762959 6082667 5501361 5064265 4791525 4670506 4658341 4697043 4734420 4740303 4711972 4669404
9042 4669404 4644811 4671455 4775183 4969032 5248855 5589224 5943116 6249920 6451544 6510582
9032 6510582 6423157 6221953 5968006 5733011 5578387 5540270 5626583 5824717 6113254 6472123
9022 6472123 6888635 7358205 7879277 8444646 9033915 9610672 10124293 10514609 10719491 10686342
9012 10686342 10385642 9820942 9030171 8078044 7043621 6007448 5040711 4197700 3512848
9003 3512848 3002414 2668673 2503997 2494257 2622911 2876274 3247790 3738277 4351492 5087512
8993 5087512 5937195 6878875 7876339 8877534 9815717 10615735 11205534 11529112 11555541 11281280
8983 11281280 10727094 9933028 8953837 7854649 6705063 5570590 4502956 3533035 2670102
8974B670102p61550o68953n76658m69947l36024j70491K1150K26710M31764O22175
8964I88278P84219R04383R71018R78359R30709Q43076P36050O27016N23385M22315
8954H708808L16619K02530Q4549k5422j14183j74856k10824k33109k53629k79460
8944H021023l11340l45391l75360l94013l93948l68537l13355k28034j17642P957
8934E181360J37224K60759L73124M72042N56720O26724O80702P14348P19608O88065
8924A0410676O17506N16168M00677K89810J99611J41694J21860J36977J72760
8915A3007739K06356K13874J78919R8200j7399j46230k62563l44081l77432l60547
8905A2196836l02030k17989j26554m1597L0832R1063J40787J78649J99421J96168
$$ plain form
8974 2670102 1908552 1239599 662941 192994 -143030 -313521 -292371 -65661 366103 988278
8964 988278 1772497 2676880 3647898 4626257 5556966 6400042 7136092 7763108 8286493 8708808
8954 8708808 9025427 9227957 9312506 9287084 9172901 8998045 8787221 8554112 8300483 8021023
8944 8021023 7709683 7364292 6988932 6594919 6200971 5832434 5519079 5291045 5173403 5181360
8934 5181360 5318584 5579343 5952467 6424509 6981229 7607953 8288655 9003003 9722611 10410676
8924 10410676 11028182 11544350 11945027 12234837 12434448 12576142 12698002 12834979 13007739
8915 13007739 13214095 13427969 13606888 13705088 13687689 13541459 13278896 12934815 12557383 12196836
8905 12196836 11894806 11676817 11550263 11508666 11539498 11630561 11771348 11949997 12149418 12345586
8895A2345586J62916R6451k403j27829k69544m15850n57909o92046q17808r33271
8885H788293j031642j102386j136051j128729j082828j005239r06174p99257o98758
8876a02771o11678n30015m32701k99098j23931P8891K85354M73259O27087P35708
8866A00105P89813P83403P16980N98145M39339K56193O8428r9300k20996k77962
8856C154148k68073k09690j37014q8017q9709j47376k43546l47705m31348m79533
8846G12137m92892m80485m49707m00330l26001k20827q5593P0513K33080L88171
8836a051934N27122O47438P48875Q27850Q75898Q84629Q53139P90445P10052O21183
8826F434697N24363M15295K93897J70886O5777l182l0290k7387j9900l6740r9013
$$ plain form
8895 12345586 12508502 12604953 12602550 12474721 12205177 11789327 11231418 10539372 9721564 8788293
8885 8788293 7756651 6654265 5518214 4389485 3306657 2301418 1395244 595987 -102771
8876 -102771 -714449 -1244464 -1677165 -1976263 -2100194 -2021303 -1735949 -1262690 -635603 100105
8866 100105 889918 1673321 2390301 2988446 3427785 3683978 3752406 3653106 3432110 3154148
8856 3154148 2886075 2676385 2539371 2451354 2361645 2214269 1970723 1623018 1191670 712137
8846 712137 219245 -261240 -710947 -1111277 -1437278 -1658105 -1743698 -1673185 -1440105 -1051934
8836 -1051934 -524812 122626 871501 1699351 2575249 3459878 4313017 5103462 5813514 6434697
8826 6434697 6959060 7374355 7668252 7839138 7904915 7901733 7871443 7844056 7824156 7787416 7688403
8815G688403k12078l63665n27956o72802p67260p88628p28609n96263m15089k14944
8805B401109k2591J45595K86659M07953N17802O15632O90183P27866P22654O77460
8795G170322N97441M84831L41689J76458O031j49179k72355l54094l92497l92473
8785G216174l65767l29619l01772k93588l06358l33686l66992l98678m21348m26629
8775C671737m06989l59081k84473j86645o7967O9590K21100L77049N25364O54156
8765D213841P52009Q07230Q10278P59617O65609N47365M24356L09409K07801J21117
8755I618632N1501K972k0504j8450L692L4975O2183P4150O5016L5194j0242o5156
8743I833963j26263j95274k77880l79940n02437o37279p65926q62510r01467q67125
$$ plain form
8815 7688403 7476325 7112660 6584704 5911902 5144642 4356014 3627405 3031142 2616053 2401109
8805 2401109 2378518 2524113 2810772 3218725 3736527 4352159 5042342 5770208 6492862 7170322
8795 7170322 7767763 8252594 8594283 8770741 8776772 8627593 8355238 8001144 7608647 7216174
8785 7216174 6850407 6520788 6219016 5925428 5619070 5285384 4918392 4519714 4098366 3671737
8775 3671737 3264748 2905667 2621194 2434549 2366582 2436172 2657272 3034321 3559685 4213841
8765 4213841 4965850 5773080 6583358 7342975 8008584 8555949 8980305 9289714 9497515 9618632
8755 9618632 9670133 9673105 9652601 9634151 9637843 9672818 9735001 9809151 9874167 9909361 9899119 9833963
8743 9833963 9707700 9512426 9234546 8854606 8352169 7714890 6948964 6086454 5184987 4317862
8733D317862p60677o00592m15834k35352p9263M4251J36150K01179K44066K69355
8723C121145K83405K95230L14387L47465L96428M59742N33756O11609O80740P23298
8713G767205P22155O69758N73574M53773L34541K34690J62888J18651R6096Q6513
8703A1219844P8734O0189K1826l4257r1050j22837j09843n1634L0495J03432J37064
8692A1241963J14987L7098q4246k30235l80496n16122o22065o89593p17276p08940
8682G445075o70135o07108n29476m52560l94554l68777l76384m04482m30539m30418
8672B780642l86681k94196j61043m328J56836L07180M36922N39633O10393O47671
8662D633029O57306O52787O48422O49315O46488O21704N58512M51333L06789J38236
$$ plain form
8733 4317862 3557185 2956593 2540759 2305407 2226144 2270395 2406545 2607724 2851790 3121145
8723 3121145 3404550 3699780 4014167 4361632 4758060 5217802 5751558 6363167 7043907 7767205
8713 7767205 8489360 9159118 9732692 10186465 10521006 10755696 10918584 11037235 11133331 11219844
8703 11219844 11298578 11358767 11380593 11346336 11255286 11132449 11022606 10970972 11001467 11104899 11241963
8692 11241963 11356950 11394048 11309802 11079567 10699071 10182949 9560884 8871291 8154015 7445075
8682 7445075 6774940 6167832 5638356 5185796 4791242 4422465 4046081 3641599 3211060 2780642
8672 2780642 2393961 2099765 1938722 1934394 2091230 2398410 2835332 3374965 3985358 4633029
8662 4633029 5290335 5943122 6591544 7240859 7887347 8509051 9067563 9518896 9825685 9963921
8652I963921m0324k15661l72603m93081n61175n71970n36949m81129m33280m15155
8642E842594m35490m91140n73205o72773p81862q90030r81641j038751j049399
8633a071697j015768r55284q91895q42469q07785p74523p25469o49451n44857
8624h279198m17432k76197j30293J2323J43816K54101L29990L58321L32315K57939
8614g414315J56723O2251R161J8269Q6670J90921L02075M01602M86999N65476
8604e134168O43266P19066P84269Q27081Q37052Q08890P45526O59162N68079M89178
8594A947401M30061L85943L43603K89628K17790J31781M2905l5433r4095j33215
8584C526369j63343k00577k56248l26462l89073m11931l68323k50333p2815J32710
$$ plain form
8652 9963921 9923597 9707936 9335333 8842252 8281077 7709107 7172158 6691029 6257749 5842594
8642 5842594 5407104 4915964 4342759 3669986 2888124 1998094 1016453 -22298 -1071697
8633 -1071697 -2087465 -3042749 -3934644 -4777113 -5584898 -6359421 -7084890 -7734341 -8279198
8624 -8279198 -8696630 -8972827 -9103120 -9090797 -8946981 -8692880 -8362890 -8004569 -7672254 -7414315
8614 -7414315 -7257592 -7195341 -7186180 -7167911 -7081241 -6890320 -6588245 -6186643 -5699644 -5134168
8604 -5134168 -4490902 -3771836 -2987567 -2160486 -1323434 -514544 230982 890144 1458223 1947401
8594 1947401 2377462 2763405 3107008 3396636 3614426 3746207 3789112 3753679 3659584 3526369
8584 3526369 3363026 3162449 2906201 2579739 2190666 1778735 1410412 1160079 1087264 1219974
8574A219974L29512M86790N86875O27296O18281N77502N24277M74658M37673M13025
8564F295863L91655L60420L09342K36948J50363O1699j4864o3666o9037k0906
8554G637817P7322K04864L28500M15508M48202M31817L90701L54682L43910L60760
8544A0994083L91679M15748M14649L80043L15427K31354J36682L2466q6212k21944
8534A3003975l67547n05800o16229o83508p02233o76730o18060n41001m62490
8525G830377m00929l74204l94759m63055n64249o71960p57690p99949p88671p25372
8515A889539o21343m94229l62807k42012j41106o4434j1836K1766M4586O2957
8505H1081P6775P9846O4777K8658k3417p8165j18200j29874j10231o6985j0732
$$ plain form
8574 1219974 1549486 2036276 2623151 3250447 3868728 4446230 4970507 5445165 5882838 6295863
8564 6295863 6687518 7047938 7357280 7594228 7744591 7806290 7791426 7727760 7658723 7637817
8554 7637817 7715139 7920003 8248503 8664011 9112213 9544030 9934731 10289413 10633323 10994083
8544 10994083 11385762 11801510 12216159 12596202 12911629 13142983 13279665 13312131 13225919 13003975
8534 13003975 12636428 12130628 11514399 10830891 10128658 9451928 8833868 8292867 7830377
8525 7830377 7429448 7055244 6660485 6197430 5633181 4961221 4203531 3403582 2614911 1889539
8515 1889539 1268196 773967 411160 169148 28042 -36392 -48228 -26462 18124 81081
8505 81081 157856 237702 302479 331137 307720 229555 111355 -18519 -128750 -195735 -206467
8494b06467N3864J30231K24381L37510M62802N87613O97919P81566Q29437Q35914
8484D734770P99926P25865O22625N00420L67620K30485R5919k5998j23450j88610
8474G739572k23232k38818k50106k66381k87022l03780l06931k90412k53893k02930
8464E116067j48991j08728j00288j36087k15367l21845m29286n12588n58172n68197
8454B016518n56947n42267n37364n47530n72446o10216o58643p12822p62201p90716
8444d274634p80883p20084o06127m49002k67024p9265J00513K64568M08098N27294
8434e876546O20666O90674P41994P77165P93940P87171P53942O97861O29678N64161
8424A180706N15244M91701M94674N17541N48173N72968N81084N66510N26864M60328
$$ plain form
8494 -206467 -152603 -22372 202009 539519 1002321 1589934 2287853 3069419 3898856 4734770
8484 4734770 5534696 6260561 6883186 7383606 7751226 7981711 8077630 8051632 7928182 7739572
8474 7739572 7516340 7277522 7027416 6761035 6474013 6170233 5863302 5572890 5318997 5116067
8464 5116067 4967076 4858348 4758060 4621973 4406606 4084761 3655475 3142887 2584715 2016518
8454 2016518 1459571 917304 379940 -167590 -740036 -1350252 -2008895 -2721717 -3483918 -4274634
8444 -4274634 -5055517 -5775601 -6381728 -6830730 -7097754 -7177019 -7076506 -6811938 -6403840 -5876546
8434 -5876546 -5255880 -4565206 -3823212 -3046047 -2252107 -1464936 -710994 -13133 616545 1180706
8424 1180706 1695950 2187651 2682325 3199866 3748039 4321007 4902091 5468601 5995465 6455793
8414F455793L64087K36729Q3290q1647k37039l64050m54573n13498n53339n85363
8404D350390o12581o27455o13995n52570m25715k23638N1449L83023P41123J086857
8394C556888J379032J580146J660918J604874J413530J109098P31023L27054n6505
8385A3306058l81843o24026p73518q35999q28702p75086p00295o27482n73539
8376G185568n44798n35623n31880n17655m81740m21432l43284k61454j93975j57040
8366C196687j58000j89785k30743k52209k31096j60533n2220P0341J82632K67088
8356B442162L14541L21217K86474K14599J18316J8408o2692j08670j11385o6311
8346C366659L1767J85823L88109O15654Q36444J022399J158576J241902J272761
$$ plain form
8414 6455793 6819880 7056609 7139899 7058252 6821213 6457163 6002590 5489092 4935753 4350390
8404 4350390 3737809 3110354 2496359 1943789 1518074 1294436 1345885 1728908 2470031 3556888
8394 3556888 4935920 6516066 8176984 9781858 11195388 12304486 13035509 13362563 13306058
8385 13306058 12924215 12300189 11526671 10690672 9861970 9086884 8386589 7759107 7185568
8376 7185568 6640770 6105147 5573267 5055612 4573872 4152440 3809156 3547702 3353727 3196687
8366 3196687 3038687 2848902 2618159 2365950 2134854 1974321 1922101 1992442 2175074 2442162
8356 2442162 2756703 3077920 3364394 3578993 3697309 3715717 3653025 3544355 3432970 3366659
8346 3366659 3398426 3584249 3972358 4588012 5424456 6446855 7605431 8847333 10120094
8337A0120094J247664J158698R99212P71508M91775J89464r8734l37617n01795
8328A4040269n81763n86444n40498m75731m19471l85768l73911l73797l73908
8319I928978l67060l51641l29000k99971k63640k19316j69627j21435q2968n9281
8309G665039n0165n2805o6447r3660j36031j88355k37154k64827k55840k01686
8299F118069j04257K2625J55718K69930L47710L84710L88714L73370L50634L26152
8289H633375K99736K69605K35794J99509J60165J14505N9222n858p7200j49587
8279I739266k18569k81526l36991l83172m17401m37501m43727m39240m29281m20999
8269E930859m23796m47121m94672n59440o25243o74379o94962o82450o36147n55567
$$ plain form
8337 10120094 11367758 12526456 13525668 14297176 14788951 14978415 14879681 14542064 14040269
8328 14040269 13458506 12872062 12331564 11855833 11436362 11050594 10676683 10302886 9928978
8319 9928978 9561918 9210277 8881277 8581306 8317666 8098350 7928723 7807288 7724320 7665039
8309 7665039 7614874 7562069 7495622 7401962 7265931 7077576 6840422 6575595 6319755 6118069
8299 6118069 6013812 6036437 6192155 6462085 6809795 7194505 7583219 7956589 8307223 8633375
8289 8633375 8933111 9202716 9438510 9638019 9798184 9912689 9971911 9966053 9888853 9739266
8279 9739266 9520697 9239171 8902180 8519008 8101607 7664106 7220379 6781139 6351858 5930859
8269 5930859 5507063 5059942 4565270 4005830 3380587 2706208 2011246 1328796 692649 137082
8259A37082m40437k94328j29054L4025J68542K52459K76975K48888J84704J01447
8249E40303J1761p3542j40271j70900j52603q7271N358R4769J52495J63416J30743
8238D74258P3469J7650j4867j5059J1793N2202R3866J32275J70620K14347K65484
8227A476038L21082L75290M21331M51503M57358M32345L75633K94011K00892J13833
8217D919316N1631L0683O1033J43713K70399M24935N85981P30271Q35582Q82618
8207H936162Q56976P52986N78186L54008J10442j21658l15260m48348n05889m85041
8197I712564m00255k82619j71177r9382q3314j17530j80031k42592k80674k79796
8187G575194k39004j72168j05451o8553q1283j42227k27458l01579l34528l13224
$$ plain form
8259 137082 -303355 -597683 -726737 -692712 -524170 -271711 5264 254152 438856 540303
8249 540303 552064 478522 338251 167351 14748 -72523 -67165 27604 180099 343515 474258
8238 474258 547727 565377 550510 535451 547244 599446 693312 825587 996207 1210554 1476038
8227 1476038 1797120 2172410 2593741 3045244 3502602 3934947 4310580 4604591 4805483 4919316
8217 4919316 4970947 5001630 5062663 5206376 5476775 5901710 6487691 7217962 8053544 8936162
8207 8936162 9793138 10546124 11124310 11478318 11588760 11467102 11151842 10703494 10197605 9712564
8197 9712564 9312309 9029690 8858513 8759131 8675817 8558287 8378256 8135664 7854990 7575194
8187 7575194 7336190 7164022 7058571 6990018 6908735 6766508 6539050 6237471 5902943 5589719
8177E589719k42181j36958j8653Q7572J54121J56975Q4192n8929k51488m63804
8167D900566o65636q32546r48746j006455j003279r39584q17406o41770m24124
8158b378980j85477M4771K36378L69025M39550M60652M52000M29748M01387L68924
8148F37978L36658L15425L17764L47127L91230M27026M34385M07415L54805K91180
8138D260993K29189J79305J54304J69644K35658L47278M81076O03611O85911P14626
8128H061595O93804O38318N64839M86085M09866L40449K79278K24440J70290J08905
8118A1977869L3680n6517j55479k51932l34364l94751m29377m38044m22803l85368
8108I142914l23668k31570j04781N1124K18417L73472M95857N73142O00133N76130
$$ plain form
8177 5589719 5347538 5210580 5191927 5279499 5433620 5590595 5674787 5615858 5364370 4900566
8167 4900566 4234930 3402384 2453638 1447183 443904 -495680 -1313086 -1954856 -2378980
8158 -2378980 -2564457 -2519686 -2283308 -1914283 -1474733 -1014081 -562081 -132333 269054 637978
8148 637978 974636 1290061 1607825 1954952 2346182 2773208 3207593 3615008 3969813 4260993
8138 4260993 4490182 4669487 4823791 4993435 5229093 5576371 6057447 6661058 7346969 8061595
8128 8061595 8755399 9393717 9958556 10444641 10854507 11194956 11474234 11698674 11868964 11977869
8118 11977869 12011549 11955032 11799553 11547621 11213257 10818506 10389129 9951085 9528282 9142914
8108 9142914 8819246 8587676 8482895 8534019 8752436 9125908 9621765 10194907 10795040 11371170
8098A1371170N03359L87084K36663O6542j04326k55734l71649m45613m83207m99467
8088A0404822n11960n33647n69974o20480o80679p41278p86772p97574p56307
8079D406151o54594m96441k96821p6337J45868L57872N56381P42878R16567J068166
8069F669690J178847J226392J196121J090083R28254P40875N56715L93623K55361
8060A4235961J35085K2742q7940j96377k96657l81669m47325m94534n27365n47795
8050A1414126n50909n25612m62129l61517k40231j26291m9329k9624p0747j58075
8040H839662k63180l52796l99821l92822l39730k63006j87956j30454r1107n8507
8030F360283j8337L7952J09638J88956K66325L35149L94109M46528M97050N46767
$$ plain form
8098 11371170 11874529 12261613 12498276 12564818 12460492 12204758 11833109 11387496 10904289 10404822
8088 10404822 9892862 9359215 8789241 8168761 7488082 6746804 5960032 5162458 4406151
8079 4406151 3751557 3255116 2958295 2881958 3027826 3385698 3942079 4684957 5601524 6669690
8069 6669690 7848537 9074929 10271050 11361133 12289387 13030262 13586977 13980600 14235961
8060 14235961 14371046 14393788 14305848 14109471 13812814 13431145 12983820 12489286 11961921 11414126
8050 11414126 10863217 10337605 9875476 9513959 9273728 9147437 9098108 9068484 8997737 8839662
8040 8839662 8576482 8223686 7823865 7431043 7091313 6828307 6640351 6509897 6418790 6360283
8030 6360283 6341946 6379898 6489536 6678492 6944817 7279966 7674075 8120603 8617653 9164420
8020I164420N88993O08678N87148N10677L78627K06425K1164j48208k80830l68755
8010A1268339m15117m28758m19568l95959l62852l19572k60239j79547q1967J2607
8000H417367P2852O9172j1408j57566l37878n14278o56530p49464p90776p84091
7990D557400p33770o43973n20333l71866k11475n3909Q8932K12243L17491M05772
7980C046512M70443M95604M62542L60369J94456j2695k29020m23953n75357o69271
7970C119630o96972o55220n49350l93695k06733m536K02555M09023O10856Q01198
7960B636756R66515J086269J138206J107012R90832Q02149N64131L05628N6671
7951I654169j55644l11329m01521m30919m16432l80652l42276l09159k78924k46178
$$ plain form
8020 9164420 9753413 10362091 10949239 11459916 11838543 12044968 12066132 11917924 11637094 11268339
8010 11268339 10853222 10424464 10004896 9608937 9246085 8926513 8666274 8486727 8404760 8417367
8000 8417367 8490219 8559391 8547983 8390417 8052539 7538261 6881731 6132267 5341491 4557400
7990 4557400 3823630 3179657 2659324 2287458 2075983 2022074 2111006 2323249 2640740 3046512
7980 3046512 3516955 4012559 4475101 4835470 5029926 5017231 4788211 4364258 3788901 3119630
7970 3119630 2422658 1767438 1218088 824393 617660 613124 815679 1224702 1835558 2636756
7960 2636756 3603271 4689540 5827746 6934758 7925590 8727739 9291870 9597498 9654169
7951 9654169 9498525 9187196 8785675 8354756 7938324 7557672 7215396 6906237 6627313 6381135
7941F381135k09934j75447j50707j42551j56028j95880k66364l68177m94842o32125
7931C589080p61291q64007r26240r40619r07994q37732p44611o41713n33017m11510
7921c979654k65051q6202J20701L39729N50318P36075Q89360J008687J092365
7912D06328J135164J131096J078517R81982Q50651O97272N39144L97368K91335
7903G508857K31471K16418K36809K81754L42806M13945M89461N62250O23823O66239
7893A1573833O85002O80580O56841O17641N65002N00339M26253L45825K59910
7884A6311226J65501N6707p2486k24561l94710n70030p34951q80934j012215j141276
7874A1502271j276976j414303j531892j597604j579485j458610j238683r47041
$$ plain form
7941 6381135 6171201 5995754 5845047 5702496 5546468 5350588 5084224 4716047 4221205 3589080
7931 3589080 2827789 1963782 1037542 96923 -811071 -1648803 -2393414 -3035127 -3568144 -3979654
7921 -3979654 -4244705 -4330907 -4210206 -3870477 -3320159 -2584084 -1694724 -686037 406328
7912 406328 1541492 2672588 3751105 4733087 5583738 6281010 6820154 7217522 7508857
7903 7508857 7740328 7956746 8193555 8475309 8818115 9232060 9721521 10283771 10907594 11573833
7893 11573833 12258835 12939415 13596256 14213897 14778899 15279238 15705491 16051316 16311226
7884 16311226 16476727 16533434 16460948 16236387 15841677 15271647 14536696 13655762 12643547 11502271
7874 11502271 10225295 8810992 7279100 5681496 4102011 2643401 1404718 457677
7866D57677o26212l20248o1924J34758K74288L71961M43674M99584N44200N79565
7856B297323O07127O27416O39218O39672O25809N97074N56895N10851M62078M08268
7846G971731L43654K64425J73399Q1666P034l0727j7568M7074J46762K51286L25835
7835I564571L42858K91776J81714L5726j19407k61196l73854m46532m71009m41784
7825H302863l59950k39141j08265n742L4030n594j17732k76270m46169n94078
7815F183952o95532p37726p18799o45191n28374l81956k20014n6766R3654K18552
7805B511800L08571L58349L65932L33055K67078J82162R6916K9246q000q673K6517
7794D462953Q9538J64890K32121K71688K71595K30640J56358N9874m7737j54763
$$ plain form
7866 457677 -168535 -488783 -550707 -415949 -141661 230300 673974 1173558 1717758 2297323
7856 2297323 2904450 3531866 4171084 4810756 5436565 6033639 6590534 7101385 7563463 7971731
7846 7971731 8315385 8579810 8753209 8834875 8841909 8811182 8793614 8840688 8987450 9238736 9564571
7835 9564571 9907429 10199205 10380919 10416645 10297238 10036042 9662188 9215656 8744647 8302863
7825 8302863 7942913 7703772 7595507 7589765 7623795 7618201 7500469 7224199 6778030 6183952
7815 6183952 5488420 4750694 4031895 3386704 2858330 2476374 2256360 2199594 2293248 2511800
7805 2511800 2820371 3178720 3544652 3877707 4144785 4326947 4423863 4453109 4445109 4436436 4462953
7794 4462953 4552491 4717381 4949502 5221190 5492785 5723425 5879783 5939657 5891920 5737157
7784E737157k45754l00649k98880k26663q2981J18808L53441N88115P87440R19107
7774G349141R60122R01717P50683N26889K58941k0066k76651m81906o17031o77140
7764H674699o70867o15424n29347m26726l15795k01966r2203L598P5832J20274
7754F022075J40425J45481J46039J50329J61068J72459J69540J33552N2685o8377
7744G225276k07292l32260m14233m36961m01690l25733k35664j57526j08266r1758
7734D513893r9901j16800j23993j05676n3095L2861J41952K58154L65729M55277
7724E268401N26371N84885O36866O83564P20982P43388P47053P31137O95667O39212
7714A1977526N58981M53813L27499J89056M9306q2915k01244k99763l72840m18865
$$ plain form
7784 5737157 5491403 5190754 4891874 4665211 4582230 4701038 5054479 5642594 6430034 7349141
7774 7349141 8309263 9210980 9961663 10488552 10747493 10727427 10450776 9968870 9351839 8674699
7764 8674699 8003832 7388408 6859061 6432335 6116540 5914574 5822371 5825969 5901801 6022075
7754 6022075 6162500 6307981 6454020 6604349 6765417 6937876 7107416 7240968 7293653 7225276
7744 7225276 7017984 6685724 6271491 5834530 5432840 5107107 4871443 4713917 4605651 4513893
7734 4513893 4413992 4297192 4173199 4067523 4014428 4047289 4189241 4447395 4813124 5268401
7724 5268401 5794772 6379657 7016523 7700087 8421069 9164457 9911510 10642647 11338314 11977526
7714 11977526 12536507 12990320 13317819 13506875 13556181 13473266 13272022 12972259 12599419 12180554
7704A2180554m44011m60793m81438n11284n46835n78305n94324n86725n53951
7695G422888n00836m34387l58498k72082j71785n6663O8488J92443K99253L72171
7685F560992L99505L80418L27288K62112K08254J82212J89837K27353K84304L46462
$$ plain form
7704 12180554 11736543 11275750 10794312 10283028 9736193 9157888 8563564 7976839 7422888
7695 7422888 6922052 6487665 6129167 5857085 5685300 5628637 5697125 5889568 6188821 6560992
7685 6560992 6960497 7340915 7668203 7930315 8138569 8320781 8510618 8737971 9022275 9368737
$$ [...]
##END NTUPLES=NMR SPECTRUM
##END=
