##TITLE=31Pdec_PH-Glu_TFAA
 CDCl3
 64 sc
 5.2.2024
##JCAMPDX= 6.0         $$ Bruker NMR JCAMP-DX V2.0
##DATA TYPE= NMR SPECTRUM
##DATA CLASS= NTUPLES
##ORIGIN= UXNMR, Bruker Analytische Messtechnik GmbH
##OWNER= root
$$ XWIN-NMR		Version 3.5
$$ Mon Feb  5 14:32:00 2024 Russian Standard Time (UT+4h)  she@DPX200
##.OBSERVE FREQUENCY= 81.013821
##.OBSERVE NUCLEUS= ^31P
##.ACQUISITION MODE= SIMULTANEOUS
##.ACQUISITION SCHEME= undefined
##.AVERAGES= 64
##.DIGITISER RES= 16
##SPECTROMETER/DATA SYSTEM= spect
##.PULSE SEQUENCE= zgpg30
##.SOLVENT NAME= CDCl3
##.SHIFT REFERENCE= (INTERNAL, CDCl3, 0, 248.564)
##AUDIT TRAIL= $$ (NUMBER, WHEN, WHO, WHERE, WHAT)
$$ ##TITLE= Audit trail, XWIN-NMR		Version 3.5
$$ ##JCAMPDX= 5.01
$$ ##ORIGIN= Bruker BioSpin GmbH
$$ ##OWNER= she
$$ F:/spectra/data/she/nmr/P31/1/pdata/1/auditp.txt
$$ ##AUDIT TRAIL=  $$ (NUMBER, WHEN, WHO, WHERE, WHAT)
(   1,<2024-02-05 14:30:08.21 +0400>,<she>,<DPX200>,
      <continue with go, POWCHK disabled, PULCHK disabled
       configuration hash MD5:
       00 E9 B6 7A A2 85 ED C7 34 08 36 98 17 FE 4E 26
       data hash MD5: 32K
       4F F4 A1 55 81 2E 98 CA 5C B2 14 88 52 1E CA 71>)
(   2,<2024-02-05 14:30:13.62 +0400>,<she>,<DPX200>,
      <Start of raw data processing
       efp BC_mod = 2 LB = 10 FT_mod = 6 PKNL = 1 PHC0 = -12294.48 PHC1 = 391.0886 SI = 64K 
       data hash MD5: 64K
       D5 0C FF 39 6A 5E 26 78 DA 10 F7 E6 88 F6 CB 44>)
(   3,<2024-02-05 14:31:11.53 +0400>,<she>,<DPX200>,
      <pk PHC0 = 98.97686 PHC1 = -235.6001 
       data hash MD5: 64K
       A8 55 65 1A 23 CB 9D ED 9A B7 9D 89 8D EB DE 91>)
(   4,<2024-02-05 14:31:19.65 +0400>,<she>,<DPX200>,
      <abs ABSG = 5 
       data hash MD5: 64K
       34 15 58 48 1C B6 D7 F5 D3 E9 97 D1 E6 20 0E ED>)
$$ ##END=
$$ 
$$ hash MD5
$$ 06 24 60 78 21 36 B9 53 CD ED 1B C8 60 6D 8B 36
##$RELAX= 
##$RELAX= 
##$RELAX= 
##$RELAX= 
##$RELAX= 
##$RELAX= 
##$RELAX= 
##$RELAX= 
##$RELAX= 
$$ Bruker specific parameters
$$ --------------------------
##$DU= <F:/spectra>
##$EXPNO= 1
##$NAME= <P31>
##$PROCNO= 1
##$TYPE= <nmr>
##$USER= <she>
##$AMP= (0..31)
100 100 100 100 100 100 100 100 100 100 100 100 100 100 100 100 100 100 
100 100 100 100 100 100 100 100 100 100 100 100 100 100 
##$AQSEQ= 0
##$AQ_mod= 1
##$AUNM= <au_zg>
##$AUTOPOS= <>
##$BF1= 81.014009
##$BF2= 200.13
##$BF3= 200.13
##$BF4= 200.13
##$BF5= 200.13
##$BF6= 200.13
##$BF7= 200.13
##$BF8= 200.13
##$BYTORDA= 1
##$CFDGTYP= 0
##$CFRGTYP= 5
##$CHEMSTR= <none>
##$CNST= (0..31)
1 1 145 1 1 1 1 1 1 1 1 1 1 1 1 1 1 1 1 1 1 1 1 1 1 1 1 1 1 1 1 1 
##$CPDPRG= <waltz16>
##$CPDPRG1= <>
##$CPDPRG2= <waltz16>
##$CPDPRG3= <>
##$CPDPRG4= <mlev>
##$CPDPRG5= <mlev>
##$CPDPRG6= <mlev>
##$CPDPRG7= <mlev>
##$CPDPRG8= <mlev>
##$CPDPRGB= <>
##$CPDPRGT= <>
##$D= (0..31)
0 1 0 0 0 0 0 0 0 0 0 0.03 2e-05 3e-06 0 0 0 0 0 0 0 0 0 0 0 0 0 0 0 0 
0 0 
##$DATE= 1707128915
##$DBL= (0..7)
120 120 120 11 120 120 24 19 
##$DBP= (0..7)
150 150 150 150 150 150 150 150 
##$DBP07= 0
##$DBPNAM0= <>
$$ [...]
##$SUBNAM3= <"">
##$SUBNAM4= <"">
##$SUBNAM5= <"">
##$SUBNAM6= <"">
##$SUBNAM7= <"">
##$SUBNAM8= <"">
##$SUBNAM9= <"">
##$SW= 501.771253377433
##$SWIBOX= (0..15)
0 1 3 0 0 0 0 0 0 0 0 0 0 0 0 0 
##$SW_h= 40650.406504065
##$TD= 32768
##$TD0= 1
##$TE= 0
##$TE2= 300
##$TE3= 300
##$TEG= 300
##$TL= (0..7)
0 120 53 12 22 120 120 120 
##$TP= (0..7)
150 150 150 150 150 150 150 150 
##$TP07= 0
##$TPNAME0= <>
##$TPNAME1= <>
##$TPNAME2= <>
##$TPNAME3= <>
##$TPNAME4= <>
##$TPNAME5= <>
##$TPNAME6= <>
##$TPNAME7= <>
##$TPOAL= (0..7)
0.5 0.5 0.5 0.5 0.5 0.5 0.5 0.5 
##$TPOFFS= (0..7)
0 0 0 0 0 0 0 0 
##$TUNHIN= 0
##$TUNHOUT= 0
##$TUNXOUT= 0
##$USERA1= <user>
##$USERA2= <user>
##$USERA3= <user>
##$USERA4= <user>
##$USERA5= <user>
##$V9= 5
##$VALIST= <valist>
##$VCLIST= <CCCCCCCCCCCCCCC>
##$VD= 0
##$VDLIST= <DDDDDDDDDDDDDDD>
##$VPLIST= <PPPPPPPPPPPPPPP>
##$VTLIST= <TTTTTTTTTTTTTTT>
##$WBST= 1024
##$WBSW= 4
##$XGAIN= (0..3)
0 0 0 0 
##$XL= 0
##$YL= 0
##$YMAX_a= 3724
##$YMIN_a= -5243
##$ZGOPTNS= <>
##$ZL1= 120
##$ZL2= 120
##$ZL3= 120
##$ZL4= 120
##$ABSF1= 248.5645
##$ABSF2= -253.2056
##$ABSG= 5
##$ABSL= 3
##$ALPHA= 0
##$AQORDER= 0
##$ASSFAC= 0
##$ASSFACI= 0
##$ASSFACX= 0
##$ASSWID= 0
##$AUNMP= <proc_1d>
##$AZFE= 0.1
##$AZFW= 0.5
##$BCFW= 0
##$BC_mod= 2
##$BYTORDP= 0
##$COROFFS= 0
##$CY= -3
##$DATMOD= 1
##$DC= 0
##$DFILT= <>
##$DTYPP= 0
##$F1P= 0
##$F2P= 0
##$FCOR= 1
##$FTSIZE= 65536
##$FT_mod= 6
##$GAMMA= 0
##$GB= 0
##$INTBC= 1
##$INTSCL= 6.047779e-11
##$ISEN= 30
##$LB= 10
##$LEV0= 0
##$LPBIN= 0
##$MAXI= 10000
##$MC2= 0
##$MEAN= 0
##$ME_mod= 0
##$MI= 50
##$NCOEF= 0
##$NC_proc= -10
##$NLEV= 6
##$NOISF1= 182.463
##$NOISF2= 159.3651
##$NSP= 0
##$NTH_PI= 0
##$NZP= 0
##$OFFSET= 248.5645
##$PC= 4
##$PHC0= -12195.5
##$PHC1= 155.4885
##$PH_mod= 1
##$PKNL= yes
##$PPARMOD= 0
##$PSCAL= 0
##$PSIGN= 0
##$REVERSE= no
##$SF= 81.0140089999694
##$SI= 65536
##$SIGF1= 159.3651
##$SIGF2= -187.1042
##$SINO= 113.3802
##$SIOLD= 16384
##$SREGLST= <1H.CDCl3>
##$SSB= 0
##$STSI= 65536
##$STSR= 0
##$SW_p= 40650.406504065
##$SYMM= 0
##$S_DEV= 0
##$TDeff= 32768
##$TDoff= 0
##$TI= <>
##$TILT= no
##$TM1= 0
##$TM2= 0
##$TOPLEV= 0
##$USERP1= <user>
##$USERP2= <user>
##$USERP3= <user>
##$USERP4= <user>
##$USERP5= <user>
##$WDW= 1
##$XDIM= 65536
##$YMAX_p= 232899670
##$YMIN_p= -151397422
$$ End of Bruker specific parameters
$$ ---------------------------------
##NTUPLES= NMR SPECTRUM
##VAR_NAME=  FREQUENCY,     SPECTRUM/REAL,   SPECTRUM/IMAG
##SYMBOL=    X,             R,               I
##VAR_TYPE=  INDEPENDENT,   DEPENDENT,       DEPENDENT
##VAR_FORM=  AFFN,          ASDF,            ASDF
##VAR_DIM=   65536,         65536,           65536
##UNITS=     HZ,            ARBITRARY UNITS, ARBITRARY UNITS
##FACTOR=    0.620285442955139, 1,           1
##FIRST=     20137.2065510682, 0,            0
##LAST=      -20513.1999529968, 0,           0
##MIN=       -20513.1999529968, -151397422,  0
##MAX=       20137.2065510682, 232899670,    0
$$ Real data points
##PAGE= N=1
##DATA TABLE= (X++(R..R)), XYDATA
$$ [...]
##PAGE= N=2
##DATA TABLE= (X++(I..I)), XYDATA
13089G300719J004142J120649J094591R36714O84972L89117R2269j80114m18890
13080A2024169o20629p76206q67410q74984p92039o31319m19754j85343N2108
13071F908593K80022M85929O53464P66658Q19487Q22753Q01821P84140P81765
13062A3104632P79388P38457O18844M05396J20695j83942m50189o32133p06258
13053A3794890o73398n54978l84512j97941k7533J00328J67352J66673J03347
13044A2494228j0229j60218l33101n12470o74344p85453q08145p13149m95494
13035H001625j83819J64640M81940P11389Q23839Q22604P36097O02956M57843
13026A2619114L24102K13319J28207O6575K5539L541k510k653j4384n3492j20112
$$ y = [7300719, 8304861, 9425510, 10520101, 11456815, 12141787, 12530904, 12623173, 12443059, 12024169, 11403540, 10627334, 9759924, 8884940, 8092901, 7461582, 7041828, 6856485, 6908593, 7188615, 7674544, 8328008, 9094666, 9914153, 10736906, 11538727, 12322867, 13104632, 13884020, 14622477, 15241321, 15646717, 15767412, 15583470, 15133281, 14501148, 13794890, 13121492, 12566514, 12182002, 11984061, 11956528, 12056856, 12224208, 12390881, 12494228, 12483999, 12323781, 11990680, 11478210, 10803866, 10018413, 9210268, 8497119, 8001625, 7817806, 7982446, 8464386, 9175775, 9999614, 10822218, 11558315, 12161271, 12619114, 12943216, 13156535, 13284742, 13351317, 13376856, 13380397, 13377887, 13375234, 13360850, 13307358, 13187246]
13015A3187246j91864k31971k08432j11184M4421K28852M14892N87591P42656
13006A4462207Q77726R85750J056752J085887J079158J049594J005981R44143
12998B2547198Q49360P08435N21489L04521Q2124j22636k94304m26157n19765
12989B3650265n84852o36855o90194p50650q12891q64649q93112q89144q49519
12980A6678399p78575o87740n90535m94448l95066k76834j20314Q8189L49758
12971A3772834O51731R71327J280860J553198J768183J918434K008721K045588
12963B5970876K023521J920501J709569J379499R50226M73196J7529l49597n79343
12954C3515977o49738n67125l63842r3676J76529L80455M68117M17718K39102
$$ y = [13187246, 12995382, 12763411, 12554979, 12443795, 12488216, 12717068, 13131960, 13719551, 14462207, 15339933, 16325683, 17382435, 18468322, 19547480, 20597074, 21603055, 22547198, 23396558, 24104993, 24626482, 24931003, 25013127, 24890491, 24596187, 24170030, 23650265, 23065413, 22428558, 21738364, 20987714, 20174823, 19310174, 18417062, 17527918, 16678399, 15899824, 15212084, 14621549, 14127101, 13732035, 13455201, 13334887, 13423076, 13772834, 14424565, 15395892, 16676752, 18229950, 19998133, 21916567, 23925288, 25970876, 27994397, 29914898, 31624467, 33003966, 33954192, 34427388, 34444917, 34095320, 33515977, 32866239, 32299114, 31935272, 31841596, 32018125, 32398580, 32866697, 33284415, 33523517]
12945C3523517l0858l38811o30886q71794j058092j214217j370591j539523j707415
12936B4761330j845905j928008j935783j859497j695968j449624j133962p71029
12928A2141554l88711j5931L23687O16787Q60491J057643J209802J310918J344760
12919A8461000J289266J127466Q58742N03880J03691k85325n99087p81097q00682
12910A9877854o62011l96551m6052L50609P61105J158163J517786J817821K036789
12901B6415513K155551K162899K061032J864211J589456J246918Q40118L77809
12893C8713507j12862n84954r84855j270263j421491j443369j362120j220595
12885C0312998j070698r61443r24992r66150j060161j159936j210712j168130
$$ y = [33523517, 33492659, 33153848, 32522962, 31651168, 30593076, 29378859, 28008268, 26468745, 24761330, 22915425, 20987417, 19051634, 17192137, 15496169, 14046545, 12912583, 12141554, 11752843, 11736912, 12060599, 12677386, 13537877, 14595520, 15805322, 17116240, 18461000, 19750266, 20877732, 21736474, 22240354, 22344045, 22058720, 21459633, 20678536, 19877854, 19215843, 18819292, 18773240, 19123849, 19884954, 21043117, 22560903, 24378724, 26415513, 28571064, 30733963, 32794995, 34659206, 36248662, 37495580, 38335698, 38713507, 38600645, 38015691, 37030836, 35760573, 34339082, 32895713, 31533593, 30312998, 29242300, 28280857, 27355865, 26389715, 25329554, 24169618, 22958906, 21790776]
12877B1790776j015044p70875m87577k30934n5024J7172k125p6167j62522k32448
12867A8775232k83856l41579m43724o21497q84220j215821j579483j923768k188838
12858I292446k316957k268742k038071j654737j172091o48994j37730L19725O93352
12849F8201R68260J145677J238200J262432J234691J170908J087350J000018R22640
12840A0098377Q63358Q20957P84149P36985O67977N76754M74473L79198L09225
12831A5711453K76790K84588L26260L88998M55728N07913N31765N25659N01223
12822A9510377M74086M50243M18616L55068K34507M3911k09632m99011p85718
12813A9992447j034330j226594j367180j476003j570587j650088j692640j668122
$$ y = [21790776, 20775732, 20004857, 19517280, 19286346, 19231322, 19248494, 19246369, 19170202, 19007680, 18775232, 18491376, 18149797, 17706073, 17084576, 16200356, 14984535, 13405052, 11481284, 9292446, 6975489, 4706747, 2668676, 1013939, -158152, -807146, -944876, -625151, 68201, 1036461, 2182138, 3420338, 4682770, 5917461, 7088369, 8175719, 9175737, 10098377, 10961735, 11782692, 12566841, 13303826, 13971803, 14548557, 15023030, 15402228, 15711453, 15988243, 16272831, 16599091, 16988089, 17443817, 17951730, 18483495, 19009154, 19510377, 19984463, 20434706, 20853322, 21208390, 21442897, 21486808, 21277176, 20778165, 19992447, 18958117, 17731523, 16364343, 14888340, 13317753, 11667665, 9975025, 8306903]
12805H306903j557955j370369j143215r32343p90245p45524p93941r04162j032549
12796i63400j138831j197025j198109j143625j035687q72866o55654l94487j11242
12787h710926J66599M13039O08310P42001Q14336Q33545Q10255P53565O71363
12778b897913N72134M64862L57569K57349J72908J17910J11816J75315L20154
12769c47896N38274P97851J050113J244260J344293J341520J256917J129675R96363
12760I351370Q74526P63623O61401N78896N38969N59994O40080P54202Q63229
12751A5586290R26181R10817Q03035O13781L78237J44977l9059j39603j40244
12742A9044412m5027J21408L20611N15570O87192Q41191J000191J185674J400785
$$ y = [8306903, 6748948, 5378579, 4235364, 3303021, 2512776, 1767252, 973311, 69149, -963400, -2102231, -3299256, -4497365, -5640990, -6676677, -7549543, -8205197, -8599684, -8710926, -8544327, -8131288, -7522978, -6780977, -5966641, -5133096, -4322841, -3569276, -2897913, -2325779, -1860917, -1503348, -1245999, -1073091, -955181, -843365, -668050, -347896, 190378, 988229, 2038342, 3282602, 4626895, 5968415, 7225332, 8355007, 9351370, 10225896, 10989519, 11650920, 12229816, 12768785, 13328779, 13968859, 14723061, 15586290, 16512471, 17423288, 18226323, 18840104, 19218341, 19363318, 19324259, 19184656, 19044412, 18999385, 19120793, 19441404, 19956974, 20644166, 21485357, 22485548, 23671222, 25072007]
12733B5072007J624341J818676J943616J965684J859489J608681J213663P02512
12725C7808669J34046m13545q64317j166041j302141j289323j163283r62136p18611
12716C0063318m62961k27198m0752Q0633J40753J55816J39995R6510K0884q8110
12706B9878888k18967l45244m31700m47083l79107k43626q0697O1486J44583J49257
12696B8087790P3991o9521k58903m63775o53499q08911r29574j029486j123549
12687B2824563j214899j291499j332291j317233j235596j090264q97434o81909
12679A3763438m69797k81744j29295j4574O7782J27582J76243K25328K85923L66614
12669A4117500M69330N86046P00175P92503Q47398Q55739Q14772P26739N97067
$$ y = [25072007, 26696348, 28515024, 30458640, 32424324, 34283813, 35892494, 37106157, 37808669, 37942715, 37529170, 36664853, 35498812, 34196671, 32907348, 31744065, 30781929, 30063318, 29600357, 29373159, 29332407, 29413040, 29553793, 29709609, 29849604, 29946114, 29966998, 29878888, 29659921, 29314677, 28882977, 28435894, 28056787, 27813161, 27732464, 27793950, 27938533, 28087790, 28161781, 28092260, 27833357, 27369582, 26716083, 25907172, 24977598, 23948112, 22824563, 21609664, 20318165, 18985874, 17668641, 16433045, 15342781, 14445347, 13763438, 13293641, 13011897, 12882602, 12868028, 12935810, 13063392, 13239635, 13464963, 13750886, 14117500, 14586830, 15172876, 15873051, 16665554, 17512952, 18368691, 19183463, 19910202, 20507269]
12660B0507269M31881K35870J2766k30812m80445p12214q96987j009290j035876
12651A6822162r79104q53709o79315m72807k44666j469K47475M85857O94480Q62042
12641A5880946R92769J101889J200451J281298J318261J280741J154827R57738
12633B5168920P36544N51161M49896M49659N30346O45749P44765P91397P73192
12624C0841629O95356N67061L91118J64480j12278m25856p49593j050897j299280
12615B9021740j469578j542721j509206j374766j161943r04277o37360l92688
12607B0029201j94326n4408L2800R2764J63317K79086M54731O75948R04658J097232
12597B3481003J224901J281885J275935J211667J083625Q86239O30871L52912
$$ y = [20507269, 20939150, 21175020, 21187786, 20956974, 20476529, 19764315, 18867328, 17858038, 16822162, 15843058, 14989349, 14310034, 13837227, 13592561, 13591092, 13838567, 14324424, 15018904, 15880946, 16873715, 17975604, 19176055, 20457353, 21775614, 23056355, 24211182, 25168920, 25905464, 26456625, 26906521, 27356180, 27886526, 28532275, 29277040, 30068437, 30841629, 31536985, 32104046, 32495164, 32659644, 32547366, 32121510, 31371917, 30321020, 29021740, 27552162, 26009441, 24500235, 23125469, 21963526, 21059249, 20421889, 20029201, 19834875, 19780467, 19813267, 19906031, 20069348, 20348434, 20803165, 21479113, 22383771, 23481003, 24705904, 25987789, 27263724, 28475391, 29559016, 30445255, 31076126, 31429038]
12589C1429038J00244r0148k11071k86209l52367m34749n31846o19700o71283
12580B8331909o76244o47122o09661n86472n85652n99679o12523o10920n96298
12571B2807338n92461o41986p87639j045817j389488j755570k074637k302320
12563A2217420k430418k473901k449841k366142k223285k019975j755978j433794
12555d935914j062160o58486k45796J54334N26200Q57485J132765J330148J425933
12546a475491J406034J277460J072622Q43353O46199N23128M84527N04304N33978
12537E816114N29637M73019L71722K42680R7126o0484k24058l80593n14131o14461
12527E736571o82111p25259p51119p58992p40464o85443n88037m48681k74601
$$ y = [31429038, 31529282, 31439134, 31228063, 30941854, 30589487, 30154738, 29622892, 29003192, 28331909, 27655665, 27008543, 26398882, 25812410, 25226758, 24627079, 24014556, 23403636, 22807338, 22214877, 21572891, 20785252, 19739435, 18349947, 16594377, 14519740, 12217420, 9787002, 7313101, 4863260, 2497118, 273833, -1746142, -3502120, -4935914, -5998074, -6656560, -6902356, -6748022, -6221822, -5364337, -4231572, -2901424, -1475491, -69457, 1208003, 2280625, 3123978, 3770177, 4293305, 4777832, 5282136, 5816114, 6345751, 6818770, 7190492, 7433172, 7530298, 7469814, 7245756, 6865163, 6351032, 5736571, 5054460, 4329201, 3578082, 2819090, 2078626, 1393183, 805146, 356465, 81864]
12518H1864q1415J05620K54333L33018L19103K05684M392k55292n29501p65319
12508c27513r08023r11225p49084m25895K2436N36680J048687J496217J833685
12499A615965K036551K099901K034402J862902J618385J341036J072241Q45777
12491A4527160O78933N67457M87523M04786K87158J16349j05500l55929n99483
12482A6008454p99924r31776r85614r66441q88674p70998o31311m82179l29284
12473I222253j74633k2609J15225K18940K63122K23823Q8302j36613m22401p23692
12463H651717r86922j160821j209663j127607r45297p19479n07849l44944k35161
12454A413974j64316j16486q2565n8996m4431l9983n0305q0492j29735j88412
$$ y = [81864, 449, 106069, 360402, 693420, 1012523, 1218207, 1222599, 967307, 437806, -327513, -1235536, -2146761, -2895845, -3321740, -3299304, -2762624, -1713937, -217720, 1615965, 3652516, 5752417, 7786819, 9649721, 11268106, 12609142, 13681383, 14527160, 15206093, 15773550, 16261073, 16665859, 16953017, 17069366, 16963866, 16607937, 16008454, 15208530, 14276754, 13291140, 12324699, 11436025, 10665027, 10033716, 9551537, 9222253, 9047620, 9025011, 9140236, 9359176, 9622298, 9846121, 9934423, 9797810, 9375409, 8651717, 7664795, 6503974, 5294311, 4166704, 3221407, 2501928, 1994079, 1649135, 1413974, 1249658, 1133172, 1050607, 991611, 947180, 907197, 856892, 776400, 646665, 458253]
12444D58253k42485k81439l02415l07450k96626k61856j85118m3790J76722M68754
12434h17450P96164J101962J326131J424455J381084J211600R55455O59892L63488
12425H402781Q9614j47377l31352m40105m51510l55053j60578J01192L86511O50823
12415G744946Q60019R97441J064951J076761J047717R83545Q81800P42959N80899
12406A5981038M23130L01816K42203K52352L16949M01204M67576M95413M87747
12397A9369428M61682M34731M18588M18627M32341M48257M51923M37575M14948
12388B3288100M03681M18895M58063M97110M98067M25366K63121K3825k56785
12379B6019443n35600p78632r68655j101572j177884j198208j166397j095351
$$ y = [458253, 215768, -65671, -368086, -675536, -972162, -1234018, -1419136, -1462926, -1286204, -817450, -21286, 1080676, 2406807, 3831262, 5212346, 6423946, 7379401, 8039293, 8402781, 8492395, 8345018, 8013666, 7573561, 7122051, 6766998, 6606420, 6707612, 7094123, 7744946, 8604965, 9602406, 10667357, 11744118, 12791835, 13775380, 14657180, 15400139, 15981038, 16404168, 16705984, 16948187, 17200539, 17517488, 17918692, 18386268, 18881681, 19369428, 19831110, 20265841, 20684429, 21103056, 21535397, 21983654, 22435577, 22873152, 23288100, 23691781, 24110676, 24568739, 25065849, 25563916, 25989282, 26252403, 26276228, 26019443, 25483843, 24705211, 23736556, 22634984, 21457100, 20258892, 19092495, 17997144]
12371A7997144j008130r32168q90545q95182r43373j016997j084991j110862j064680
12362I050216r34291p29083m74556k03263N1283K57629L91429M43869M26742L66945
12352H646920K92379K19503J51218Q4588K0836l0229n3777l7869K0658J15785
12342I430012K35851L67711M99367O20495P19750P79763P74824O77698M76301
12333A4581772J91692j16081l63468m77054m28526k49844j8735J76004K68984
12324A3564744K37124R9504r7577l03031m80488o14832p04631p50485p50397p03149
12314I496782o12450m87019l38692j82164l5803P9637J45656J51359R5812j3831
12304H299287j65911l46144n38270p27098r04659j073234j238603j395956j519664
$$ y = [17997144, 16989014, 16056846, 15166301, 14271119, 13327746, 12310749, 11225758, 10114896, 9050216, 8115925, 7386842, 6912286, 6709023, 6760306, 7017935, 7409364, 7853233, 8279975, 8646920, 8939299, 9158802, 9310020, 9394608, 9415444, 9385215, 9331438, 9293569, 9314227, 9430012, 9665863, 10033574, 10532941, 11153436, 11873186, 12652949, 13427773, 14105471, 14581772, 14773464, 14657383, 14293915, 13816861, 13388335, 13138491, 13119756, 13295760, 13564744, 13801868, 13901372, 13803795, 13500764, 13020276, 12405444, 11700813, 10950328, 10199931, 9496782, 8884332, 8397313, 8058621, 7876457, 7840654, 7920291, 8065947, 8217306, 8313118, 8299287, 8133376, 7787232, 7248962, 6521864, 5617205, 4543971, 3305368, 1909412, 389748]
12295C89748j565841j486341j246206q38232k91713L27149R26144J408917J702054
12286f74321J777425J659632J413377J116076Q30467N91598M10320K83678K02897
12277G611149J57750J39808J43695J64566J94910K25585K49786K64024K65618
12268I416891K53379K33277K19650K23869K38818K37580J92081R5576l1378j54640
12258A0925103k45041k87120k77057k18457j22113p284J01532J83798K32552K57295
12248A0543208K78039L14362L75034M52066N21532N52319N20543M22843K81281
12239A4261227J37168L7081J6829Q9068K39774M36446O44687Q42796J024127J187232
12229A8916435J325304J426563J484537J505256J501324J477636J423375J319176
$$ y = [389748, -1176093, -2662434, -3908640, -4746872, -5038585, -4711436, -3785292, -2376375, -674321, 1103104, 2762736, 4176113, 5292189, 6122656, 6714254, 7124574, 7408252, 7611149, 7768899, 7908707, 8052402, 8216968, 8411878, 8637463, 8887249, 9151273, 9416891, 9670270, 9903547, 10123197, 10347066, 10585884, 10823464, 11015545, 11111121, 11079743, 10925103, 10680062, 10392942, 10115885, 9897428, 9775315, 9768031, 9869563, 10053361, 10285913, 10543208, 10821247, 11135609, 11510643, 11962709, 12484241, 13036560, 13557103, 13979946, 14261227, 14398395, 14435476, 14452305, 14541373, 14781147, 15217593, 15862280, 16705076, 17729203, 18916435, 20241739, 21668302, 23152839, 24658095, 26159419, 27637055, 29060430, 30379606]
12221C0379606J153904R37541P00827M82496L12686K02585J45289J25050J27160
12212C4567144J42424J65781J92256K13943K20765K05836J72126J34269J12448
12203C6126992J22331J68006K40760L21773L87017M14519L92574L23688K19748
12194C8717408R0240o7707k68048n21600q18577j123441j389718j585656j711185
12185C1321716j793234j863512j934781j990828j995690j915806j740328j486143
12177A6601394j186895q79073n97693l79140k57944k51885l46880m98218o51306
12168A1552360p67797q38444q75134q90368q80659q26007p04530n09998k59892
12159D999531Q984K51294M24586N00533M76148L79322K60193J68053J27568J32344
$$ y = [30379606, 31533510, 32471051, 33171878, 33654374, 33967060, 34169645, 34314934, 34439984, 34567144, 34709568, 34875349, 35067605, 35281548, 35502313, 35708149, 35880275, 36014544, 36126992, 36249323, 36417329, 36658089, 36979862, 37366879, 37781398, 38173972, 38497660, 38717408, 38807648, 38739941, 38471893, 37950293, 37131716, 36008275, 34618557, 33032901, 31321716, 29528482, 27664970, 25730189, 23739361, 21743671, 19827865, 18087537, 16601394, 15414499, 14535426, 13937733, 13558593, 13300649, 13048764, 12701884, 12203666, 11552360, 10784563, 9946119, 9070985, 8180617, 7299958, 6473951, 5769421, 5259423, 4999531, 5008515, 5259809, 5684395, 6184928, 6661076, 7040398, 7300591, 7468644, 7596212, 7728556]
12149G728556J60372J96609K42706L08072L93997M86185N60035N92391N71715
12140A1240638N02948M06458L12044K50175K43147K97939M02335N27537O39451
12131A4822672P14880P52926P73553Q04388Q64421R53845J054018J135882J171227
12122B3047812J140288J031849Q38340N53620J79432k62427p23590j138065j444177
12113B3223082j605981j621795j518930j341834j139304r52389q05546p05568
12105A3531735o48326o26732o33742o61221o98662p32403p44293p12232o16755
12096G457369m52199k34719m73K06152L49071M14290M13455L74118L22480K69932
12086I119476K10904J30904J8928j22003k72022m02723m92111n34817n40074n22052
$$ y = [7728556, 7888928, 8085537, 8328243, 8636315, 9030312, 9516497, 10076532, 10668923, 11240638, 11743586, 12150044, 12462088, 12712263, 12955410, 13253349, 13655684, 14183221, 14822672, 15537552, 16290478, 17064031, 17868419, 18732840, 19686685, 20740703, 21876585, 23047812, 24188100, 25219949, 26058289, 26611909, 26791341, 26528914, 25805324, 24667259, 23223082, 21617101, 19995306, 18476376, 17134542, 15995238, 15042849, 14237303, 13531735, 12883409, 12256677, 11622935, 10961714, 10263052, 9530649, 8786356, 8074124, 7457369, 7005170, 6770451, 6769978, 6976130, 7325201, 7739491, 8152946, 8527064, 8849544, 9119476, 9330380, 9461284, 9480212, 9358209, 9086187, 8683464, 8191353, 7656536, 7116462, 6594410]
12076F594410m93274m65690m55176m83096n71652p33135r57111j204475j416688
12067a85887j537865j535855j408577j175385q65428n13711j62779J41334L64900
12058f879253N04747N91835O73591P87325R44071J130576J322203J495736J636959
12049B207790J742076J812924J848997J843091J784943J668787J497238J279500
12041A5685346J028340P58906M87450K27891j1550k28117m20428n83418p04937
12032A6239483p66000p46165o33008m30054j57570J52696M62143P26666R00522
12023A5748713R48314Q60037O56828L81835Q3362j98675m39031o28482p71664
12014A6641237q80590r65458j027786j059533j047685r81528q59655o93252n03429
$$ y = [6594410, 6101136, 5635446, 5180270, 4697174, 4125522, 3392387, 2435276, 1230801, -185887, -1723752, -3259607, -4668184, -5843569, -6708997, -7222708, -7385487, -7244153, -6879253, -6374506, -5782671, -5109080, -4321755, -3377684, -2247108, -924905, 570831, 2207790, 3949866, 5762790, 7611787, 9454878, 11239821, 12908608, 14405846, 15685346, 16713686, 17472592, 17960042, 18187933, 18176383, 17948266, 17527838, 16944420, 16239483, 15473483, 14727318, 14094310, 13664256, 13506686, 13659382, 14121525, 14848191, 15748713, 16697027, 17557064, 18213892, 18595727, 18679089, 18480414, 18041383, 17412901, 16641237, 15760647, 14795189, 13767403, 12707870, 11660185, 10678657, 9819002, 9125750, 8622321]
12005H622321l15037j52347l7519J3491J48n6004j17271j46539j21168l4892J06870
11994G762053K88389M82304O54388P76165Q35123Q33486P79660O83142N56028
11985A3650738M14415K74232J44372K3218r9761k39524m09507o14413q44044j072313
11975A1227413j263916j386091j419151j359504j214252r93322p07097l70823
11967B513257q723L48776O72609R40028J134196J242740J259481J187731J041146
11958A0331241Q41244O13811L86331J86563M0951k9774j9481N3371J44001J95799
11948A2744057J67697N8138r2171k22859k87326k74961k09842j31725p5278n9168
11938A1616562q5741j45641k22605k97237l50326l66686l39363k73025j84663
$$ y = [8622321, 8307284, 8154937, 8117418, 8130909, 8131057, 8075053, 7957782, 7811243, 7690075, 7655183, 7762053, 8050442, 8532746, 9187134, 9963299, 10798422, 11631908, 12411568, 13094710, 13650738, 14065153, 14339385, 14483757, 14506975, 14407214, 14167690, 13758183, 13143770, 12299726, 11227413, 9963497, 8577406, 7158255, 5798751, 4584499, 3591177, 2884080, 2513257, 2504534, 2853310, 3525919, 4465947, 5600143, 6842883, 8102364, 9290095, 10331241, 11172485, 11786296, 12172627, 12359190, 12400141, 12370367, 12350886, 12404257, 12548258, 12744057, 12911754, 12969892, 12877721, 12654862, 12367536, 12092575, 11882733, 11751008, 11675730, 11616562, 11530821, 11385180, 11162575, 10865338, 10515012, 10148326, 9808963, 9535938, 9351275]
11929I351275j00835n1247n9241j31551k52775l89528n03458n65819n65945n10835
11919F220041m18402l09167k00731j05708l0097L0319R1704J75949K97433M52305
11909F203646O17818P59772Q42537Q40427P49822N94886M18607K62581J50479
11900A1440575Q6035O1755O7350R2649J27399J60843J80832J72051J16080l169
11890A2502400j89055m23262o66802q73674j010071j067600j063821j031618j003144
11881E173353r94898j000830r98313r63628q85746p68678o23613m60364k85696
11872a808413j08145N6423J84308K50982K42806J66109M6537q1994j91282k66188
11862a508857l01825k96171k47137j57295m0255P9496J74292K22522K14703J57188
$$ y = [9351275, 9250440, 9199193, 9139952, 9008401, 8755626, 8366098, 7862640, 7296821, 6730876, 6220041, 5801639, 5492472, 5291741, 5186033, 5155936, 5186255, 5277959, 5453908, 5751341, 6203646, 6821464, 7581236, 8423773, 9264200, 10014022, 10608908, 11027515, 11290096, 11440575, 11526610, 11588365, 11655715, 11748364, 11875763, 12036606, 12217438, 12389489, 12505569, 12502400, 12313345, 11890083, 11223281, 10349607, 9339536, 8271936, 7208115, 6176497, 5173353, 4178455, 3177625, 2179312, 1215684, 329938, -438740, -1062353, -1522717, -1808413, -1916558, -1860135, -1675827, -1424845, -1182039, -1015930, -969393, -1051387, -1242669, -1508857, -1810682, -2106853, -2353990, -2511285, -2551540, -2472044, -2297752, -2075230, -1860527, -1703339]
11852a703339P4410O101l565P9487K69617N60588R29765J342659J756516K123733
11842E435972K395764K528813K492230K277349J901994J408294Q55761L11639
11834A9607816j61634n20186p47427q52396q60318q03051p13637o22290n50919
11825A3775958n07532m84280m60752m11855l18801j79587j3025J47689K68138
11816A1815953L23563L02727K08941O3859q9312j93323j98302q5339J24417L80325
11806A2653509O23395Q06410R08132R39092R33387R24529R17687Q79990P58982
11797B0345113N15138J42871l31878q66779j412301j908701k281611k451420k360281
11788I390151k003922j446811q06152k09383K51968N46495O95776P48181P54723
$$ y = [-1703339, -1628929, -1622828, -1626393, -1546906, -1277289, -716701, 213064, 1555723, 3312239, 5435972, 7831736, 10360549, 12852779, 15130128, 17032122, 18440416, 19296177, 19607816, 19446182, 18925996, 18178569, 17326173, 16465855, 15662804, 14949167, 14326877, 13775958, 13268426, 12784146, 12323394, 11911539, 11592738, 11413151, 11400126, 11547815, 11815953, 12139516, 12442243, 12651184, 12715043, 12625731, 12432408, 12234106, 12148767, 12273184, 12653509, 13276904, 14083314, 14991446, 15930538, 16863925, 17788454, 18706141, 19586131, 20345113, 20860251, 21003122, 20671244, 19804465, 18392164, 16483463, 14201852, 11750432, 9390151, 7386229, 5939418, 5133266, 4923883, 5175851, 5722346, 6418122, 7166303, 7921026]
11779G921026P58498P93367Q81697J027886J213325J399121J537152J585092J520083
11770A8637247J346506J094251Q07163N26489K77320O4496j20832k88369m37574
11761B1906697n55442o24361o34020n88962n07876m15967l34272k70396k16102
11752A7759299j54732p4395K2548J19610J93575K23472J98504J24074K2744p3103
11742A8361596j34390j46599j12916m9077K5755R6434J53407J88956J94082J61401
11732A8738649R1589n022j15783k36148l73323n38850p34480r41231j120774j230720
11722A3533907j244298j160152r96576p77977n25655k56783J2977K67885M91818
11713I345146O68299P81876Q22266P90112P00315N78415M49484L25363J99633
$$ y = [7921026, 8679524, 9472891, 10354588, 11382474, 12595799, 13994920, 15532072, 17117164, 18637247, 19983753, 21078004, 21885167, 22411656, 22688976, 22753472, 22632640, 22344271, 21906697, 21351255, 20726894, 20092874, 19503912, 18996036, 18580069, 18245797, 17975401, 17759299, 17604567, 17530172, 17552720, 17672330, 17865905, 18089377, 18287881, 18411955, 18434699, 18361596, 18227206, 18080607, 17967691, 17918614, 17944369, 18040803, 18194210, 18383166, 18577248, 18738649, 18830238, 18825216, 18709433, 18473285, 18099962, 17561112, 16826632, 15885401, 14764627, 13533907, 12289609, 11129457, 10132881, 9354904, 8829249, 8572466, 8585443, 8853328, 9345146, 10013445, 10795321, 11617587, 12407699, 13108014, 13686429, 14135913, 14461276, 14660909]
11704A4660909N4978j21781l27081n38247p22781q54126r23632r39463r13604
11695I375172q49974p45278n99396m21489k24533j5414K07891M48271O96161R20351
11685H791762J071363J099270R77254P15966L60263k6714l81528o54285q16942
11676A1136409q64590q10092o77667n01359l25276j96406j48160j85385k82530
11667G144944l95213m76488m91514m29367l08711j70595n7343J0266M0415N7466
11657D923860Q2415J24315J86571K75142L94726N33873O54650P01139O25358M13977
11647H916026R8022k59808n91299q47612j011585j093565j115077j091307j024374
11638A979421r10742p54091n70913l84380k12486n9758Q2525K27543L80076N27698
$$ y = [14660909, 14715887, 14594106, 14267025, 13728778, 13005997, 12151871, 11228239, 10288776, 9375172, 8525198, 7779920, 7180524, 6759035, 6534502, 6519088, 6726979, 7175250, 7871411, 8791762, 9863125, 10962395, 11939649, 12655615, 13015878, 12989164, 12607636, 11953351, 11136409, 10271819, 9461727, 8784060, 8282701, 7957425, 7761019, 7612859, 7427474, 7144944, 6749731, 6273243, 5781729, 5352362, 5043651, 4873056, 4815713, 4825979, 4866394, 4923860, 5006275, 5130590, 5317161, 5592303, 5987029, 6520902, 7175552, 7876691, 8502049, 8916026, 9014048, 8754240, 8162941, 7315329, 6303744, 5210179, 4095102, 3003795, 1979421, 1068679, 314588, -256325, -640705, -853191, -912949, -830424, -602881, -222805, 304893]
11628C04893O43619P01184O91239O31676N63545N33932N71118O64028P60314P88541
11618F854089O92917M59915J22653k55573o06240q75154j029246j053397r46584
11609C363380p23204m15587o9395K69318N67341Q08930R90041J107313J149519
11600G047656J098277R39883O81899L61772L8285k31150m13140n06377n31701
11591H485404n13976m69759m07202l33814k63490k17334k17095k73337l75172
11582E414225m91096n83753o28298o19643n65074m72701l46792j90733j1634J77178
11572A681679L55596M97867N76033N65939M55138K51178j3342k84439n01512o18742
11562B965395o22901n37302m07803k77398j64852o0826N8792K15370M17342O58339
$$ y = [304893, 948512, 1649696, 2340935, 2972611, 3536156, 4070088, 4641206, 5305234, 6065548, 6854089, 7547006, 8006921, 8129574, 7874001, 7267761, 6392607, 5363361, 4309964, 3363380, 2640176, 2224589, 2155194, 2424512, 2991853, 3800783, 4790824, 5898137, 7047656, 8145933, 9085816, 9767715, 10129487, 10167772, 9936622, 9523482, 9017105, 8485404, 7971428, 7501669, 7094467, 6760653, 6497163, 6279829, 6062734, 5789397, 5414225, 4923129, 4339376, 3711078, 3091435, 2526361, 2053660, 1706868, 1516135, 1504501, 1681679, 2037275, 2535142, 3111175, 3677114, 4132252, 4383430, 4370088, 4085649, 3584137, 2965395, 2342494, 1805192, 1397389, 1119991, 955139, 894313, 953105, 1168475, 1585817, 2244156]
11552B244156R19351J174255J399831J586411J741516J883377K028152K177351
11544A5154400K310794K389038K365807K205237J895425J452908R18109L44622
11536B9036340k14118p16036j135390j461016j690872j826292j868328j818442
11528A8305846j683657j481809j241245r94528p70857n90500m60972l75741l18657
11519A0387880k73374k30271j85133j33655p0573M860Q4179J51786J92056J96277
11509A0124032J67086J20501Q4093Q9217J59049K98927M95080P21804R51021J158023
11499A4368833J322656J430667J478803J480919J467748J476516J534409J644083
11491B6204634J777177J878169J880157J731771J425624J010185N72105J96006
$$ y = [2244156, 3163507, 4337762, 5737593, 7324004, 9065520, 10948897, 12977049, 15154400, 17465194, 19854232, 22220039, 24425276, 26320701, 27773609, 28691718, 29036340, 28822222, 28106186, 26970796, 25509780, 23818908, 21992616, 20124288, 18305846, 16622189, 15140380, 13899135, 12904607, 12133750, 11543250, 11082278, 10706537, 10387880, 10114506, 9884235, 9699102, 9565447, 9494874, 9499734, 9583913, 9735699, 9927755, 10124032, 10291118, 10411619, 10495712, 10584929, 10743978, 11042905, 11537985, 12259789, 13210810, 14368833, 15691489, 17122156, 18600959, 20081878, 21549626, 23026142, 24560551, 26204634, 27981811, 29859980, 31740137, 33471908, 34897532, 35907717, 36479822, 36675828]
11483C6675828p3674k46458l71542n08065o96047r39558j208284j456156j645486
11474B9530558j760485j802672j776288j678896j504800j255458r45057n95322
11466A8211580k24966J55256N36809R03365J227706J479606J638132J699267J675638
11457B7302393J590594J469431J329527J172514R82877P35720M11796J3016m30432
11448C4577436q67413j245057j528800j710866j802710j817641j756036j603796
11440B2245117j345702r84237n49582r3447L27542O67226Q97889J012324J021954
11431B3199084R49412Q15511O27191L75552M6539l62398q29959j309439j738431
11422B1773062k055948k220626k222822k084811j848827j559584j250449r38256
$$ y = [36675828, 36602154, 36355696, 35984154, 35476089, 34780042, 33840484, 32632200, 31176044, 29530558, 27770073, 25967401, 24191113, 22512217, 21007417, 19751959, 18806902, 18211580, 17986614, 18141870, 18678679, 19582044, 20809750, 22289356, 23927488, 25626755, 27302393, 28892987, 30362418, 31691945, 32864459, 33847336, 34583056, 34994852, 35007868, 34577436, 33710023, 32464966, 30936166, 29225300, 27422590, 25604949, 23848913, 22245117, 20899415, 19915178, 19365596, 19272149, 19599691, 20266917, 21164806, 22177130, 23199084, 24148496, 24964007, 25591198, 25966750, 26013289, 25650891, 24820932, 23511493, 21773062, 19717114, 17496488, 15273666, 13188855, 11340028, 9780444, 8529995, 7591739]
11414G591739o25377l06000K4491L58725O71399R25059J085985J138577J087101
11405A1951699R45511P26599M40462J01598k64189o20341r26867j148871j262982
11396I942619j262668j162394r95850q04310o19853m54729l03177j51195J3809
11387D202252J96533L89575N73000P20088Q06850Q18733P51824O11697M12516
11378I483068J74312q2819l43425n95928q29033j031670j196636j321129j400715
11369B856025j423175j370978j231669j006439p09628l62171J3248L92732P51232
11360b090823J065131J314825J484084J558613J529161J399071J188789R30971
11352H379822O59233L99642J69975j6649j49847k24185k43957k27825k10093k34888
$$ y = [7591739, 6966362, 6660362, 6684853, 7043578, 7714977, 8640036, 9726021, 10864598, 11951699, 12897210, 13623809, 14064271, 14165869, 13901680, 13281339, 12354472, 11205601, 9942619, 8679951, 7517557, 6521707, 5717397, 5097544, 4642815, 4339638, 4188443, 4202252, 4398785, 4788360, 5361360, 6081448, 6888298, 7707031, 8458855, 9070552, 9483068, 9657380, 9574561, 9231136, 8635208, 7806175, 6774505, 5577869, 4256740, 2856025, 1432850, 61872, -1169797, -2176236, -2885864, -3248035, -3234787, -2842055, -2090823, -1025692, 289133, 1773217, 3331830, 4860991, 6260062, 7448851, 8379822, 9039055, 9438697, 9608672, 9592023, 9442176, 9217991, 8974034, 8746209, 8536116, 8301228]
11342H301228l42243n51541q51679j203759j553626j846737k039325k103907k029448
11333d221037j818064j481890j044003n42310k9288M38631Q18861J095622J278720
11324e504758J390627J452994J480538J480939J455207J397377J297481J149504
11316E599909R59394P45792N32060L35874J63736J2368j26068k57891l82149m87373
11306G095652n54504n67172n24280m46672l72732l44197l88016n02288o53674
11297B742117p89179q56858q23838o82412m44543j32960K23525N89387R20849
11288G46088J168194J284238J238147J030190O99204L14628m7006l29851n15484
11279E588348o21243o84624p43073q16924r02076r77694j026058j050041j072878
$$ y = [8301228, 7958985, 7407444, 6555765, 5352006, 3798380, 1951643, -87682, -2191589, -4221037, -6039101, -7520991, -8564994, -9107304, -9136592, -8697961, -7879100, -6783478, -5504758, -4114131, -2661137, -1180599, 300340, 1755547, 3152924, 4450405, 5599909, 6559303, 7305095, 7837155, 8173029, 8336765, 8349133, 8223065, 7965174, 7583025, 7095652, 6541148, 5973976, 5449696, 5003024, 4630292, 4286095, 3898079, 3395791, 2742117, 1952938, 1096080, 272242, -410170, -854713, -987673, -764148, -174761, 746088, 1914282, 3198520, 4436667, 5466857, 6166061, 6480689, 6433683, 6103832, 5588348, 4967105, 4282481, 3539408, 2722484, 1820408, 842714, -183344, -1233385, -2306263]
11270b306263j119854j197295j284146j339146j317740j191258r60235o53308
11262a1369245l11029L2766L56598O42964Q70550J019545J085429J085609J050263
11253e536550J004641R57471R02697Q28598P23708N76566L76025J18420j82169
11244b30593m90782p60855r50664j036863j018479r11231p37518n19408k78919
11235f935312m2598J56996K86807L22864K58590J09078q9690k88053m35677m95095
11225g152090m49064l00159o6490K22453N29903Q17809J054706J222556J319316
11216b801060J356254J351987J326409J296120J270690J249467J220892J167612
11208G438371J077336R53605Q18140P00987O24335N92214N94151O18310O60465
$$ y = [-2306263, -3426117, -4623412, -5907558, -7246704, -8564444, -9755702, -10715937, -11369245, -11680274, -11647508, -11290910, -10647946, -9777396, -8757851, -7672422, -6586813, -5536550, -4531909, -3574438, -2671741, -1843143, -1119435, -542869, -166844, -48424, -230593, -721375, -1482230, -2432894, -3469757, -4488236, -5399467, -6136985, -6656393, -6935312, -6977910, -6820914, -6534107, -6211243, -5952653, -5843575, -5933265, -6221318, -6656995, -7152090, -7601154, -7901313, -7967803, -7745350, -7215447, -6397638, -5342932, -4120376, -2801060, -1444806, -92819, 1233590, 2529710, 3800400, 5049867, 6270759, 7438371, 8515707, 9469312, 10287452, 10988439, 11612774, 12204988, 12799139, 13417449, 14077914]
11199A4077914P19361P82876Q19632P86862O51612M10478R3450k50610n75931
11190A7515644q54297j075535j239028j345650j395134j387437j324053j207173
11182G687337j038489q21916n72024l22832j27122m0961r9157k95286n78259q68622
11172B922669j086983j180192j132946r63799p14322m38190j88352m47J19289
11163b663273J90338K40375K89740L49217M25880N25346O48425P89323R39017
11154A734388J089044J229942J344932J405187J373682J220206R41740N74737
11146A0913858J87979j42032l58347m38642l93926k56668o6348J41877L42673
11137I930424N20030O62860P59811P96637P59133O41989M58649K44051M6088r0002
$$ y = [14077914, 14797275, 15580151, 16399783, 17186645, 17838257, 18248735, 18342185, 18091575, 17515644, 16661347, 15585812, 14346784, 13001134, 11606000, 10218563, 8894510, 7687337, 6648848, 5826932, 5254908, 4932076, 4804954, 4763993, 4664836, 4369550, 3791291, 2922669, 1835686, 655494, -477452, -1441251, -2155573, -2593763, -2782115, -2782562, -2663273, -2472935, -2232560, -1942820, -1593603, -1167723, -642377, 6048, 795371, 1734388, 2823432, 4053374, 5398306, 6803493, 8177175, 9397381, 10339121, 10913858, 11101837, 10959805, 10601458, 10162816, 9768890, 9512222, 9445874, 9587751, 9930424, 10450454, 11113314, 11873125, 12669762, 13428895, 14070884, 14529533, 14773584, 14819672, 14729670]
11127A4729670j35829q6803L9011K08459L84158N34469O39734O95683P16127P32851
11117A8457530P86954R10377J106086J340190J552995J683628J693854J577635
11109B9109249J353078J046159O80261K77886j32083n12931q28506j055567j191460
11100B8746086j252817j266032j253908j226047j180284j114841j040701r82569
11092A9428887r67373j009887j104852j227500j340475j406404j403452j335241
11084I633703j226358j105694r91032q85843p85976o86584n85331m85564m00618
11075B480703l52574l59855m19984n02237n58450n44874m39834k47763P981K95047
11065f41840N78375Q22932R97319J081444J075652J003455R02533Q08326P41590
$$ y = [14729670, 14593841, 14507038, 14546049, 14754508, 15138666, 15673135, 16312869, 17008552, 17724679, 18457530, 19244484, 20154861, 21260947, 22601137, 24154132, 25837760, 27531614, 29109249, 30462327, 31508486, 32188747, 32466633, 32334550, 31821619, 30993113, 29937546, 28746086, 27493269, 26227237, 24973329, 23747282, 22566998, 21452157, 20411456, 19428887, 18461514, 17451627, 16346775, 15119275, 13778800, 12372396, 10968944, 9633703, 8407345, 7301651, 6310619, 5424776, 4638800, 3952216, 3366885, 2881321, 2480703, 2128129, 1768274, 1348290, 846053, 287603, -257271, -697105, -944868, -936887, -641840, -63465, 759467, 1756786, 2838230, 3913882, 4917337, 5819870, 6628196, 7369786]
11056G369786P06890O97818P00579O94357O54420N60736M06709K01315l5045k76074
11046A1681491m94699o69614p91999q66598r04073r10158q81887q16399p27101
11037D618963o53644o53094p72702j021487j362152j729330k058704k306833k455734
11028h394717k509828k490932k428387k342519k230122k064858j815961j474101
11020b5751425j067193o55125l05841o6780N2268P7471N5081L1934M0410R1350
11010b7497850J75686K73340L64848M39847M99530N54292O19170P08477Q30603
11001b3032057R84568J159730J338322J499350J622895J694570J709387J673486
10993a1349749J602516J516789J434269J363353J298455J221949J112917R57738
$$ y = [7369786, 8076676, 8774494, 9475073, 10169430, 10823850, 11384586, 11791295, 11992610, 11957565, 11681491, 11186792, 10517178, 9725179, 8858581, 7954508, 7044350, 6162463, 5346064, 4618963, 3965319, 3312225, 2539523, 1518036, 155884, -1573446, -3632150, -5938983, -8394717, -10904545, -13395477, -15823864, -18166383, -20396505, -22461363, -24277324, -25751425, -26818618, -27473743, -27779584, -27846364, -27794096, -27716625, -27661544, -27629610, -27589200, -27497850, -27322164, -27048824, -26683976, -26244129, -25744599, -25190307, -24571137, -23862660, -23032057, -22047489, -20887759, -19549437, -18050087, -16427192, -14732622, -13023235, -11349749, -9747233, -8230444, -6796175, -5432822, -4134367, -2912418, -1799501, -841763]
10985h41763P55185N13835K47143k7687k87773n05464o54205p15036o79892n53496
10975b749153l56172j23186J06291L07962M84393O57619Q46378J046263J227766
10966A448161J351028J383977J312258J139441Q82752N68943K30992r5651l77990
10957G843911n90600p18849p58728p14576n98179m31306k48510r3999r736j9508
10947C659920j18317k73747m38350n65723o22645n94767m87708l24899j40582
10938I3182L1987J71507K71654L35787L70224L81386L75062L54283L17431K61316
10928B963819J88900J14994O4383O4057J35781K92594N37085Q57704J223773J585303
10918H028393J882872K065185K104793K003807J789194J502999J192536R02702
$$ y = [-841763, -86578, 427257, 674400, 646713, 358940, -146524, -800729, -1515765, -2195657, -2749153, -3105325, -3228511, -3122220, -2814258, -2329865, -1672246, -825868, 220395, 1448161, 2799189, 4183166, 5495424, 6634865, 7517617, 8086560, 8317552, 8221901, 7843911, 7253311, 6534462, 5775734, 5061158, 4462979, 4031673, 3783163, 3689164, 3679428, 3659920, 3541603, 3267856, 2829506, 2263783, 1641138, 1046371, 558663, 233764, 93182, 125169, 296676, 568330, 904117, 1274341, 1655727, 2030789, 2385072, 2702503, 2963819, 3152719, 3267713, 3332096, 3396153, 3531934, 3824528, 4361613, 5219317, 6443090, 8028393, 9911265, 11976450, 14081243, 16085050, 17874244, 19377243, 20569779, 21472481]
10910B1472481O70501N20514M59543M71457N17597N47653N18597M12009K40974
10901B5831326M4391j27624k31728k46662j79951o2947O3495J65700K28347K55623
10891B5739970K63445K68580K80486K97736L08013K91649K29902J15357m3185
10882B7751953k26783m18674o10757p97718r66125j092837j157934j161511j128394
10873B0191220j096254j097837j150406j255312j401832j570663j737385j876369
10865I005162j963508j977546j902903j735054j483856j169648q13737m31476
10857b472566l4110L62790P33511J046702J279181J428890J516095J571162J617931
10848G049586J663771J700121J709554J673741J579270J420908J202684R37379
$$ y = [21472481, 22142982, 22663496, 23123039, 23594496, 24112093, 24659746, 25178343, 25590352, 25831326, 25875717, 25748093, 25516365, 25269703, 25089752, 25026805, 25090300, 25256000, 25484347, 25739970, 26003415, 26271995, 26552481, 26850217, 27158230, 27449879, 27679781, 27795138, 27751953, 27525170, 27106496, 26495739, 25698021, 24731896, 23639059, 22481125, 21319614, 20191220, 19094966, 17997129, 16846723, 15591411, 14189579, 12618916, 10881531, 9005162, 7041654, 5064108, 3161205, 1426151, -57705, -1227353, -2041090, -2472566, -2506676, -2143886, -1410375, -363673, 915508, 2344398, 3860493, 5431655, 7049586, 8713357, 10413478, 12123032, 13796773, 15376043, 16796951, 17999635, 18937014]
10840A8937014O45228L52118Q6913j23001k58495l15623l07188k54412j72090
10831A8590464n8451J00935L17459N83700Q67516J117615J277097J301409J175841
10822B5273585R24137O00181K64526l9897k96659n05673o66395p69588q00683
10813B3983534p46209n96538l47963q960L92973Q12853J199738J509420J709336
10804B7908184J776263J694016J455821J069909N64179j3510o01082j133450j555825
10795C1164505j834428j961287j952575j842296j674549j496919j354264j279265
10787A7768922j278900j324112j354267j301030j121680q23146m63234j29915
10779I972638Q9429J35363p645l08960p01950j102940j433119j636867j691618
$$ y = [18937014, 19582242, 19934360, 20021273, 19898272, 19639777, 19324154, 19016966, 18762554, 18590464, 18532013, 18632948, 18950407, 19534107, 20401623, 21519238, 22796335, 24097744, 25273585, 26197722, 26797903, 27062429, 27022532, 26725873, 26220200, 25553805, 24784217, 23983534, 23237325, 22640787, 22292824, 22283864, 22676837, 23489690, 24689428, 26198848, 27908184, 29684447, 31378463, 32834284, 33904193, 34468372, 34454862, 33853780, 32720330, 31164505, 29330077, 27368790, 25416215, 23573919, 21899370, 20402451, 19048187, 17768922, 16490022, 15165910, 13811643, 12510613, 11388933, 10565787, 10102553, 9972638, 10062067, 10197430, 10189785, 9880825, 9178875, 8075935, 6642816, 5005949, 3314331]
10770C314331j607361j417437j165484q95093o45526m50415l32940k96523l18861
10761c815309l57716l66953l11925j76050L9422L16190O20028R07538J139454
10752b005321J293057J365743J370234J328120J265464J207653J170887J153913
10744H149750J137008J090671R88858Q19049N85387L06038P442k82359n39566
10735A2262278p48129r00933j000021j055819j083155j093599j088595j058915
10727D233112r89974q67512o81354m30678j31362J82710M71373P05375Q72478
10718C364168R67416R80369R00240P29967M95907K40272L812j86927l21279l98895
10708F775050m23553m00553l38321k51007j57168p3321p490M0843P4160Q9352
$$ y = [3314331, 1706970, 289533, -875951, -1771044, -2416570, -2866985, -3199925, -3496448, -3815309, -4173025, -4539978, -4851903, -5027953, -4988531, -4672341, -4052313, -3144775, -2005321, -712264, 653479, 2023713, 3351833, 4617297, 5824950, 6995837, 8149750, 9286758, 10377429, 11366287, 12185336, 12770723, 13076761, 13084203, 12801844, 12262278, 11514149, 10613216, 9613195, 8557376, 7474221, 6380622, 5292027, 4233112, 3243138, 2375626, 1694272, 1263594, 1132232, 1314942, 1786315, 2491690, 3364168, 4331584, 5311953, 6212193, 6942160, 7438067, 7678339, 7682151, 7495224, 7173945, 6775050, 6351497, 5950944, 5612623, 5361616, 5204448, 5131127, 5123637, 5164480, 5238640, 5327992]
10698E327992P4605J2200j13718l06996n52558q18953j070221j278486j428248
10689a54383j512127j525431j464656j327945j114458q24356m63291m9638L83072
10680h053213P93337J144335J413583J595680J700379J748069J761750J756283
10672C860203J731755J678190J589621J475916J362073J275535J231170J223390
10664A5427853J228198J211906J141484R93611P61853M61171J26200j99534m79721
10655B0673021o96552q49856r47552r96843j000904r57924q59229o89433m34227
10646A3240501r5652K94305O73943R70771J130465J137967J017932Q17200N83623
10637A9771055L52846J44736l3785j81463k93792l59246l66061l15233k27736
$$ y = [5327992, 5402597, 5414797, 5301079, 4994083, 4441525, 3622572, 2552351, 1273865, -154383, -1666510, -3191941, -4656597, -5984542, -7099000, -7923356, -8386647, -8436285, -8053213, -7259876, -6115541, -4701958, -3106278, -1405899, 342170, 2103920, 3860203, 5591958, 7270148, 8859769, 10335685, 11697758, 12973293, 14204463, 15427853, 16656051, 17867957, 19009441, 20003052, 20764905, 21226076, 21352276, 21152742, 20673021, 19976469, 19126613, 18179061, 17182218, 16181314, 15223390, 14364161, 13674728, 13240501, 13144849, 13439154, 14113097, 15083868, 16214333, 17352300, 18370232, 19187432, 19771055, 20123901, 20268637, 20234852, 20053389, 19759597, 19400351, 19034290, 18719057, 18491321]
10628A8491321j38162p9007o6966r9416j60134k27410k78875k93408k54318j55483
10618A6738142o479J68035L33981M54113M93260M25349K42863l7000l75886p26031
10608A7710347j041390j281916j413906j413648j275718j019468o87006l33423
10600I243872j5063K20391L42708L46534K53221J02893o0904k05521l15052l87312
10590I525767m27269m42245m40047m28271m13400l99963l89886l81529l69616
10581E833541l48861l21258l00605l07216l53953m33571n16895n63013n35927
10572B152242m20367k30612q391J89943L12055L27540K39257Q3740q0740j94791
10562B369876k19256j49651j7936J21697K18930K50343K22691J56540O9235k6449
$$ y = [18491321, 18353159, 18274152, 18207186, 18107770, 17947636, 17720226, 17441351, 17147943, 16893625, 16738142, 16731663, 16899698, 17233679, 17687792, 18181052, 18606401, 18849264, 18812264, 18436378, 17710347, 16668957, 15387041, 13973135, 12559487, 11283769, 10264301, 9577295, 9243872, 9228809, 9449200, 9791908, 10138442, 10391663, 10494556, 10433652, 10228131, 9913079, 9525767, 9098498, 8656253, 8216206, 7787935, 7374535, 6974572, 6584686, 6203157, 5833541, 5484680, 5163422, 4862817, 4555601, 4201648, 3768077, 3251182, 2688169, 2152242, 1731875, 1501263, 1492872, 1682815, 1994870, 2322410, 2561667, 2645407, 2564667, 2369876, 2150620, 2000969, 1983033, 2104730, 2323660, 2574003, 2796694, 2953234, 3022469, 2996020]
10552B996020j13491j69940j82891j64064j49935j83124k87178m52057o40491
10543F52849q10719r39338j029333j101017j174476j253676j319197j333767j259951
10534i568625j081649q16863n13906k32457j9335J07549J58583J59499J39168
10525a1668036J24670J37382J84473K52568L13017L35720K99993J98212L5786
10516i786215j72065m09211o69054r57614j288068j673581k121820k629293l177548
10507b2884469l737305m280587m794632n293217n822019o450773p250421q270265
10499f8783688r533498j1049229j2823671j4861656j7158894j9678090k2302344
10492a76191070k4781031k6692861k7438369k6290832k2581431j6051465p210334
$$ y = [2996020, 2882529, 2712589, 2529698, 2365634, 2215699, 2032575, 1745397, 1293340, 652849, -157870, -1097208, -2126541, -3227558, -4402034, -5655710, -6974907, -8308674, -9568625, -10650274, -11467137, -11981043, -12213500, -12232835, -12125286, -11966703, -11807204, -11668036, -11543366, -11405984, -11221511, -10968943, -10655926, -10320206, -10020213, -9822001, -9786215, -9958280, -10367491, -11036545, -11994159, -13282227, -14955808, -17077628, -19706921, -22884469, -26621774, -30902361, -35696993, -40990210, -46812229, -53263002, -60513423, -68783688, -78317186, -89366415, -102190086, -117051742, -134210636, -153888726, -176191070, -200972101, -227664962, -255103331, -281394163, -303975594, -320027059, -327237393]
10485c27237393K617029J1721602J8698122K2932066K4612836K4392896K3007301
10478a99255541K1052368J8924040J6841133J4901538J3139064J1555781J0131278
10471i2710339Q833353P639771O553712N598487M799683M169761L700052L360608
10463d8054912L109334K906075K720930K532571K324429K087735J830352J581996
10455b8961490J386156J277378J257082J288981J321233J315948J259418J149731
10447a8705563R82909P55279M77767J85669o6400k23028k50869j53729K8388K34762
10437a6734815M05716N03191N24695N03821M93858N42221O70711Q69710J103189
10428a1117703J318856J461928J491436J394573J193695R41866P05250N37118
$$ y = [-327237393, -324620364, -312898762, -294200640, -271268574, -246655738, -222262842, -199255541, -178203173, -159279133, -142438000, -127536462, -114397398, -102841617, -92710339, -83876986, -76237215, -69683503, -64085016, -59285333, -55115572, -51415520, -48054912, -44945578, -42039503, -39318573, -36786002, -34461573, -32373838, -30543486, -28961490, -27575334, -26297956, -25040874, -23751893, -22430660, -21114712, -19855294, -18705563, -17722654, -16967375, -16489608, -16303939, -16370339, -16593367, -16844236, -16997965, -16969577, -16734815, -16329099, -15825908, -15301213, -14797392, -14303534, -13761313, -13090602, -12220892, -11117703, -9798847, -8336919, -6845483, -5450910, -4257215, -3315349, -2610099, -2072981]
10420b072981M57333M49946M76527M91223M49762L17435Q0107k48603o32538j028102
10410a259891j398852j722526j990009k198351k342102k409458k387160k270549
10402a7978898k071378j818551j550868j302951j089514q97573o93805m43865
10394b7847403j31995K29695O06264R56962J256463J508384J741958J993753K287014
10385a7398905K620710K970847L299086L563943L732677L790874L743991L608442
10377I931665L399515L128026K808585K467493K136194J832075J544702J242631
10369B8490886Q96680N01366Q0385l23319o62783q98803j006244r77765q27306
10360B5273097n91265l22092p2639J21847K52491L30892L74816L97346M04869
$$ y = [-2072981, -1615648, -1165702, -689175, -197952, 251810, 569245, 649352, 400749, -231789, -1259891, -2658743, -4381269, -6371278, -8569629, -10911731, -13321189, -15708349, -17978898, -20050276, -21868827, -23419695, -24722646, -25812160, -26709733, -27403538, -27847403, -27979398, -27749703, -27143439, -26186477, -24930014, -23421630, -21679672, -19685919, -17398905, -14778195, -11807348, -8508262, -4944319, -1211642, 2579232, 6323223, 9931665, 13331180, 16459206, 19267791, 21735284, 23871478, 25703553, 27248255, 28490886, 29387566, 29888932, 29969317, 29645998, 28983215, 28084412, 27078168, 26100403, 25273097, 24681832, 24359740, 24287101, 24408948, 24661439, 24992331, 25367147, 25764493, 26169362]
10351B6169362L99232L77385L29323K41257J06848o1156k30282l61888m29476
10342B6540605m28260l70463k72871j48213n953J41548K75974L77462M34284M51633
10332B6995746M52625M67138N11581N72327O07509N69227M31094K01834q1408
10323C0727673l70299o19197p90109q53261p91117o07643l35391l0220K47805
10314B6578241M56090N80217O29531O24137N81623N09068M03698K62750R6577
10305C0721932o5734j84809k29587j94448j03919j274P3019J00100Q7431N7993
10295C0260704L2834J8321M091k9141r7504k04565l39052m79194o00172o82279
10285B7884043p18294p16518o95521o72230o52236o30643o02904n76262n71588
$$ y = [26169362, 26568594, 26945979, 27275302, 27516559, 27623407, 27562251, 27331969, 26970081, 26540605, 26112345, 25741882, 25469011, 25320798, 25314845, 25456393, 25732367, 26109829, 26544113, 26995746, 27448371, 27915509, 28427090, 28999417, 29606926, 30176153, 30607247, 30809081, 30727673, 30357374, 29738177, 28948068, 28094807, 27303690, 26696047, 26360656, 26330436, 26578241, 27034331, 27614548, 28244079, 28868216, 29449839, 29958907, 30362605, 30625355, 30721932, 30656198, 30471389, 30241802, 30047354, 29943435, 29942161, 30015180, 30115280, 30202711, 30260704, 30293538, 30311859, 30315950, 30286809, 30189305, 29984740, 29645688, 29166494, 28566322, 27884043, 27165749, 26449231, 25753710, 25081480, 24429244, 23798601, 23195697, 22619435, 22047847]
10276B2047847o12661p09847q50004r99992j120948j184328j183135j135922j081222
10267A3169788j060564j096104j177592j269653j334256j350854j320226j252582
10259C307957j152071j010961q18289n75346l03233l3734K09964M25838O28015
10250F78140Q29617J028947J209366J350262J438205J470221J449377J379160
10242A0833295J262462J105961R25431P46265N96885M98407M57603M67555N14025
10233A7407889N81663O56572P26622P81721Q13698Q14847P77124O95530N74628
10224B3830294M31706K91477J75389R4076M7165K6958K0770J1861j7982q4231
10214B4827483j96596l57860n62768p97509j042919j280989j498909j687178j836066
$$ y = [22047847, 21435186, 20725339, 19875335, 18875343, 17754395, 16570067, 15386932, 14251010, 13169788, 12109224, 11013120, 9835528, 8565875, 7231619, 5880765, 4560539, 3307957, 2155886, 1144925, 326636, -248710, -551943, -585677, -375713, 50125, 678140, 1507757, 2536704, 3746070, 5096332, 6534537, 8004758, 9454135, 10833295, 12095757, 13201718, 14127149, 14873414, 15470299, 15968706, 16426309, 16893864, 17407889, 17989552, 18646124, 19372746, 20154467, 20968165, 21783012, 22560136, 23255666, 23830294, 24262000, 24553477, 24728866, 24822942, 24870107, 24897065, 24917835, 24929696, 24911714, 24827483, 24630887, 24273027, 23710259, 22912750, 21869831, 20588842, 19089933, 17402755, 15566689]
10205A5566689j936458j984170j981774j935248j848409j718808j537010j290666
10197A334146r73206n92685j74632K42599O16048R06057J082646J129746J046806
10188D617525Q49305N69910K57323l2330k50617l69521l84530l09813j71487j468
10178D774297J68713L13362M15700M69089M77648M54498M15326L69596L15756
10169H173985K44203J45369J7232j31796k85429m25566n38180o15729o55932o59763
10159E268394o31272n78150n09658m30849l37412k17087n8249J40533L66418N93819
10149C606487P87927R10043R28078Q31607O43371M18061K26652J32704J70498
10140H655428L33688N79326Q45548J074783J231978J310983J328385J309598J274682
$$ y = [15566689, 13630231, 11646061, 9664287, 7729039, 5880630, 4161822, 2624812, 1334146, 360940, -231745, -406377, -163778, 452270, 1358327, 2440973, 3570719, 4617525, 5466830, 6036740, 6294063, 6261733, 6011116, 5641595, 5257065, 4947252, 4775765, 4774297, 4943010, 5256372, 5672072, 6141161, 6618809, 7073307, 7488633, 7858229, 8173985, 8418188, 8563557, 8580789, 8448993, 8163564, 7737998, 7199818, 6584089, 5928157, 5268394, 4637122, 4058972, 3549314, 3118465, 2781053, 2563966, 2505717, 2646250, 3012668, 3606487, 4394414, 5304457, 6232535, 7064142, 7707513, 8125574, 8352226, 8484930, 8655428, 8989116, 9568442, 10413990, 11488773, 12720751, 14031734, 15360119, 16669717, 17944399]
10131A7944399J230128J168633J075178R36795P52842N40988L33884J66178N7728
10122B4206753J958l3481r2176k07052l84314o03496q31073j034501j187102j266299
10112A8569217j253153j136301r17186o12957k55352J14600M54160P25085Q96742
10103A6584855R48446Q73247O81383M00525P2978k49018n11943o75797p30371
10094A7394305p02404o46340o21687o68015p89191r52984j104488j186387j158183
10085I564626j008337p54981m34343q3491K70592O08981R12319J157705J324243
10076A1557314J399282J378292J261116J052398P67999M40648J17078j53580l32756
10067A7487791l99847l54191k15519k2250J77710L44005M59014N29668N74622
$$ y = [17944399, 19174527, 20343160, 21418338, 22355133, 23107975, 23648963, 23982847, 24149025, 24206753, 24208711, 24175230, 24083054, 23876002, 23491688, 22888192, 22057119, 21022618, 19835516, 18569217, 17316064, 16179763, 15262577, 14649620, 14394268, 14508868, 14963028, 15688113, 16584855, 17533301, 18406548, 19087931, 19488456, 19561434, 19312416, 18800473, 18124676, 17394305, 16691901, 16045561, 15423874, 14755859, 13966668, 13013684, 11909196, 10722809, 9564626, 8556289, 7801308, 7366965, 7283474, 7554066, 8163047, 9075366, 10233071, 11557314, 12956596, 14334888, 15596004, 16648402, 17416401, 17857049, 17974127, 17820547, 17487791, 17087944, 16733753, 16518234, 16495984, 16673694, 17017699, 17476713, 18006381, 18581003]
10058A8581003O05516O13290N67853M34880K03502r3990l88840o07393p04536
10049A9211285o76404n50299l66354j63606K7925J92431L30707M56200N83890
10040A9045775P17069Q40545R25052R40161Q67188P05068M68129J80113j30135
10031B4558965m29576o82389q57520r41581r47669r10812q71932q61282q89485
10022A7166719r45759j001476j020968r78566q71595p17863n39816l50893j55956
10013A0583827L9127K22969L85537N28098O63940Q07403R61170J113652J248512
10004A6554235J356420J437695J494500J522473J511136J451369J340673J181840
9996B7850341R79942P42824M82661K14091m8549k89273m86346o15507o62122o30720
$$ y = [18581003, 19186519, 19799809, 20367662, 20802542, 21006044, 20912054, 20523214, 19915821, 19211285, 18534881, 17984582, 17618228, 17454622, 17482547, 17674978, 18005685, 18461885, 19045775, 19762844, 20603389, 21528441, 22468602, 23335790, 24040858, 24508987, 24689100, 24558965, 24129389, 23447000, 22589480, 21647899, 20700230, 19789418, 18917486, 18056204, 17166719, 16220960, 15219484, 14198516, 13219950, 12348355, 11630492, 11090676, 10739783, 10583827, 10622954, 10845923, 11231460, 11759558, 12423498, 13230901, 14192071, 15305723, 16554235, 17910655, 19348350, 20842850, 22365323, 23876459, 25327828, 26668501, 27850341, 28830283, 29573107, 30055768, 30269859, 30221310, 29932037, 29445691, 28830184, 28168062, 27537342]
9986B7537342n41523m18854k84050j56189n2796J4182M1754L2655j0926q8739
9976B6072856j97508l26548m59400n78607o66579p01571o56714n10217k62941
9967B1712771N1289L73656O42160Q12423Q67159Q15332O86869N25799L81524K98909
9957B7167891L09979M29963O57471R75547J350283J728996K045562K237843K270755
9948C9174290K150043J916942J628185J334829J070325Q49536O74536N42122M49102
9939D9789910L93169L70112L70893L82370L91591L89875L73886L45738L15655
9930E3123199L05719L48343M76273P09324J046650J468555J944715K442761K933034
9921F4798573L389923L794375M141661M451260M768531N149712N633265O213066
$$ y = [27537342, 26995819, 26576965, 26292915, 26136726, 26083930, 26098112, 26139866, 26172521, 26161595, 26072856, 25875348, 25548800, 25089400, 24510793, 23844214, 23142643, 22485929, 21975712, 21712771, 21764060, 22137716, 22779876, 23592299, 24459458, 25274790, 25961659, 26487458, 26868982, 27167891, 27477870, 27907833, 28565304, 29540851, 30891134, 32620130, 34665692, 36903535, 39174290, 41324333, 43241275, 44869460, 46204289, 47274614, 48124150, 48798686, 49340808, 49789910, 50183079, 50553191, 50924084, 51306454, 51698045, 52087920, 52461806, 52807544, 53123199, 53428918, 53777261, 54253534, 54962858, 56009508, 57478063, 59422778, 61865539, 64798573, 68188496, 71982871, 76124532, 80575792, 85344323, 90494035, 96127300, 102340366]
9913A02340366O832627P410168P883391Q243766Q533046Q802219R059155R230853
9905A68335591R147498Q546524P101111M482832M64501m942242j1351365j7957161
9897A63827289k3680557k7512179k8892208k7894358k5106359k1318707j7238132
9890g815211j3356858r957628p167793n007748l427084k335152j626436j198847
9882e1892757r63932q48326p89078p29837o22679m33806j49266K20983O42711
9873e5565987J064594J432745J704939J856685J879550J778450J571546J289625
9865d2987853R70557O49833L53244R6567j09616k55739l32493l30599k39045m5432
9855d2230576K56906O57484J122003J596845K022637K348632K540580K580754
$$ y = [102340366, 109172993, 116583161, 124466552, 132710318, 141243364, 150045583, 159104738, 168335591, 177483089, 186029613, 193130724, 197613556, 198078057, 193135815, 181784450, 163827289, 140146732, 112634553, 83742345, 55847987, 30741628, 9422921, -7815211, -21172069, -31129697, -38297490, -43305238, -46732322, -49067474, -50693910, -51892757, -52856689, -53705015, -54494093, -55223930, -55846609, -56280415, -56429681, -56208698, -55565987, -54501393, -53068648, -51363709, -49507024, -47627474, -45849024, -44277478, -42987853, -42017296, -41367463, -41014219, -40917652, -41027268, -41283007, -41615500, -41946099, -42185144, -42230576, -41973670, -41316186, -40194183, -38597338, -36574701, -34226069, -31685489, -29104735]
9847b9104735K465876K209212J844926J424788J002598O16418K83452R470j99960
9838a9447955l37426l99032l88858l18413k02602n5165J13654K95361M79644O54899
9828a9605893Q15328R68462J133491J327816J550339J774529J957663K059586
9820h018679K056527J941527J717745J397231J007819N97575K26946m8587j94916
9811F83188k08226j15921L0759J73381K68017L01559K92540K74823K72982K84524
9801B257626K81319K29619J13890n2959k37666m02823n18200n63098n23878l91808
9791A92022j63718J53328N34274R30652J275653J502241J566337J461439J216632
9782H668860Q81477N08357J40954j89633m64827o78002q32792r37379r95420r99925
$$ y = [-29104735, -26638859, -24429647, -22584721, -21159933, -20157335, -19540917, -19257465, -19247995, -19447955, -19785381, -20184413, -20573271, -20891684, -21094286, -21149451, -21035797, -20740436, -20260792, -19605893, -18790565, -17822103, -16688612, -15360796, -13810457, -12035928, -10078265, -8018679, -5962152, -4020625, -2302880, -905649, 102170, 699745, 926691, 878104, 683188, 474962, 359041, 389800, 563181, 831198, 1132757, 1425297, 1700120, 1973102, 2257626, 2538945, 2768564, 2882454, 2829495, 2591829, 2189006, 1670806, 1107708, 583830, 192022, 28304, 181632, 715906, 1646558, 2922211, 4424452, 5990789, 7452228, 8668860, 9550337, 10058694, 10199648, 10010015, 9545188, 8867186, 8034394, 7097015, 6101595, 5101670]
9772E101670r36722p96245n84767l27316o2176J67975L24570L80254L23582J60356
9762C751181q7998l87818o98703r81850j209469j370828j471174j523132j534459
9753e514250j499417j400846j222827r64950o47872l08143J2365K77474M66183
9744a0802283N77597O27663O39895O37502O40102O59456O90637P06560O67695
9735d955176N45652L43812R8663j38350l24028m36518m73649m43447l57380k31054
9725f371475q7680M3489J35395J71961J50996Q1727j8079j22929k01251k21482
9715f439328j61946j9613J87275M24142O49715Q25745R24138R32238Q57491P28947
9705a091196N90645M86208M42442M61933N27347O11726O88574P40069P62388P64554
$$ y = [5101670, 4164948, 3368703, 2783936, 2456620, 2394444, 2562419, 2886989, 3267243, 3590825, 3751181, 3663183, 3275365, 2576662, 1594812, 385343, -985485, -2456659, -3979791, -5514250, -7013667, -8414513, -9637340, -10602290, -11250162, -11558305, -11545940, -11268466, -10802283, -10224686, -9597023, -8957128, -8319626, -7679524, -7020068, -6329431, -5622871, -4955176, -4409524, -4065712, -3967049, -4105399, -4429427, -4865945, -5339594, -5783041, -6140421, -6371475, -6459155, -6415666, -6280271, -6108310, -5957314, -5875587, -5893666, -6016595, -6217846, -6439328, -6601274, -6620887, -6433612, -6009470, -5359755, -4534010, -3609872, -2677634, -1820143, -1091196, -500551, -14343, 428099, 890032, 1417379, 2029105, 2717679, 3457748, 4220136, 4984690]
9695D984690P59493P53424P42271P16230O65658N83224M64532L11030J33212n1349
9685A0062415k25834l81445n16779o29151p06030p25834o68720n27706l09613
9676E371303k6870L07522O72377J024509J296494J416964J344280J090955P22061
9667A3219595L30347N201j89283k23367j01677J42709M58871P90564J086711J308537
9657A6828208J434573J463540J413131J313947J199832J096147J008947R22097
9649B6680422Q08486O50406M53297K41596M2412j27194k61016l57926m18870m49117
9639B7262496m60867m70711m92074n29210n79784o45175p38155q78223j076650
9630B1391647j324128j592140j847232k067006k245371k383082k472231k490111
$$ y = [4984690, 5744183, 6497607, 7239878, 7956108, 8621766, 9204990, 9669522, 9980552, 10113764, 10062415, 9836581, 9455136, 8938357, 8309206, 7603176, 6877342, 6208622, 5680916, 5371303, 5344433, 5651955, 6324332, 7348841, 8645335, 10062299, 11406579, 12497534, 13219595, 13549942, 13555143, 13365860, 13142493, 13040816, 13183525, 13642396, 14432960, 15519671, 16828208, 18262781, 19726321, 21139452, 22453399, 23653231, 24749378, 25758325, 26680422, 27488908, 28139314, 28592611, 28834207, 28876619, 28749425, 28488409, 28130483, 27711613, 27262496, 26801629, 26330918, 25838844, 25309634, 24729850, 24084675, 23346520, 22468297, 21391647, 20067519, 18475379, 16628147, 14561141, 12315770, 9932688, 7460457, 4970346]
9622D970346k409735k217362j920544j542563j114302o72510k58506R2258L65099
9613d707819N69338P23507Q35555Q95737Q85854P93974O23665L95507J44505q3967
9603A075856k40363k81533j85848L2337L19177N96450P91207Q64365Q22191P05529
9593D499368N64458M32564L13463J84904J5869k14260n03681q25328j130967j361437
9583A974953j463614j410467j214526r25446o11338l34465j35641l4139l6550
9574d191233j40948l30591n66540p93750r62272j048774j062149j031603r89183
9565a1117043r58253r50022r64024r90084j012860j019744j009067r93478r96050
9556b0010625j041593j146884j311464j510784j697377j815652j825948j722666
$$ y = [4970346, 2560611, 343249, -1577295, -3119858, -4234160, -4906670, -5165176, -5072918, -4707819, -4138481, -3414974, -2579419, -1683682, -797828, -3854, 619811, 1015318, 1159823, 1075856, 835493, 553960, 368112, 400449, 719626, 1316076, 2107283, 2971648, 3793839, 4499368, 5063826, 5496390, 5809853, 5994757, 6010626, 5796366, 5292685, 4467357, 3336390, 1974953, 511339, -899128, -2113654, -3039100, -3650438, -3984903, -4120544, -4154683, -4191233, -4332181, -4662772, -5229312, -6023062, -6985334, -8034108, -9096257, -10127860, -11117043, -12075296, -13025318, -13989342, -14979426, -15992286, -17012030, -18021097, -19014575, -20010625, -21052218, -22199102, -23510566, -25021350, -26718727, -28534379, -30360327, -32082993]
9548c2082993j533342j301015j064144q45822o52982m80128l13663j36431O6595
9539c8343925L01633N61429Q27790J082807J321011J549705J773327J974180K108457
9530b6843586K125268J997015J739679J408771J074076P90701N84597M57642M02195
9521a6263642M10559M73149N70353O67856P22378O97954N84851M08407K19374
9512a1508761P0475o145q595L8750R7428J31056J22048Q1299M2544M2179R7464
9501a0800258J97838L13615M13395M77239M98547M77526M14416L07808J57053
9492g542821l4033k52177m68602o37797p08537o45288m46601j48083J90312N03629
9482a0189998P39692Q71099Q98461Q44256P41941O26975N31540M80297M86868
$$ y = [-32082993, -33616335, -34917350, -35981494, -36827316, -37480298, -37960426, -38274089, -38410520, -38343925, -38042292, -37480863, -36653073, -35570266, -34249255, -32699550, -30926223, -28952043, -26843586, -24718318, -22721303, -20981624, -19572853, -18498777, -17708076, -17123479, -16665837, -16263642, -15853083, -15379934, -14809581, -14141725, -13419347, -12721393, -12136542, -11728135, -11508761, -11438286, -11444431, -11453026, -11414276, -11316848, -11185792, -11063744, -10982445, -10939901, -10897722, -10800258, -10602420, -10288805, -9875410, -9398171, -8899624, -8422098, -8007682, -7699874, -7542821, -7576854, -7829031, -8297633, -8935430, -9643967, -10289255, -10735856, -10883939, -10693627, -10189998, -9450306, -8579207, -7680746, -6836490, -6094549, -5467574, -4936034, -4455737, -3968869]
9473c968869N54015O77596Q49395J055908J276617J486375J660581J778704J824781
9464G195103J787376J660456J444095J144361P73374L49892j01038n50120r66287
9455A2737212j318386j577266j720579j739516j642761j453559j201535r15131
9447A168479o18432l31538p2889J36275K67750K90117J84637l5918l22735o07731
9437E8015q30136r55269r78373r18276q07875o84657n82034n21666n06927n19585
9427g246783n23974m79957l58422j50079J35231M73523Q30601J165495J436832
9418d717533J612318J677415J638332J516855J338907J123471Q79334O11366L29536
9409F010001N1279k04810m26509o08406p46024q31983q58434q19874p09693n15238
$$ y = [-3968869, -3414854, -2737258, -1887863, -831955, 444662, 1931037, 3591618, 5370322, 7195103, 8982479, 10642935, 12087030, 13231391, 14004765, 14354657, 14253619, 13703499, 12737212, 11418826, 9841560, 8120981, 6381465, 4738704, 3285145, 2083610, 1168479, 550047, 218509, 145620, 281895, 549645, 839762, 1024399, 988481, 665746, 58015, -772121, -1727390, -2705763, -3624039, -4431914, -5116571, -5698605, -6220271, -6727198, -7246783, -7770757, -8250714, -8609136, -8759215, -8623984, -8150461, -7319860, -6154365, -4717533, -3105215, -1427800, 210532, 1727387, 3066294, 4189765, 5069099, 5680465, 6010001, 6061280, 5856470, 5429961, 4821555, 4075531, 3243548, 2385114, 1565240, 855547, 340309]
9399C40309k23454J61134O01066J029431J371952J573294J615469J525266J369745
9390I364212J236276J198784J284189J458515J642484J748118J715861J533476
9382B1181915J231075Q60509M73630J09755k05820m57349o35450p39425p82839
9373B1036001p94903q12276q64057r59250j084337j211703j313522j373139j387706
9364A1235108j361098j293106j173798r88329p30455m17284r5043J71684L25684
9355E673363L44646K53995J17456J0918p685P9867K47319M37811N88300O50929
9345H396919O02418M42938J90811j22788m58296p71515j018371j163494j191746
9336D906876j115075r66778p84988n96804m13444k36510o7343Q8286K21837L26708
$$ y = [340309, 116855, 277989, 879055, 1908486, 3280438, 4853732, 6469201, 7994467, 9364212, 10600488, 11799272, 13083461, 14541976, 16184460, 17932578, 19648439, 21181915, 22412990, 23273499, 23747129, 23856884, 23651064, 23193715, 22558265, 21818840, 21036001, 20241098, 19428822, 18564765, 17605515, 16521178, 15309475, 13995953, 12622814, 11235108, 9874010, 8580904, 7407106, 6418777, 5688322, 5271038, 5175995, 5347679, 5673363, 6018009, 6272004, 6389460, 6400378, 6392693, 6472560, 6719879, 7157690, 7745990, 8396919, 8999337, 9442275, 9633086, 9510298, 9052002, 8280487, 7262116, 6098622, 4906876, 3791801, 2825023, 2040035, 1443231, 1029787, 793277, 725934, 814220, 1036057, 1362765]
9326A362765M01874M52397M87103N14834N40858N64650N79747N76170N46274M93273
9316F519945M36547M04783M15365M53441M70695M09938K39604k6039l32310o08157
9306H383812p93968q61157q17677o99686n55452m30091l56242l49909m09035n14621
9296B595974o35849p39162p98644q04100p63547o98417o33261n85279n60076n55344
9286d177705n67428n93453o27220o54904o57327o17797n28450l91051k15436j9345
9276i050116J73004L38460M66793N67202O62145P71809R01238J040032J173525
9267b955908J293870J400082J488268J544742J551663J499845J394535J248424
9259H465521J070760Q64489O32709L86290J45690o3142k15251k92610k87719k04228
$$ y = [1362765, 1764639, 2217036, 2704139, 3218973, 3759831, 4324481, 4904228, 5480398, 6026672, 6519945, 6956492, 7361275, 7776640, 8230081, 8700776, 9110714, 9350318, 9324279, 8991969, 8383812, 7589844, 6728687, 5911010, 5211324, 4655872, 4225781, 3869539, 3519630, 3110595, 2595974, 1960125, 1220963, 422319, -381781, -1145328, -1843745, -2477006, -3062285, -3622361, -4177705, -4745133, -5338586, -5965806, -6620710, -7278037, -7895834, -8424284, -8815335, -9030771, -9050116, -8877112, -8538652, -8071859, -7504657, -6842512, -6070703, -5169465, -4129433, -2955908, -1662038, -261956, 1226312, 2771054, 4322717, 5822562, 7217097, 8465521, 9536281, 10400770, 11033479, 11419769, 11565459, 11502317, 11287066, 10994456, 10706737, 10502509]
9249A0502509n6334J30393L17459M56900N04463M38476K71900M7152j84364l84427
9239A2044127n38002o47540p18681p48253p21739o20875m36140j76289J30086
9230G566694M40143P04996Q77798R22084Q20299N79440K30273j79606n95135r61854
9220A0405132j231493j365867j340459j148358q03871l43658J76757O91816J138752
9211F178751J470974J666809J729021J675548J527785J303672J017771O85635
9203A7255966L29395j7786l12795n13823n99333n82165n06261m26251l83109l89919
9193A3853919m32475m80989n05955m90750m35489l52535k60233j79954j33853
9184A0581686j37706j90888k73659l57954m24366m70507n03598n24669n19300
$$ y = [10502509, 10446175, 10576568, 10894027, 11350927, 11855390, 12293866, 12565766, 12612918, 12428554, 12044127, 11506125, 10858585, 10139904, 9391651, 8669912, 8049037, 7612897, 7436608, 7566694, 8006837, 8711833, 9589631, 10511715, 11332014, 11911454, 12141727, 11962121, 11366986, 10405132, 9173639, 7807772, 6467313, 5318955, 4515084, 4171426, 4348183, 5039999, 6178751, 7649725, 9316534, 11045555, 12721103, 14248888, 15552560, 16570331, 17255966, 17585361, 17567575, 17254780, 16740957, 16141624, 15559459, 15053198, 14626947, 14243838, 13853919, 13421444, 12940455, 12434500, 11943750, 11508261, 11155726, 10895493, 10715539, 10581686, 10443980, 10253092, 9979433, 9621479, 9197113, 8726606, 8223008, 7698339, 7179039]
9175G179039m64215l46128j78940n328J20841J61043J10507k984j37629k59979
9165F176227l57055m33093m96785n49360n80884n75523n21663m21102k92500j67029
9155A781233p7883m8140q2128j64000k64158l50043l95307l83505l08347j75725
9145d68003q510J51569K51787K45521J10705j39698m59799p84146j046836j199527
9135c346937j222782j128111r50809p35498n18892l17471j27157O5253K68429
9126h013975M82119P04430R40895J202886J493680J794115K062148K248518K317008
9117E231824K255418K073361J793565J445329J063211O87710L62247J23323j3300
9108A5022688o1694o2144o5152j12699k27059m09189o41354q89861j110107j257628
$$ y = [7179039, 6714824, 6368696, 6189756, 6184428, 6305269, 6466312, 6576819, 6573835, 6436206, 6176227, 5819172, 5386079, 4889294, 4339934, 3759050, 3183527, 2661864, 2240762, 1948262, 1781233, 1703350, 1655210, 1573082, 1409082, 1144924, 794881, 399574, 16069, -292278, -468003, -476513, -324944, -73157, 172364, 283069, 143371, -316428, -1100574, -2147410, -3346937, -4569719, -5697830, -6648639, -7384137, -7903029, -8220500, -8347657, -8282404, -8013975, -7531856, -6827426, -5886531, -4683645, -3189965, -1395850, 666298, 2914816, 5231824, 7487242, 9560603, 11354168, 12799497, 13862708, 14550418, 14912665, 15035988, 15022688, 14960994, 14898850, 14833698, 14720999, 14493940, 14084751, 13443397, 12553536, 11443429, 10185801]
9098A0185801j302787j240826j090820q85185o57584m36049k42058r1146R329
9089D248675O4110Q9595J05031J20928J35723J44763J52215J73534K27588L28627
9079E790789M85161P01083R71269J272618J560251J776773J872565J826287J653056
9070A7909852J394883J100710Q10760N53975L52772K23186J67448J67971J91190
9061B2872747J98716J56820M0423j64248m54173q04110j168272j491827j727119
9052A7458957j846398j846914j748997j588960j407482j235942j086424r51114
9044E746726q11565o52111m69495k73583q0041R8593K57018L95968N20226O37604
9034E369340P55290Q72307R75421J046693J078959J085063J091717J123349J187984
$$ y = [10185801, 8883014, 7642188, 6551368, 5666183, 5008599, 4572550, 4330492, 4239346, 4248675, 4312785, 4402380, 4507411, 4628339, 4764062, 4908825, 5061040, 5234574, 5462162, 5790789, 6275950, 6977033, 7948302, 9220920, 10781171, 12557944, 14430509, 16256796, 17909852, 19304735, 20405445, 21216205, 21770180, 22122952, 22346138, 22513586, 22681557, 22872747, 23071463, 23228283, 23268706, 23104458, 22650285, 21846175, 20677903, 19186076, 17458957, 15612559, 13765645, 12016648, 10427688, 9020206, 7784264, 6697840, 5746726, 4935161, 4283050, 3813555, 3539972, 3459931, 3558524, 3815542, 4211510, 4731736, 5369340, 6124630, 6996937, 7972358, 9019051, 10098010, 11183073, 12274790, 13398139, 14586123]
9025A4586123J271974J343548J363127J297426J131788Q75008N55649K13119j13283
9016B2524479l95597o25406q14216r84559j156728j338897j524683j696624j832023
9007A2155746j909436j915092j846838j712317j521914j282386r96451o66618
8999C04694k97904J01272N15156R12936J245645J456645J503138J375110J099827
8990H216519P30921L30010m9812l72680o19802p84156q66093q73510q24572p47513
8980D139312o73890o27417o14861o24528o33104o16867n62218m71027l58114k41711
8970a284425j33049l3292N9589J40549J93537J97727J39414K1676j34183k96544
8960a129001m36446n37888n99609o29336o36685o29937o17049o07701o12568o38168
$$ y = [14586123, 15858097, 17201645, 18564772, 19862198, 20993986, 21868994, 22424643, 22637762, 22524479, 22128882, 21503476, 20689260, 19704701, 18547973, 17209076, 15684393, 13987769, 12155746, 10246310, 8331218, 6484380, 4772063, 3250149, 1967763, 971312, 304694, 6790, 108062, 623218, 1536154, 2781799, 4238444, 5741582, 7116692, 8216519, 8947440, 9277450, 9227638, 8854958, 8235156, 7451000, 6584907, 5711397, 4886825, 4139312, 3465422, 2838005, 2223144, 1598616, 965512, 348645, -213573, -684600, -1042714, -1284425, -1417474, -1450766, -1391177, -1250628, -1057091, -859364, -719950, -698274, -832457, -1129001, -1565447, -2103335, -2702944, -3332280, -3968965, -4598902, -5215951, -5823652, -6436220, -7074388]
8950g074388o80130p21519p40564p23380o71373n97337n14783m30014l41854k46591
8940a2741933j42909l3740P4973J76594K65228L35504L81937L99904L89417L60789
8930a0534236L38276L56353M46966O23881Q74978J168169J465974J738606J969866
8921a551167K157092K307976K434551K544376K631681K673790K636457K487448
8913A8322204K212687J826687J371029R01016M66980R8527k02382m56777o93103
8904B3846868r27363j151796j342355j480779j572152j641209j710479j780724
8896A2240011j829678j825477j739492j550813j248205q36927l47524J63758O28347
8887C654000R86748J206054J285550J251256J146303J021891R27597Q98618R44384
$$ y = [-7074388, -7754518, -8476037, -9216601, -9939981, -10611354, -11208691, -11723474, -12153488, -12495342, -12741933, -12884842, -12918582, -12843609, -12667015, -12401787, -12066283, -11684346, -11284442, -10895025, -10534236, -10195960, -9839607, -9392641, -8768760, -7893782, -6725613, -5259639, -3521033, -1551167, 605925, 2913901, 5348452, 7892828, 10524509, 13198299, 15834756, 18322204, 20534891, 22361578, 23732607, 24633623, 25100603, 25199130, 24996748, 24539971, 23846868, 22919505, 21767709, 20425354, 18944575, 17372423, 15731214, 14020735, 12240011, 10410333, 8584856, 6845364, 5294551, 4046346, 3209419, 2861895, 3025653, 3654000, 4640748, 5846802, 7132352, 8383608, 9529911, 10551802, 11479399, 12378017, 13322401]
8878A3322401J048126J180717J319165J455962J595256J743168J900044K056055
8870B5620894K190012K274258K286471K220433K085161J892392J645097J338485
8862D1553203R70672N50981R9713l55996p84822j154684j441502j639654j763709
8853C6034202j836433j870582j858043j774384j596750j325292r95277o70254
8845B4107187m17448k79435k60035l32111m59112o13985p84187r64096j145614
8836A8851164j316189j463150j575019j635706j620455j505424j288643j004316
8828G442262p15257m87337l63685l52622m30927n56868o86863p89582q51859q75171
8818A332091q67342q35562p83316p10979o19561n16245m18053l49237l31478l71554
$$ y = [13322401, 14370527, 15551244, 16870409, 18326371, 19921627, 21664795, 23564839, 25620894, 27810906, 30085164, 32371635, 34592068, 36677229, 38569621, 40214718, 41553203, 42523875, 43074856, 43174569, 42818573, 42033751, 40879067, 39437565, 37797911, 36034202, 34197769, 32327187, 30469144, 28694760, 27098010, 25772718, 24777441, 24107187, 23689739, 23410304, 23150269, 22818158, 22359046, 21745061, 20960874, 19996778, 18851164, 17534975, 16071825, 14496806, 12861100, 11240645, 9735221, 8446578, 7442262, 6727005, 6239668, 5875983, 5523361, 5092434, 4535566, 3848703, 3059121, 2207262, 1332091, 464749, -370813, -1154129, -1865108, -2484669, -3000914, -3418967, -3768204, -4099682, -4471236]
8808d471236m54410n47417o14193o28413n77898m59479k75237l7750K21841M56645
8798g387547O21795O95678O89136O37899N85787N69292O09413P10480Q62270J042141
8788c63656J217606J352623J418621J405822J328205J219225J120320J066513
8780I765279J073876J133850J217278J285954J305793J256957J139087R70366
8772A9148440P79354N92426M23702K72757J28263k8058k19143m68001p86656j161325
8762A8681759j544236j862767k046786k060491j918307j673955j391344j118554
8754E065319q80096o84656n33518m20278l27387k31095j15685J6451J51026K78719
8744B318800M04500N39221O82375Q12795Q94751Q94136P94457O04463L53597P8696
$$ y = [-4471236, -4925646, -5473063, -6087256, -6715669, -7293567, -7753046, -8028283, -8066033, -7844192, -7387547, -6765752, -6070074, -5380938, -4743039, -4157252, -3587960, -2978547, -2268067, -1405797, -363656, 853950, 2206573, 3625194, 5031016, 6359221, 7578446, 8698766, 9765279, 10839155, 11973005, 13190283, 14476237, 15782030, 17038987, 18178074, 19148440, 19927794, 20520220, 20943922, 21216679, 21344942, 21316884, 21097741, 20629740, 19843084, 18681759, 17137523, 15274756, 13227970, 11167479, 9249172, 7575217, 6183873, 5065319, 4185223, 3500567, 2967049, 2546771, 2219384, 1988289, 1872604, 1889055, 2040081, 2318800, 2723300, 3262521, 3944896, 4757691, 5652442, 6546578, 7341035, 7945498, 8299095, 8377791]
8734H377791j87961m21216n99001p01479p16953o47453n06532l11311p6737J83890
8724D393038M55573P20252R58087J148076J266603J287907J192425R81749O88415
8715A3092125L68238P7119j51005l09736m09315m61579m71760m39627l66257k61366
8705A0666837j46640n2081n797k1756r2452j92054k89461l63053m07259m28391
8695H667893m36441m40918m52404m85570n58524o85346q62797j059029j216030
8686B470834j270242j180668r46199o02402k02718K03028N81775R16741J196414
8677A166563J403812J517135J521839J422032J239430J000978P26843M28745J17494
8668A0544871j89653m69491o99727q63982r50677r51163q64641p08126n20602
$$ y = [8377791, 8189830, 7768614, 7169613, 6468134, 5751181, 5103728, 4597196, 4285885, 4209148, 4393038, 4848611, 5568863, 6526950, 7675026, 8941629, 10229536, 11421961, 12403710, 13092125, 13460363, 13537482, 13386477, 13076741, 12667426, 12205847, 11734087, 11294460, 10928203, 10666837, 10520197, 10468116, 10462319, 10440563, 10348111, 10156057, 9866596, 9503543, 9096284, 8667893, 8231452, 7790534, 7338130, 6852560, 6294036, 5608690, 4745893, 3686864, 2470834, 1200592, 19924, -926275, -1528677, -1731395, -1528367, -946592, -29851, 1166563, 2570375, 4087510, 5609349, 7031381, 8270811, 9271789, 9998632, 10427377, 10544871, 10355218, 9885727, 9186000, 8322018, 7371341, 6420178, 5555537, 4847411, 4326809]
8659D326809l54233k57074k57241l54728n22168p13915q80384r81082r91144r02832
8649a887992p26245m89172k31959K899J81073K82468L04311K62822J89549J17941
8639a994305O4876K1072l9564j37240k67887m02311n00420n27235m60974k94409
8629d538397l5864K87965O31439R36318J145131J216490J135735R17406O01176
8620B297399K44879q4793l26447m42232m32080l34636k13330j34860j48631k71667
8610A53602m81480p20101r10631r81963q92434o43267k76629J40972N42858Q82503
8600c186570J140748J319060J426014J466155J436961J335373J171030R77852
8592G086623Q12600P35226P80266R38418J161319J385018J555732J644046J645232
$$ y = [4326809, 3972576, 3715502, 3458261, 3103533, 2581365, 1867450, 987066, 5984, -985160, -1887992, -2614237, -3103409, -3335368, -3332469, -3151396, -2868928, -2564617, -2301795, -2112246, -1994305, -1929429, -1908357, -1947921, -2085161, -2353048, -2755359, -3255779, -3783014, -4243988, -4538397, -4574261, -4286296, -3654857, -2718539, -1573408, -356918, 778817, 1696223, 2297399, 2542278, 2457485, 2131038, 1688806, 1256726, 922090, 708760, 573900, 425269, 153602, -327878, -1047979, -1958610, -2940573, -3833007, -4476274, -4752903, -4611931, -4069073, -3186570, -2045822, -726762, 699252, 2165407, 3602368, 4937741, 6108771, 7086623, 7899223, 8634449, 9414715, 10353133, 11514452, 12899470, 14455202, 16099248, 17744480]
8583A7744480J571301J441438J274899J088103Q95176P09582N44405M10616L13934
8574B5993934K51716K11774J75060J22640M4584n3929j54132k33751k79640k93288
8564B5784968k85127k64908k39127k16811k13382k44055l11337l98607m75338
8555B3136276n08466m71377l47681j33147J59792M95094Q10846J030613J088805
8546B5260755R56576O51009K23054k63547p47171j173366j496915j686574j730818
8537A9993003j639880j442484j179288q95571o35115m36901l34503l54513n09372
8528A2565376p85558j136301j488906j766744j914305j912274j778529j559075
8520B23684j313995j101223r61358r08622r31096r98529j072992j118546j108970
$$ y = [17744480, 19315781, 20757219, 22032118, 23120221, 24015397, 24724979, 25269384, 25680000, 25993934, 26245650, 26457424, 26632484, 26755124, 26799708, 26745779, 26591647, 26357896, 26078256, 25784968, 25499841, 25234933, 24995806, 24778995, 24565613, 24321558, 24010221, 23611614, 23136276, 22627810, 22156433, 21808752, 21675605, 21835397, 22330491, 23141337, 24171950, 25260755, 26217331, 26868340, 27091394, 26827847, 26080676, 24907310, 23410395, 21723821, 19993003, 18353123, 16910639, 15731351, 14835780, 14200665, 13763764, 13429261, 13074748, 12565376, 11779818, 10643517, 9154611, 7387867, 5473562, 3561288, 1782759, 223684, -1090311, -2191534, -3152892, -4061514, -4992610, -5991139, -7064131, -8182677, -9291647]
8511i291647j033752r01473p37770n75634m40742l39929k60791j82840r2423Q292
8501a3848709J02866J70570J98363J88091J55357J21232J01690J00473J09952
8492a2600115J20845J35494J74471K69044M42324O90992R79069J247245J432966
8483g107665J491805J409923J202114Q98843N32100J28180k91881p08203j098479
8474c543263j437366j699677j865512j923489j870416j710234j455813j133001
8466a6638771p82159m52633j89633j8214O6389R3758R9481J05195J12384J13465
8456a7490738J08856J14436J53514K41223L74846N36595P03491Q54645R73224
8447a3429908J048173J078488J074722J052059J019436R75492R15240Q39672P58089
$$ y = [-9291647, -10325399, -11226872, -11964642, -12540276, -12981018, -13320947, -13581738, -13764578, -13857001, -13848709, -13745843, -13575273, -13376910, -13188819, -13033462, -12912230, -12810540, -12710067, -12600115, -12479270, -12343776, -12169305, -11900261, -11457937, -10766945, -9787876, -8540631, -7107665, -5615860, -4205937, -3003823, -2104980, -1572880, -1444700, -1736581, -2444784, -3543263, -4980629, -6680306, -8545818, -10469307, -12339723, -14049957, -15505770, -16638771, -17420930, -17873563, -18063196, -18081410, -18015021, -17921263, -17821782, -17716587, -17604203, -17490738, -17381882, -17267446, -17113932, -16872709, -16497863, -15961268, -15257777, -14403132, -13429908, -12381735, -11303247, -10228525, -9176466, -8157030, -7181538, -6266298, -5426626, -4668537]
8438d668537O81436O13103N45323M65115L66910K62814J81658J56658K11042L50791
8428h33687N64894Q27861J102083J342602J506298J562423J498704J319076J034774
8419I925028O56125J93359l32921q81663j394000j810324k090971k227733k241841
8410b04941k172086k059174j932313j803337j670005j523624j353887j149350
8402a3868717q98796n98188k60411Q0657L77717N87047O85898O81446O08635N20510
8392a2084202M75583N23643O90872R69237J317326J674309J979548K187267K271861
8383E444K226720K061631J800538J478154J133605Q01729N05641K54734M9032
8374A0317228j13965k34890l12467l45641l34887k81262j84528m3143J41899L61293
$$ y = [-4668537, -3987101, -3373998, -2828675, -2363560, -1996650, -1733836, -1552178, -1395520, -1184478, -833687, -268793, 559068, 1661151, 3003753, 4510051, 6072474, 7571178, 8890254, 9925028, 10581153, 10774512, 10441591, 9559928, 8165928, 6355604, 4264633, 2036900, -204941, -2377027, -4436201, -6368514, -8171851, -9841856, -11365480, -12719367, -13868717, -14767513, -15365701, -15626112, -15545455, -15167738, -14580691, -13894793, -13213347, -12604712, -12084202, -11608619, -11084976, -10394104, -9424867, -8107541, -6433232, -4453684, -2266417, 5444, 2232164, 4293795, 6094333, 7572487, 8706092, 9507821, 10013462, 10268196, 10317228, 10203263, 9968373, 9655906, 9310265, 8975378, 8694116, 8509588, 8466445, 8608344, 8969637]
8364H969637N94741Q14326R91165J099668J117699J026457Q14299M84269O1003
8355A5973264m07675q57128j220266j447068j522784j475699j366699j261705
8347F414240j200650j182263j174037j138199j054334r25718p70440o06190m37694
8338b075285k53225l3290K32156N28564Q15062J039284J161337J173363J103322
8329C691288J000601R11783Q60041Q38258Q18346P71498O87911N82494M81285
8320A0643505L99150L27905K44000J26769k8031k05900l79554n19270o04706o32649
8310I371219o15247n70531n13578m53621l94696l35883k72082j98813j20077n2774
8300E843917k1141m1584j07510j87414k41490k47229k15646j86497k05845k99778
$$ y = [8969637, 9564378, 10378704, 11369869, 12469537, 13587236, 14613693, 15427992, 15912261, 15973264, 15565589, 14708461, 13488195, 12041127, 10518343, 9042644, 7675945, 6414240, 5213590, 4031327, 2857290, 1719091, 664757, -260961, -1031401, -1637591, -2075285, -2328510, -2361800, -2129644, -1601080, -786018, 253266, 1414603, 2587966, 3691288, 4691889, 5603672, 6463713, 7301971, 8120317, 8891815, 9579726, 10162220, 10643505, 11042655, 11370560, 11614560, 11741329, 11713298, 11507398, 11127844, 10608574, 10003868, 9371219, 8755972, 8185441, 7671863, 7218242, 6823546, 6487663, 6215581, 6016768, 5896691, 5843917, 5822776, 5781192, 5673682, 5486268, 5244778, 4997549, 4781903, 4595406, 4389561, 4089783]
8290D089783m57795o33865p65773q04964p40963o04673m47166l08374j97611r7889
8280i69290J4174J51930L16981N06413P16274R36930J147238J315349J406891
8271E542890J396172J276083J063441P96610N25029K95234J40211P5548J00922
8262A1212140K03335L59757N39018P04931Q23180Q71356Q45974P59041O24728
8253A6943460M47610K24848l8816l18261n70574p50469q25407p83152o34842m16281
8243A3278116j82104J1442J27244J56986J14393K1326j01138k33782l58594m62148
8233A2371741n41847o08113o76976p56065q34923q88304q90167q28390p12815
8224E634141n75022m59598m06455m29525n03908n71974n67807m48170k14328Q6896
$$ y = [4089783, 3631988, 2998123, 2232350, 1427386, 686423, 81750, -365416, -673790, -871401, -969290, -955116, -803186, -486205, 20208, 736482, 1673412, 2820650, 4135999, 5542890, 6939062, 8215145, 9278586, 10075196, 10600225, 10895459, 11035670, 11111218, 11212140, 11415475, 11775232, 12314250, 13019181, 13842361, 14713717, 15559691, 16318732, 16943460, 17391070, 17615918, 17577102, 17258841, 16688267, 15937798, 15112391, 14329239, 13694397, 13278116, 13096012, 13107454, 13234698, 13391684, 13506077, 13527403, 13426265, 13192483, 12833889, 12371741, 11829894, 11221781, 10544805, 9788740, 8953817, 8065513, 7175346, 6346956, 5634141, 5059119, 4599521, 4193066, 3763541, 3259633, 2687659, 2119852, 1671682, 1457354, 1544250]
8214A544250L83375O07389P18660P12460O15573M75052L41925K53571K22977K40107
8204F115339K81056L17422L24347K89344K19637J42424R7256J24854K54803M92311
8194H658793Q08563J143398J422549J580318J575756J398395J066913O23782J26270
8185A8404737l65446p99687j139883j364584j463564j435695j291336j055340
8177I489202p64354m58210j71317P1756K57941L86027M63341M97800M90701M36535
8167A0699422L29099J68149l6544k63265m79973o52270p55596p83852p48200o67405
8157F809565n55981m16512k40665j9445K43603N26270P92977J005477J130041
8148I275330J139675J017075P62150M00351j6137m19282p45098r52387j030092
$$ y = [1544250, 1927625, 2535014, 3253674, 3966134, 4581707, 5056759, 5398684, 5652255, 5875232, 6115339, 6396395, 6713817, 7038164, 7327508, 7547145, 7689569, 7786825, 7911679, 8166482, 8658793, 9467356, 10610754, 12033303, 13613621, 15189377, 16587772, 17654685, 18278467, 18404737, 18039291, 17239604, 16099721, 14735137, 13271573, 11835878, 10544542, 9489202, 8724848, 8266638, 8095321, 8167077, 8425018, 8811045, 9274386, 9772186, 10262887, 10699422, 11028521, 11196670, 11160126, 10896861, 10416888, 9764618, 9009022, 8225170, 7476970, 6809565, 6253584, 5837072, 5596407, 5576962, 5820565, 6346835, 7139812, 8145289, 9275330, 10415005, 11432080, 12194230, 12594581, 12578444, 12159162, 11414064, 10461677, 9431585]
8139I431585r92134q68052o96823n21765l80401k91162k47103k23090j91359j34636
8129D885060m9913N7636J85585L40811N33454P61229R99289J208247J355140J429011
8119A1705549J439694J405597J343953J270208J202881J165934J183538J268363
8111B1985717J410971J578884J726995J812245J804144J688944J470536J169595
8103C4648031Q18401M50027Q6621k64568o03864r27367j222103j471737j664450
8094B9848991j792837j846904j810948j671100j428695j108896p58194m30935
8086A9000482j70051Q323J16086J78809K17565K41571K54059K60176K66128K71117
8076B0644265K62587K21539J33836k268j77283l75870n79287p64359r04857r78291
$$ y = [9431585, 8439451, 7571399, 6874576, 6352811, 5972410, 5681248, 5434145, 5211055, 5019696, 4885060, 4835147, 4892783, 5078368, 5419179, 5952633, 6713862, 7713151, 8921398, 10276538, 11705549, 13145243, 14550840, 15894793, 17165001, 18367882, 19533816, 20717354, 21985717, 23396688, 24975572, 26702567, 28514812, 30318956, 32007900, 33478436, 34648031, 35466432, 35916459, 36003080, 35738512, 35134648, 34207281, 32985178, 31513441, 29848991, 28056154, 26209250, 24398302, 22727202, 21298507, 20189611, 19431417, 19000482, 18830431, 18838754, 18954840, 19133649, 19351214, 19592785, 19846844, 20107020, 20373148, 20644265, 20906852, 21128391, 21262227, 21259959, 21082676, 20706806, 20127519, 19363160, 18458303, 17480012]
8066A7480012r73031q89773p38705n37938l13455r5284R1932K37618L45667M26120
8056A5033163M84700N17411N13295M62774L65409K31838Q0464o6108j82348k41961
8046A7198637k24941j27568L1532K13951L71652M60102M50558L39229J51286o2210
8036A8802228k35239l03926k25777M960L52626P50442J122378J405000J558057
8027B3230749J563278J420938J151019P94248M04344L2336k86446n34669p07259
8018B7068538q05208q33276q01189p26313o34785n57806n22654n42576o10841
8009B1033890p01803p79515q12345p87535p15899o21514n23514m24824l16946
8000A5349995j96160p7239P562K5562l4707j54293k95616m26562n37761o40452
$$ y = [17480012, 16506981, 15617208, 14878503, 14340565, 14027110, 13931826, 14023758, 14261376, 14607043, 15033163, 15517863, 16035274, 16548569, 17011343, 17376752, 17608590, 17689054, 17622946, 17440598, 17198637, 16973696, 16846128, 16877660, 17091611, 17463263, 17923365, 18373923, 18713152, 18864438, 18802228, 18566989, 18263063, 18037286, 18042246, 18394872, 19145314, 20267692, 21672692, 23230749, 24794027, 26214965, 27365984, 28160232, 28564576, 28596912, 28310466, 27775797, 27068538, 26263330, 25430054, 24628865, 23902552, 23267767, 22709961, 22187307, 21644731, 21033890, 20332087, 19552572, 18740227, 17952692, 17236793, 16615279, 16091765, 15666941, 15349995, 15153835, 15076596, 15084158, 15109720, 15075013, 14920720, 14625104, 14198542, 13660781, 13020329]
7990A3020329p49025q63459r64585j024451j023356r61102q55058p28505n99524
7981E251264m77106l62256k49744j31263l164J24762K29003K84429K79900K24200
7971E170025J38573M3648m9942j44527k53206l93052n74784p94119j031022j256963
7961H54631j442938j562083j589035j503488j300403r99733o45269k89757K5460
7952h452615K84041M95054O83005Q74823J089581J332865J594857J850065K057911
7943A809587K166741K124932J898077J484199R18748K68350l81973r44921j350313
7934G993427j564190j598441j503751j348756j196417j087890j037724j038101
7926b381843j067265j098014j104975j070707r89178q64272p05017n22903l33523
$$ y = [13020329, 12271304, 11407845, 10443260, 9418809, 8395453, 7434351, 6579293, 5850788, 5251264, 4774158, 4411902, 4162158, 4030895, 4027731, 4152493, 4381496, 4665925, 4945825, 5170025, 5308598, 5352246, 5302304, 5157777, 4904571, 4511519, 3936735, 3142616, 2111594, 854631, -588307, -2150390, -3739425, -5242913, -6543316, -7543049, -8188318, -8478075, -8452615, -8168574, -7673520, -6990515, -6115692, -5026111, -3693246, -2098389, -248324, 1809587, 3976328, 6101260, 7999337, 9483536, 10402284, 10670634, 10288661, 9343740, 7993427, 6429237, 4830796, 3327045, 1978289, 781872, -306018, -1343742, -2381843, -3449108, -4547122, -5652097, -6722804, -7711982, -8576254, -9281271, -9804174, -10137697]
7917a0137697j57659j6590P5711J15736J06138M9300n4711k04910l94569o09350
7907a1228601q30460j040697j227543j379487j479336j502768j425071j230230
7899b1344193r15618m92170J5569N67727J108494J570245J883863J994424J878773
7890a3732886J558567J101633O07378J78455j11202k37088k22713j18344K5774
7881a0950426J76561L20367M54571N76178O74185P29976P24499O45613M90717
7872f157759K67281l643k83486n20701o66619o93148o00106m09775j55607J27827
7862i095736M11276O73283Q98490J073707J186111J226105J192612J096041R55971
7853c82140P94373O28013M64416L03760J44534j1928j60751k94422m02156m68899
$$ y = [-10137697, -10295356, -10311946, -10236235, -10120499, -10014361, -9965061, -10019772, -10224682, -10619251, -11228601, -12059061, -13099758, -14327301, -15706788, -17186124, -18688892, -20113963, -21344193, -22259811, -22751981, -22736412, -22168685, -21060191, -19489946, -17606083, -15611659, -13732886, -12174319, -11072686, -10465308, -10286853, -10398055, -10635143, -10857856, -10976200, -10950426, -10773865, -10453498, -9998927, -9422749, -8748564, -8018588, -7294089, -6648476, -6157759, -5890478, -5894121, -6177607, -6698308, -7364927, -8058075, -8658181, -9067956, -9223563, -9095736, -8684460, -8011177, -7112687, -6038980, -4852869, -3626764, -2434152, -1338111, -382140, 412233, 1040246, 1504662, 1808422, 1952956, 1941028, 1780277, 1485855, 1083699, 614800]
7843F14800m78586m22940l10495j68261l3375O1252R9906Q9226N2577J6458k640
$$ y = [614800, 136214, -286726, -597221, -765482, -798857, -737605, -637699, -548473, -495896, -479438, -482078]
$$ [...]
##END NTUPLES=NMR SPECTRUM
##END=
