##TITLE=31Pdec_PEA0606
 , 24 sc
 6.6.2019
##JCAMPDX= 6.0         $$ Bruker NMR JCAMP-DX V2.0
##DATA TYPE= NMR SPECTRUM
##DATA CLASS= NTUPLES
##ORIGIN= UXNMR, Bruker Analytische Messtechnik GmbH
##OWNER= root
$$ XWIN-NMR		Version 3.5
$$ Thu Jun  6 15:58:43 2019 Russian Standard Time (UT+4h)  she@DPX200
##.OBSERVE FREQUENCY= 81.013821
##.OBSERVE NUCLEUS= ^31P
##.ACQUISITION MODE= SIMULTANEOUS
##.ACQUISITION SCHEME= undefined
##.AVERAGES= 24
##.DIGITISER RES= 17
##SPECTROMETER/DATA SYSTEM= spect
##.PULSE SEQUENCE= zgpg30
##.SOLVENT NAME= DMSO
##.SHIFT REFERENCE= (INTERNAL, DMSO, 0, 182.463)
##AUDIT TRAIL= $$ (NUMBER, WHEN, WHO, WHERE, WHAT)
$$ ##TITLE= Audit trail, XWIN-NMR		Version 3.5
$$ ##JCAMPDX= 5.01
$$ ##ORIGIN= Bruker BioSpin GmbH
$$ ##OWNER= she
$$ F:/spectra/data/she/nmr/P31/1/pdata/1/auditp.txt
$$ ##AUDIT TRAIL=  $$ (NUMBER, WHEN, WHO, WHERE, WHAT)
(   1,<2019-06-06 15:57:15.20 +0400>,<she>,<DPX200>,
      <created by zg, POWCHK disabled, PULCHK disabled
       configuration hash MD5:
       00 E9 B6 7A A2 85 ED C7 34 08 36 98 17 FE 4E 26
       data hash MD5: 32K
       D7 CE 4D AC E3 15 4B 96 73 A4 04 58 03 EF 38 80>)
(   2,<2019-06-06 15:57:22.34 +0400>,<she>,<DPX200>,
      <Start of raw data processing
       efp BC_mod = 2 LB = 1 FT_mod = 6 PKNL = 1 PHC0 = -2419.089 PHC1 = -436.801 SI = 64K 
       data hash MD5: 64K
       49 BF 94 9D 0B 0B E7 BA 6B 57 BF D5 72 E8 D0 8A>)
(   3,<2019-06-06 15:57:58.96 +0400>,<she>,<DPX200>,
      <pk PHC0 = -49.88855 PHC1 = 111.8001 
       data hash MD5: 64K
       C8 E8 C7 D9 58 27 2E 8D D9 98 CC 6C 7A E9 54 7E>)
(   4,<2019-06-06 15:58:02.53 +0400>,<she>,<DPX200>,
      <abs ABSG = 5 
       data hash MD5: 64K
       C5 43 45 34 F1 74 4C A0 E8 61 D6 00 52 E2 40 39>)
$$ ##END=
$$ 
$$ hash MD5
$$ 58 7B 93 C0 36 26 6B 5D 85 DF 2A 78 1F 4D D2 9B
##$RELAX= 
##$RELAX= 
##$RELAX= 
##$RELAX= 
##$RELAX= 
##$RELAX= 
##$RELAX= 
##$RELAX= 
$$ Bruker specific parameters
$$ --------------------------
##$DU= <F:/spectra>
##$EXPNO= 1
##$NAME= <P31>
##$PROCNO= 1
##$TYPE= <nmr>
##$USER= <she>
##$AMP= (0..31)
100 100 100 100 100 100 100 100 100 100 100 100 100 100 100 100 100 100 
100 100 100 100 100 100 100 100 100 100 100 100 100 100 
##$AQSEQ= 0
##$AQ_mod= 1
##$AUNM= <au_zg>
##$AUTOPOS= <>
##$BF1= 81.014009
##$BF2= 200.13
##$BF3= 200.13
##$BF4= 200.13
##$BF5= 200.13
##$BF6= 200.13
##$BF7= 200.13
##$BF8= 200.13
##$BYTORDA= 1
##$CFDGTYP= 0
##$CFRGTYP= 5
##$CHEMSTR= <none>
##$CNST= (0..31)
1 1 145 1 1 1 1 1 1 1 1 1 1 1 1 1 1 1 1 1 1 1 1 1 1 1 1 1 1 1 1 1 
##$CPDPRG= <waltz16>
##$CPDPRG1= <>
##$CPDPRG2= <waltz16>
##$CPDPRG3= <>
##$CPDPRG4= <mlev>
##$CPDPRG5= <mlev>
##$CPDPRG6= <mlev>
##$CPDPRG7= <mlev>
##$CPDPRG8= <mlev>
##$CPDPRGB= <>
##$CPDPRGT= <>
##$D= (0..31)
0 1 0 0 0 0 0 0 0 0 0 0.03 2e-05 3e-06 0 0 0 0 0 0 0 0 0 0 0 0 0 0 0 0 
0 0 
##$DATE= 1559822234
##$DBL= (0..7)
120 120 120 11 120 120 24 19 
##$DBP= (0..7)
150 150 150 150 150 150 150 150 
##$DBP07= 0
##$DBPNAM0= <>
##$DBPNAM1= <>
##$DBPNAM2= <>
$$ [...]
##$SUBNAM3= <"">
##$SUBNAM4= <"">
##$SUBNAM5= <"">
##$SUBNAM6= <"">
##$SUBNAM7= <"">
##$SUBNAM8= <"">
##$SUBNAM9= <"">
##$SW= 369.568048894756
##$SWIBOX= (0..15)
0 1 3 0 0 0 0 0 0 0 0 0 0 0 0 0 
##$SW_h= 29940.119760479
##$TD= 32768
##$TD0= 1
##$TE= 0
##$TE2= 300
##$TE3= 300
##$TEG= 300
##$TL= (0..7)
0 120 53 12 22 120 120 120 
##$TP= (0..7)
150 150 150 150 150 150 150 150 
##$TP07= 0
##$TPNAME0= <>
##$TPNAME1= <>
##$TPNAME2= <>
##$TPNAME3= <>
##$TPNAME4= <>
##$TPNAME5= <>
##$TPNAME6= <>
##$TPNAME7= <>
##$TPOAL= (0..7)
0.5 0.5 0.5 0.5 0.5 0.5 0.5 0.5 
##$TPOFFS= (0..7)
0 0 0 0 0 0 0 0 
##$TUNHIN= 0
##$TUNHOUT= 0
##$TUNXOUT= 0
##$USERA1= <user>
##$USERA2= <user>
##$USERA3= <user>
##$USERA4= <user>
##$USERA5= <user>
##$V9= 5
##$VALIST= <valist>
##$VCLIST= <CCCCCCCCCCCCCCC>
##$VD= 0
##$VDLIST= <DDDDDDDDDDDDDDD>
##$VPLIST= <PPPPPPPPPPPPPPP>
##$VTLIST= <TTTTTTTTTTTTTTT>
##$WBST= 1024
##$WBSW= 4
##$XGAIN= (0..3)
0 0 0 0 
##$XL= 0
##$YL= 0
##$YMAX_a= 1029
##$YMIN_a= -916
##$ZGOPTNS= <>
##$ZL1= 120
##$ZL2= 120
##$ZL3= 120
##$ZL4= 120
##$ABSF1= 182.463
##$ABSF2= -187.1042
##$ABSG= 5
##$ABSL= 3
##$ALPHA= 0
##$AQORDER= 0
##$ASSFAC= 0
##$ASSFACI= 0
##$ASSFACX= 0
##$ASSWID= 0
##$AUNMP= <proc_1d>
##$AZFE= 0.1
##$AZFW= 0.5
##$BCFW= 0
##$BC_mod= 2
##$BYTORDP= 0
##$COROFFS= 0
##$CY= -3
##$DATMOD= 1
##$DC= 0
##$DFILT= <>
##$DTYPP= 0
##$F1P= 0
##$F2P= 0
##$FCOR= 1
##$FTSIZE= 65536
##$FT_mod= 6
##$GAMMA= 0
##$GB= 0
##$INTBC= 1
##$INTSCL= 5.30512e-09
##$ISEN= 30
##$LB= 1
##$LEV0= 0
##$LPBIN= 0
##$MAXI= 10000
##$MC2= 0
##$MEAN= 0
##$ME_mod= 0
##$MI= 50
##$NCOEF= 0
##$NC_proc= -9
##$NLEV= 6
##$NOISF1= 182.463
##$NOISF2= 159.3651
##$NSP= 0
##$NTH_PI= 0
##$NZP= 0
##$OFFSET= 182.463
##$PC= 4
##$PHC0= -2468.978
##$PHC1= -325.0009
##$PH_mod= 1
##$PKNL= yes
##$PPARMOD= 0
##$PSCAL= 0
##$PSIGN= 0
##$REVERSE= no
##$SF= 81.0140089999434
##$SI= 65536
##$SIGF1= 159.3651
##$SIGF2= -187.1042
##$SINO= 113.3802
##$SIOLD= 16384
##$SREGLST= <1H.CDCl3>
##$SSB= 0
##$STSI= 65536
##$STSR= 0
##$SW_p= 29940.119760479
##$SYMM= 0
##$S_DEV= 0
##$TDeff= 32768
##$TDoff= 0
##$TI= <>
##$TILT= no
##$TM1= 0
##$TM2= 0
##$TOPLEV= 0
##$USERP1= <user>
##$USERP2= <user>
##$USERP3= <user>
##$USERP4= <user>
##$USERP5= <user>
##$WDW= 1
##$XDIM= 65536
##$YMAX_p= 407590201
##$YMIN_p= -9951478
$$ End of Bruker specific parameters
$$ ---------------------------------
##NTUPLES= NMR SPECTRUM
##VAR_NAME=  FREQUENCY,     SPECTRUM/REAL,   SPECTRUM/IMAG
##SYMBOL=    X,             R,               I
##VAR_TYPE=  INDEPENDENT,   DEPENDENT,       DEPENDENT
##VAR_FORM=  AFFN,          ASDF,            ASDF
##VAR_DIM=   65536,         65536,           65536
##UNITS=     HZ,            ARBITRARY UNITS, ARBITRARY UNITS
##FACTOR=    0.456856943014862, 1,           1
##FIRST=     14782.0589164792, 0,            0
##LAST=      -15158.0608439998, 0,           0
##MIN=       -15158.0608439998, -9951478,    0
##MAX=       14782.0589164792, 407590201,    0
$$ Real data points
##PAGE= N=1
##DATA TABLE= (X++(R..R)), XYDATA
$$ [...]
$$ plain form
37760 -389368 -446653 -463320 -569425 -687232 -648734 -468811 -344978 -384220 -475856 -472932 -374461
37749 -374461 -269916 -205836 -175271 -162988 -143661 -99447 -74322 -129130 -211512 -181835 -26010
37738 -26010 80313 12629 -112667 -112633 -3572 59603 41254 49228 125801 185781 179927 170684
37726 170684 205647 239501 229149 204753 204885 233742 311787 460353 594507 552304 306034
37715 306034 41521 -62795 -47890 -66270 -144426 -181725 -138160 -81565 -51042 -821 94312
37704 94312 185355 241488 300920 370924 360137 198169 -23863 -127999 -57341 69588 117703
37693 117703 70383 -16418 -108262 -174510 -140214 41451 277592 390207 307225 132776 7099
37682 7099 -31153 -13952 37803 99838 116432 69639 32256 69917 126931 96834 -21800 -133189
$$ packed form
37760c89368n7285j6667j06105j17807L8498J79923J23833l9242r1636K924R8471
37749c74461J04545O4080L0565J2283J9327M4214K5125n4808q2382K9677J55825
37738b6010J06323o7684j25296L4J09061O3175j8349P974P6573N9980n854r243
37726A70684L4963L3854j0352k4396J32K8857P8045J48566J34154m2203k46270
37715C06034k64513j04316J4905j8380p8156l7299M3565N6595L0523N0221R5133
37704I4312R1043N6133N9432P0004j0787j61968k22032j04136P0658J26929M8115
37693A17703m7320q6801r1844o6248L4296J81665K36141J12615q2982j74449j25677
37682G099l8252J7201N1755O2035J6594m6793l7383L7661N7014l0097j18634j11389
$$ plain form
37670 -133189 -187071 -211904 -215363 -165975 -90623 -82668 -174332 -282587 -309573 -220885 -20240
37659 -20240 240579 403109 294206 -45302 -337195 -364818 -204077 -65927 -12246 43709
37649 43709 135629 204483 234830 282402 355568 390840 368545 347243 350150 309221 171012 -4446
37637 -4446 -97365 -46636 107214 260230 308017 208173 9387 -189592 -315234 -353838 -336908
37626 -336908 -312928 -306920 -282239 -173764 12807 177424 242215 245310 264285 291082 252331
37615 252331 121750 -58286 -240977 -390313 -455449 -404978 -280380 -162672 -102767 -118871
37605 -118871 -206342 -294748 -274496 -156948 -125137 -297725 -515924 -531128 -360011 -258575
37595 -258575 -343818 -447988 -404418 -289263 -271750 -357627 -401796 -308836 -142321 -71916 -221244
$$ packed form
37670a33189n3882k4833l459M9388P5352P955r1664j08255k6986Q8688K00645
37659b0240K60819J62530j08903l39508k91893k7623J60741J38150N3681N5955
37649D3709R1920O8854L0347M7572P3166L5272k2295k1302K907m0929j38209j75458
37637d446r2919N0729J53850J53016M7787r9844j98786j98979j25642l8604J6930
37626c36908K3980O008K4681J08475J86571J64617O4791L095J8975K6797l8751
37615B52331j30581j80036j82691j49336o5136N0471J24598J17708N9905j6104
37605a18871q7471q8406K0252J17548L1811j72588k18199j5204J71117J01436
37595b58575q5243j04170M3570J15155J7513q5877m4169R2960J66515P0405j49328
$$ plain form
37584 -221244 -497462 -601000 -340919 73512 236924 58688 -146075 -132449 -41782 -107185
37574 -107185 -282303 -373913 -362643 -350686 -319541 -191207 -47602 -42783 -143736 -185068 -140684
37563 -140684 -112533 -86034 49168 239923 298503 225702 236996 390912 457148 281797 40484
37552 40484 -44324 -30736 -95593 -209254 -207745 -88651 -1571 6512 19389 42612 -27496 -203697
37540 -203697 -352983 -382290 -330286 -236637 -74938 120897 215039 157975 96589 171071 290777
37529 290777 258862 73393 -53533 14079 165429 211325 116952 -5788 -66696 -74905 -79543
37518 -79543 -102409 -127174 -122300 -85745 -74916 -145133 -241137 -231123 -105597 -50674 -214098
37507 -214098 -467420 -549474 -418192 -295209 -351879 -523163 -675833 -777424 -803712 -654342
$$ packed form
37584b21244k76218j03538K60081M14431J63412j78236k04763J3626R0667o5403
37574a07185j75118r1610J1270J1957L1145J28334J43605M819j00953m1332M4384
37563a40684K8151K6499J35202J90755N8580p2801J1294J53916O6236j75351k41313
37552D0484q4808J3588o4857j13661J509J19094Q7080Q083J2877K3223p0108j76201
37540b03697j49286k9307N2004R3649J61699J95835R4142n7064o1386P4482J19706
37529B90777l1915j85469j26926O7612J51350M5896r4373j22740o0908q209m638
37518g9543k2866k4765M874L6555J0829p0217r6004J0014J25526N4923j63424
37507b14098k53322q2054J31282J22983n6670j71284j52670j01591k6288J49370
$$ plain form
37497 -654342 -317480 998 82445 -43115 -187382 -275599 -357356 -411143 -344416 -180796
37487 -180796 -56548 -13358 26896 56793 -50761 -306438 -525166 -588884 -615313 -718842
37477 -718842 -755299 -514847 -98493 124007 -38947 -367536 -515513 -403624 -226339 -145363
37467 -145363 -118312 -46156 30572 -18668 -207538 -383526 -409591 -313779 -215067 -171964 -163311
37456 -163311 -154825 -113155 -12034 97378 85529 -90171 -280309 -315776 -223266 -137893 -72615
37445 -72615 46524 168181 165789 94884 148158 305115 294017 19067 -232627 -195278 -15418
37434 -15418 -1746 -151055 -201498 -67163 67323 74541 50846 108826 203065 231830 168474
37423 168474 34638 -142670 -305434 -394718 -431664 -477212 -509459 -454247 -342967 -302601 -349107
$$ packed form
37497f54342L36862L18478Q1447j25560j44267q8217q1757n3787O6727J63620
37487a80796J24248M3190M0254K9897j07554k55677k18728o3718k6429j03529
37477g18842l6457K40452M16354K22500j62954l28589j47977J11889J77285Q0976
37467a45363K7051P2156P6728m9240j88870j75988k6065R5812R8712M3103Q653
37456a63311Q486M1670J01121J09412j1849j75700j90138l5467R2510Q5373O5278
37445g2615J19139J21657k392p0905N3274J56957j1098k74950k51694L7349J79860
37434a5418J3672j49309n0443J34335J34486P218k3695N7980R4239K8765o3356
37423A68474j33836j77308j62764q9284l6946m5548l2247N5212J11280M0366m6506
$$ plain form
37412 -349107 -323363 -111845 163239 268655 135428 -60640 -89040 96203 318151 386411
37402 386411 322525 302859 373589 365073 178147 173 53327 236388 254833 58511 -116932
37391 -116932 -155521 -222024 -428728 -607617 -574623 -411580 -299347 -235434 -118018 14739
37381 14739 40234 -29373 -72753 -52842 -20605 20453 89996 121632 46002 -60081 -79934
37370 -79934 -70670 -175521 -342043 -342859 -104235 185981 347558 396210 400829 347645 249479
37359 249479 216812 286117 311825 164626 -75502 -256573 -374657 -506664 -617859 -610786
37349 -610786 -511992 -440193 -414674 -351828 -236656 -143658 -91466 -31411 13273 -38492 -143809
37338 -143809 -137782 20819 164052 160481 98050 109277 148251 88894 -51447 -146100 -154582
$$ packed form
37412c49107K5744K11518K75084J05416j33227j96068k8400J85243K21948O8260
37402C86411o3886j9666P0730q516j86926j77974N3154J83061J8445j96322j75443
37391a16932l8589o6503k06704j78889L2994J63043J12233O3913J17416J32757
37381A4739K5495o9607m3380J9911L2237M1058O9543L1636p5630j06083j9853
37370g9934R264j04851j66522q16K38624K90216J61577M8652M619n3184r8166
37359B49479l2667O9305K5708j47199k40128j81071j18084j32007j11195P073
37349f10786R8794P1799K5519O2846J15172R2998N2192O0055M4684n1765j05317
37338a43809O027J58601J43233l571o2431J1227L8974n9357j40341r4653q482
$$ plain form
37327 -154582 -128111 -66687 59633 165794 111619 -65343 -147725 -32420 125826 156704
37317 156704 124255 203764 404476 570263 616040 610365 615999 586806 475536 341439 270841
37306 270841 247159 182392 59738 -28092 2720 116523 189672 128995 -53275 -249559 -316445
37295 -316445 -164417 147433 411673 439424 255053 66442 6848 -22460 -181107 -423107
37285 -423107 -521207 -358501 -86624 50715 -20263 -166887 -225094 -156795 -49152 7090
37275 7090 23730 77718 162826 150854 -25490 -217270 -219177 -58137 40086 -13918 -58426
37264 -58426 31672 140141 130158 92750 167313 235929 57173 -324282 -560278 -446873 -179095
37253 -179095 -62627 -141038 -237827 -243751 -204465 -175975 -139256 -70217 77 29107 21896 18821
$$ packed form
37327a54582K6471O1424J26320J06161n4175j76962q2382J15305J58246L0878
37317A56704l2449P9509K00712J65787M5777n675N634k9193j11270j34097p0598
37306B70841k3682o4767j22654q7830L0812J13803P3149o0677j82270j96284o6886
37295c16445J52028L11850K64240K7751j84371j88611n9594k9308j58647k42000
37285d23107r8100J62706K71877J37339p0978j46624n8207O8299J07643N6242
37275G090J6640N3988Q5108j1972j76344j91780j907J61040R8223n4004m4508
37264e8426R0098J08469r983l7408P4563O8616j78756l81455k35996J13405K67778
37253a79095J16468p8411r6789n924L9286K8490L6719O9039P0294K9030p211l075
$$ plain form
37241 18821 38147 45116 -15759 -155385 -319787 -446017 -518407 -552027 -554719 -543157 -561446
37230 -561446 -627725 -687104 -676139 -606273 -515633 -377095 -158497 44342 68392 -92732 -248577
37219 -248577 -254682 -185255 -178075 -205683 -132502 42719 146440 61014 -111948 -186198 -124073
37208 -124073 -46569 -31911 -10632 96196 226386 263543 223362 223314 278814 285890 242335 311018
37196 311018 559366 789924 780954 578357 383458 256768 125907 -1190 -56238 -87177
37186 -87177 -176840 -222092 -55593 221671 316344 180109 68921 100915 86270 -72716 -152650
37175 -152650 5743 186695 145771 13566 46513 184088 191926 84938 48771 52590 -83214
37164 -83214 -289989 -302640 -112285 -6429 -111898 -237423 -246508 -257425 -355822 -410191 -320648
$$ packed form
37241A8821J9326O969o0875j39626j64402j26230p2390l3620k692J1562j8289
37230e61446o6279n9379J0965O9866R0640J38538K18598K02839K4050j61124j55845
37219b48577o105O9427P180k7608P3181J75221J03721q5426j72962p4250O2125
37208a24073P7504J4658K1279J06828J30190L7157m0181m8N5500P076m3555O8683
37196C11018K48348K30558q970k02597j94899j26690j30861j27097n5048l0939
37186h7177q9663m5252J66499K77264R4673j36235j11188L1994j4645j58986p9934
37175a52650J58393J80952m0924j32205L2947J37575P838j06988l6167L819j35804
37164h3214k06775j2651J90355J05856j05469j25525r085j0917r8397n4369Q9543
$$ plain form
37153 -320648 -190169 -101458 29714 228013 331404 258511 163382 139465 18516 -305931
37143 -305931 -594227 -587450 -423731 -404237 -492738 -410365 -144938 21846 -3121 7479 170832
37132 170832 275813 142250 -91125 -223301 -295376 -424209 -527059 -460122 -303381 -254743
37122 -254743 -312870 -311670 -237538 -256161 -392924 -432353 -241214 1083 41595 -109480 -240043
37111 -240043 -245267 -205445 -198158 -209152 -240189 -339593 -463446 -442635 -194182 113510 216711
37100 216711 47082 -217674 -372205 -372325 -311798 -288839 -320641 -349192 -311440 -216439 -142723
37089 -142723 -139814 -158421 -116716 -16339 51142 2704 -165979 -388373 -562921 -603311 -508638
37078 -508638 -379894 -324138 -346039 -365230 -324080 -243294 -188577 -211255 -297222 -358590 -326961
$$ packed form
37153c20648J30479Q8711J31172J98299J03391p2893r5129k3917j20949l24447
37143c05931k88296O777J63719J9494q8501Q2373K65427J66784k4967J0600J63353
37132A70832J04981j33563k33375j32176p2075j28833j02850O6937J56741M8638
37122b54743n8127J200P4132j8623j36763l9429J91139K42297M0512j51075j30563
37111b40043n224L9822P287j0994l1037r9404j23853K0811K48453L07692J03201
37100B16711j69629k64756j54531j20O0527K2959l1802k8551L7752R5001P3716
37089a42723K909j8607M1705J00377O7481m8438j68683k22394j74548m0390R4673
37078e08638J28744N5756k1901j9191M1150Q0786N4717k2678q5967o1368L1629
$$ plain form
37067 -326961 -270664 -329262 -492204 -569311 -469744 -364297 -414945 -481057 -326529 -33016 76381
37056 76381 -83989 -251130 -234067 -159769 -187347 -245012 -219938 -182208 -219253 -237135 -147585
37045 -147585 -94672 -248657 -483420 -512009 -288254 -48321 13515 -90559 -263305 -403282
37035 -403282 -389630 -192636 4940 -13524 -209488 -371275 -458104 -618338 -847575 -903638
37025 -903638 -668130 -364826 -271328 -380953 -491908 -488387 -385842 -217049 -32729 61704
37015 61704 15066 -71224 -70059 -8711 -13773 -115527 -218583 -254818 -270395 -346218 -484348
37004 -484348 -585744 -532151 -314966 -85121 -23122 -148584 -316702 -404347 -415331 -396102
36994 -396102 -363467 -351865 -409323 -487252 -459033 -326691 -277373 -421388 -595972 -578817 -405862
$$ packed form
37067c26961N6297n8598j62942p7107R9567J05447n0648o6112J54528K93513J09397
37056G6381j60370j67141J7063P4298k7578n7665K5074L7730l7045j7882Q9550
37045a47585N2913j53985k34763k8589K23755K39933O1836j04074j72746j39977
37035d03282J3652J96994J97576j8464j95964j61787q6829j60234k29237n6063
37025i03638K35508L03304R3498j09625j10955L521J02545J68793J84320R4433
37015F1704m6638q6290J165O1348n062j01754j03056l6235j5577p5823j38130
37004d84348j01396N3593K17185K29845O1999j25462j68118q7645j0984J9229
36994c96102L2635J1602n7458p7929K8219J32342M9318j44015j74584J7155J72955
$$ plain form
36983 -405862 -306774 -375874 -481017 -488006 -414674 -340740 -298868 -295784 -341990 -420411 -493099 -556764
36971 -556764 -632965 -707531 -749066 -779272 -848447 -945913 -1007590 -1001020 -928728 -774600 -548063
36960 -548063 -365614 -368815 -547204 -747243 -868954 -942781 -997471 -988803 -917286 -893905 -995575
36949 -995575 -1133268 -1153704 -1028140 -875290 -830553 -930328 -1081304 -1120700 -970001 -748759
36939 -748759 -650052 -679243 -638093 -427018 -216581 -193980 -267665 -211807 -32205 35989 -98352
36928 -98352 -231783 -170506 -3488 62822 15041 12321 120383 238867 289755 319460 369727
36917 369727 383321 322967 280140 350370 467104 495780 463611 537546 750378 915461 903691
36906 903691 858341 981504 1207604 1292150 1197005 1166009 1362047 1628344 1733425 1699578
$$ packed form
36983d05862R9088o9100j05143o989P3332P3934M1872L084m6206p8421p2688o3665
36971e56764p6201p4566m1535l0206o9175r7466o1677O570P2292J54128K26537
36960e48063J82449l201j78389k00039j21711p3827n4690Q668P1517K3381j01670
36949i95575j37693k0436J25564J52850M4737r9775j50976l9396J50699K21242
36939g48759R8707k9191M1150K11075K10437K2601p3685N5858J79602O8194j34341
36928i8352j33431O1277J67018O6310m7781k720J08062J18484N0888K9705N0267
36917C69727J3594o0354m2827P0230J16734K8676l2169P3935K12832J65083j1770
36906I03691m5350J23163K26100Q4546r5145l0996J96038K66297J05081l3847
$$ plain form
36896 1699578 1716502 1818779 1845007 1708019 1534185 1487344 1575307 1689843 1746891 1718334
36886 1718334 1590246 1370128 1115870 904779 780023 749230 804158 902117 955769 902779
36876 902779 790850 740848 799221 868192 829035 711133 668772 774678 909191 915870 822880
36865 822880 822642 1030842 1337218 1510797 1400456 1035634 606790 354787 383135 542045
36855 542045 584139 467110 390446 482900 606459 589550 506205 527481 594131 488367 216203
36844 216203 58276 172909 376686 438542 397795 425349 514645 510148 371478 222509 158056
36833 158056 157121 188759 265593 367011 421216 402932 368788 361730 345387 268561 148820 58822
36821 58822 49337 98040 128752 97876 68697 151676 341561 482060 460562 376449 413871
$$ packed form
36896A699578J6924J02277K6228j36988j73834m6841Q7963J14536N7048k8557
36886A718334j28088k20118k54258k11091j24756l0793N4928R7959N3652n2990
36876I02779j11929n0002N8373O8971l9157j17902m2361J05906J34513O679r2990
36865H22880k38K08200L06376J73579j10341l64822m28844k52003K8348J58910
36855E42045M2094j17029p6664R2454J23559j6909q3345K1276O6650j05764k72164
36844B16203j57927J14633K03777O1856m0747K7554Q9296m497j38670j48969o4453
36833A58056r35L1638P6834J01418N4205j8284l4144p058j6343p6826j19741q9998
36821E8822r485M8703L0712l0876k9179Q2979J89885J40499k1498q4113L7422
$$ plain form
36810 413871 581473 696188 625469 433047 259815 162396 118608 114504 159197 241610 309354
36799 309354 288931 152449 2607 36899 323644 639952 675717 424457 221723 319006
36789 319006 555580 580115 305629 -9830 -101028 33050 206955 274556 229690 163301
36779 163301 177823 303155 455176 500164 387967 206449 89675 92567 172333 267071 349174
36768 349174 392656 331629 110354 -213617 -468106 -516381 -389989 -232841 -137854 -92198
36758 -92198 -58203 -25377 21237 100902 185198 224941 251988 362850 558244 696843 681263
36747 681263 602884 604641 668166 655360 525950 391652 354133 392608 429157 421704 368870
36736 368870 289302 220947 194668 199524 213948 256001 338914 390653 309373 119695 -12979
$$ packed form
36810D13871J67602J14715p0719j92422j73232r7419m3788m104M4693Q2413O7744
36799C09354k0423j36482j49842L4292K86745L16308L5765k51260k02734R7283
36789C19006K36574K4535k74486l15459r1198J34078J73905O7601m4866o6389
36779A63301J4522J25332J52021M4988j12197j81518j16774K892P9766R4738Q2103
36768C49174M3482o1027k21275l23971k54489m8275J26392J57148R4987M5656
36758i2198L3995L2826M6614P9665Q4296L9743K7047J10862J95394J38599j5580
36747F81263p8379J757O3525j2806j29410j34298l7519L8475L6549p453n2834
36736C68870p9568o8355k6279M856J4424M2053Q2913N1739q1280j89678j32674
$$ plain form
36725 -12979 26080 157929 221429 189062 192755 325193 484549 488035 334131 257892 445239
36714 445239 751698 847411 647136 428380 450781 632574 746738 773840 832784 869475
36704 869475 709168 410369 264919 365295 443985 282739 40954 -13414 100758 183812
36694 183812 205813 285284 402900 411918 317943 293256 383056 428503 344344 263889 315346
36683 315346 434380 508078 545497 580477 550839 426779 341954 422055 563325 565846 436843
36672 436843 361019 379745 321125 111526 -49497 35091 253069 331818 222210 141210 229518
36661 229518 350295 311329 160110 126730 317184 585343 725619 703960 647070 651914 676650
36650 676650 626521 495601 378429 350493 385108 410930 411250 416858 423596 390249 331537 341701
$$ packed form
36725a2979L9059J31849O3500l2367L693J32438J59356L486j53904p6239J87347
36714D45239L06459R5713k00275k18756K2401J81793J14164K7102N8944L6691
36704H69475j60307k98799j45450J00376P8690j61246k41785n4368J14172Q3054
36694A83812K2001P9471J17616R018r3975k4687Q9800M5447q4159q0455N1457
36683C15346J19034P3698L7419L4980k9638j24060q4825Q0101J41270K521j29003
36672D36843p5824J8726n8620k09599j61023Q4588K17978P8749j09608q1000Q8308
36661B29518J20777l8966j51219l3380J90454K68159J40276k1659n6890M844K4736
36650F76650n0129j30920j17172k7936L4615K5822L20N608O738l3347n8712J0164
$$ plain form
36638 341701 479087 670945 779487 732710 557215 330122 151088 112105 214250 334714
36628 334714 348984 271303 210784 221652 284123 397612 565583 693678 655911 507199 481819
36617 481819 689150 932102 948700 746852 563602 545123 610522 620569 547505 450405 382216
36606 382216 362691 379545 385137 338880 271600 264069 346474 461276 544688 608878 712087
36595 712087 854297 925501 787208 431041 34274 -200542 -257858 -284879 -347684 -326181
36585 -326181 -114785 181057 357067 347860 242910 125714 18266 -58144 -90757 -112394
36575 -112394 -118382 -1338 285657 553607 557157 339588 194802 263478 384625 408364 418419
36564 418419 508717 549475 379862 100253 -41811 13344 112212 158925 218044 335147 420771
$$ packed form
36638C41701J37386J91858J08542m6777j75495k27093j79034l8983J02145J20464
36628C34714J4270p7681o0519J0868O2471J13489J67971J28095l7767j48712k5380
36617D81819K07331K42952J6598k01848j83250j8479O5399J0047p3064r7100o8189
36606C82216j9525J6854N592m6257o7280p531Q2405J14802Q3412O4190J03209
36595G12087J42210P1204j38293l56167l96767k34816n7316k7021o2805K1503
36585c26181K11396K95842J76010r207j04950j17196j07448p6410l2613k1637
36575a12394n988J17044K86995K67950L550k17569j44786O8676J21147K3739J0055
36564D18419R0298M0758j69613k79609j42064N5155R8868M6713N9119J17103Q5624
$$ plain form
36553 420771 373815 225486 109549 133594 289388 453289 488874 386566 274437 260463
36543 260463 318698 370961 399383 409964 374765 307615 311510 430195 530096 471868 333589
36532 333589 299121 371984 387148 290423 204927 195190 163113 46499 -49279 -10333 127121
36521 127121 264490 373271 457545 487736 454157 402450 356068 294242 247361 288313 370449
36510 370449 322605 102167 -89584 -68419 88515 205353 290130 468252 717066 873062
36500 873062 878470 837380 823078 786528 671423 488633 267512 52838 -55651 8680 154207
36489 154207 229770 246842 352179 568858 733952 736500 652072 576670 491722 387400 363452
36478 363452 475747 601146 594585 489822 407720 349543 239027 111470 83594 144036 140323
$$ packed form
36553D20771m6956j48329j15937K4045J55794J63901L5585j02308j12129j3974
36543B60463N8235N2263K8422J0581l5199o7150L895J18685R9901n8228j38279
36532C33589l4468P2863J5164r6725q5496r737l2077j16614r5778L8946J37454
36521A27121J37369J08781Q4274L0191l3579n1707m6382o1826m6881M0952Q2136
36510C70449m7844k20438j91751K1165J56934J16838Q4777J78122K48814J55996
36500H73062N408m1090j4302l6550j15105j82790k21121k14674j08489O4331J45527
36489A54207P5563J7072J05337K16679J65094K548q4428p5402q4948j04322k3948
36478C63452J12295J25399o561j04763q2102n8177j10516j27557k7876O0442l713
$$ plain form
36467 140323 4038 -158194 -261435 -411127 -778057 -1365145 -1988934 -2475326 -2806916 -3072163
36457 -3072163 -3318061 -3484619 -3479635 -3296196 -3034462 -2804973 -2634191 -2481018 -2322178 -2186413
36447 -2186413 -2106428 -2066710 -2014654 -1917924 -1801380 -1718134 -1682277 -1647219 -1563322 -1432934 -1283759
36436 -1283759 -1122839 -967339 -885682 -922198 -990093 -944251 -787377 -699129 -797442 -953894
36426 -953894 -932743 -672973 -362798 -252674 -425782 -714979 -828217 -621403 -270411 -88966
36416 -88966 -155279 -247357 -198299 -137144 -239367 -403467 -397500 -234819 -157459 -271779 -437422
36405 -437422 -528034 -566268 -556021 -422980 -220818 -174740 -371535 -581209 -552091 -343224
36395 -343224 -189151 -151661 -105270 666 70270 40687 -34992 -98540 -150990 -196551 -232632
$$ packed form
36467A40323j36285j62232j03241j49692l66930n87088o23789m86392l31590k65247
36457c072163k45898j66558M984J83439K61734K29489J70782J53173J58840J35765
36447b186413P9985L9718N2056R6730J16544Q3246L5857L5058Q3897J30388J49175
36436a283759J60920J55500Q1657l6516o7895M5842J56874Q8248r8313j56452
36426i53894K1151K59770L10175J10124j73108k89197j13238K06814L50992J81445
36416h8966o6313r2078M9058O1155j02223j64100N967J62681P7360j14320j65643
36405d37422r0612l8234J0247J33041K02162M6078j96795k09674K9118K08867
36395c43224J54073L7490M6391J05936O9604k9583p5679o3548n2450m5561l6081
$$ plain form
36384 -232632 -293899 -394845 -437069 -304803 -63919 72804 16562 -95901 -130785 -147562
36374 -147562 -253482 -384184 -389082 -283208 -240078 -322737 -389610 -337401 -285185 -377994 -511219
36363 -511219 -446596 -181490 7019 -56026 -210478 -224542 -115416 -30850 43887 216234
36353 216234 399476 375613 152771 -11756 -8927 -34786 -233590 -436060 -434080 -306924 -251333
36342 -251333 -246542 -137500 51950 143502 93084 24216 -2566 -37243 -68274 -19256 67057
36331 67057 46200 -89338 -175621 -129329 -60379 -75564 -133130 -161648 -175672 -199038 -205836 -209499
36319 -209499 -284089 -422114 -488149 -390280 -196129 -19351 97807 131589 35190 -164484
36309 -164484 -332772 -368988 -293999 -152869 39268 192414 143886 -115778 -349693 -343689
$$ packed form
36384b32632o1267j00946m2224J32266K40884J36723n6242j12463l4884j6777
36374a47562j05920j30702m898J05874M3130q2659o6873N2209N2216r2809j33225
36363e11219O4623K65106J88509o3045j54452j4064J09126Q4566P4737J72347
36353B16234J83242k3863k22842j64527K829k5859j98804k02470J980J27156N5591
36342b51333M791J09042J89450R1552n0418o8868k6782l4677l1031M9018Q6313
36331F7057k0857j35538q6283M6292O8950j5185n7566k8518j4024k3366o798l663
36319b09499p4590j38025o6035R7869J94151J76778J17158L3782r6399j99674
36309a64484j68288l6216P4989J41130J92137J53146m8528k59664k33915O004
$$ plain form
36299 -343689 -167169 -35966 -16289 -15093 13604 18394 -24204 -69752 -83997 -75083 -75102 -143578
36287 -143578 -314119 -476891 -436428 -191316 -18032 -119975 -321905 -316681 -111354 21496
36277 21496 -19484 -56976 19516 74671 -15330 -145659 -144029 6973 207404 360633 375630
36266 375630 202165 -35908 -89410 114673 347193 369976 222892 83062 -16704 -130210
36256 -130210 -166730 23665 342895 473610 296227 84152 150966 428734 554129 323951
36246 323951 -82047 -345270 -359326 -276691 -272745 -357151 -425914 -422501 -383067 -348601 -312226
36235 -312226 -275462 -287602 -371500 -453154 -440519 -355450 -300526 -285541 -192402 21925 181547
36224 181547 84615 -186707 -308949 -122457 149824 201717 42941 -81137 -103858 -226081
$$ packed form
36299c43689J76520J31203J9677J196K8697M790m2598m5548j4245Q914j9o8476
36287a43578j70541j62772M0463K45112J73284j01943k01930N224K05327J32850
36277B1496m0980l7492P6492N5155r0001j30329J630J51002K00431J53229J4997
36266C75630j73465k38073n3502K04083K32520K2783j47084j39830r9766j13506
36256a30210l6520J90395L19230J30715j77383k12075O6814K77768J25395k30178
36246C23951m05998k63223j4056Q2635L946q4406o8763L413L9434L4466L6375
36235c12226L6764j2140q3898q1654J2635Q5069N4924J4985R3139K14327J59622
36224A81547r6932k71322j22242J86492K72281N1893j58776j24078k2721j22223
$$ plain form
36214 -226081 -541807 -814843 -787731 -542910 -345848 -237612 -39140 264332 419917 275599
36204 275599 29342 -45517 25438 33 -204794 -406457 -414630 -240142 -20281 139525
36194 139525 201434 172536 117735 136848 261788 406073 463213 423620 346970 257639 142476
36183 142476 37837 27975 128669 246424 302151 335530 422224 536743 584799 548037 499897
36172 499897 477128 436556 365424 335205 391641 475055 519515 560970 661496 776519 794919
36161 794919 695007 578138 545358 599085 665892 669345 584472 458371 370895 354340 374957
36150 374957 401083 430600 430713 340014 185013 100898 158012 262532 322167 393791 528615
36139 528615 593483 453298 249381 242630 401607 421496 193496 -24453 -11266 107784
$$ packed form
36214b26081l15726k73036K7112K44821J97062J08236J98472L03472J55585j44318
36204B75599k46257p4859P0955k5405k04827k01663q173J74488K19861J59806
36194A39525O1909k8898n4801J9113J24940J44285N7140l9593p6650q9331j15163
36183A42476j04639r862J00694J17755N5727L3379Q6694J14519M8056l6762m8140
36172D99897k2769m0572p1132l0219N6436Q3414M4460M1455J00526J15023J8400
36161G94919r9912j16869l2780N3727O6807L453q4873j26101q7476j6555K0617
36150C74957K6126K9517J13r0699j55001q4115N7114J04520N9635P1624J34824
36139E28615O4868j40185k03917o751J58977J9889k28000k17949J3187J19050
$$ plain form
36129 107784 123410 81815 132711 210998 141162 -30638 -79058 44843 145047 100865 45014
36118 45014 142351 344639 461099 380625 152726 -87415 -225887 -252224 -258240 -311643 -348241
36107 -348241 -269873 -122364 -42939 -22274 113588 409014 626708 532736 224762 3720
36097 3720 -16882 23200 35026 115568 304970 428983 351960 234025 317790 540411 600189
36086 600189 395466 145484 24746 -65188 -231891 -340747 -241539 -73978 -88517 -259085
36076 -259085 -337729 -247060 -147850 -117471 -39721 124570 215781 134212 4078 -43224 -49947
36065 -49947 -58194 45907 327058 595754 622381 461253 362684 425251 517815 503366 370345
36054 370345 168969 -28689 -123431 -80912 -9761 -25467 -71991 -11598 146917 260940 270098
$$ packed form
36129A07784J5626m1595N0896P8287o9836j71800m8420J23901J00204m4182n5851
36118D5014R7337K02288J16460q0474k27899k40141j38472k6337o016n3403l6598
36107c48241P8368J47509P9425K0665J35862K95426K17694r3972l07974k21042
36097C720k0602M0082J1826Q0542J89402J24013p7023j17935Q3765K22621N9778
36086F00189k04723k49982j20738q9934j66703j08856R9208J67561j4539j70568
36076b59085p8644R0669R9210L0379P7750J64291R1211q1569j30134m7302o723
36065d9947q247J04101K81151K68696K6627j61128r8569O2567R2564j4449j33021
36054C70345k01376j97658r4742M2519P1151j5706m6524O0393J58515J14023R158
$$ plain form
36043 270098 241979 214341 159916 118915 191305 348640 412529 300741 168418 207477 394395
36032 394395 539621 541284 497234 567511 788263 1055097 1273833 1468286 1683576 1835443
36022 1835443 1798578 1663583 1719994 2064565 2385769 2322248 1929646 1591207 1545544 1720267
36012 1720267 1962164 2164720 2189356 1962003 1704560 1781884 2203113 2534113 2458670 2188701
36002 2188701 2119739 2289196 2434421 2449436 2489046 2646412 2784842 2750934 2594711 2510049
35992 2510049 2637084 2945680 3255053 3379336 3309936 3217148 3208478 3153638 2858180 2359458
35982 2359458 1908977 1664061 1528081 1326657 1034270 770845 640496 628717 634731 581725
35972 581725 503410 505206 615143 714638 680394 564295 540108 667811 805601 792853 638560
$$ packed form
36043B70098k8119k7638n4425m1001P2390J57335O3889j11788j32323L9059J86918
36032C94395J45226J663m4050P0277K20752K66834K18736J94453K15290J51867
36022A835443l6865j34995N6411L44571L21204o3521l92602l38439m5663J74723
36012A720267K41897K02556K4636k27353k57443P7324M21229L31000p5443k69969
36002B188701o8962J69457J45225J5015L9610J57366J38430l3908j56223q4662
35992B510049J27035L08596L09373J24283o9400r2788q670n4840k95458m98722
35982B359458m50481k44916j35980k01424k92387k63425j30349j1779O014n3006
35972E81725p8315J796J09937R9495l4244j16099k4187J27703J37790j2748j54293
$$ plain form
35961 638560 463404 317209 154315 -19925 -88119 32798 246169 362428 315762 214329
35951 214329 175779 207457 273757 368884 450452 407032 210059 22786 17141 129917 157117
35940 157117 66145 37363 179912 384755 513751 569669 598503 574125 487258 427297 458307
35929 458307 503669 460572 355117 292302 321881 427196 561373 623965 509977 271503
35919 271503 115340 135291 174212 84451 -12434 86010 319574 433228 338269 183280 79632
35908 79632 -17913 -126973 -147095 -29855 127170 236005 322384 393434 348721 144290 -61241
35897 -61241 -63934 130632 327028 394478 398651 466340 597812 664693 574386 390946 265793
35886 265793 263911 303391 275301 169503 52996 -18112 -16191 72921 217738 336832 389184
$$ packed form
35961F38560j75156j46195j62894j74240o8194J20917K13371J16259m6666j01433
35951B14329l8550L1678O6300R5127Q1568m3420j96973j87273n645J12776K7200
35940A57117r0972k8782J42549K04843J28996N5918K8834k4378q6867n9961L1010
35929D58307M5362m3097j05455o2815K9579J05315J34177O2592j13988k38474
35919B71503j56163J9951L8921q9761r6885R8444K33564J13654r4959j54989j03648
35908G9632r7545j09060k0122J17240J57025J08835Q6379P1050m4713k04431k05531
35897f1241k693J94566J96396O7450M173O7689J31472O6881r0307j83440j25153
35886B65793j882L9480k8090j05798j16507p1108J921Q9112J44817J19094N2352
$$ plain form
35875 389184 423092 473574 477370 378116 247428 180815 124207 -51291 -320740 -499508 -476919
35864 -476919 -324338 -155133 -12701 69882 38508 -83321 -168791 -136158 -50157 -15718 -36788
35853 -36788 -41983 -3220 27637 -15570 -130815 -221226 -174701 -4879 131932 121826 39825
35842 39825 24575 71260 72575 8831 -56197 -123886 -221884 -245148 -55721 246774 390736
35831 390736 318847 261921 338355 345914 113529 -183339 -281749 -214804 -187627 -220720 -192665
35820 -192665 -135911 -191642 -307126 -272902 -85888 -2746 -154312 -342111 -334669 -177925 -74027
35809 -74027 -96125 -175389 -274060 -408527 -529748 -517513 -322961 -45251 169180 277807
35799 277807 365689 515008 675823 714278 598020 464880 456845 548803 617344 618969 592310
$$ packed form
35875C89184L3908N0482L796r9254j30688o6613n6608j75498k69449j78768K2589
35864d76919J52581J69205J42432Q2583l1374j21829q5470L2633Q6001L4439k1070
35853c6788n195L8763L0857m3207j15245r0411M6525J69822J36811j0106q2001
35842C9825j5250M6685J315o3744o5028o7689r7998k3264J89427L02495J43962
35831C90736p1889n6926P6434P559k32385k96868r8410O6945K7177l3093K8055
35820a92665N6754n5731j15484L4224J87014Q3142j51566j87799P442J56744J03898
35809g4027k2098p9264r8671j34467j21221J2235J94552K77710K14431J08627
35799B77807Q7882J49319J60815L8455j16258j33140q035R1958O8541J625k6659
$$ plain form
35788 592310 527314 374686 189483 122611 218888 333303 312286 177787 71974 85947
35778 85947 197781 320558 360213 281974 170998 173014 319620 462992 445594 290545 152469
35767 152469 110808 95832 20452 -92315 -150841 -121519 -63566 -39351 -34657 -3722 30331
35756 30331 -9558 -115715 -146969 8425 265664 426987 407117 282005 140002 16882
35746 16882 -15882 134569 401380 537078 406039 198772 199911 401481 519331 385878
35736 385878 151889 47343 88962 123061 64611 -20665 -35463 43070 172096 289233 339352
35725 339352 299759 195795 77122 -18945 -72054 -69194 -16208 55901 122574 191573 272572
35714 272572 337462 347630 316871 311319 377089 487140 562875 536688 406570 254264 194668
$$ packed form
35788E92310o4996j52628j85203o6872R6277J14415k1017j34499j05813J3973
35778H5947J11834J22777L9655p8239j10976K016J46606J43372j7398j55049j38076
35767A52469m1661j4976p5380j12767n8526K9322N7953K4215M694L0935L4053
35756C0331l9889j06157l1254J55394K57239J61323j9870j25112j42003j23120
35746A6882l2764J50451K66811J35698j31039k07267J139K01570J17850j33453
35736C85878k33989j04546M1619L4099n8450q5276j4798P8533J29026J17137N0119
35725C39352l9593j03964j18673r6067n3109K860N2986P2109O6673O8999Q0999
35714B72572O4890J0168l0759n552O5770J10051P5735k6187j30118j52306n9596
$$ plain form
35703 194668 266148 371478 368276 224182 42529 -70821 -110356 -115089 -71724 55838 215673
35692 215673 260621 94779 -187201 -345761 -216131 110308 360671 370903 265250 281615
35682 281615 450170 559027 453129 232985 85302 41995 29224 54891 176166 323203
35672 323203 338402 205788 79747 47018 13733 -105732 -231523 -247554 -173459 -96714 -23082
35661 -23082 86069 193221 224661 193737 175279 184162 179218 163687 182222 236000 297735 391145
35649 391145 546411 686949 684729 546109 422996 401313 392949 297416 165611 118130 183488
35638 183488 314234 494081 704642 821260 693134 365853 106916 129785 359553 552577
35628 552577 594283 568673 551289 479863 304334 155306 217495 452291 588733 448607
$$ packed form
35703A94668P1480J05330l202j44094j81653j13350l9535m733M3365J27562J59835
35692B15673M4948j65842k81980j58560J29630L26439K50363J0232j05653J6365
35682B81615J68555J08857j05898k20144j47683m3307j2771K5667J21275J47037
35672C23203J5199j32614j26041l2729l3285j19465j25791j6031P4095P6745P3632
35661b3082J09151J07152L1440l0924j8458Q883m944j5531J8535N3778O1735R3410
35649C91145J55266J40538k220j38620j23113k1683q364r5533j31805m7481O5358
35638A83488J30746J79847K10561J16618j28126l27281k58937K2869K29768J93024
35628E52577M1706k5610j7384p1426j75529j49028O2189K34796J36442j40126
$$ plain form
35618 448607 183381 95210 270467 496354 545578 446440 407722 523805 648181 589448
35608 589448 367213 191895 200229 305150 348225 310063 278616 272209 224128 130326 78538
35597 78538 101365 117350 68351 15841 42049 140368 256777 350586 360692 220039 -13869
35586 -13869 -144157 -51794 155539 305158 367218 384249 315578 137253 16584 158645
35576 158645 482849 664429 540582 293837 172795 203619 269492 323392 389579 446135
35566 446135 436925 366859 298986 275337 286305 287414 220218 66521 -93135 -135061 -35141
35555 -35141 105533 201214 272196 360421 435733 442480 380153 289063 207404 176418 223685 301684
35543 301684 309754 223451 142474 168931 297734 459597 597741 663056 618037 501231 411189
$$ packed form
35618D48607k65226q8171J75257K25887M9224r9138l8718J16083J24376n8733
35608E89448k22235j75318Q334J04921M3075l8162l1447o407m8081r3802n1788
35597G8538K2827J5985m8999n2510K6208R8319J16409R3809J0106j40653k33908
35586a3869j30288R2363K07333J49619O2060J7031o8671j78325j20669J42061
35576A58645L24204J81580j23847k46745j21042L0824O5873N3900O6187N6556
35566D46135r210p0066o7873k3649J0968J109o7196j53697j59656m1926R9920
35555c5141J40674R5681P0982Q8225P5312O747o2327r1090q1659l0986M7267P7999
35543C01684Q070q6303q0977K6457J28803J61863J38144O5315m5019j16806r0042
$$ plain form
35532 411189 372034 296080 138581 -394 -5717 99471 206592 250947 216694 109129 17179
35521 17179 103588 402785 699958 746995 550286 323399 215241 223471 315191 456826 544209
35510 544209 478765 325736 243219 243857 189373 45237 -36625 48078 201161 290995 340687
35499 340687 445195 610655 779152 921460 1008954 983258 856199 757207 776336 843880
35489 843880 879892 964082 1190075 1418024 1385235 1074223 772433 703848 777880 805292 797631
35478 797631 878209 995576 948621 709175 526337 615662 868462 991035 864140 635407
35468 635407 481920 420504 382599 353517 359200 394809 454028 571410 739416 830980 729585
35457 729585 524220 436678 526496 608769 535812 420579 445631 550515 498675 239691 21323
$$ packed form
35532D11189l9155p5954j57499j38975n323J05188J07121M4355l4253j07565r1950
35521A7179Q6409K99197K97173M7037j96709k26887j08158Q230R1720J41635Q7383
35510E44209o5444j53029q2517O38n4484j44136q1862Q4703J53083Q9834M9692
35499C40687J04508J65460J68497J42308Q7494k5696j27059r8992J9129O7544
35489H43880L6012Q4190K25993K27949l2789l11012l01790o8585P4032K7412p661
35478G97631Q0578J17367m6955k39446j82838Q9325K52800J22573j26895k28733
35468F35407j53487o1416l7905k9082N683L5609N9219J17382J68006R1564j01395
35457G29585k05365q7542Q9818Q2273p2957j15233K5052J04884n1840k58984k18368
$$ plain form
35446 21323 89001 413345 782774 1037328 1119308 1018645 812802 680127 709660 742030
35436 742030 577525 326468 336788 713348 1118760 1186285 965758 784433 790315 846901
35426 846901 809940 673785 454234 162197 -63149 -22671 242543 414548 295983 85007
35416 85007 101700 373832 663583 793969 757953 589595 346416 183193 220638 332503
35406 332503 272021 41244 -77686 73568 307230 390142 375142 455300 623148 686738
35396 686738 571133 414772 372876 476758 684177 914104 1011498 840318 486748 242437
35386 242437 279004 423957 381591 129135 -49693 56780 309718 409409 282571 142374
35376 142374 162610 242156 189895 40554 20681 215351 444866 534602 549917 638391 760478
$$ packed form
35446B1323O7678L24344L69429K54554Q1980j00663k05843j32675K9533L2370
35436G42030j64505k51057J0320L76560M05412O7525k20527j81325N882N6586
35426H46901l6961j36155k19551k92037k25346M0478K65214J72005j18565k10976
35416H5007J6693K72132K89751J30386l6016j68358k43179j63223L7445J11865
35406C32503o0482k30777j18930J51254K33662Q2912j5000Q0158J67848O3590
35396F86738j15605j56361m1896J03882K07419K29927R7394j71180l53570k44311
35386B42437L6567J44953m2366k52456j78828J06473K52938R9691j26838j40197
35376A42374K0236P9546n2261j49341j9873J94670K29515Q9736J5315Q8474J22087
$$ plain form
35365 760478 758556 639524 584163 652320 667204 479342 203875 80948 193800 432963
35355 432963 657631 770956 702998 471124 242951 200701 322254 400674 295578 68818
35345 68818 -129821 -189067 -33937 343438 768954 938401 715730 307099 25744 -48874
35335 -48874 -58570 -86122 -58754 74389 229824 299105 255869 121849 -51721 -124575 64658
35324 64658 459680 722141 560313 89985 -270886 -273594 -80175 2493 -92739 -176579 -107182
35313 -107182 24630 40890 -90648 -242676 -299952 -259923 -173329 -73757 7445 32570 15989
35302 15989 39904 158217 321739 441055 475874 418019 256888 40376 -95191 -62793
35292 -62793 50509 107051 122812 210918 350389 382352 254944 103092 34411 -3175 -68772
$$ packed form
35365G60478j922j19032n5361O8157J4884j87862k75467j22927J12852K39163
35355D32963K24668J13325o7958k31874k28173m2250J21553P8420j05096k26760
35345F8818j98639n9246J55130L77375M25516J69447k22671m08631k81355p4618
35335d8874r696k7552K7368J33143J55435O9281m3236j34020j73570p2854J89233
35324F4658L95022K62461j61828m70328l60871k708J93419Q2668r5232q3840O9397
35313a07182J31812J6260j31538j52028n7276M0029Q6594R9572Q1202K5125j6581
35302A5989K3915J18313J63522J19316L4819n7855j61131k16512j35567L2398
35292f2793J13302N6542J5761Q8106J39471L1963j27408j51852o8681l7586o5597
$$ plain form
35281 -68772 -105772 -77442 -74827 -146461 -142855 92170 444549 623752 514274 280796 124111
35270 124111 77096 70412 69356 75223 69657 36595 16178 78582 227108 349558 305242 80939
35258 80939 -173856 -303256 -288128 -174577 53556 387421 642165 614533 402730 325191
35248 325191 452915 492542 277611 92711 253254 585750 658548 406320 180021 216184
35238 216184 382306 468819 442880 355195 240534 173831 216622 271066 198098 94217 195839
35227 195839 469793 585126 385240 107241 -1049 -7411 -60075 -83390 52674 251200
35217 251200 331453 322366 371043 451846 401562 197931 2138 -54849 27295 196740 384030
35206 384030 489715 466441 390971 368637 423698 551310 756759 935174 865171 497105
$$ packed form
35281f8772l7000K8330K615p1634L606K35025L52379J79203j09478k33478j56685
35270A24111m7015o684j056N867n566l3062k0417O2404J48526J22450m4316k24303
35258H0939k54795j29400J5128J13551K28133L33865K54744k7632k11803p7539
35248C25191J27724L9627k14931j84900J60543L32496P2798k52228k26299L6163
35238B16184J66122Q6513k5939q7685j14661o6703M2791N4444p2968j03881J01622
35227A95839K73954J15333j99886k77999j08290o362n2664k3315J36064J98526
35217B51200Q0253r087M8677Q0803n0284k03631j95793n6987Q2144J69445J87290
35206C84030J05685k3274p5470k2334N5061J27612K05449J78415p0003l68066
$$ plain form
35196 497105 116771 11291 82505 40521 -102453 -38342 331235 698808 758080 569997
35186 569997 394744 348145 377138 438017 525090 581794 530542 393014 293708 323971 436237
35175 436237 487103 389386 221706 153904 242739 355623 343375 221896 106016 33897 -28254
35164 -28254 -57120 12933 158829 278858 329995 337958 287249 146663 7573 30112 203967
35153 203967 316226 232943 76347 25374 65557 74924 73494 209043 487717 675998 569378
35142 569378 289122 180530 386583 636132 570627 221929 -9345 129932 448665 628229
35132 628229 635683 631329 625251 500357 311910 271454 411957 533333 540658 582752 754447
35121 754447 907371 914985 918679 1109452 1413387 1606681 1645353 1669254 1732770 1738303 1636253
$$ packed form
35196D97105l80334j05480P1214m1984j42974O4111L69577L67573N9272j88083
35186E69997j75253m6599K8993O0879Q7073N6704n1252j37528r9306L0263J12266
35175D36237N0866r7717j67680o7802Q8835J12884j2248j21479j15880p2119o2151
35164b8254k8866P0053J45896J20029N1137P963n0709j40586j39090K2539J73855
35153B03967J12259q3283j56596n0973M0183R367j430J35549K78674J88281j06620
35142E69378k80256j08592K06053K49549o5505l48698k31274J39277L18733J79564
35132F28229P454m354o078j24894j88447m0456J40503J21376P325M2094J71695
35121G54447J52924P614L694J90773L03935J93294L8672K3901O3516N533j02050
$$ plain form
35110 1636253 1519405 1489264 1552996 1675090 1822795 1935141 1942996 1857497 1772512 1752369 1769607
35099 1769607 1770210 1747680 1727729 1716869 1695855 1657606 1640748 1708892 1867465 2010119 2009145 1879246
35087 1879246 1782566 1826614 1928288 1953247 1930143 2012834 2240323 2452087 2488991 2398026 2362027
35076 2362027 2461184 2588700 2613427 2542840 2459416 2353779 2144066 1870032 1726760 1818545
35066 1818545 1988551 2016745 1899806 1777594 1654560 1413335 1100084 952743 1064411 1228310
35056 1228310 1238862 1161812 1148908 1148689 1008103 756680 568947 491275 411968 289142 212133
35045 212133 217969 228224 215364 270529 433780 590205 620286 549031 461484 367327 254985
35034 254985 207871 335055 596186 800475 803309 638486 439614 298436 237265 257433
$$ packed form
35110A636253j16848l0141O3732J22094J47705J12346P855q5499q4985k0143J7238
35099A769607O03k2530j9951j0860k1014l8249j6858O8144J58573J42654r74j29899
35087A879246r6680M4048J01674K4959k3104Q2691K27489K11764L6904r0965l5999
35076B362027R9157J27516K4727p0587q3424j05637k09713k74034j43272R1785
35066A818545J70006K8194j16939j22212j23034k41225l13251j47341J11668J63899
35056A228310J0552p7050j2904k19j40586k51423j87733p7672p9307j22826p7009
35045B12133N836J0255j2860N5165J63251J56425L0081p1255q7547r4157j12342
35034B54985m7114J27184K61131K04289K834j64823j98872j41178o1171K0168
$$ plain form
35024 257433 336905 398957 368123 277399 244952 302999 326998 211906 52980 35297 175334
35013 175334 308025 333715 331912 390379 469535 515178 567344 641969 624090 431596 204427
35002 204427 156909 274158 328754 209204 67796 87048 234905 343616 342549 302898 284831
34991 284831 248477 148273 47921 64025 193248 272768 173515 -18396 -107901 -50678 23159
34980 23159 52695 148588 373012 570989 563933 410866 319052 355690 406007 382493 316258
34969 316258 243907 149269 39793 -31608 -39181 8530 121896 290166 411878 391087 294547
34958 294547 280857 372214 435915 404771 367633 408117 497543 593854 705364 797226 772928
34947 772928 625982 488629 453821 469476 488392 585490 805602 1008040 1010897 827554 630417
$$ packed form
35024B57433P9472O2052l0834r0724l2447N8047K3999j15092j58926j7683J40037
35013A75334J32691K5690j803N8467P9156M5643N2166P4625j7879j92494k27169
35002B04427m7518J17249N4596j19550j41408J9252J47857J08711j067l9651j8067
34991B84831l6354j00204j00352J6104J29223P9520r9253j91911q9505N7223P3837
34980B3159K9536R5893K24424J97977p056j53067r1814L6638N0317k3514o6235
34969C16258p2351r4638j09476p1401p573M7711J13366J68270J21712k0791r6540
34958B94547j3690R1357O3701l1144l7138M0484Q9426R6311J11510R1862k4298
34947G72928j46946j37353l4808J5655J8916R7098K20112K02438K857j83343j97137
$$ plain form
34936 630417 524694 475085 420068 342993 245787 149418 110849 159974 235941 262167 266450
34925 266450 347018 525574 705911 785049 756318 698157 687556 714966 680930 523188 351427
34914 351427 363993 584742 782250 733828 484394 246327 133004 125377 224467 449502
34904 449502 692793 759580 608452 427005 414757 588789 839419 1065601 1199399 1201337
34894 1201337 1110487 1029167 998908 965762 921760 978260 1196938 1424886 1431883 1192838 922503
34883 922503 828701 923839 1082838 1188521 1194338 1130375 1087198 1125049 1166744 1060342 794314
34872 794314 557977 505765 549424 512460 426816 490495 721804 862343 726981 479479
34862 479479 389985 435842 367920 138808 19447 221336 602153 872576 950916 956634 945711
$$ packed form
34936F30417j05723m9609n5017p7075r7206r6369l8569M9125P5967K6226M283
34925B66450Q0568J78556J80337P9138k8731n8161j0601K7410l4036j57742j71761
34914C51427J2566K20749J97508m8422k49434k38067j13323p627R9090K25035
34904D49502K43291O6787j51128j81447j2248J74032K50630K26182J33798J938
34894A201337r0850q1320l0259l3146m4002N6500K18678K27948O997k39045k70335
34883I22503r3802R5138J58999J05683N817o3963m3177L7851M1695j06402k66028
34872G94314k36337n2212M3659l6964q5644O3679K31309J40539j35362k47502
34862D79479q9494M5857o7922k29112j19361K01889L80817K70423P8340N718j0923
$$ plain form
34851 945711 836641 592300 329200 198942 229460 310074 303737 185808 94522 193910 449813
34840 449813 629694 603740 536364 632312 791417 743886 496256 361263 475370 575417
34830 575417 434877 272465 438534 843376 1042848 869705 638748 641139 747015 698443
34820 698443 556037 582453 801596 957698 905100 796911 822313 937484 956588 794749
34810 794749 529977 305872 248768 404623 670197 837126 785006 600622 452472 401529
34800 401529 405168 441384 514739 569860 527584 418447 365640 405815 440174 418958 462642
34789 462642 695772 1028076 1220861 1154034 930801 727380 639018 679108 813855 947157
34779 947157 967415 885522 854795 970505 1117901 1129447 1034568 997602 1026848 946708 723395
$$ packed form
34851I45711j09070k44341k63100j30258L0518Q0614o337j17929r1286R9388K55903
34840D49813J79881k5954o7376R5948J59105m7531k47630j34993J14107J00047
34830E75417j40540j62412J66069M04842J99472j73143k30957K391J05876m8572
34820F98443j42406K6416K19143J56102n2598j08189K5402J15171J9104j61839
34810G94749k64772k24105n7104J55855K65574J66929n2120j84384j48150n0943
34800D01529L639L6216P3355N5121m2276j09137n2807M0175L4359k1216M3684
34789D62642K33130L32304J92785o6827k23233k03421q8362M0090J34747J33302
34779I47157K0258q1893l0727J15710J47396J1546r4879l6966K9246q0140k23313
$$ plain form
34768 723395 611799 811225 1120311 1165704 917900 733455 858763 1123943 1224800 1113809
34758 1113809 965969 902188 923427 1034175 1249814 1502462 1677124 1731154 1676553 1492544
34748 1492544 1195682 961693 998234 1268960 1503926 1540711 1508017 1584810 1717166 1721466
34738 1721466 1593802 1544933 1711420 1963476 2069310 1974907 1828807 1757591 1733409 1707538
34728 1707538 1757568 1960566 2168758 2109806 1766505 1473019 1505799 1728613 1816204 1706077
34718 1706077 1602988 1612939 1645305 1677466 1832914 2115148 2316444 2324431 2307287 2435292 2606798
34707 2606798 2643022 2596323 2633539 2719432 2671856 2494836 2407913 2515781 2665262 2707096 2726650
34696 2726650 2899517 3227322 3541160 3724868 3831426 3965588 4115475 4162023 4070046 4007664
$$ packed form
34768G23395j11596J99426L09086M5393k47804j84445J25308K65180J00857j10991
34758A113809j47840o3781K1239J10748K15639K52648J74662N4030n4601j84009
34748A492544k96862k33989L6541K70726K34966L6785l2694P6793J32356M300
34738A721466j27664m8869J66487K52056J05834r4403j46100p1216k4182k5871
34728A707538N0030K02998K08192n8952l43301k93486L2780K22814Q7591j10127
34718A706077j03089R951L2366L2161J55448K82234K01296P987j7144J28005J71506
34707B606798L6224m6699L7216Q5893m7576j77020q6923J07868J49481M1834J9554
34696B726650J72867L27805L13838J83708J06558J34162J49887M6548r1977o2382
$$ plain form
34686 4007664 4177400 4532026 4791766 4804284 4750090 4875596 5157099 5414296 5658067 6069150
34676 6069150 6636526 7086682 7272501 7421520 7848373 8563373 9316819 9924916 10400573
34667 10400573 10844270 11367265 12077450 12989426 13970006 14904032 15883287 17086220 18506320
34658 18506320 19996328 21596554 23595024 26165435 29144948 32330350 35851705 40081778
34650 40081778 45299977 51651339 59353083 68728146 80111235 93979735 111153330 132629394
34642 132629394 159287253 191984849 231503198 277191898 324938696 367146394 396023801
34635 396023801 407590201 402634664 384393644 356184369 321149044 282868343 244944620
34628 244944620 209899916 178850802 152059718 129366255 110250347 94056674 80363531
$$ packed form
34686D007664J69736L54626K59740J2518n4194J25506K81503K57197K43771M11083
34676F069150N67376M50156J85819J49019M26853P15000P53446O08097M75657
34667A0400573M43697N22995P10185R11976R80580R34026R79255J202933J420100
34658A8506320J490008J600226J998470K570411K979513L185402L521355M230073
34650D0081778N218199O351362P701744R375063J1383089J3868500J7173595K1476064
34642A32629394K6657859L2697596L9518349M5688700M7746798M2207698K8877407
34635C96023801J1566400m955537j8241020k8209275l5035325l8280701l7923723
34628B44944620l5044704l1049114k6791084k2693463j9115908j6193673j3693143
$$ plain form
34621 80363531 68968630 59573723 51752201 45198444 39742988 35138500 31096239 27533739
34613 27533739 24528458 22019846 19814991 17891286 16393901 15274113 14222902 13067473
34605 13067473 11965013 11076278 10309271 9552800 8916091 8509991 8176509 7684322 7070977
34596 7070977 6550651 6166094 5778323 5368940 5104041 5048834 5013476 4783289 4390104 4056461
34586 4056461 3923874 3918134 3874020 3731149 3570743 3477629 3424933 3329418 3169682 2979612
34576 2979612 2761688 2506711 2287571 2213026 2260567 2264873 2122107 1917071 1799205 1813331
34566 1813331 1896050 1953468 1895049 1680639 1395163 1201514 1167203 1211458 1258000 1334142 1462158
34555 1462158 1569159 1592315 1575018 1568358 1536136 1459002 1430180 1516314 1602031 1516594 1267263
$$ packed form
34621H0363531j1394901r394907p821522o553757n455456m604488m042261l562500
34613B7533739l005281k508612k204855j923705j497385j119788j051211j155429
34605A3067473j102460q88735p67007p56471o36709m06100l33482m92187o13345
34596G070977n20326l84557l87771m09383k64899n5207l5358k30187l93185l33643
34586D056461j32587n740m4114j42871j60406r3114n2696r5515j59736j90070
34576B979612k17924k54977k19140p4545M7541M306j42766k05036j17866J4126
34566A813331Q2719N7418n8419k14410k85476j93649l4311M4255M6542P6142J28016
34555A462158J07001K3156j7297o660l2222p7134k8822Q6134Q5717q5437k49331
$$ plain form
34544 1267263 1017159 875635 838358 885420 987827 1045625 981747 892925 941070 1077020
34534 1077020 1053508 782185 511543 526382 784231 992628 981205 849378 768066 787428
34524 787428 875283 1011177 1145848 1145851 907577 527400 257917 257451 445465 630844 702182
34513 702182 641937 453286 194600 38134 145082 458422 730589 792974 706592 614675
34503 614675 555208 489443 424825 401359 390084 308345 158913 92080 265994 625728 867677
34492 867677 717698 269526 -64546 -23191 197895 247125 106198 50753 187941 334176
34482 334176 388936 509399 769047 930611 790081 531165 468975 593545 654015 594871
34472 594871 599030 724307 797032 711666 582434 519361 468690 374075 312758 350780 402263
$$ packed form
34544A267263k50104j41524l7277M7062J02407N7798o3878q8822M8145J35950
34534A077020k3512k71323k70642J4839K57849K08397j1423j31827q1312J9362
34524G87428Q7855J35894J34671Lk38274l80177k69483m66J88014J85379P1338
34513G02182o0245j88651k58686j56466J06948L13340K72167O2385q6382r1917
34503F14675n9467o5765o4618k3466j1275q1739j49432o6833J73914L59734K41949
34492H67677j49979m48172l34072M1355K21086M9230j40927n5445J37188J46235
34482C34176N4760J20463K59648J61564j40530k58916o2190J24570O0470n9144
34472E94871M159J25277P2725q5366j29232o3073n0671r4615o1317L8022N1483
$$ plain form
34461 402263 357723 255756 217145 280530 398953 538494 684442 786624 788162 704340 616051
34450 616051 582934 595161 607424 594043 564097 533269 499592 468161 488495 614808 809312
34439 809312 940108 918471 798398 700288 678320 702254 718313 679175 564903 422637 329109
34428 329109 270812 142823 -70944 -211976 -134864 102872 339355 508234 620828 642144
34418 642144 545099 432086 438296 539869 598434 561585 480656 381089 275817 252207 353397
34407 353397 417548 265720 40654 97028 496849 864354 859698 590848 411796 477639
34397 477639 661285 794864 829587 810109 813454 892717 1018043 1103218 1112011 1082188 1046770
34386 1046770 1018686 1040190 1129469 1194654 1149319 1092452 1176962 1303757 1200944 860568 615723
$$ packed form
34461D02263m4540j01967l8611O3385J18423J39541J45948J02182J538q3822q8289
34450F16051l3117J2227J2263j3381k9946l0828l3677l1431K0334J26313J94504
34439H09312J30796k1637j20073r8110k1968K3934J6059l9138j14272j42266r3528
34428C29109n8297j27989k13767j41032P7112K37736K36483J68879J12594K1316
34418F42144r7045j13013O210J01573N8565l6849q0929r9567j05272k3610J01190
34407C53397O4151j51828k25066N6374L99821L67505m656k68850j79052O5843
34397D77639J83646J33579L4723j9478L345P9263J25326Q5175Q793k9823l5418
34386A046770k8084K1504Q9279O5185m5335n6867Q4510J26795j02813l40376k44845
$$ plain form
34375 615723 664378 799240 788518 740209 827771 905714 745095 485547 463529 659185 709213
34364 709213 494015 332388 470220 698773 683101 442120 270461 314854 452214 540249
34354 540249 597300 707277 867850 992703 1025170 1009943 1041781 1148247 1255073 1291656
34344 1291656 1284732 1287789 1263490 1140496 977242 945223 1103541 1286527 1289176 1107692 920973
34333 920973 860241 871649 823270 701473 648537 786762 1042165 1209633 1198714 1128096 1126955
34322 1126955 1139255 1039753 882842 873677 1079566 1320840 1405745 1341804 1226478 1053692
34312 1053692 778133 502175 415407 532947 651061 622806 541770 553548 603771 530061
34302 530061 341965 222159 243890 275217 226852 214589 350889 524002 556778 483383 470981
$$ packed form
34375F15723M8655J34862j0722m8309Q7562P7943j60619k59548k2018J95656N0028
34364G09213k15198j61627J37832K28553j5672k40981j71659M4393J37360Q8035
34354E40249N7051J09977J60573J24853L2467j5227L1838J06466J06826L6583
34344A291656o924L057k4299j22994j63254l2019J58318J82986K649j81484j86719
34333I20973o0732J1408m8379j21797n2936J38225K55403J67468j0919p0618j141
34322A126955J2300r9502j56911r165K05889K41274Q4905o3941j15326j72786
34312A053692k75559k75958q6768J17540J18114k8255q1036J1778N0223p3710
34302E30061j88096j19806K1731L1327m8365j2263J36300J73113L2776p3395j2402
$$ plain form
34291 470981 526658 500739 371218 297431 342845 354883 216136 42716 15872 150061 337764
34280 337764 500502 582924 519465 338339 196901 183859 186744 95180 25332 152940 392961
34269 392961 464548 277920 62757 61465 242810 385601 336883 120023 -133004 -287410
34259 -287410 -284766 -167142 -17105 125292 267092 410639 542954 659817 755492 804770
34249 804770 793096 736697 633426 437520 145152 -126435 -214406 -63115 225137 464081
34239 464081 498570 321156 115037 99831 279310 429563 396791 289478 279746 347657 377946
34228 377946 399849 524451 697462 734836 609896 503708 528573 581130 540691 460612 463835
34217 463835 552731 622416 607290 542791 512883 576455 723595 892090 1043825 1200014 1366718
$$ packed form
34291D70981N5677k5919j29521p3787M5414J2038j38747j73420k6844J34189J87703
34280C37764J62738Q2422o3459j81126j41438j3042K885r1564o9848J27608K40021
34269C92961P1587j86628k15163j292J81345J42791m8718k16860k53027j54406
34259b87410K644J17624J50037J42397J41800J43547J32315J16863R5675M9278
34249H04770j1674n6399j03271j95906k92368k71587q7971J51291K88252K38944
34239D64081L4489j77414k06119j5206J79479J50253l2772j07313r732O7911L0289
34228C77946K1903J24602J73011L7374j24940j06188K4865N2557m0439q0079L223
34217D63835Q8896O9685j5126o4499k9908O3572J47140J68495J51735J56189J66704
$$ plain form
34206 1366718 1478337 1486831 1460437 1504441 1620518 1735395 1827140 1920661 2000030 2038152 2074057
34195 2074057 2145158 2193128 2168336 2164338 2279665 2398368 2313515 2050673 1850552 1821611 1838725
34184 1838725 1821070 1861583 1992944 2064108 1988522 1916214 1998736 2145715 2183140 2119805 2081994
34173 2081994 2084822 2041033 1932209 1823169 1752906 1726403 1756452 1810148 1790364 1684212 1645126
34162 1645126 1788597 1976573 1963011 1714086 1425239 1235923 1091981 919027 782584 791745
34152 791745 924558 1035523 1016966 901280 800910 778493 800962 814504 819211 837369 848252
34141 848252 810919 723469 600165 428342 225264 90236 94798 164391 191119 208075 288830
34130 288830 333717 188940 -36612 -55818 140124 209186 -26816 -286163 -248668 -15536
$$ packed form
34206A366718J11619Q494k6394M4004J16077J14877R1745R3521P9369L8122L5905
34195B074057P1101M7970k4792l998J15327J18703q4853k62842k00121k8941J7114
34184A838725j7655M0513J31361P1164p5586p2308Q2522J46979L7425o3335l7811
34173B081994K828m3789j08824j09040p0263k6503L0049N3696j9784j06152l9086
34162A645126J43471J87976j3562k48925k88847j89316j43942j72954j36443R161
34152G91745J32813J10965j8557j15686j00370k2417K2469J3542M707J8158J0883
34141H48252l7333q7450j23304j71823k03078j35028M562O9593K6728J6956Q0755
34130B88830M4887j44777k25552j9206J95942O9062k36002k59347L7495K33132
$$ plain form
34120 -15536 112799 107023 146885 234202 208557 93591 106387 308670 518533 602544 616651
34109 616651 613786 540790 401008 323195 375643 461051 474293 436774 410455 401138 410820 474952
34097 474952 582599 650011 625793 545539 452305 347553 244244 177764 139463 88645 50281
34086 50281 105930 264571 437733 567674 682789 795683 847409 802872 722545 689479 719802
34075 719802 771814 786426 703642 505039 261778 88859 42091 98751 211963 318914
34065 318914 335533 242324 151580 180756 275892 281937 183891 143387 270244 479297 616238
34054 616238 627279 562457 488880 433535 360474 212927 34324 -9779 161907 380934 424657
34043 424657 330678 323728 448053 500580 365783 189657 141078 208402 331620 529805 762139
$$ packed form
34120a5536J28335n776L9862Q7317k5645j14966J2796K02283K09863Q4011J4107
34109F16651k865p2996j39782p7813N2448Q5408J3242l7519k6319r317R682O4132
34097D74952J07647O7412k4218q0254r3234j04752j03309o6480l8301n0818l8364
34086E0281N5649J58641J73162J29941J15115J12894N1726m4537q0327l3066L0323
34075G19802N2012J4612q2784j98603k43261j72919m6768N6660J13212J06951
34065C18914J6619r3209r0744K9176R5136O045r8046m0504J26857K09053J36941
34054F16238J1041o4822p3577n5345p3061j47547j78603m4103J71686K19027M3723
34043D24657r3979o950J24325N2527j34797j76126m8579O7324J23218J98185K32334
$$ plain form
34032 762139 846524 681521 414207 243918 190341 188588 257620 404700 508574 498396 529456
34021 529456 763192 1065270 1154132 987498 763788 578983 342435 50546 -111611 -29223
34011 -29223 171117 303125 330059 314873 291113 262759 231353 165554 35316 -97698 -138251
34000 -138251 -118171 -143987 -158498 40205 453444 770558 759757 580646 501936 480616 303962
33989 303962 40589 1548 242045 439837 372529 214962 195878 231634 142679 18551
33979 18551 64205 215836 237349 138780 156062 302132 290559 9126 -255615 -244395 -99672
33968 -99672 -88728 -184915 -198659 -151044 -205531 -325220 -310213 -143978 -15503 3413 31060
33957 31060 107184 127399 102591 213003 497560 723215 690576 474940 251249 78490
$$ packed form
34032G62139Q4385j65003k67314j70289n3577j753O9032J47080J03874j0178L1060
34021E29456K33736L02078Q8862j66634k23710j84805k36548k91889j62157Q2388
34011b9223K00340J32008K6934j5186k3760k8354l1406o5799j30238j33014m0553
34000a38251K0080k5816j4511J98703M13239L17114j0801j79111p8710k1320j76654
33989C03962k63373l9041K40497J97792o7308j57567j9084L5756q8955j24128
33979A8551M5654J51631K1513r8569J7282J46070j1573k81433k64741J1220J44723
33968i9672J0944r6187j3744M7615n4487j19689J5007J66235J28475J8916K7647
33957C1060P6124K0215k4808J10412K84557K25655l2639k15636k23691j72759
$$ plain form
33947 78490 -21463 18775 161145 224298 168154 222032 525486 830403 818600 568146 409421
33936 409421 415255 361689 173920 77562 230866 480937 609115 611396 602255 600673 551634
33925 551634 454762 356194 286608 284559 398276 591678 732070 746431 715298 742788 813303
33914 813303 856835 880071 931156 981078 945611 819505 713078 741783 909489 1093586 1135400
33903 1135400 986434 789480 763371 966887 1223353 1320323 1228915 1072984 948250 861315
33893 861315 800663 751370 646655 425374 169908 78013 228613 453407 525891 425976
33883 425976 322423 324093 363562 341435 276680 255241 304584 390208 484146 558255 544834
33872 544834 396890 188647 77033 138751 293594 402123 395801 303937 200469 141206
$$ packed form
33947G8490r9953M0238J42370O3153n6144N3878L03454L04917j1803k50454j58725
33936D09421N834n3566j87769r6358J53304K50071J28178K281r141j582m9039
33925E51634r6872r8568o9586k049J13717J93402J40392J4361l1133K7490P0515
33914H13303M3532K3236N1085M9922l5467j26106j06427K8705J67706J84097M1814
33903A135400j48966j96954k6109K03516K56466R6970r1408j55931j24734q6935
33893H61315o0652m9293j04715k21281k55466r1895J50600K24794P2484r9915
33883D25976j03553J670L9469k2127o4755k1439M9343Q5624R3938P4109j3421
33872E44834j47944k08243j11614O1718J54843J08529o322r1864j03468n9263
$$ plain form
33862 141206 124290 113252 122428 238838 490287 728684 758659 588231 433600 440861 520027
33851 520027 513532 412441 312110 250238 209683 219153 319088 450727 499925 452518 398843
33840 398843 368205 268312 49862 -143444 -88913 240771 582457 624191 339652 15604
33830 15604 -90712 -46688 -103316 -316327 -466458 -373345 -124679 82218 183209 220421
33820 220421 197069 111979 61830 139702 252946 196215 -70396 -330983 -345593 -108512 154270
33809 154270 212403 48704 -136988 -157410 -59546 -46808 -183974 -310569 -299420 -246688 -283424
33798 -283424 -333184 -233625 -17677 117041 89402 15986 18325 94409 180301 213728 147032
33787 147032 14192 -40576 77254 259314 326756 262629 169286 70613 -49567 -78858 103293
$$ packed form
33862A41206j6916j1038R176J16410K51449K38397K9975j70428j54631P261P9166
33851E20027o495j01091j00331o1872m0555R470R9935J31639M9198m7407n3675
33840C98843l0638r9893k18450j93306N4531L29684L41686M1734k84539l24048
33830A5604j06316M4024n6628k13011j50131R3113K48666K06897J00991L7212
33820B20421k3352q5090n0149P7872J13244n6731k66611k60587j4610K37081K62782
33809A54270N8133j63699j85692k0422R7864J2738j37166j26595J1149N2732l6736
33798b83424m9760R9559K15948J34718k7639p3416K339P6084Q5892L3427o6696
33787A47032j32840n4768J17830J82060O7442o4127r3343r8673j20180k9291J82151
$$ plain form
33776 103293 349486 356884 99346 -107447 -49138 123408 180232 127737 87951 59291 -23388
33765 -23388 -122615 -148295 -80777 58482 248143 396718 368303 163913 -70478 -285502
33755 -285502 -574754 -877218 -887376 -463640 87565 380272 422985 453896 470460 275403
33745 275403 -78646 -260699 -120544 126253 247807 262852 255290 172007 -28799 -205597
33735 -205597 -195564 -49092 58729 89951 162637 319387 418640 318824 95794 -20283
33725 -20283 67854 187993 121896 -92632 -208347 -108850 49327 80132 1286 -62403 -68349
33714 -68349 -34146 49360 155896 188268 130444 108650 168323 152857 -16524 -126794 3174
33703 3174 155792 15251 -275511 -269960 80385 313117 141566 -154727 -211945 -92578
$$ packed form
33776A03293K46193P398k57538k06793N8309J72546N6824n2495l9786k8660q2679
33765b3388r9227k5680O7518J39259J89661J48575k8415k04390k34391k15024
33755b85502k89252l02464j0158M23736N51205K92707M2713L0911J6564j95057
33745B75403l54049j82053J40155K46797J21554J5045p562q3283k00806j76798
33735b05597J0033J46472J07821L1222P2686J56750R9253r9816k23030j16077
33725b0283Q8137J20139o6097k14528j15715R9497J58177L0805p8846o3689n946
33714f8349L4203Q3506J06536L2372n7824k1794N9673j5466j69381j10270J29968
33703C174J52618j40541k90762N551L50345K32732j71551k96293n7218J19367
$$ plain form
33693 -92578 -54872 -102353 -73452 13500 14894 -51281 -47619 19936 17097 -82255 -171607 -186175
33681 -186175 -132418 6779 228216 414902 448283 375955 325741 311077 271814 236387 265469
33670 265469 293572 220405 116701 133170 228156 204518 27179 -108943 -64930 81671 204217
33659 204217 262747 218956 18042 -247195 -329570 -112967 212666 364783 260588 27545
33649 27545 -161008 -186879 -46439 106991 92979 -53271 -99457 48530 190750 120807
33639 120807 -100283 -302416 -464675 -615958 -628031 -365513 36161 297701 362950 396032
33629 396032 443522 377115 195812 99194 168308 223202 119954 -30182 -71089 -19517 79097
33618 79097 293501 598324 716877 438798 -27102 -286977 -267077 -211466 -234614 -191567
$$ packed form
33693i2578L7706m7481K8901Q6952J394o6175L662O7555k839r9352q9352j4568
33681a86175N3757J39197K21437J86686L3381p2328n0214j4664l9263l5427K9082
33670B65469K8103p3167j03704J6469R4986k3638j77339j36122M4013J46601J22546
33659B04217N8530m3791k00914k65237q2375K16603L25633J52117j04195k33043
33649B7545j88553k5871J40440J53430j4012j46250m6186J47987J42220o9943
33639A20807k21090k02133j62259j51283j2073K62518M01674K61540O5249L3082
33629C96032M7490o6407j81303r6618O9114N4894j03248j50136m0907N1572R8614
33618G9097K14404L04823J18553k78079m65900k59875J9900N5611k3148M3047
$$ plain form
33608 -191567 -13387 139435 157526 156786 242197 318981 287888 233647 249756 245765 120578
33597 120578 -14764 -5333 55885 -62217 -368906 -619943 -644770 -510851 -340936 -152690
33587 -152690 57565 220604 272896 243991 204534 188566 199602 232683 268380 295370 335136
33576 335136 387661 385410 292532 216848 298936 498896 625725 584469 457653 331992 205225
33565 205225 103002 116022 240799 334615 322191 305593 366025 403378 306950 152284 66151
33554 66151 6739 -133780 -285233 -268560 -89899 30480 -47161 -212953 -278708 -199345 -73272
33543 -73272 -7145 -24006 -55110 -4988 145111 316395 438388 509926 510119 361642 90548
33532 90548 -91239 -27706 140201 165192 58658 39821 158273 234845 203000 228182 390138
$$ packed form
33608a91567J78180J52822J8091p40Q5411P6784l1093n4241J6109l991j25187
33597A20578j35342R431O1218j18102l06689k51037k4827J33919J69915J88246
33587a52690K10255J63039N2292k8905l9457j5968J1036L3081L5697K6990L9766
33576C35136N2525k251r2878p5684Q2088J99960J26829m1256j26816j25661j26767
33565B05225j02223J3020J24777R3816j2424j6598O0432L7353r6428j54666q6133
33554F6151n9412j40519j51453J6673J78661J20379p7641j65792o5755P9363J26073
33543g3272O6127j6861l1104N0122J50099J71284J21993P1538J93j48477k71094
33532I0548j81787O3533J67907K4991j06534j8837J18452P6572l1845K5182J61956
$$ plain form
33521 390138 502333 399840 201067 115113 158726 231002 305502 359526 262489 -38215 -319549
33510 -319549 -303980 -30334 201629 220484 115003 -1007 -138823 -313815 -449989 -468827
33500 -468827 -364111 -163312 85277 285922 364925 364676 366744 347258 233053 73926 12244
33489 12244 91057 232632 384138 523466 551704 387696 171217 141200 272938 279795 52873
33478 52873 -156595 -125228 17760 40501 -31676 -41264 -18294 -107044 -269859 -330230 -273986
33467 -273986 -268298 -383812 -508727 -554700 -561748 -571823 -558669 -506719 -418069 -240697 49213
33456 49213 288308 234980 -115661 -487567 -647616 -622458 -542915 -444175 -312996 -187420
33446 -187420 -97147 -9588 75408 81959 -8767 -94746 -109695 -124083 -191779 -226085 -156172 -84173
$$ packed form
33521C90138J12195j02493j98773q5954M3613P2276P4500N4024r7037l00704k81334
33510c19549J5569K73646K31963J8855j05481j16010j37816j74992j36174j8838
33500d68827J04716K00799K48589K00645P9003k49K068j9486j14205j59127o1682
33489A2244P8813J41575J51506J39328K8238j64008k16479l0017J31738O857k26922
33478E2873k09468L1367J42988K2741p2177r588K2970q8750j62815o0371N6244
33467b73986N688j15514j24915m5973p048j0075J3154N1950Q8650J77372K89910
33456D9213K39095n3328l50641l71906j60049K5158P9543R8740J31179J25576
33446a87420R0273Q7559Q4996O551r0726q5979j4949j4388o7696l4306O9913P1999
$$ plain form
33434 -84173 -130840 -227253 -231221 -163777 -141545 -145778 -69948 53154 108516 159227 375011 666196
33422 666196 688804 338770 -35616 -109140 -26843 -115956 -341953 -389897 -205659 -94213
33412 -94213 -237055 -424855 -387237 -144512 105592 243804 220542 -13009 -367683 -558540
33402 -558540 -405084 -94710 63858 64755 141080 329319 387614 195495 -30838 -45949 105147
33391 105147 225477 267033 316665 381484 377163 305992 294804 434786 678907 919990 1103942
33380 1103942 1238166 1322927 1308742 1144713 878599 663916 605754 627599 573269 417817
33370 417817 271795 193429 134102 77424 73716 97843 39363 -97143 -146624 -31022 104229
33359 104229 108443 27425 -33252 -91671 -193309 -274488 -274826 -253458 -247662 -169976 -11548 27283
$$ packed form
33434h4173m6667r6413l968O7444K2232m233P5830J23102N5362N0711K15784K91185
33422F66196K2608l50034l74386p3524Q2297q9113k25997m7944J84238J11446
33412i4213j42842j87800L7618K42725K50104J38212k3262k33551l54674j90857
33402e58540J53456L10374J58568Q97P6325J88239N8295j92119k26333j5111J51096
33391A05147J20330M1556M9632O4819m321p1171j1188J39982K44121K41083J83952
33380A103942J34224Q4761j4185j64029k66114k14683n8162K1845n4330j55452
33370D17817j46022p8366n9327n6678l708K4127n8480j36506m9481J15602J35251
33359A04229M214q1018o0677n8419j01638q1179l38K1368N796P7686J58428L8831
$$ plain form
33347 27283 -178358 -424561 -447940 -295753 -170429 -70727 97312 200110 48661 -194151
33337 -194151 -184158 49462 123850 -104694 -367055 -449986 -438937 -414029 -306107 -167619 -190678
33326 -190678 -326991 -292677 -85154 -45880 -237380 -277238 -67662 -123524 -714686 -1182854
33316 -1182854 -742971 353012 1122094 1152520 939371 964960 1102430 1058515 853291 626467
33306 626467 370574 98873 -14097 120501 323202 379225 301743 253882 344744 568693
33296 568693 816533 920778 827715 719040 812074 1076286 1323858 1511850 1720914 1899885
33286 1899885 1925697 1896999 2048930 2349023 2501751 2419402 2359188 2480849 2592814 2512635
33276 2512635 2396389 2485474 2730383 2887223 2849892 2703016 2553407 2461602 2457242 2509967
$$ packed form
33347B7283k05641k46203k3379J52187J25324R9702J68039J02798j51449k42812
33337a94151R993K33620P4388k28544k62361q2931J1049K4908J07922J38488k3059
33326a90678j36313L4314K07523L9274j91500l9858K09576n5862n91162m68168
33316a182854M39883J095983P69082L0426k13149K5589J37470m3915k05224k26824
33306F26467k55893k71701j12970J34598K02701N6023p7482m7861R0862K23949
33296E68693K47840J04245r3063j08675R3034K64212K47572J87992K09064J78971
33286A899885K5812k8698J51931L00093J52728q2349o0214J21661J11965q0179
33276B512635j16246Q9085K44909J56840l7331j46876j49609r1805m360N2725
$$ plain form
33266 2509967 2554071 2593916 2683654 2781288 2769670 2647926 2532479 2445683 2306980 2168661
33256 2168661 2219389 2473174 2691205 2717251 2664332 2655939 2613683 2437132 2177813 1899450
33246 1899450 1579459 1272729 1128391 1102676 933598 588994 440644 727056 1115278 1129204
33236 1129204 800702 529433 457044 388537 260489 262830 445815 562088 425727 178202
33226 178202 66796 132341 229466 235406 144674 28691 -34418 -17184 55527 164289 306533
33215 306533 436453 479597 438007 379965 307730 181822 92053 184031 355082 302692 13393
33204 13393 -104653 192026 560872 555973 273158 121665 156812 106145 -49781 -30710 197084
33193 197084 310753 176169 78660 241118 475495 520059 422135 363270 351056 311968 291171
$$ packed form
33266B509967M4104L9845Q9738R7634j1618j21744j15447q6796j38703j38319
33256B168661N0728K53785K18031K6046n2919q393m2256j76551k59319k78363
33246A899450l19991l06730j44338k5715j69078l44604j48350K86412L88222J3926
33236A129204l28502k71269p2389o8507j28048K341J82985J16273j36361k47525
33226A78202j11406O5545R7125N940r0732j15983o3109J7234P2711J08762J42244
33215C06533J29920M3144m1590n8042p2235j25908q9769R1978J71051n2390k89299
33204A3393j18046K96679L68846m899k82815j51493L5147n0667j55926J9071K27794
33193A97084J13669j34584r7509J62458K34377M4564r7924n8865j2214l9088k0797
$$ plain form
33182 291171 336384 341598 221019 112542 199777 422108 556548 526828 447485 390319 285620
33171 285620 88412 -84163 -59836 175250 419435 437936 201778 -92250 -255697 -297494
33161 -297494 -333566 -398216 -445780 -464396 -457514 -368632 -169175 22485 64671 12 -22024
33150 -22024 7759 -23505 -108665 -112047 -19521 16524 -70332 -160155 -158589 -121553 -96590 -19490
33138 -19490 140750 287308 333782 309621 269335 231748 249706 379134 532265 538650 407732
33127 407732 338240 399962 424402 312815 221322 286937 383612 345114 252931 288530 442798
33116 442798 593521 750661 988351 1224208 1316338 1327167 1435150 1596303 1554200 1231120
33106 1231120 866364 670934 563735 400272 274911 360366 532491 433095 -28860 -459184
$$ packed form
33182B91171M5213N214j20579j08477Q7235K22331J34440k9720p9343n7166j04699
33171B85620j97208j72575K4327K35086K44185J8501k36158k94028j63447m1797
33161b97494l6072o4650m7564j8616O882Q8882J99457J91660M2186o4659k2036
33150b2024K9783l1264q5160l382R2526L6045q6856q9823J566L7036K4963P7100
33138a9490J60240J46558M6474k4161m0286l7587J7958J29428J53131O385j30918
33127D07732o9492O1722K4440j11587r1493O5615R6675l8498r2183L5599J54268
33116D42798J50723J57140K37690K35857R2130J0829J07983J61153m2103l23080
33106A231120l64756j95430j07199j63463j25361Q5455J72125r9396m61955m30324
$$ plain form
33096 -459184 -424393 9794 382887 422575 287346 204796 135474 -47588 -250989 -268768
33086 -268768 -92315 116277 294996 492452 643789 591319 355701 156551 107914 102737
33076 102737 67901 121636 362221 669261 846933 852146 778329 706761 653856 587045 447551
33065 447551 238573 93961 138427 285229 329753 243252 181543 187744 121004 -55665 -164825
33054 -164825 -114144 -81110 -231582 -432281 -427730 -182821 109380 269435 259659 161646 120884
33043 120884 219277 342179 298090 113768 30862 138400 218484 75689 -181979 -337244
33033 -337244 -355229 -325697 -284032 -249230 -282994 -361447 -350526 -247633 -249304 -409323 -449785
33022 -449785 -145230 290626 464550 311607 87902 -23443 -35270 21978 134307 207554
$$ packed form
33096d59184L4791M34187L73093L9688j35229q2550o9322j83062k03401j7779
33086b68768J76453K08592J78719J97456J51337n2470k35618j99150m8637n177
33076A02737l4836N3735K40585L07040J77672N213p3817p1568n2905o6811j39494
33065D47551k08978j44612M4466J46802M4524q6501o1709O201o6740j76669j09160
33054a64825N0681L3034j50472k00699M551K44909K92201J60055r776r8013m0762
33043A20884R8393J22902m4089j84322q2906J07538Q0084j42795k57668j55265
33033c37244j7985K9532M1665L4802l3764p8453J0921J02893j671j60019m0462
33022d49785L04555M35856J73924j52943k23705j11345j1827N7248J12329P3247
$$ plain form
33012 207554 169863 136274 271289 530313 720137 761353 718674 646536 587238 640571 843037
33001 843037 1062702 1217533 1503757 2153599 2998782 3516993 3344437 2594418 1688544 1016537
32991 1016537 718990 641481 507835 235524 24444 55072 222683 299422 237638 163960
32981 163960 176552 276829 391486 368151 110294 -193356 -194715 139698 440054 461873
32971 461873 394834 452882 508353 403572 277810 265585 212617 33334 -19371 179217 302765
32960 302765 157240 120313 458877 719096 475203 158133 307531 556824 420604 502892
32950 502892 1417899 1844427 -362630 -4732468 -7777911 -7044063 -4034271 -1875615 -1423388
32941 -1423388 -1283480 -687747 -333678 -611193 -850199 -652758 -566096 -949548 -1266474 -1032096
$$ packed form
33012B07554l7691l3589J35015K59024J89824M1216m2679p2138n9298N3333K02466
33001H43037K19665J54831K86224O49842Q45183N18211j72556p50019r05874o72007
32991A016537k97547p7509j33646k72311k11080L0628J67611P6739o1784p3678
32981A63960J2592J00277J14657k3335k57857l03650j359L34413L00356K1819
32971D61873o7039N8048N5471j04781j25762j2225n2968j79283n2705J98588J23548
32960C02765j45525l6927L38564K60219k43893l17070J49398K49293j36220Q2288
32950E02892R15007M26528k207057m369838l045443P33848L009792K158656M52227
32941a423388J39908N95733L54069k77515k39006J97441Q6662l83452l16926K34378
$$ plain form
32931 -1032096 -594812 -439068 -416927 -202547 64133 107836 40617 78385 106087 -36723
32921 -36723 -160066 -42068 123170 14041 -290855 -473055 -496462 -568733 -686466 -622529
32911 -622529 -359240 -182980 -281130 -509575 -641984 -637540 -566434 -445498 -279328 -162286
32901 -162286 -205212 -383116 -542000 -561599 -459943 -329100 -218048 -119348 -46436 -59230
32891 -59230 -189768 -387050 -573018 -723094 -850047 -933497 -924255 -827017 -733913 -737365 -810872
32880 -810872 -815744 -671248 -499499 -511935 -722319 -883952 -797748 -569606 -422310 -360816
32870 -360816 -236902 -82194 -103554 -320738 -476651 -403624 -253035 -246187 -398235 -604357
32860 -604357 -793950 -866735 -691123 -342011 -150116 -316317 -632938 -776029 -712963 -617763
$$ packed form
32931a032096M37284J55744K2141K14380K66680M3703o7219L7768K7702j42810
32921c6723j23343J17998J65238j09129l04896j82200k3407p2271j17733O3937
32911f22529K63289J76260r8150k28445j32409M444P1106J20936J66170J17042
32901a62286m2926j77904j58884j9599J01656J30843J11052R8700P2912j2794
32891e9230j30538j97282j85968j50076j26953q3450R242R7238R3104l452p3507
32880h10872m872J44496J71749j2436k10384j61633Q6204K28142J47296O1494
32870c60816J23914J54708k1360k17184j55913P3027J50589O848j52048k06122
32860f04357j89593p2785J75612L49112J91895j66201l16621j43091O3066R5200
$$ plain form
32850 -617763 -554210 -496336 -524895 -715065 -907203 -870073 -652749 -511039 -510914 -480384 -364047
32839 -364047 -335214 -473010 -588943 -530150 -465088 -660994 -1058995 -1278644 -1082456 -691755
32829 -691755 -528057 -709766 -975682 -1125797 -1307020 -1687469 -2053475 -2063237 -1823787 -1822122
32819 -1822122 -2231501 -2676981 -2831303 -2861145 -3049541 -3323662 -3473708 -3562544 -3748958 -3884292
32809 -3884292 -3645619 -2973390 -2091175 -1201739 -431390 57285 197477 173258 185659 176025
32799 176025 26252 -129988 -99132 14804 -32275 -236913 -434074 -613209 -785737 -700377
32789 -700377 -133669 625801 1028758 949490 698325 445238 143203 -21458 287555 913626
32779 913626 1220572 956583 598028 572971 608162 190647 -672084 -1495815 -1869154 -1675713
$$ packed form
32850f17763O3553N7874k8559j90170j92138L7130K17324J41710J25L0530J16337
32839c64047K8833j37796j15933N8793O5062j95906l98001k19649J96188L90701
32829f91755J63698j81709k65916j50115j81223l80449l66006r762K39450J665
32819a822122m09379m45480j54322k9842j88396k74121j50046q8836j86414j35334
32809c884292K38673O72229Q82215Q89436P70349M88675J40192k4219J2401r634
32799A76025j49773j56240L0856J13936m7079k04638j97161j79135j72528Q5360
32789g00377N66708P59470M02957p9268k51165k53087l02035j64661L09013O26071
32779I13626L06946k63989l58555k5057L5191m17515q62731q23731l73339J93441
$$ plain form
32769 -1675713 -1005717 -139337 538166 839058 899820 921904 972461 1087210 1273282 1309880
32759 1309880 890392 131163 -399785 -363261 -22639 273865 592386 1079422 1502050 1551157
32749 1551157 1344807 1193379 1065898 745541 365077 284383 468709 470685 105478 -264272
32739 -264272 -249182 91199 446329 651612 701201 573149 263003 -97278 -325815 -380362
32729 -380362 -370919 -397605 -437758 -398765 -253238 -93329 -23678 -17106 51212 207883 310638
32718 310638 234721 56280 -31860 56150 230316 344517 321656 189043 53823 35521
32708 35521 173034 379752 499229 429327 234318 133899 302735 649483 894981 922108
32698 922108 905849 994362 1044384 878127 651401 680030 964096 1172156 1088276 815394
$$ packed form
32769a675713O69996Q66380O77503L00892O0762K2084N0557J14749J86072L6598
32759A309880m19488p59229n30948L6524L40622K96504L18521M87036M22628M9107
32749A551157k06350j51428j27481l20357l80464q0694J84326J976l65207l69750
32739b64272J5090L40381L55130K05283M9589j28052l10146l60281k28537n4547
32729c80362R443k6686m0153L8993J45527J59909O9651O572O8318J56671J02755
32718C10638p5917j78441q8140Q8010J74166J14201k2861j32613j35220j8302
32708C5521J37513K06718J19477o9902j95009j00419J68836L46748K45498K7127
32698I22108j6259Q8513N0022j66257k26726K8629K84066K08060q3880k72882
$$ plain form
32688 815394 544177 385601 427163 667163 874902 809281 603862 622832 890452 1006718
32678 1006718 723854 268932 -32819 -128294 -88828 71130 245949 228719 54992 53329
32668 53329 334043 538606 363596 40395 -24632 157993 280947 269658 320587 502453
32658 502453 660201 701444 709869 760889 826501 876141 918782 935731 880901 749840 584318
32647 584318 425533 297800 217750 223368 398975 766381 1096758 1038836 614723 352154
32637 352154 623713 1082447 1158104 901591 808554 953536 940114 685549 577617 766457
32627 766457 957304 1035449 1230398 1495106 1426567 1036734 888866 1176340 1381467 1184439
32617 1184439 979800 1097681 1245101 1164867 1128732 1306460 1361527 1140651 1022551 1142766
$$ packed form
32688H15394k71217j58576M1562K40000K07739o5621k05419J8970K67620J16266
32678A006718k82864m54922l01751r5475L9466J59958J74819j7230j73727j663
32668E3329K80714K04563j75010l23201o5027J82625J22954j1289N0929J81866
32658E02453J57748M1243Q425N1020O5612M9640M2641J6949n4830j31061j65522
32647E84318j58785j27733q0050N618J75607L67406L30377n7922m24113k62569
32637C52154K71559M58734P5657k56513r3037J44982j3422k54565j07932J88840
32627G66457J90847P8145J94949K64708o8539l89833j47868K87474K05127j97028
32617A184439k04639J17881J47420q0234l6135J77728N5067k20876j18100J20215
$$ plain form
32607 1142766 1114087 958040 1301681 2110636 2399181 1889839 1643766 2183062 2512407 2149923
32597 2149923 2371579 3826505 4861231 4541160 5356008 9442477 13369875 11132342 2631139
32588 2631139 -5116495 -6641075 -4099972 -2634937 -3219726 -3331308 -2198485 -1489884 -1772007
32579 -1772007 -1758045 -1017345 -661269 -1062885 -1164456 -482661 83189 -68764 -351938 -279488
32569 -279488 -255380 -551080 -683156 -352521 -18805 -54007 -162873 -51471 81097 61238
32559 61238 58135 98678 -78592 -444273 -586222 -405891 -291415 -417369 -488924 -352759
32549 -352759 -243903 -251535 -152881 41102 -19070 -386321 -652882 -604008 -477331 -416433 -251867
32538 -251867 10119 88303 4019 142250 524399 655993 364208 151474 383523 725776
$$ packed form
32607A142766k8679j56047L43641Q08955K88545n09342k46073N39296L29345l62484
32597B149923K21656J454926J034726l20071Q14848M086469L927398k237533q501203
32588B631139p747634j524580K541103J465035n84789j11582J132823P08601k82123
32579a772007J3962P40700L56076m01616j01571O81795N65850j51953k83174P2450
32569b79488K4108k95700j32076L30635L33716l5202j08866J11402J32568j9859
32559F1238l103M0543j77270l65681j41949J80331J14476j25954p1555J36165
32549c52759J08856p632R8654J93983o0172l67251k66561M8874J26677O0898J64566
32538b51867K61986P8184q4284J38231L82149J31594k91785k12734K32049L42253
$$ plain form
32528 725776 763959 623395 559769 464392 237273 175637 482250 774033 594956 117807
32518 117807 -148262 -95918 334 27735 87308 135798 15123 -208709 -293015 -193737 -118478
32507 -118478 -203542 -337165 -309904 -37546 325514 462915 202125 -250212 -551800 -670199
32497 -670199 -811151 -934592 -755855 -314100 -77965 -269660 -512350 -441250 -263160 -330353
32487 -330353 -499977 -379251 6502 253794 186364 14977 -62545 -62660 -16799 119040 302106
32476 302106 369913 228603 -44064 -275874 -297690 -44770 328399 525253 415218 177136
32466 177136 46695 48261 76984 90949 88132 39427 -11844 78854 344188 591923 633131
32455 633131 489960 269418 3525 -253462 -352833 -237672 -46587 99255 234660 366269
$$ packed form
32528G25776L8183j40564o3626r5377k27119o1636L06613K91783j79077m77149
32518A17807k66069N2344R6252K7401N9573M8490j20675k23832q4306R9278P5259
32507a18478q5064j33623K7261K72358L63060J37401k60790m52337l01588j18399
32497f70199j40952j23441J78737M41755K36135j91695k42690P1100J78090o7193
32487c30353j69624J20726L85753K47292o7430j71387p7522j15M5861J35839J83066
32476C02106O7807j41310k72667k31810k1816K52920L73169J96854j10035k38082
32466A77136j30441J566K8723J3965k817m8705n1271R0698K65334K47735M1208
32455F33131j43171k20542k65893k56987r9371J15161J91085J45842J35405J31609
$$ plain form
32445 366269 397465 389356 594400 985498 1060664 478201 -347064 -703648 -495252 -251319
32435 -251319 -298144 -401181 -300555 -154901 -236953 -491189 -651303 -634956 -594224 -637253
32425 -637253 -676938 -572359 -326856 -96931 -13658 -32604 -6477 112611 232654 292825
32415 292825 354208 462990 538329 485454 337332 206538 169869 255210 449687 660511
32405 660511 755594 690086 516601 287570 85790 103697 446435 849995 901461 617012
32395 617012 467721 690080 934689 838494 592801 596945 828991 969992 964407 1029441 1209539
32384 1209539 1331602 1365486 1454092 1583166 1561073 1357155 1165899 1106415 1123904 1198961
32374 1198961 1378938 1576653 1606878 1465818 1333161 1267907 1147463 939851 783494 743639
$$ packed form
32445C66269L1196q109K05044L91098P5166n82463q25265l56584K08396K43933
32435b51319m6825j03037J00626J45654q2052k54236j60114J6347M0732m3029
32425f37253l9685J04579K45503K29925Q3273j8946K6127J19088J20043O0171
32415B92825O1383J08782P5339n2875j48122j30794l6669Q5341J94477K10824
32405F60511R5083o5508j73485k29031k01780J7907L42738M03560N1466k84449
32395F17012j49291K22359K44609r6195k45693M144K32046J41001n585O5034J80098
32384A209539J22063L3884Q8606J29074k2093k03918j91256n9484J7489P5057
32374A198961J79977J97715L0225j41060j32657o5254j20444k07612j56357l9855
$$ plain form
32364 743639 724387 676256 664412 679417 608216 451588 349367 337187 310424 285321 433870
32353 433870 755471 964628 853262 563418 357660 303504 328691 406734 514178 547728
32343 547728 460985 377083 404300 432343 275502 -46920 -333338 -472856 -553855 -699017
32333 -699017 -908652 -1101124 -1233390 -1326546 -1390500 -1376426 -1246182 -1070568 -981174 -1003316
32323 -1003316 -1030482 -1015701 -1071305 -1278194 -1513008 -1612015 -1607975 -1625405 -1623165 -1458674 -1165301
32312 -1165301 -933312 -818789 -702381 -558229 -524837 -643931 -747395 -697935 -561546 -453721
32302 -453721 -384774 -343955 -368722 -434708 -432159 -343183 -287808 -305231 -258701 -67816 132995
32291 132995 198194 170885 127209 -20704 -367904 -771353 -973998 -924804 -792894 -700769
$$ packed form
32364G43639j9252m8131j1844J5005p1201j56628j02221j2180k6763k5103J48549
32353D33870L21601K09157j11366k89844k05758n4156K5187P8043J07444L3550
32343E47728q6743q3902K7217K8043j56841l22422k86418j39518q0999j45162
32333f99017k09635j92472j32266r3156o3954J4074J30244J75614Q9394k2142
32323a003316k7166J4781n5604k06889k34814r9007M040j7430K240J64491K93373
32312a165301K31989J14523J16408J44152L3392j19094j03464M9460J36389J07825
32302d53721O8947M0819k4767o5986K549Q8976N5375j7423M6530J90885K00811
32291A32995O5199k7309m3676j47913l47200m03449k02645M9194J31910R2125
$$ plain form
32281 -700769 -629733 -579809 -622596 -734046 -735937 -519363 -239243 -158744 -318654 -479807 -437754
32270 -437754 -297826 -325848 -564787 -756300 -687715 -465353 -333735 -350015 -393435 -402580 -409808
32259 -409808 -388573 -272159 -119357 -67688 -109712 -107475 -51455 -98535 -298555 -488551 -547433
32248 -547433 -571337 -689809 -870076 -1013336 -1094875 -1097489 -955638 -693958 -488373 -453586
32238 -453586 -479809 -403088 -226878 -54804 75991 159941 143764 39810 10933 164802
32228 164802 346520 323359 115816 -54223 -115322 -232968 -513815 -810691 -906600 -773583
32218 -773583 -568025 -447404 -458461 -547522 -612975 -572784 -431912 -282540 -213119 -215511 -196836
32207 -196836 -92086 46247 101198 42957 -18525 25095 127166 140402 380 -216745
$$ packed form
32281g00769P1036M9924m2787j11450j891K16574K80120Q0499j59910j61153M2053
32270d37754J39928k8022k38939j91513O8585K22362J31618j6280m3420r145p228
32259d09808K1235J16414J52802N1669m2024K237N6020m7080k00020j89996n8882
32248e47433k3904j18472j80267j43260q1539k614J41851K61680K05585L4787
32238d53586k6223P6721J76210J72074J30795Q3950j6177j03954k8877J53869
32228A64802J81718k3161k07543j70039o1099j17646k80847k96876r5909J33017
32218g73583K05558J20621j1057q9061o5453M0191J40872J49372O9421k392J8675
32207a96836J04750J38333N4951n8241o1482M3620J02071J3236j40022k17125
$$ plain form
32197 -216745 -399435 -484698 -456343 -350940 -257376 -225452 -197986 -131015 -132474 -324872 -590256
32186 -590256 -649560 -438560 -218686 -233857 -421126 -558152 -544689 -421062 -246743 -106475
32176 -106475 -136263 -384791 -688991 -807294 -666732 -419595 -288710 -386789 -623782 -763335
32166 -763335 -645246 -366049 -149437 -59331 1163 19484 -151896 -472546 -624647 -422718
32156 -422718 -113472 -58288 -266647 -461063 -484268 -410647 -333902 -275192 -264407 -306021 -282687
32145 -282687 -77621 216823 377039 320749 150050 -42173 -224088 -297067 -132256 201134
32135 201134 414262 308392 8993 -192725 -166440 -36967 11614 -49816 -104550 -83124
32125 -83124 -70886 -165042 -290838 -293410 -195109 -187660 -327686 -424958 -329060 -158814 -118337
$$ packed form
32197b16745j82690q5263K8355J05403R3564L1924K7466O6971j459j92398k65384
32186e90256n9304K11000K19874j5171j87269j37026J3463J23627J74319J40268
32176a06475k9788k48528l04200j18303J40562K47137J30885r8079k36993j39553
32166g63335J18089K79197K16612R0106O0494J8321j71380l20650j52101K01929
32156d22718L09246N5184k08359j94416k3205P3621P6745N8710J0785m1614K3334
32145b82687K05066K94444J60216n6290j70699j92223j81915p2979J64811L33390
32135B01134K13128j05870k99399k01718K6285J29473M8581o1430n4734K1426
32125h3124J2238r4156j25796k572R8301P449j40026r7272R5898J70246M0477
$$ plain form
32114 -118337 -228219 -374011 -485135 -524459 -439550 -280148 -226231 -335760 -415007 -321658
32104 -321658 -219735 -293873 -387780 -247810 -4529 -33790 -365426 -608848 -524552 -324759
32094 -324759 -286904 -366479 -364350 -256895 -177340 -203823 -297576 -353700 -249478 35010 306799
32083 306799 326939 128096 -15754 9748 1300 -216507 -496161 -577416 -436376 -253727
32073 -253727 -147073 -101660 -91002 -110363 -128502 -125863 -151181 -249521 -371942 -439122 -458290
32062 -458290 -501222 -594500 -691697 -727905 -660673 -494563 -300971 -170592 -115530 -66989 4871
32051 4871 31782 -51379 -198590 -292087 -263184 -153995 -85353 -158793 -347171 -494705 -479806
32040 -479806 -356309 -262462 -218575 -118758 79221 266572 313400 201473 3325 -196499
$$ packed form
32114a18337j09882j45792j11124l9324Q4909J59402N3917j09529p9247R3349
32104c21658J01923p4138r3907J39970K43281k9261l31636k43422Q4296J99793
32094c24759L7855p9575K129J07455P9555k6483r3753n6124J04222K84488K71789
32083C06799K0140j98843j43850K5502q448k17807k79654q1255J41040J82649
32073b53727J06654M5413J0658j9361j8139K639k5318r8340j22421o7180j9168
32062d58290m2932r3278r7197l6208O7232J66110J93592J30379N5062M8541P1860
32051D871K6911q3161j47211r3497K8903J09189O8642p3440j88378j47534J4899
32040d79806J23497R3847M3887R9817J97979J87351M6828j11927j98148j99824
$$ plain form
32030 -196499 -335982 -391807 -380429 -315694 -196439 -74731 -57902 -153596 -198197 -71857 92513
32019 92513 85594 -51883 -88889 25441 82207 -50369 -221716 -222946 -54068 130541 219155
32008 219155 197610 104561 2869 -71345 -154311 -276244 -360629 -317773 -206409 -151272 -134284
31997 -134284 -57055 17426 -70010 -248749 -229745 67522 347729 328749 85851 -130938
31987 -130938 -226474 -250789 -229690 -174069 -136142 -122519 -65476 24127 26287 -66458 -79498 57403
31975 57403 140272 -18188 -287192 -399599 -309086 -177951 -115470 -114858 -167295 -262591 -333209
31964 -333209 -335258 -320620 -321493 -264673 -118379 -6468 -39241 -141270 -184608 -179961 -197841 -221004
31952 -221004 -220449 -253105 -332805 -335871 -197510 -66508 -87123 -159612 -106634 48504 162025
$$ packed form
32030a96499j39483n5825J1378O4735J19255J21708J6829r5694m4601J26340J64370
32019I2513o919j37477l7006J14330N6766j32576j71347j230J68878J84609Q8614
32008B19155k1545r3049j01692p4214q2966j21933q4385M2856J11364N5137J6988
31997a34284P7229P4481q7436j78739J9004K97267K80207j8980k42898k16789
31987a30938r5536k4315K1099N5621L7927J3623N7043Q9603K160r2745j3040J36901
31975E7403Q2869j58460k69004j12407R0513J31135O2481O12n2437r5296p0618
31964c33209k049J4638q73N6820J46294J11911l2773j02029m3338M647j7880k3163
31952b21004N55l2656p9700l066J38361J31002k0615p2489N2978J55138J13521
$$ plain form
31941 162025 200788 199492 126208 -1590 -19499 130237 206921 5354 -274536 -311439 -181262
31930 -181262 -218930 -441719 -518069 -312973 -68470 24538 68592 161125 177732 7066 -247638
31919 -247638 -437578 -531431 -514035 -338238 -74024 99386 134238 145063 143210 -10622 -300205
31908 -300205 -466709 -369680 -197506 -155942 -165764 -58604 112114 163345 55811 -105998
31898 -105998 -242194 -310686 -252809 -75038 91006 125206 39349 -112510 -320154 -523927
31888 -523927 -580860 -449304 -283179 -218054 -186175 -73272 67864 112074 63802 9928 -39322
31877 -39322 -110110 -146050 -86092 -149 2371 -48697 -39384 31645 48672 -44817 -180413 -268029
31865 -268029 -278155 -235632 -198470 -218542 -278480 -315106 -333738 -406587 -512535 -508476 -351828
$$ packed form
31941A62025L8763j296p3284j27798j7909J49736P6684k01567k79890l6903J30177
31930a81262l7668k22789p6350K05096K44503R3008M4054R2533J6607j70666k54704
31919b47638j89940r3853J7396J75797K64214J73410L4852J0825j853j53832k89583
31908c00205j66504R7029J72174M1564r822J07160J70718N1231j07534j61809
31898a05998j36196o8492N7877J77771J66044L4200q5857j51859k07644k03773
31888e23927n6933J31556J66125O5125L1879J12903J41136M4210m8272n3874m9250
31877c9322p0788l5940N9958Q5943K520n1068R313P1029J7027r3489j35596q7616
31865b68029j0126M2523L7162k0072n9938l6626j8632p2849j05948M059J56648
$$ plain form
31854 -351828 -219230 -267011 -380376 -322332 -60021 219027 363307 367027 261464 73269
31844 73269 -103809 -151276 -71811 22875 83180 155605 221295 143601 -133617 -425594 -464760
31833 -464760 -214300 61932 86901 -110504 -232141 -72708 240099 425582 377630 189322
31823 189322 -70566 -396815 -662699 -642349 -331568 -51270 -69947 -264672 -328314 -196808
31813 -196808 -74813 -106792 -221331 -286174 -255880 -162616 -81345 -92674 -177937 -189079 -34317
31802 -34317 157670 189781 61347 -69612 -145123 -250108 -408253 -521535 -541688 -532603 -513399
31791 -513399 -397772 -166490 28094 22274 -176046 -429037 -615089 -674293 -585754 -377888
31781 -377888 -131444 66632 152473 84843 -106840 -269685 -223654 39653 321135 419941
$$ packed form
31854c51828J32598m7781j13365N8044K62311K79048J44280L720j05563j88195
31844G3269j77078m7467P9465R4686O0305P2425O5690p7694k77218k91977l9166
31833d64760K50460K76232K4969j97405j21637J59433L12807J85483m7952j88308
31823A89322k59888l26249k65884K0350L10781K80298j8677j94725o3642J31506
31813a96808J21995l1979j14539o4843L0294R3264Q1271j1329q5263j1142J54762
31802c4317J91987L2111j28434j30959p5511j04985j58145j13282k0153R085J9204
31791e13399J15627K31282J94584n820j98320k52991j86052n9204Q8539K07866
31781c77888K46444J98076Q5841o7630j91683j62845M6031K63307K81482R8806
$$ plain form
31771 419941 322302 159838 49858 22099 46000 73049 76277 78494 119729 189491 230836
31760 230836 216965 172654 112158 21451 -73650 -90359 11023 156809 243049 260043 282294
31749 282294 348413 402513 365527 230385 61505 -85491 -206727 -299864 -311880 -193127
31739 -193127 2629 135921 123181 17482 -66611 -57766 52195 215631 320344 252126
31729 252126 23774 -218905 -365512 -440016 -485574 -461125 -344617 -234077 -218487 -230714
31719 -230714 -169865 -95491 -133846 -246696 -285262 -250111 -286347 -398933 -387459 -143496 164288
31708 164288 304183 241430 87660 -75026 -202466 -233231 -159755 -85081 -93669 -125891 -88284
31697 -88284 -25301 -53328 -159993 -203801 -115885 14737 82867 93852 96596 62650 -84553
$$ packed form
31771D19941r7639j62464j09980k7759K3901K7049L228K217M1235O9762M1345
31760B30836j3871m4311o0496r0707r5101j6709J01382J45786Q6240J6994K2251
31749B82294O6119N4100l6986j35142j68880j46996j21236r3137j2016J18753
31739a93127J95756J33292j2740j05699q4093Q845J09961J63436J04713o8218
31729B52126k28352k42679j46607p4504m5558K4449J16508J10540J5590j2227
31719b30714O0849P4374l8355j12850l8566L5151l6236j12586J1474K43963L07784
31708A64288J39895o2753j53770j62686j27440l0765P3476P4674q588l2222L7607
31697h8284O2983k8027j06665m3808Q7916J30622O8130J0985K744l3946j47203
$$ plain form
31686 -84553 -326621 -501493 -446373 -187747 54202 87228 -45919 -127399 -22737 179654
31676 179654 299824 274625 192694 160882 190450 213609 178058 107171 66047 77626 97069
31665 97069 79764 40061 11096 -16485 -58679 -64228 46034 250551 395667 329082 53011
31654 53011 -257979 -384340 -236801 59809 277870 312626 269029 301061 425622 547279
31644 547279 595754 551982 397739 151356 -78108 -180562 -171097 -137998 -105902 -55525 -26725
31633 -26725 -67495 -124165 -131018 -159048 -290149 -386526 -230480 89315 198077 -67179 -418340
31622 -418340 -506085 -340374 -166403 -108023 -122061 -165508 -213846 -206509 -136504 -109280 -178055
31611 -178055 -228334 -162248 -63755 -17356 83306 322190 488959 307234 -116711 -356546
$$ packed form
31686h4553k42068j74872N5120K58626K41949L3026j33147q1480J04662K02391
31676A79654J20170k5199q1931l1812K9568K3159l5551p0887m1124J1579J9443
31665I7069j7305l9703k8965k7581m2194n549J10262K04517J45116o6585k76071
31654E3011l10990j26361J47539K96610K18061L4756m3597L2032J24561J21657
31644E47279M8475m3772j54243k46383k29464j02454R465L3099L2096N0377K8800
31633b6725m0770n6670o853k8030j31101r6377J56046L19795J08762k65256l51161
31622d18340q7745J65711J73971N8380j4038m3447m8338P337P0005K7224o8775
31611a78055n0279O6086R8493M6399J00662K38884J66769j81725m23945k39835
$$ plain form
31601 -356546 -187493 198307 515596 677184 708216 611605 432834 286757 215143 146886
31591 146886 61864 44328 108333 136488 83014 71816 169776 213168 20873 -322293 -561911
31580 -561911 -593075 -526640 -468530 -390736 -245782 -90412 -33242 -106194 -228569 -287658 -238614
31569 -238614 -116121 49308 273639 515670 582253 285823 -259820 -641861 -566918 -204725
31559 -204725 11451 -109466 -346007 -405781 -288901 -212668 -259521 -261766 -76404 159272
31549 159272 188607 7079 -111290 -10971 107627 -2991 -236147 -267963 -32168 202469
$$ packed form
31601c56546J69053L85800L17289J61588L1032r6611j78771j46077p1614o8257
31591A46886q5022j7536O4005K8155n3474j1198R7960M3392j92295l43166k39618
31580e61911l1164O6435N8110P7794J44954J55370N7170p2952j22375n9089M9044
31569b38614J22493J65429K24331K42031O6583k96430n45643l82041P4943L62193
31559b04725K16176j20917k36541n9774J16880P6233m6853k245J85362K35676
31549A59272K9335j81528j18369J00319J18598j10618k33156l1816K35795K34637
$$ [...]
##END NTUPLES=NMR SPECTRUM
##END=
