##TITLE=31Pdec_PATFAA
 CDCl3, 24 sc
 19.4.2023
##JCAMPDX= 6.0         $$ Bruker NMR JCAMP-DX V2.0
##DATA TYPE= NMR SPECTRUM
##DATA CLASS= NTUPLES
##ORIGIN= UXNMR, Bruker Analytische Messtechnik GmbH
##OWNER= root
$$ XWIN-NMR		Version 3.5
$$ Wed Apr 19 13:42:48 2023 Russian Standard Time (UT+4h)  she@DPX200
##.OBSERVE FREQUENCY= 81.013821
##.OBSERVE NUCLEUS= ^31P
##.ACQUISITION MODE= SIMULTANEOUS
##.ACQUISITION SCHEME= undefined
##.AVERAGES= 24
##.DIGITISER RES= 16
##SPECTROMETER/DATA SYSTEM= spect
##.PULSE SEQUENCE= zgpg30
##.SOLVENT NAME= CDCl3
##.SHIFT REFERENCE= (INTERNAL, CDCl3, 0, 248.564)
##AUDIT TRAIL= $$ (NUMBER, WHEN, WHO, WHERE, WHAT)
$$ ##TITLE= Audit trail, XWIN-NMR		Version 3.5
$$ ##JCAMPDX= 5.01
$$ ##ORIGIN= Bruker BioSpin GmbH
$$ ##OWNER= she
$$ F:/spectra/data/she/nmr/P31/1/pdata/1/auditp.txt
$$ ##AUDIT TRAIL=  $$ (NUMBER, WHEN, WHO, WHERE, WHAT)
(   1,<2023-04-19 13:41:57.60 +0400>,<she>,<DPX200>,
      <created by zg, POWCHK disabled, PULCHK disabled
       configuration hash MD5:
       00 E9 B6 7A A2 85 ED C7 34 08 36 98 17 FE 4E 26
       data hash MD5: 32K
       75 17 24 12 E3 AA B0 0D 32 20 BB 0C 1F 05 98 25>)
(   2,<2023-04-19 13:41:59.95 +0400>,<she>,<DPX200>,
      <Start of raw data processing
       efp BC_mod = 2 LB = 1 FT_mod = 6 PKNL = 1 PHC0 = -11184 PHC1 = 535.8849 SI = 64K 
       data hash MD5: 64K
       CB AB A5 EE F0 DC 47 BF 21 47 AA 13 9D F0 5D 53>)
(   3,<2023-04-19 13:42:23.40 +0400>,<she>,<DPX200>,
      <pk PHC0 = 210.7098 PHC1 = -451.6 
       data hash MD5: 64K
       9A 15 7E 63 7B 2B 14 F8 2C C9 D8 C5 44 25 1D 70>)
(   4,<2023-04-19 13:42:26.90 +0400>,<she>,<DPX200>,
      <abs ABSG = 5 
       data hash MD5: 64K
       99 D8 23 DD CA 17 06 E0 A4 47 CB 68 CB 4E E6 14>)
$$ ##END=
$$ 
$$ hash MD5
$$ A3 21 A4 44 7B D8 AC 50 24 94 EA CD C5 85 8A 43
##$RELAX= 
##$RELAX= 
##$RELAX= 
##$RELAX= 
##$RELAX= 
##$RELAX= 
##$RELAX= 
##$RELAX= 
##$RELAX= 
$$ Bruker specific parameters
$$ --------------------------
##$DU= <F:/spectra>
##$EXPNO= 1
##$NAME= <P31>
##$PROCNO= 1
##$TYPE= <nmr>
##$USER= <she>
##$AMP= (0..31)
100 100 100 100 100 100 100 100 100 100 100 100 100 100 100 100 100 100 
100 100 100 100 100 100 100 100 100 100 100 100 100 100 
##$AQSEQ= 0
##$AQ_mod= 1
##$AUNM= <au_zg>
##$AUTOPOS= <>
##$BF1= 81.014009
##$BF2= 200.13
##$BF3= 200.13
##$BF4= 200.13
##$BF5= 200.13
##$BF6= 200.13
##$BF7= 200.13
##$BF8= 200.13
##$BYTORDA= 1
##$CFDGTYP= 0
##$CFRGTYP= 5
##$CHEMSTR= <none>
##$CNST= (0..31)
1 1 145 1 1 1 1 1 1 1 1 1 1 1 1 1 1 1 1 1 1 1 1 1 1 1 1 1 1 1 1 1 
##$CPDPRG= <waltz16>
##$CPDPRG1= <>
##$CPDPRG2= <waltz16>
##$CPDPRG3= <>
##$CPDPRG4= <mlev>
##$CPDPRG5= <mlev>
##$CPDPRG6= <mlev>
##$CPDPRG7= <mlev>
##$CPDPRG8= <mlev>
##$CPDPRGB= <>
##$CPDPRGT= <>
##$D= (0..31)
0 1 0 0 0 0 0 0 0 0 0 0.03 2e-05 3e-06 0 0 0 0 0 0 0 0 0 0 0 0 0 0 0 0 
0 0 
##$DATE= 1681897317
##$DBL= (0..7)
120 120 120 11 120 120 24 19 
##$DBP= (0..7)
150 150 150 150 150 150 150 150 
##$DBP07= 0
##$DBPNAM0= <>
##$DBPNAM1= <>
$$ [...]
##$SUBNAM3= <"">
##$SUBNAM4= <"">
##$SUBNAM5= <"">
##$SUBNAM6= <"">
##$SUBNAM7= <"">
##$SUBNAM8= <"">
##$SUBNAM9= <"">
##$SW= 501.771253377433
##$SWIBOX= (0..15)
0 1 3 0 0 0 0 0 0 0 0 0 0 0 0 0 
##$SW_h= 40650.406504065
##$TD= 32768
##$TD0= 1
##$TE= 0
##$TE2= 300
##$TE3= 300
##$TEG= 300
##$TL= (0..7)
0 120 53 12 22 120 120 120 
##$TP= (0..7)
150 150 150 150 150 150 150 150 
##$TP07= 0
##$TPNAME0= <>
##$TPNAME1= <>
##$TPNAME2= <>
##$TPNAME3= <>
##$TPNAME4= <>
##$TPNAME5= <>
##$TPNAME6= <>
##$TPNAME7= <>
##$TPOAL= (0..7)
0.5 0.5 0.5 0.5 0.5 0.5 0.5 0.5 
##$TPOFFS= (0..7)
0 0 0 0 0 0 0 0 
##$TUNHIN= 0
##$TUNHOUT= 0
##$TUNXOUT= 0
##$USERA1= <user>
##$USERA2= <user>
##$USERA3= <user>
##$USERA4= <user>
##$USERA5= <user>
##$V9= 5
##$VALIST= <valist>
##$VCLIST= <CCCCCCCCCCCCCCC>
##$VD= 0
##$VDLIST= <DDDDDDDDDDDDDDD>
##$VPLIST= <PPPPPPPPPPPPPPP>
##$VTLIST= <TTTTTTTTTTTTTTT>
##$WBST= 1024
##$WBSW= 4
##$XGAIN= (0..3)
0 0 0 0 
##$XL= 0
##$YL= 0
##$YMAX_a= 7659
##$YMIN_a= -11348
##$ZGOPTNS= <>
##$ZL1= 120
##$ZL2= 120
##$ZL3= 120
##$ZL4= 120
##$ABSF1= 248.5645
##$ABSF2= -253.2056
##$ABSG= 5
##$ABSL= 3
##$ALPHA= 0
##$AQORDER= 0
##$ASSFAC= 0
##$ASSFACI= 0
##$ASSFACX= 0
##$ASSWID= 0
##$AUNMP= <proc_1d>
##$AZFE= 0.1
##$AZFW= 0.5
##$BCFW= 0
##$BC_mod= 2
##$BYTORDP= 0
##$COROFFS= 0
##$CY= -3
##$DATMOD= 1
##$DC= 0
##$DFILT= <>
##$DTYPP= 0
##$F1P= 0
##$F2P= 0
##$FCOR= 1
##$FTSIZE= 65536
##$FT_mod= 6
##$GAMMA= 0
##$GB= 0
##$INTBC= 1
##$INTSCL= 6.047779e-11
##$ISEN= 30
##$LB= 1
##$LEV0= 0
##$LPBIN= 0
##$MAXI= 10000
##$MC2= 0
##$MEAN= 0
##$ME_mod= 0
##$MI= 50
##$NCOEF= 0
##$NC_proc= -7
##$NLEV= 6
##$NOISF1= 182.463
##$NOISF2= 159.3651
##$NSP= 0
##$NTH_PI= 0
##$NZP= 0
##$OFFSET= 248.5645
##$PC= 4
##$PHC0= -10973.29
##$PHC1= 84.28488
##$PH_mod= 1
##$PKNL= yes
##$PPARMOD= 0
##$PSCAL= 0
##$PSIGN= 0
##$REVERSE= no
##$SF= 81.0140089999694
##$SI= 65536
##$SIGF1= 159.3651
##$SIGF2= -187.1042
##$SINO= 113.3802
##$SIOLD= 16384
##$SREGLST= <1H.CDCl3>
##$SSB= 0
##$STSI= 65536
##$STSR= 0
##$SW_p= 40650.406504065
##$SYMM= 0
##$S_DEV= 0
##$TDeff= 32768
##$TDoff= 0
##$TI= <>
##$TILT= no
##$TM1= 0
##$TM2= 0
##$TOPLEV= 0
##$USERP1= <user>
##$USERP2= <user>
##$USERP3= <user>
##$USERP4= <user>
##$USERP5= <user>
##$WDW= 1
##$XDIM= 65536
##$YMAX_p= 321657539
##$YMIN_p= -25504848
$$ End of Bruker specific parameters
$$ ---------------------------------
##NTUPLES= NMR SPECTRUM
##VAR_NAME=  FREQUENCY,     SPECTRUM/REAL,   SPECTRUM/IMAG
##SYMBOL=    X,             R,               I
##VAR_TYPE=  INDEPENDENT,   DEPENDENT,       DEPENDENT
##VAR_FORM=  AFFN,          ASDF,            ASDF
##VAR_DIM=   65536,         65536,           65536
##UNITS=     HZ,            ARBITRARY UNITS, ARBITRARY UNITS
##FACTOR=    0.620285442955139, 1,           1
##FIRST=     20137.2065510682, 0,            0
##LAST=      -20513.1999529968, 0,           0
##MIN=       -20513.1999529968, -25504848,   0
##MAX=       20137.2065510682, 321657539,    0
$$ Real data points
##PAGE= N=1
##DATA TABLE= (X++(R..R)), XYDATA
$$ [...]
40788D071131O32958j91138j654398k310359j311851M20581J261310P51609k46681
40779A423162r85938j448504j494853n81511J090561K120032J472834j33738j238517
40770B23528j430833j266670j007622n05415R9299N96806J183844J739849J346317
40761I79103j96804j252696m87859P30592L40729p68389r3742J816127J721572
40752B788633p43281j947771k46864J108018l59586j841543j71317K287385J492933
40743B366607j180980j229720J240833K020528M04074j7445J331033M30867l640572
40734A725225n620193k041640K847514L336392L46083j280179m09044L38204O0815
40725f96823K09051P28077m0895j814038k345614j040973L47956O73262N17835
$$ plain form
40788 4071131 4704089 4512951 2858553 548194 -763657 -343076 918234 1669843 1423162
40779 1423162 437224 -1011280 -2506133 -3087644 -1997083 122949 1595783 1462045 223528
40770 223528 -1207305 -2473975 -3481597 -3987012 -3887713 -3290907 -2107063 -367214 979103
40761 979103 782299 -470397 -958256 -227664 113065 -655324 -749066 1067061 2788633
40752 2788633 2045352 97581 -149283 958735 599149 -1242394 -1413711 873674 2366607
40743 2366607 1185627 -44093 1196740 3217268 3621342 3603897 4934930 5365797 1725225
40734 1725225 -3894968 -5936608 -3089094 247298 593381 -686798 -1095842 -757638 -696823
40725 -696823 -487772 240305 199410 -1614628 -3960242 -5001215 -4653259 -3979997 -3462162
40716c462162M35995K94375K28014L85450J75944n53747n56068P38375J527936
40707g85888L44851j012481j11514J845210J719610m66069j725656j025599l55465
40698a573001p64700q67771R4893Q72382P01786M67691O36839N22035J72432N65191
40688H27777J429749J267159o8820j129720j367907j459388j237715m9132J027674
40679g60323M49201n09346O37093K736514J993747j695978l989703k787745r51584
40670d878124o81732j60578J702969K154990l00354k171787n02837J838031J062423
40661a936999q58113J62318K692183J904167j996730l643257r18156K099617J786998
40652g07972j68785n24299N97377R62977M9599o70475j41759J072727J538223
$$ plain form
40716 -3462162 -3026167 -2731792 -2503778 -2118328 -1942384 -2496131 -3052199 -2313824 -785888
40707 -785888 -441037 -1453518 -1565032 280178 1999788 1533719 -191937 -1217536 -1573001
40698 -1573001 -2337701 -3205472 -3110579 -2238197 -1536411 -1068720 -431881 90154 262586 827777
40688 827777 2257526 3524685 3455865 2326145 958238 -501150 -1738865 -1787997 -760323
40679 -760323 -311122 -820468 -183375 2553139 4546886 2850908 -1138795 -3926540 -4878124
40670 -4878124 -5559856 -5720434 -4017465 -1862475 -2162829 -4334616 -4837453 -2999422 -1936999
40661 -1936999 -2795112 -2632794 59389 1963556 -33174 -3676431 -4594587 -2494970 -707972
40652 -707972 -876757 -1401056 -803679 159298 208897 -461578 -603337 469390 2007613
40643B007613L61874j719365k783269j820896J03105J388920J663698J269855
40635D71535L97808j95547O74546K313487J981592j014016l238129j735365J383797
40626A039708K180460Q08164K86674P74611l22881k913413l617674j311759R43568
40617b132542Q11939j21798L01988J363870J239960j01229j454816k065840j594367
40608c752835n1859J420282J377597K06675k85695L88612J045330J182624J312371
40599B843102R90205o89360k526401k261296m52348J56019m43989O42152L390527
40590A648611L564995m05330l713230j872122K463181L557576Q67134j257360
40582D853455o14096N87648K03180r15365j039083l6556R00093N53943j253529
$$ plain form
40643 2007613 2369487 650122 -2133147 -3954043 -3850938 -2462018 -798320 471535
40635 471535 869343 673796 1348342 3661829 5643421 4629405 1391276 -344089 1039708
40626 1039708 3220168 4028332 4315006 5089617 4766736 1853323 -1764351 -3076110 -2132542
40617 -2132542 -1320603 -1442401 -1140413 223457 1463417 1362188 -92628 -2158468 -3752835
40608 -3752835 -3804694 -2384412 -1006815 -800140 -1085835 -697223 348107 1530731 2843102
40599 2843102 3833307 3143947 617546 -1643750 -2096098 -1940079 -2384068 -1741916 1648611
40590 1648611 5213606 4808276 1095046 -777076 1686105 5243681 6110815 4853455
40582 4853455 4239359 4827007 5030187 4114822 3075739 3039183 3939276 4493219 3239690
40573C239690k953481k423909J35028J948975J465330M41141O30485P81547o47377
40564B617429k099402j370378M32314Q19887K62491R07787K223600J925407M18326
40555F137461J35656Q97582K54625j641580k048002q29208q77467k466420k205236
40546b642589O86815K146533n542j890498J79425L396627K947789l13872j717923
40537B786765k95830O94244j67512q23451j87019K20756k72173k87889L95242
40528B063133m3077j917023k811376j400153M10082Q22108Q67337J756734K113273
40519A861038N06120j253850m53517K010541K588446K42532k213852k271999p26685
40510B88774L05011L27148J95947K83577K33636j34752o39917j031046r04436
$$ plain form
40573 3239690 286209 -2137700 -2002672 -53697 1411633 1852774 2483259 3264806 2617429
40564 2617429 518027 -852351 -420037 399850 662341 1570128 3793728 5719135 6137461
40555 6137461 6273117 7170699 7425324 5783744 3735742 2906534 2029067 -437353 -2642589
40546 -2642589 -1955774 190759 185217 -1705281 -1525856 1870771 4818560 4504688 2786765
40537 2786765 2490935 3185179 3017667 2194216 2007197 2227953 1955780 1667891 2063133
40528 2063133 2020056 103033 -2708343 -4108496 -3698414 -2876306 -2008969 -252235 1861038
40519 1861038 2367158 1113308 659791 2670332 5258778 5501310 3287458 1015459 288774
40510 288774 593785 920933 1116880 1400457 1634093 1499341 859424 -171622 -1076058
40501a076058R2723J433289J791210O99459n05202l53071O07468N50070q19083
40492B420805j586537l33999J666020K097737P73228l17279n4431L65426k94985
40483D735985j169252r00155k72803j082762k738313k516176K34975K631195K318131
40474A240825P23215K91962N88840q0143q50403K47146J848697N53002l004496
40465A558645l884229k95102K980578J512364k101240k462305L93018J759002
40457e39269n2859j760607r18489Q72182J615183J886705K481944K291667N46518
40448F422975j266216j694751j549380k027849k409077j466798K95940J556775
40440b138381K060050K119570J555747N20161l0917l2898q34596k539600k799722
$$ plain form
40501 -1076058 -983335 449954 2241164 2940623 2435421 2082350 2689818 3239888 2420805
40492 2420805 834268 500269 2166289 4264026 5037254 4719975 4665544 5030970 4735985
40483 4735985 3566733 2666578 2393775 1311013 -1427300 -3943476 -3708501 -1077306 1240825
40474 1240825 1964040 2256002 2844842 2764699 1914296 2161442 4010139 4563141 1558645
40465 1558645 -2325584 -2620686 359892 1872256 -228984 -2691289 -2298271 -539269
40457 -539269 -592128 -2352735 -3271224 -2399042 -783859 1102846 3584790 5876457 6422975
40448 6422975 5156759 3462008 1912628 -115221 -2524298 -3991096 -3695156 -2138381
40440 -2138381 -78331 2041239 3596986 4117147 4086230 4053332 3218736 679136 -2120586
40431b120586l12449K364173K064035m25330j853900j339702o54993n47817o4034
40422b890603P74483Q27097M22802J042720K213523J780200l06338j558458r24011
40413A381415o1902J21579Q08179J921892J077758k110138m076586k343376M49882
40404b831297O72245p09188k96869J932730L004615K014735Q29052J60052j161701
40395C614374k814553k573115j09051J911795J615909J97841o00421q17559r55171
40386e29951o12554K99744R11627J010064J408024J893279J090497o63905r96674
40377C810151M81183P49158j787084l887176k063289J737013K926017J237452
40369C203425M52769J642869J475081j705702m459317l266860K09072J774967
$$ plain form
40431 -2120586 -2433035 -68862 1995173 1569843 -284057 -1623759 -2278752 -2826569 -2890603
40422 -2890603 -2116120 -1289023 -866221 176499 2390022 4170222 3863884 2305426 1381415
40413 1381415 1319513 1441092 2249271 4171163 5248921 3138783 -937803 -3281179 -2831297
40404 -2831297 -2159052 -2868240 -3165109 -1232379 1772236 3786971 4616023 4776075 3614374
40395 3614374 799821 -1773294 -1882345 29450 1645359 1843200 1242779 425220 -529951
40386 -529951 -1142505 -842761 68866 1078930 2486954 4380233 5470730 4806825 3810151
40377 3810151 4291334 5040492 3253408 -633768 -2697057 -960044 1965973 3203425
40369 3203425 3656194 5299063 6774144 5068442 609125 -2657735 -2448663 -673696
40361f73696N97113n38489J35686J254212Q78170q35142k065323j442767N73799
40352b116437K044972J462355m79588j623093j023560J73244Q40475J254925J509241
40343B042534M59177j991765l256473j253546J850251K080309n68765k091634
40335b729912n66738J204696N34895r79030n67868J018934J109372k35933o12902
40326a824486M23425Q93410K07589P1488R48201Q85780q10659j778569m51522
40317a435343R76746Q1721j494136o02933J921828K162664p20634l020654k031194
40308d161935K83326Q27169j46351l41282P04604J518761J396312R53919N61833
40299A596356J61681K48443J234117K095787J408621l55910j233448n39242L42253
$$ plain form
40361 -673696 -76583 -615072 -479386 774826 1652996 817854 -1247469 -2690236 -2116437
40352 -2116437 -71465 1390890 911302 -711791 -1735351 -1562107 -721632 533293 2042534
40343 2042534 2501711 509946 -2746527 -4000073 -2149822 -69513 -638278 -2729912
40335 -2729912 -3296650 -2091954 -1557059 -2536089 -3103957 -2085023 -975651 -1211584 -1824486
40326 -1824486 -1401061 -507651 -300062 -228574 719627 1605407 794748 -983821 -1435343
40317 -1435343 -458597 -376876 -1871012 -2473945 -552117 1610547 889913 -2130741 -4161935
40308 -4161935 -3878609 -3051440 -3197791 -3539073 -2834469 -1315708 80604 1034523 1596356
40299 1596356 1758037 2006480 3240597 5336384 6745005 6389095 5155647 4616405 4958658
40290D958658J48973p57481j424590j531664j194965o56045m04463n92443m00746
40281a854766P48281J645556P94150p07270k50969J899848K247387n77595l043526
40272I01096j709141J462196K002665m58452k182847j246880L65009Q81497J226169
40263A241312K126839K026633m2903j959477j301885R88579K065423J108064m52218
40254E800367j646607k441419k091822K36452L044639L307925N21977k242693
40246D488819k436610j181726q19781j151421l68121J371705J956655Q02168j78690
40237B482998K94435R41995K91322q43486q81928j14084J64917K34221J278849
40228C849239K437890J290051j945139l345109l43529M007021M442343L43877
$$ plain form
40290 4958658 5107631 4350150 2925560 1393896 198931 -457114 -861577 -1454020 -1854766
40281 -1854766 -1106485 539071 1333221 625951 374982 2274830 4522217 3944622 901096
40272 901096 -808045 654151 2656816 2198364 15517 -1231363 -866354 15143 1241312
40263 1241312 3368151 5394784 5351881 3392404 2090519 3079098 5144521 6252585 5800367
40254 5800367 4153760 1712341 -379481 -143029 2901610 6209535 6731512 4488819
40246 4488819 2052209 870483 50702 -1100719 -1468840 -97135 1859520 2661688 2482998
40237 2482998 2777433 3719428 4010750 3167264 2285336 2171252 2336169 2570390 3849239
40228 3849239 6287129 7577180 5632041 2286932 1943403 5950424 10392767 10736644
40220A0736644l591306l646468j284131L3691k65101l38692K59469R8444j024133
40211I78417j204555M98566K231479J961241L68824n36727n34320r14531j723564
40202A124830j526909J4338J419445J702819J487806J152568q7569k093633k774907
40193D18788q89030J645584K173264Q39853k92132n31652o26899m35334P74310
40184C076752K077104J715394J67953l34766M63659N36654n09603m33284J538830
40175H298693K759550J214294j178785j565611j37034J312056K663269M440034
40167A7806466N153953K947626q53365k778720j618456N51421J509981R27415
40159B3646321m67617j688029j613355j37312J064221N40474p41154r51036k77126
$$ plain form
40220 10736644 7145338 3498870 2214739 2248430 1983329 1644637 1904106 2002550 978417
40211 978417 -226138 272428 2503907 4465148 4833972 4297245 3762925 2848394 1124830
40202 1124830 -402079 -387741 1031704 2734523 4222329 5374897 5287328 3193695 418788
40193 418788 -470242 1175342 3348606 4188459 3896327 3364675 2737776 2302442 3076752
40184 3076752 5153856 6869250 7037203 6702437 7166096 7702750 7193147 6759863 8298693
40175 8298693 11058243 12272537 11093752 9528141 9391107 10703163 13366432 17806466
40167 17806466 22960419 25908045 25054680 22275960 20657504 21208925 22718906 23646321
40159 23646321 23178704 21490675 19877320 19740008 20804229 21344703 20603549 19652513 19375387
40150A9375387j08164k16918O42083J883522J661701J20912o84619j19147M99274
40141B3054031O57395R88050P73349j522387m622980m870087j540532J566390
40133A4483229J492612q5074m45145j17270q56812j859184j258240K02791K29498
40124A1786405j157253j766698r12073k87712j009682j948499j544136J94284
40116C354636J994282K674283J922196L88591q34306j129034o77877O8862O96821
40107H458454P09393L5209m14677R9810N76122m19703j805331o82635L206436
40098I763078O134708N051139J574875n64922m18033P3549k76700n43238K24870
40089B1019326J382630J483657p2249k188139k776545r74984J469057K236622
$$ plain form
40150 19375387 19267223 19050305 19692388 21575910 23237611 23358523 22673904 22554757 23054031
40141 23054031 23711426 24699476 25472825 23950438 19327458 14457371 12916839 14483229
40133 14483229 15975841 15890767 15445622 15328352 14471540 12612356 11354116 11556907 11786405
40124 11786405 10629152 8862454 7950381 7662669 6652987 4704488 3160352 3354636
40116 3354636 5348918 8023201 9945397 10333988 9499682 8370648 7692771 7761633 8458454
40107 8458454 9167847 9203056 8788379 8888189 9464311 9044608 7239277 6556642 9763078
40098 9763078 15897786 20948925 22523800 21958878 21540845 21614394 21337694 20794456 21019326
40089 21019326 22401956 23885613 23813364 21625225 18848680 17873696 19342753 21579375
40081B1579375J569149J435875J833746Q30161j269542j336535J513980L776536
40073B9932745K764105O98407P26211J899899J672875Q28404J812807L908464
40065D4243917M223918K415196N82554o39114k141728l293258k652484j248974
40057D1490027j458919k936962l181992j753210m13829L45236J166758R27984
40049C4185093j715047m353610l185463O51622K193878N24229k3811K248880L204825
40040C3730596N3059l694251l910995j922308j023919q88357L21964J490604O50165
40031B4806558q69549o93861J11855r97520l117423l147485j048275J99653n01397
40022A4742556j236273q58607m78204p31064n35064O21362J448368Q05838o75105
$$ plain form
40081 21579375 23148524 24584399 26418145 27248306 25978764 24642229 26156209 29932745
40073 29932745 32696850 33395257 34121468 36021367 37694242 38522646 40335453 44243917
40065 44243917 48467835 50883031 51465585 50826471 48684743 45391485 42739001 41490027
40057 41490027 40031108 37094146 33912154 32158944 31745115 32090351 33257109 34185093
40049 34185093 32470046 28116436 24930973 25582595 27776473 28300702 28276891 30525771 33730596
40040 33730596 33783655 30089404 26178409 24256101 23232182 22343825 22665789 24156393 24806558
40031 24806558 23937009 23243148 23355003 22357483 19240060 16092575 15044300 15243953 14742556
40022 14742556 13506283 12647676 12169472 11438408 10903344 11524706 12973074 13778912 13103807
40013A3103807j515900q96010Q31892K244173J857333k4135j222043n42352L72637
40004A4209402m35360k038645k015125k65643Q92384K55966q30614q45798o6677
39995H859890L92575K02650j59685k62473j37201j00893j98175J19049J214033
39986I929770K206790J704165k10679j883195k222575j567653k69198J687538
39978I374963L188338K436648q2798j429388l93561N28382q10640k517644j498282
39969H796018J767251L927143L152255N75527j786874k665915j912613p02389
39961A1150403m38609o32944M29418K250415K038028p20766k804303k156854p53814
39952H360974l82953M13214K259437K291103m32080j432962K128037N328388K781358
$$ plain form
40013 13103807 11587907 10691897 11523789 13767962 15625295 15601160 14379117 13836765 14209402
40004 14209402 13774042 11735397 9720272 9454629 10347013 10602979 9772365 8926567 8859890
39995 8859890 9252465 9455115 9295430 9032957 8895756 8794863 8596688 8715737 9929770
39986 9929770 12136560 13840725 13630046 11746851 9524276 7956623 7687425 9374963
39978 9374963 12563301 14999949 14917151 13487763 13094202 13622584 12811944 10294300 8796018
39969 8796018 10563269 14490412 17642667 18218194 16431320 13765405 11852792 11150403
39961 11150403 10711794 10078850 10508268 12758683 14796711 14075945 11271642 9114788 8360974
39952 8360974 7978021 8391235 10650672 12941775 12509695 11076733 13204770 18533158 21314516
39943B1314516j860748j286429L567387N503879L189369K224489M628674O553998
39935D3835135P104137R984426J4501576J4198519P544755J541268J435069N174815
39927A05319700J1089370K1086068L1177200K9340958J1068103j1004179k1378830
39920A76698390j8455556r024391M847013K1313998K8407677J4219029j3666839
39913B04339321l2937003l2255255k0655532j0324241l048043K335913J836331
39906A09291491o270866j4578814j5467980j1276281q657644p953002n356155
39899C9730749j535843m59215j896250k055636n55484n51637k353003k627950
39891B7695731l55502J426565P58097n89325q21849q06333j439828j404905M23949
$$ plain form
39943 21314516 19453768 18167339 21734726 27238605 30427974 32652463 37281137 43835135
39935 43835135 50939272 60923698 75425274 89623793 97168548 98709816 100144885 105319700
39927 105319700 116409070 137495138 168672338 198013296 209081399 198077220 176698390
39920 176698390 158242834 149218443 154065456 175379454 203787131 218006160 204339321
39913 204339321 171402318 139147063 118491531 108167290 105119247 107455160 109291491
39906 109291491 103020625 88441811 72973831 61697550 53039906 45086904 39730749
39899 39730749 38194906 37735691 35839441 33783805 33228321 32676684 30323681 27695731
39891 27695731 27340229 28766794 29524891 28935566 28113717 27307384 25867556 24462651 24886600
39882B4886600K472066K393648K46197j875103k495520j707524j52887J529223
39874B5296700K386371J502900q69162l050622l296881j443843Q96840J763894
39866B3186197N22158j624847k650504j542883N25889J194624l72882k192717
39858A7045035j855237J38993R76189m62037k096857j852992m07775M74854N33771
39849A2493944L77510l9488n27154Q5942J815633K402342O70026q95598J37582
39840A6520739J756074O09939j968845j687991J505638K980853P70866j518359
39832A8968914o98665J489552K061744J281779R81884J419418K253187M112551
39824C1870364O928980Q851981Q648143P152480N284146L425868L632978Q325573
$$ plain form
39882 24886600 27358666 29752314 29998511 28123408 25627888 23920364 23767477 25296700
39874 25296700 27683071 29185971 28316809 25266187 21969306 20525463 21422303 23186197
39866 23186197 23708355 22083508 19433004 17890121 18416010 19610634 19237752 17045035
39858 17045035 15189798 15328791 16304980 15842943 13746086 11893094 11485319 11960173 12493944
39849 12493944 12871454 12831966 12304812 12390754 14206387 16608729 17278755 16383157 16520739
39840 16520739 18276813 18886752 16917907 15229916 16735554 19716407 20487273 18968914
39832 18968914 18270249 19759801 21821545 23103324 24085208 25504626 27757813 31870364
39824 31870364 38799344 47651325 56299468 63451948 68736094 72161962 75794940 84120513
39816H4120513J4764326J5368479P105982l066135o147090j563466M173683O231859
39808A20988151M346896l03000n720081q213954o260719m314549p630819j3981199
39800G8910726j5976140j1569148o523537n487377o252654n046663k585870j628512
39792B3840825k014282j591061l0383J109251R42576n4976j014471j167552l29133
39783A9690794N41187M00564k31746k82361m13861j930499l605473k664487O37034
39774A2141152K630768J381848q73026j645172j440846j501862j316036l99828
39766H976998O7618n00606n93796O02235J324776L34468n87280K17517J032412
39757A0874342l38612k453031k362092l97248O13457l5156m81635K1048K74254
$$ plain form
39816 84120513 98884839 114253318 121359300 118293165 112146075 110582609 114756292 120988151
39808 120988151 125335047 125032047 119311966 111098012 104837293 100522744 92891925 78910726
39800 78910726 62934586 51365438 44841901 39354524 33101870 28055207 25469337 23840825
39792 23840825 21826543 20235482 20205099 21314350 22256926 22201950 21187479 20019927 19690794
39783 19690794 20231981 20632545 20400799 20118438 19704577 17774078 14168605 11504118 12141152
39774 12141152 14771920 16153768 15280742 13635570 12194724 10692862 9376826 8976998
39766 8976998 9044616 8544010 7950214 8552449 9877225 10211693 9624413 9841930 10874342
39757 10874342 10535730 8082699 5720607 5323359 5936816 5901660 5420025 5441073 5715327
39748E715327j4941M38401J899050K863707K477007J686384J592222K375922L933512
39739B2966591N724572O066674L839948J232101K386390Q153874J3876200J3834219
39731G8080569P280037o44551l512171R54059R045049J4103421J1859703L331521
39723A20497637o787295j3399186j3002201n454562M036391O934451p85169j2951938
39715G9088128j8563876j3446442m074337O35688j504720o007096q049031o589971
39707B1488343l733111k083250k352229k725555j215502J263653J709398p04464
39699A1647283l190527l139871j353635q2330L15500R23710J878922K342751J915655
39690A1257458N51265j805906m003279l641790l18637K549970J757337r66012
$$ plain form
39748 5715327 5700386 6138787 8037837 10901544 13378551 15064935 16657157 19033079 22966591
39739 22966591 28691163 34757837 38597785 39829886 42216276 50370150 64246350 78080569
39731 78080569 85360606 84716055 81203884 82157943 91202992 105306413 117166116 120497637
39723 120497637 113710342 100311156 87308955 81854393 85890784 92825235 92040066 79088128
39715 79088128 60524252 47077810 43003473 43639161 42134441 36127345 28078314 21488343
39707 21488343 17755232 15671982 13319753 10594198 9378696 10642349 12351747 11647283
39699 11647283 8456756 5316885 3963250 3880920 4196420 5120130 6999052 9341803 11257458
39690 11257458 11808723 10002817 5999538 2357748 2039111 4589081 6346418 5380406
39682E380406j304051J238979K815728J271054r81298j254252l87748k96873n05463
39673E976482L02441J224332M43465j479253k214085j082376L43574Q10286N77911
39664D902777J42423m24616p99063o41771n26807j128274j572590l24990K152079
39655A779168L410569K128581l48631k020306k253910j369998J06490J113092
39647B545055O25186o23287o26534Q26465J422863j33211j811066j242480P17129
39638A700120J599047J096288P30520P50658J38833p53733m35029P92050Q79479
39629F498233m95194j167609j07294P22340m42943k259967k404166j015986j2907
39620f85493Q710J49298R40414J550790J309913N97808o0643p15289j403871j612100
$$ plain form
39682 5380406 4076355 5315334 8131062 9402116 8420818 7166566 6778818 6481945 5976482
39673 5976482 6278923 7503255 7946720 6467467 4253382 3171006 3514580 4324866 4902777
39664 4902777 5045200 4620584 3821521 3179750 2652943 1524669 -47921 -372911 1779168
39655 1779168 5189737 7318318 6969687 4949381 2695471 1325473 1431963 2545055
39647 2545055 3170241 2546954 1920420 2746885 4169748 4036537 2225471 982991 1700120
39638 1700120 3299167 4395455 5125975 5876633 6015466 5261733 4826704 5618754 6498233
39629 6498233 6003039 4835430 4728136 5450476 5007533 2747566 343400 -672586 -685493
39620 -685493 -676783 -527485 412929 1963719 3273632 3871440 3810797 3095508 1691637 79537
39610G9537q53295N48271J687742K028459J792736J323051M90418p38266j492952
39601D865701q47681M14649K97909j476801k582810j362587N83648R17832J78034
39592I87894L53004J061673M31656p92842R6536K645320K889348l95039l018221
39583D259329j441196J817355K085614o17140k296381j081016R96206J753439
39575E476210J243241L66730l93818o43670k92462p8371n14499q74302n84423
39566C704636n57289j405749j659203m6392J708268J190649n57483m58660J475382
39557C394159J987772j65055k278359k003357m99899J25059q8871q0843J24474
39548E15080J33129L47593Q75569P00506o13113j649117j011021N33299J104635
$$ plain form
39610 79537 -773758 -225487 1462255 3490714 5283450 6606501 7096919 6358653 4865701
39601 4865701 4018020 4432669 4730578 3253777 670967 -691620 -107972 809860 987894
39592 987894 1340898 2402571 2834227 2041385 2137921 4783241 7672589 7277550 4259329
39583 4259329 2818133 4635488 6721102 6103962 3807581 2726565 3722771 5476210
39575 5476210 6719451 7086181 6692363 6048693 5756231 5677860 5163361 4289059 3704636
39566 3704636 3147347 1741598 82395 36003 1744271 2934920 2377437 1918777 3394159
39557 3394159 5381931 5216876 2938517 935160 435261 560320 471449 390606 515080
39548 515080 648209 995802 1871371 2571877 1958764 309647 -701374 -168075 936560
39539I36560J72490j126392j518643n93828J136858K475492K337475Q33214q13393
39530C839833j504144r25658O49332K216255K161902K3215k167209k052407l12802
39521A928317J85968j351929k622709j916473l34481O53121J439070K608592L120908
39512C710384J941276l927j103577j106669o55137n8956L31835r3335r73707r76121
39502A012066J9107M62745j52989k70068P43514J030298m48552j521220k07749
39493F67152J712561J460556l08853j042026o26235o60448p24560O70844K234799
39484C383790J255798j381079j917714J33750J079092o08340j617709L82541K504773
39475C214902J365368j374701j958758n36013j21106j103245j037938N96767J491643
$$ plain form
39539 936560 1109050 -17342 -1535985 -2129813 -992955 1482537 3820012 4653226 3839833
39530 3839833 2335689 1410031 2059363 4275618 6437520 6460735 4293526 2241119 1928317
39521 1928317 2114285 762356 -1860353 -3776826 -4111307 -3458186 -2019116 589476 3710384
39512 3710384 5651660 5647733 4544156 3437487 2782350 2723394 3055229 2961894 1988187 1012066
39502 1012066 1031173 1493918 1340929 1070861 1814375 2844673 2396121 874901 667152
39493 667152 2379713 3840269 3531416 2489390 1863155 1202707 478147 1148991 3383790
39484 3383790 4639588 3258509 1340795 1474545 2553637 1945297 327588 710129 3214902
39475 3214902 4580270 3205569 1246811 710798 589692 -513553 -1551491 -954724 536919
39466E36919P28208K65053J135336J356796o09597k842404k635812m90835R41832
39457a614504Q64388P64456J164696N67124j586119l034845j469637J885803L326213
39448H67575J192520k198032l538875k151675J79281J882959K703326K597694
39440A534773J285370o19487j456056n86541L10251o05726k409598k347325K15992
39431d678347K614453K428091N25257p81154j066124j221844p39626J521912M072487
39422B675105L596631n6707k805247j944720J25757K11890n50179N30418K102853
39413C885801P17075k631962l194957j38086J764460j92542k320097q40488J930688
39404a020108J799571l40541n94095J109739J397487l91554j438624p08771k55064
$$ plain form
39466 536919 1265127 1530180 2665516 4022312 3412715 570311 -2065501 -2556336 -1614504
39457 -1614504 -750116 14340 1179036 1746160 160041 -2874804 -4344441 -2458638 867575
39448 867575 2060095 -137937 -3676812 -5828487 -5649206 -3766247 -1062921 1534773
39440 1534773 2820143 2200656 744600 158059 468310 -137416 -2547014 -4894339 -4678347
39431 -4678347 -2063894 364197 889454 108300 -957824 -2179668 -2919294 -1397382 2675105
39422 2675105 6271736 6215029 3409782 1465062 1590819 1802709 1252530 1782948 3885801
39413 3885801 4602876 1970914 -1224043 -1362129 402331 209789 -2110308 -2950796 -1020108
39404 -1020108 779463 438922 -155173 954566 2352053 1960499 521875 -186896 -441960
39395d41960p36948j59051J745366K153802j6754j834604j193061k52973j158915
39386a895098j761469N17382L236768K118711j680350k586393R75212M079425
39378C004188K710684o41938j511587k04406k53611k034270k224796M25445K648801
39369A918510J355317j975850l577843k282609J9270J637387K388971K079334
39361A562487K40516k093720k577196o83823J093114O82681m18888M47929K526944
39352G80044K296442j026253l491426j630020K365444L313669J27883k766324
39344c0541j703279J329488K023880l6553j497058q01676j19672r80763j389680
39335c205854N59183K826949K254946l76302j522322k89779R15950R63039J315131
$$ plain form
39395 -441960 -1178908 -1337959 407407 2561209 2544455 709851 -483210 -736183 -1895098
39386 -1895098 -3656567 -3139185 97583 2216294 535944 -2050449 -1075237 3004188
39378 3004188 5714872 5072934 3561347 3356941 3103330 1069060 -1155736 -730291 1918510
39369 1918510 3273827 1297977 -2279866 -4562475 -4543205 -2905818 -516847 1562487
39361 1562487 1803003 -290717 -2867913 -3551736 -2458622 -1775941 -2194829 -1746900 780044
39352 780044 3076486 2050233 -1441193 -3071213 -705769 2607900 2735783 -30541
39344 -30541 -1733820 -404332 1619548 1582995 85937 -715739 -835411 -1816174 -3205854
39335 -3205854 -2646671 180278 2435224 2058922 536600 246821 1162771 2125810 3440941
39326C440941K138917J149171j944330l595204j618837R93805O64766j126381
39318A02848o83353J482409J637731o64712j788682m0389J831481J362234j12911
39309C126656m40950r0729m63884j108634q94792l28830n71858j282716j280728
39300c336465m96706L08116R78647J642105J661234M51024j054436j158075M45431
39291e59125K290012K869097J999162N72517m10719o11060n38395q85300j593467
39282C132722j948595j602211r05455k23329L30235M89544J19926r0579O14377
39273h3365J556456J313309J09424k63499N65317P56637m30297q35021J099561
39264C788522L022853J772765j387824k040471R29450L566413K615758N1275k74119
$$ plain form
39326 3440941 5579858 6729029 4784699 1189495 -429342 564463 1229229 102848
39318 102848 -580505 901904 2539635 1874923 86241 45852 1877333 3239567 3126656
39309 3126656 2685706 2594977 2131093 1022459 127667 -201163 -773021 -2055737 -3336465
39300 -3336465 -3833171 -3525055 -2546408 -904303 756931 1207955 153519 -1004556 -559125
39291 -559125 1730887 4599984 6599146 7171663 6760944 6149884 5611489 4726189 3132722
39282 3132722 1184127 -418084 -1323539 -1546868 -1216633 -727089 -607163 -697742 -83365
39273 -83365 1473091 2786400 2895824 2632325 3197642 3954279 3523982 2688961 3788522
39264 3788522 6811375 8584140 7196316 5155845 6085295 9651708 12267466 12318741 12044622
39255A2044622J642244K420543O35038j283559r48712O15107R18378k92332j236808
39246A4514521j291399j740157l024933l362929j446381R40541R35699j377392
39238D147570k983736k041283l7125P91123M49497L87539R34476J098989M46069
39229C193119k46808k88811l4967k03744p49212q07463K00282J521007J545385
39220D128788k22383k084383j962864j02530J283633J125172O47409Q77470Q37932
39211D528244m52407j763699j378989J5724M05820j36263L77368K153970K738026
39202F487794Q12853j450414j570016n02701r08212k652579k738869J21601L299026
39193H98483L659428J451370o33601j082064n86654j46806M9598m0263m06833
$$ plain form
39255 12044622 13686866 16107409 16742447 15458888 14510176 15125283 16043661 15751329 14514521
39246 14514521 13223122 11482965 8458032 5095103 3648722 4589263 5524962 4147570
39238 4147570 1163834 -877449 -914574 -123451 326046 713585 1648061 2747050 3193119
39229 3193119 2946311 2657500 2622533 2418789 1669577 862114 1062396 2583403 4128788
39220 4128788 3906405 1822022 -140842 -243372 1040261 2165433 2812842 3690312 4528244
39211 4528244 4075837 2312138 933149 948873 1354693 1218430 1595798 3749768 6487794
39202 6487794 7300647 5850233 4280217 3777516 2869304 216725 -2522144 -2400543 898483
39193 898483 4557911 6009281 5375680 4293616 3706962 3560156 3609754 3569491 3162658
39184C162658j98966J494568L548180L230007j55793l530026l492959m99056K100207
39175E658820K416989J491082P46383J28507q28669j808161k276850k082154j099558
39166B346389N34518J623960Q40055j094624j747122k65011J248214P31423r26247
39157C291555j424470l47355P77683J012730Q50227P56317M86305L8929R194N51692
39147F002807Q70426K74896o91611o55052R92483L030107L411987J893660J186398
39138A6316101M077650R143852J1056131O414703j891113p712899q284376o100846
39130B3019203m595565m157034l170855j303098q9714n41186j447870p54050J673943
39121H633774L487035K693247O47150R49573M886900R081233Q824327L291342
$$ plain form
39184 3162658 2963692 4458260 8006440 11236447 11080654 7550628 4057669 3558613 5658820
39175 5658820 8075809 9566891 10313274 10441781 9613112 7804951 5528101 3445947 2346389
39166 2346389 2880907 4504867 5344922 4250298 2503176 2238165 3486379 4217802 3291555
39157 3291555 1867085 1519730 2297413 3310143 4160370 4916687 5402992 5441921 5451115 6002807
39147 6002807 6873233 7148129 6456518 5801466 6793949 9824056 13236043 15129703 16316101
39138 16316101 20393751 29537603 40593734 47008437 45117324 37404425 29120049 23019203
39130 23019203 18423638 14266604 11095749 9792651 9702937 9161751 7713881 6959831 8633774
39121 8633774 12120809 14814056 15461206 16410779 21297679 30378912 39203239 42494581
39113D2494581l648840p623671p673637n924468m530091l761584k744679j201994
39105E385617N2252K35193l34856o61446k56142N43186J130283R68305j79136
39096F883256j545596j439265P29340K927337K656528M36008q65941k47445L27596
39087I861818l64180q30536n4378J36929j749491l649639k856823m38048N35599
39078E91251n0557K30690J610526J742267L08943O0829J999143L053917O93100
39069A0240109k846351l535039j081086J119159Q13353o18006o24624J107276
39061D574791K389205J304575j215889k236053n87540J307067P47218j183788
39053E099586j264180O57658J301089o14171j988962j98446K630351K873783Q05658
$$ plain form
39113 42494581 38845741 31222070 23548433 17623965 13093874 9332290 6587611 5385617
39105 5385617 5437869 5673062 5338206 4676760 4420618 4963804 6094087 7062392 6883256
39096 6883256 5337660 3898395 4627735 7555072 10211600 10647608 9781667 9534222 9861818
39087 9861818 9497638 8667102 8612724 8749653 7000162 3350523 493700 55652 591251
39078 591251 540694 771384 2381910 4124177 4433120 4493949 6493092 9547009 10240109
39069 10240109 7393758 3858719 2777633 3896792 4710145 4092139 3467515 4574791
39061 4574791 6963996 8268571 7052682 4816629 4229089 5536156 6283374 5099586
39053 5099586 3835406 4493064 5794153 5179982 3191020 2992574 5622925 8496708 9302366
39044I302366l57254M93205J453290J263897Q64640J133363J703338K606791M758873
39035B3222509P698471Q595245N045096j758266p648654r209395o611095k961222
39027A6372689j005962o18506J08095J712325K764026K673006L032572M771672
39019B9809917N837843L910254R9509k503223k879158j969134L24516M312414
39011C6942938P091980M424777k824964q171935p384081l371682j002268o82511
39003B5022254k66003l535j238752k314557m69120L215720N178766N078376N628093
38994C9831242O945293N962884K157434j078464k287309m249085q023390r538393
38986B9720212n871428r29175k25500k887197l844082j920810l48579k64611O56957
$$ plain form
39044 9302366 8945112 9438317 10891607 12155504 13020144 14153507 15856845 18463636 23222509
39035 23222509 30920980 39516225 44561321 42803055 35154401 25945006 19333911 16372689
39027 16372689 15366727 14748221 14856316 16568641 19332667 22005673 25038245 29809917
39019 29809917 35647760 39558014 39657523 37154300 34275142 32306008 32630524 36942938
39011 36942938 44034918 48459695 45634731 37462796 30078715 26707033 25704765 25022254
39003 25022254 24756251 24752716 23513964 21199407 20730287 23946007 29124773 34203149 39831242
38994 39831242 46776535 52739419 54896853 53818389 51531080 47281995 39258605 29720212
38986 29720212 23848784 22919609 22694109 19806912 15962830 14042020 13693441 13428830 14085787
38977A4085787K912802L869406K837351K487766L456004K286497k560925o842977
38969B2531711o168882k295146p8134o99937j825009k412737l066772k942069
38961C043025q20980J310637L10067k480683k378072J063017K645073k23905k829960
38952c61781m37121L782221L346291j350255l509510l44416K988481J661270j821099
38943C954081k370091k59760L16036j369404j714219P29755K562694R08431k029940
38934G27583k236988M88067K737021K173073k15699j987119j632739N22384K460864
38925C036447K016010n55778k334730j363183N79733O30306q11567q80171J111731
38916A428798K640342J855607j03069j387938j719449j454013n07565O58341Q43243
$$ plain form
38977 14085787 16998589 20867995 23705346 26193112 29649116 31935613 29374688 22531711
38969 22531711 16362829 14067683 13989549 13289612 11464603 9051866 5985094 3043025
38961 3043025 2222045 3532682 3842749 1362066 -1016006 47011 2692084 2468179 -361781
38952 -361781 -798902 2983319 6329610 4979355 1469845 1125429 4113910 5775180 3954081
38943 3954081 1583990 1324230 1640266 270862 -1443357 -713602 1849092 2757523 727583
38934 727583 -1509405 -1021338 1715683 3888756 3673057 1685938 53199 575583 3036447
38925 3036447 5052457 4496679 2161949 798766 1378499 2008805 1197238 317067 1428798
38916 1428798 4069140 5924747 5821678 4433740 2714291 1260278 752713 1411054 2254297
38907B254297L0596k52139M72661O63363l50905p14564Q44080K260268R85828
38898F193485j789459k519941k89046K151232K270765N20923j070250j343511
38890D124198n91009J76367K19238j29192O8258O81987L35279j257006k163239
38881A464881r57612P59019O08446q45496j092086K34659J013738L48111j83627
38872A350033M45277J041207O23807K38152Q30349J165812k34441k247216k278286
38863I34694P3616K220291J819148l58499j583819p07723N01572n1188j770741
38854A077351k219574o76487R67037J313193J370907K058004J893040m77299k962602
38845B343570k295460R53161K801735J516143k42672J72265J691129J843292N07265
$$ plain form
38907 2254297 2284893 2032754 2505415 3168778 2817873 2103309 2947389 5207657 6193485
38898 6193485 4404026 1884085 1595039 3746271 6017036 6537959 5467709 4124198
38890 4124198 3533189 3709556 3928794 3799602 3867860 4549847 4885126 3628120 1464881
38881 1464881 507269 1266288 1874734 1029238 -62848 171811 1185549 1533660 1350033
38872 1350033 1795310 2836517 3460324 3698476 4528825 5694637 5460196 3212980 934694
38863 934694 1008310 3228601 5047749 4689250 3105431 2397708 2899280 2848092 1077351
38854 1077351 -1142223 -1818710 -851673 461520 1832427 3890431 5783471 5306172 2343570
38845 2343570 48110 1001271 3803006 5319149 5076477 5248742 6939871 8783163 9290428
38836I290428o87406j158730j441134j364592k70925J174234J230698m36429j820205
38827D515939r49121J400418K383183O47536j724444j826863O4588Q30995q96653
38818D445578k636958j855253J74655N74465n47067o30994Q46638J570074K92676
38809B233814j314431j476320n60158L48629R19467P62729o44248k174690j431067
38800c336275J689933L862127K510525n54203j646606j16141J362226Q12741p09455
38791C874872r95649L98996J706102J128105q76192k000450j062185L71339L44024
38782B888962n70098n11522L69590L51746n18844m57116N30232L38165j241537
38773A179578j529661N75295K308807J298350o95988q26998M03653N92976m64159
$$ plain form
38836 9290428 8603022 7444292 6003158 4638566 4367641 5541875 6772573 6336144 4515939
38827 4515939 3566818 4967236 7350419 7997955 6273511 4446648 4511236 5342231 4445578
38818 4445578 1808620 -46633 128022 702487 155420 -475574 371064 1941138 2233814
38809 2233814 919383 -556937 -1117095 -768466 151001 913730 269482 -1905208 -3336275
38800 -3336275 -1646342 2215785 4726310 4172107 2525501 2409360 3771586 4584327 3874872
38791 3874872 2879223 3278219 4984321 6112426 5236234 3235784 2173599 2544938 2888962
38782 2888962 2318864 1807342 2176932 2528678 2009834 1552718 2082950 2421115 1179578
38773 1179578 -350083 225212 2534019 3832369 3136381 2309383 2713036 3306012 2841853
38764B841853j043419o52870k15546O0934N81992Q53639K67594l05753K08561
38755B596985R45249L30500j151733j506397j51604J516676K103325J252735o14245
38746E321491k113892j429027J229729K736530O56586l150073m674511k753042
38738d176209K62866K096625K413616J581647P5281q78917k02045J360096K100972
38729D633932J629383O97234n35119k072300k681193j302057O49849R13026o3070
38720A869685J05289J592568K000745M65044q76911m01247O92904Q04706L85519
38711F638302N53994J035513Q90071M1794r80894j800876k014748j350631m77738
38702B534787m69020j068031p89868Q12323K278890K170320P56027o70746j226698
$$ plain form
38764 2841853 1798434 1145564 930018 990952 1572944 2426583 2694177 2388424 2596985
38755 2596985 3542234 3872734 2721001 1214604 1063000 2579676 4683001 5935736 5321491
38746 5321491 3207599 1778572 3008301 5744831 6401417 3251344 -1423167 -4176209
38738 -4176209 -3913343 -1816718 596898 2178545 2253826 1374909 1172864 2532960 4633932
38729 4633932 6263315 6960549 6425430 4353130 1671937 369880 1019729 1932755 1869685
38720 1869685 1974974 3567542 5568287 6033331 5156420 4755173 5448077 6252783 6638302
38711 6638302 7192296 8227809 9117880 9159674 8178780 6377904 4363156 3012525 2534787
38702 2534787 2065767 997736 207868 1020191 3299081 5469401 6225428 5554682 4327984
38693D327984r03351l85276m36651q58873n53418O45114J261215M93691j84264
38684C406171M68858R67646l57785j858671r30507J217042J070812j354995k422518
38675B06053q15021P36782M69292L5905O16378P43257j97228k36967J309166J996560
38665D864177N53746o27373K14194J087699J81617p75787k04569n591j618492
38656C669621k433515l10541J846503Q16995r42421M39447K882378J655501j999637
38647E624331k612072Q0644Q30892j735645k910686n53055J309235J42135o75232
38638d99453J238197K263095n26325l150318j000343K949461K665666j118928
38630B821052k375637M01743K577105J496817q1915J48643L94377q24600j326042
$$ plain form
38693 4327984 3424633 3039357 2602706 1743833 1190415 1835529 3096744 3590435 3406171
38684 3406171 3875029 4842675 4484890 2626219 1695712 2912754 3983566 2628571 206053
38675 206053 -608968 127814 597106 633011 1249389 1992646 1795418 1558451 2867617 4864177
38665 4864177 5417923 4790550 5004744 6092443 6274060 5498273 5293704 5288113 3669621
38656 3669621 1236106 925565 2772068 3589063 2646642 3086089 5968467 7623968 5624331
38647 5624331 3012259 3092903 3923795 2188150 -722536 -1275591 33644 175779 -499453
38638 -499453 738744 3001839 2475514 -674804 -1675147 1274314 3939980 2821052
38630 2821052 445415 847158 3424263 4921080 4839165 4987808 5382185 4557585 3231543
38621C231543O61107K670966J669176r22785j407964M23106J236951m57965k084753
38612E019382j003519J591142K391329M55892j801730k032205p47555J66905M77305
38603D516946J252997J885330J24496l806294n722078k625036K385927L675959
38595A688247P69193j351327P7057J824384L99047k242002k008460P79660K081611
38586B017410L44828j736826j745542n44828Q4914K00267P17007J420749J386412
38577B144391M95406m38321n71000L26985J574031J862297N71760j229936j859540
38568B876073r00801P28121K002826K056687J89694k686827l603628r55524K306416
38559B013037J925852j427120k758898q8805K812957K489509N27301k52348m64725
$$ plain form
38621 3231543 3892650 6563616 8232792 7310007 5902043 6325149 7562100 7104135 5019382
38612 5019382 4015863 5607005 7998334 8454226 6652496 4620291 3872736 4039641 4516946
38603 4516946 5769943 7655273 7779769 3973475 -1748603 -4373639 -1987712 1688247
38595 1688247 2457440 1106113 1183170 3007554 3406601 1164599 -843861 -64201 2017410
38586 2017410 2362238 625412 -1120130 -1664958 -1580044 -1379777 -662770 757979 2144391
38577 2144391 2639797 2201476 1630476 1957461 3531492 5393789 5965549 4735613 2876073
38568 2876073 1975272 2703393 4706219 6762906 6952600 4265773 662145 -293379 2013037
38559 2013037 3938889 2511769 -247129 -335934 2477023 4966532 5493833 5241485 4776760
38550D776760j539319j767532O34450K968842J488869k133053k932664n19622
38542I76731O20590j084286j816255P77373L415245K568147j38170j118304k50674
38533C950397K04993k82784o89714r24998j260660q00937Q45610J886528R36044
38524C864479k97069L12552J547696R43977p76335j015450m3432l56882j700393
38515B479143j175904J232604J860552m49366j840315L33662K796087J483058
38507F719521j756858k085039O16416J899057R6087j434900k98752J211818M90496
38498E457846r39061l53101J377991J407333j23126l30329J550563K907610J959415
38489A2915141N03220J265228M316445P186014P266233L609644k067904n684578
$$ plain form
38550 4776760 3237441 1469909 2104359 5073201 6562070 4429017 1496353 976731
38542 976731 1597321 513035 -1303220 -525847 2889398 5457545 5319375 4201071 3950397
38533 3950397 4155390 3872606 3182892 2257894 997234 196297 1041907 2928435 3864479
38524 3864479 3567410 3879962 5427658 6371635 5595300 4579850 4536418 4179536 2479143
38515 2479143 1303239 2535843 4396395 3947029 2106714 2440376 5236463 6719521
38507 6719521 4962663 2877624 3494040 5393097 5489184 4054284 3755532 4967350 5457846
38498 5457846 4518785 4165684 5543675 6951008 6827882 6497553 8048116 10955726 12915141
38489 12915141 13418361 14683589 19000034 26186048 33452281 37061925 34994021 29309443
38481B9309443m097001R06871L824871J806107k208206m076326l741339l622608
38473A8101812m005413l393994k127155j916814k219857p87564J935730K641398
38465H228143L05544j914802j406094L69024R28952N40988N95084O02051m43462
38456G805428j460251q77764L81008K84147p80320n97692J187490K569815K250616
38447A0762477Q73022p43453k292993k890602j733276j50397m78002k257666k197006
38438a107896Q67978L547299K431655r68869k382576o65557J264977J069729j91926
38429C864814n27164m8236j46670r61169j268047m96801M02330K77163p06999
38420C89221j177619r7248J855548K692949J332858q14420j348693k2492Q47282
$$ plain form
38481 29309443 25212442 26119313 29944184 31750291 29542085 25465759 21724420 18101812
38473 18101812 14096399 10702405 8575250 6658436 4438579 3651015 5586745 8228143
38465 8228143 8533687 6618885 5212791 5581815 6510767 7051755 7646839 8248890 7805428
38456 7805428 6345177 5467413 5848421 6132568 5352248 4754556 5942046 8511861 10762477
38447 10762477 11635499 10892046 8599053 5708451 3975175 3824778 3346776 1089110 -1107896
38438 -1107896 -239918 3307381 5739036 4770167 2387591 1722034 2987011 4056740 3864814
38429 3864814 3337650 3289414 3142744 2181575 913528 416727 819057 1096220 389221
38420 389221 -788398 -885646 969902 3662851 4995709 4181289 2832596 2810104 3657386
38411C657386l20330k020057j864609m6139J194392R79068O12681R74434J154939
38402D321765L05311q44111j135072l99960Q31021J817318J542435k63751j812925
38393D362031r95130J163752J280243j324907l233884k050920J73053P86216O83563
38384H44017J666640K535407J475933R46M95986J760223J179640l88913l11330
38375I258549R62543J493397K452958N668748Q598722Q491365R640928J7565281
38367F4132491K6211302K1721719K081532j7007695k0895891j1601157Q24140
38360F5466441J2151090K0218687J7058976j494002k2920757k8778113j7806683
38353D3895639o249241m756165p319588n743291k608661l430341n597231l466545
$$ plain form
38411 3657386 3337056 1316999 -547610 -593749 600643 1579711 2192392 3166826 4321765
38402 4321765 4627076 3782965 2647893 2247933 3078954 4896272 6438707 6174956 4362031
38393 4362031 3366901 4530653 5810896 4485989 1252105 -798815 -625762 160454 844017
38384 844017 2510657 5046064 6521997 6522943 7018929 8779152 9958792 9569879 9258549
38375 9258549 10221092 11714489 14167447 19836195 28434917 36926282 46567210 64132491
38367 64132491 90343793 112065512 114147044 97139349 76243458 64642301 65466441
38360 65466441 77617531 97836218 114895194 113401192 90480435 61702322 43895639
38353 43895639 37646398 32890233 25570645 19827354 17218693 13788352 8191121 4724576
38345D724576J532517L669364K002614M1592q98828j969751k410644n27757K032609
38336H196292J898175o46451k030390q47491O84839N90798o81204j896246k180490
38327C087832p29606K135904L917277K427763q78408k489655j548280m35947o68375
38318D818505r98293k49742N78819L58182p3370M41332J027175J8532k087542
38309C833598k905592j555797J4165K4242l19680J177710L650896L688336L85123
38300G993001k742820k506274m23253J09022q26310m67506J466037K268237R82969
38291E853103j23934L08352O40419l48540j186968o68567j42267p18007q49778
38282B763813Q68188K810491K805743J517435P81082N30900J70774J053022M192889
$$ plain form
38345 4724576 6257093 9926457 11929071 11970663 11071835 9102084 6691440 6163683 8196292
38336 8196292 10094467 9448016 7417626 6570135 7254974 7845772 7164568 5268322 3087832
38327 3087832 2358226 4494130 8411407 10839170 9960762 7471107 5922827 5486880 4818505
38318 4818505 3820212 3570470 4149289 4507471 4434101 4875433 5902608 5921140 3833598
38309 3833598 928006 -627791 -613626 -589384 -909064 268646 3919542 7607878 7993001
38300 7993001 5250181 2743907 2320654 2429676 1603366 1135860 2601897 4870134 5853103
38291 5853103 5729169 6037521 6677940 6329400 5142432 4473865 4331598 3613591 2763813
38282 2763813 3632001 6442492 9248235 10765670 11546752 12077652 12248426 13301448 17494337
38273A7494337O910267N507066P80383k614558k278570m17313Q4407j073223k783032
38264B1609764m258305m789943l976593k816006k586934k401368k55870L070214
38256C594959L981060J100025k237057k284133L39541K160950J590266k2944j088735
38247G133932j325563r19125l0230O98486N43804j51795l34617Q3032L3901q31160
38237D900665j245316j80076J269537J189642k74777r63760r176O35959p36116
38228D586582k447305j550473J578926L415684K270518L76032J7770L01169m03195
38219H145708j216885n84278M09536l47343k022395j733171P71748K447744J448648
38210G319312m59074q70601J49497R96642P50231m74765j864543j967819o5580
$$ plain form
38273 17494337 24404604 29911670 30692053 28077495 25798925 25381612 25466019 24392796 21609764
38264 21609764 17351459 12561516 8584923 5768917 3181983 780615 524745 3594959
38256 3594959 7576019 8676044 6438987 4154854 4494395 6655345 8245611 8222667 7133932
38247 7133932 5808369 4889244 4859014 5557500 6101304 5949509 5614892 5697924 5731825 4900665
38237 4900665 3655349 3475273 4744810 5934452 5659675 4695915 4686739 5322698 4586582
38228 4586582 2139277 588804 2167730 5583414 7853932 8229964 8247734 8548903 8145708
38219 8145708 6928823 6344545 6754081 6406738 4384343 2651172 3422920 5870664 7319312
38210 7319312 6860238 5989637 6139134 7135776 7886007 7411242 5546699 3578880 3513300
38201C513300K073209J824553l13237q23121J623830L714595K204242j249735
38193A2567636k592518j026316Q10652J315151J426343J865355J852255J132182
38185A7350740Q57089J570433K191788J884055J357058J483971K049562K699438
38177C1444134L755951N164086N939957N776118O059079Q075114J1187037J4123019
38169I1524495J7228366K1868898K8027653L3920622L7633513L7637636L2060428
38162B99901611J9627552K128376j5526624k8775771l6241087l8743238l6938065
38155A65432754l1278117k3553455j6763257j2985044j1918664j1614958j0283070
38148D7036189p572800m617443k844079k502460k527629j997494j258301j217199
$$ plain form
38201 3513300 5586509 7411062 7097825 6274704 7898534 11613129 13817371 12567636
38193 12567636 9975118 8948802 9759454 11074605 12500948 14366303 16218558 17350740
38185 17350740 18207829 19778262 21970050 23854105 25211163 26695134 28744696 31444134
38177 31444134 35200085 40364171 46304128 52080246 58139325 66214439 77401476 91524495
38169 91524495 108752861 130621759 158649412 192570034 230203547 267841183 299901611
38162 299901611 319529163 321657539 306130915 277355144 241114057 202370819 165432754
38155 165432754 134154637 110601182 93837925 80852881 68934217 57319259 47036189
38148 47036189 39463389 34845946 32001867 29499407 26971778 24974284 23715983 22498784
38140B2498784j975171k707936k620994j608902l07084K04943o70835k025917
38132A0786888k118765o25210P63296P81913L62600O14916M23330j671907m030102
38123E286959l277800O73881L839813L356919R17638m30988n38580j068294j989454
38114F770094j842498o72246j07469n99472p90390J7541O19307j29147j435699
38105A830021j602695k72881J117154R88305n94369j843245j095997J243478L034892
38096B804663K804387J202105j72005n47958j24183N99278Q65415l6129j578948
38087E816625k006523n92726J027140J061911J61206J78241J107460J253004J30298
38078H136636q83660r07748o06321n12294j57058M90907M16524p08982j554560
$$ plain form
38140 22498784 20523613 17815677 15194683 13585781 13278697 13483640 12812805 10786888
38132 10786888 8668123 8042913 8806209 9588122 9950722 10565638 10988968 9317061 5286959
38123 5286959 2009159 2683040 6522853 9879772 10797410 10366422 9827842 8759548 6770094
38114 6770094 4927596 4255350 4147881 3548409 2758019 2775560 3394867 3265720 1830021
38105 1830021 227326 -45555 1071599 2059904 1465535 -377710 -1473707 -230229 2804663
38096 2804663 5609050 6811155 6639150 6091192 5967009 6566287 7431702 7395573 5816625
38087 5816625 3810102 3217376 4244516 5306427 5467633 5645874 6753334 8006338 8136636
38078 8136636 7252976 6345228 5738907 5226613 5069555 5560462 5976986 5268004 3713444
38069C713444q83591P01983J589655R65824o82514k027109j643738N13904K180395
38060D428253R25404k279281l583005j365385J266776Q62825j365921j536617
38052b646951R94461K802943J563614p99651j184662N54343K022668J573862k57669
38043D622958j941083k353819j316605L08353J123280M71693p69822j079525O0798
38034h73772J664319K303741J504532J57712m45366j34431j56246j414318k698261
38025i2090j799674J321766L752237K956549o784j871281j245736J21505P0751
38016C207243j411951k722784k576660r05349J291339K527517K043027P73123
38008B225505K61528M27931k82489k054026k705994p93942J785660K158821M91924
$$ plain form
38069 3713444 2829853 3531836 5121491 6087315 5404801 3377692 1733954 2247858 4428253
38060 4428253 5353657 3074376 -508629 -1874014 -607238 255587 -1110334 -2646951
38052 -2646951 -1652490 1150453 2714067 1914416 729754 1284097 3306765 4880627 4622958
38043 4622958 2681875 328056 -988549 -680196 443084 914777 144955 -934570 -873772
38034 -873772 790547 3094288 4598820 4756532 4311166 4176735 4020489 2606171 -92090
38025 -92090 -1891764 -569998 3182239 6138788 6132004 4260723 3014987 3136492 3207243
38016 3207243 1795292 -927492 -3504152 -4409501 -3118162 -590645 1452382 2225505
38008 2225505 2487033 2914964 2632475 578449 -2127545 -2921487 -1135827 1022994 1514918
37999A514918m78405M84929J719067J455115m713j387381k002289j616616l53647
37990f69022O61075Q6200j507777j847145j06307J756452J846189Q68009M42373
37981A530047M49114j27429q91924o58787K97394O41840K84970L37198Q65662
37972B728085O46647n87587j455705j056849k73786j94177m99462l50874R3479
37963i50229J22704j20668K39905J350248K117632J483043k15686j576242j724124
37954G26583j079528l76847M01060J415234J891770R26756p43303j251088j81586
37945A729051Q30909N86257k15481p14855j227159j662753o73368J754721K794809
37936C202131M66411k637331k417735P81458K707055J482890k64202k01218L69964
$$ plain form
37999 1514918 1036513 1521442 3240509 4695624 4690911 3303530 1301241 -315375 -669022
37990 -669022 -7947 78253 -1429524 -3276669 -3382976 -1626524 219665 1087674 1530047
37981 1530047 1979161 1851732 959808 301021 598415 1240255 1525225 1862423 2728085
37972 2728085 3374732 2787145 1331440 274591 805 -193372 -692834 -1043708 -950229
37963 -950229 -827525 -948193 -708288 641960 2759592 4242635 4026949 2450707 726583
37954 726583 -352945 -729792 -328732 1086502 2978272 3905028 3161725 1910637 1729051
37945 1729051 2559960 3146217 2930736 2215881 988722 -674031 -1347399 407322 3202131
37936 3202131 3668542 1031211 -1386524 -605066 2101989 3584879 3320677 3119459 3489423
37927C489423m10846j510449r01392J052035K302852J941306N35572j212827k544463
37918B741211k397533o38452J239516J841199J389134N77249o89803k124401k216749
37909b78629l90442J357706J048939k26433j74446Q45450O40208p38432r39417
37900A144504M91307J084864m42424j999858j556170j93078K15479J41445Q02445
37891c11486J213518k17108k177550j767207P99328J987178J89339j727575p14393
37882b725956J954921K734513R15375q65735p23482L05382N10920p3513m05681
37873A626744k50459j88909m93950q31080p39361L1912J241599J930634J141630
37864C468760o83559j746912j041341J56959r2199j616606k156608l87528K120169
$$ plain form
37927 3489423 3078577 1568128 666736 1718771 4021623 5962929 6498501 5285674 2741211
37918 2741211 343678 -294774 944742 2785941 4175075 4752324 4062521 1938120 -278629
37909 -278629 -669071 688635 1737574 1511141 1336695 2182145 2822353 2083921 1144504
37900 1144504 1635811 2720675 2278251 278393 -1277777 -1470855 -1255376 -1113931 -311486
37891 -311486 902032 684924 -1492626 -3259833 -2460505 -473327 -283988 -2011563 -2725956
37882 -2725956 -771035 1963478 2878853 2013118 1289636 1595018 2105938 2032425 1626744
37873 1626744 1376285 1187376 693426 -137654 -877015 -845103 396496 2327130 3468760
37864 3468760 2785201 1038289 -3052 153907 61708 -1554898 -3711506 -4099034 -1978865
37855a978865K721303R54533r84036j059619K64654J093261P32354J32542J1546
37846A887673q975j51520Q3330N44894J10700j146005j213289O94298J978550
37837B779656K22962k506998k284203N27305J723436L756j102818O58258K530069
37828B551423J522957p93974j429586q61050j204188j876581r61807P43164Q97572
37819a412070k33560m10409O02523J136036J010518J419390J987593J330900L7251
37810E468172k77489k26691j341083k311058p89801J638795J225670j257583j143507
37801I85425K026515L065845j40673k583879l05870K889976J704726k077439k907120
37792B657506l72918J107853r4577j167731m12591N50743N12186M11276O41067
$$ plain form
37855 -1978865 742438 1696971 712935 -346684 -82030 1011231 1743585 1876127 1887673
37846 1887673 1878698 1727178 1810508 2355402 2466102 1320097 106808 801106 2779656
37837 2779656 3002618 495620 -1788583 -1261278 462158 465914 -636904 21354 2551423
37828 2551423 4074380 3280406 1850820 989770 -214418 -2090999 -3052806 -2309642 -1412070
37819 -1412070 -1645630 -2056039 -1453516 -317480 693038 2112428 4100021 5430921 5468172
37810 5468172 5190683 4963992 3622909 1311851 522050 2160845 3386515 2128932 985425
37801 985425 3011940 6077785 5937112 3353233 3047363 5937339 7642065 5564626 2657506
37792 2657506 2284588 3392441 3297864 2130133 1717542 2268285 2780471 3191747 3832814
37783C832814J40414j027815j249005k88734J18345n96848p46888N94748J894019
37774B671050J672466O71464J85734n0244q43016j649009j220545M41329J937560
37765C816789K072102R13041n83165j495948j473085o55816N87265J651127J791277
37756F623587R31832K03341O74449J577242J136936o11779j507195m25857R88204
37747I590760Q53530l55598j147536j398831j721476j768502j016076j95637j47512
37738B693122j69425P50879J960991K114095J188588q0036j576530k815939k127518
37729A938227P45749K680857Q42064k690564l342323n63904J725649J256095Q3894
37720B675744K77728O99181r1649q48233M1036J501347J559626O53042O97298
$$ plain form
37783 3832814 3973228 2945413 1696408 1407674 1526019 929171 182283 777031 2671050
37774 2671050 4343516 5014980 5200714 5150470 4307454 2658445 1437900 1879229 3816789
37765 3816789 5888891 6801932 6218767 4722819 3249734 2593918 3181183 4832310 6623587
37756 6623587 7555419 7758760 8433209 10010451 11147387 10535608 9028413 8602556 9590760
37747 9590760 10444290 10088692 8941156 7542325 5820849 4052347 3036271 2840634 2693122
37738 2693122 2523697 3274576 5235567 7349662 8538250 8458214 6881684 4065745 1938227
37729 1938227 2683976 5364833 6206897 3516333 174010 -389894 1335755 2591850 2675744
37720 2675744 2953472 3652653 3561004 2712771 2753807 4255154 5814780 6467822 7165120
37711G165120J757986J960919M75614j304134j779900j024505k07839P8414M03073
37702G524748J520828L056896L524375K024433l14967j274560J6186K165292L231044
37693B1474275K879226K498798L300299M654014M810541L406070K278502K732346
37685D8034071K973789L87989m038696o450733n699119m861207n853693o169077
37677A8323324l569064o43417r41636l111670l190869r44731O26098Q32320J473157
37668H853512K133882M85373k545322l037355l86363J531910P95337J79444J595220
37659I605638K507857N79462k162372k768412j619698m54583O86121J791381J270969
37650I436363j081160k417936r97283R01868J061144J042314K474035L047157
$$ plain form
37711 7165120 8923106 10884025 11359639 10055505 8275605 7251100 7043261 7121675 7524748
37702 7524748 9045576 12102472 15626847 17651280 17336313 16061753 16077939 18243231 21474275
37693 21474275 24353501 26852299 30152598 34806612 39617153 43023223 45301725 48034071
37685 48034071 51007860 51395849 47357153 40906420 35207301 30346094 24492401 18323324
37677 18323324 14754260 14110843 13169207 10057537 6866668 5921937 6548035 7380355 8853512
37668 8853512 10987394 11472767 8927445 5890090 5503727 7035637 7830974 8010418 9605638
37659 9605638 12113495 12692957 10530585 7762173 6142475 5687892 6374013 8165394 9436363
37650 9436363 8355203 5937267 4939984 5841852 6902996 7945310 10419345 13466502
37642A3466502M51857k639557k332451O2688M48400j013360p25154J527189K197394
37633A1443508K58297j488368j746388k215978k984062j618047J626811K646477
37625E922250j77610k827443j603934J469316K298096P28170m44974k35176Q9661
37616E218356r7636l51311p03384j300734j295724o9198J270734J359952O35515
37607D666570K81953J69169m00021q95423m34611L15094J9215j045203j316853
37598A359890j88298J510062K760963K818512J226215j164447k136550p70849
37590E415498Q32274M63790p08842j99818J187380L41809k497154k984064R24142
37581B775015N167286M739139L61380k889645k324375j10834O04948n35036j657798
$$ plain form
37642 13466502 13918359 11278802 8946351 9009039 9457439 8444079 7718925 9246114 11443508
37633 11443508 11701805 10213437 8467049 6251071 3267009 1648962 3275773 5922250
37625 5922250 5744640 2917197 1313263 2782579 5080675 5808845 5363871 5128695 5218356
37616 5218356 5120720 4769409 4066025 2765291 1469567 1400369 2671103 4031055 4666570
37607 4666570 4948523 5117692 4717671 3822248 3387637 3702731 3721946 2676743 1359890
37598 1359890 1171592 2681654 5442617 8261129 9487344 8322897 6186347 5415498
37590 5415498 6247772 6711562 6002720 5802902 6990282 7332091 4834937 1850873 2775015
37581 2775015 7942301 12681440 13042820 10153175 7828800 7717966 8322914 7787878 6130080
37572F130080j250004M37642J700894R54170j395437l033307k467509r31929m08596
37563b63996o87838k13971Q32156P30477n10696p39571P35051J672312M55075
37554B008999j135245p16069Q94900J153832n7936m92240O31503J559849J082860
37545D930453K02047j11338n95136j750091k056007j00400K591466L044800Q88766
37536G044560j137757j069401j61339m26682j371308j017537O52982J502981N79440
37527D595939n17137m08442m7309n69776q51651N50854K269936J705250p66664
37518E961000k090301j127284N6096P6494K08084J165402J087355j092552k933862
37509A310432j844638Q63568K058125J303961M89471L17323Q7912r0440K64921
$$ plain form
37572 6130080 4880076 5317718 7018612 7972782 6577345 3544038 1076529 144600 -263996
37563 -263996 -951834 -1165805 -333649 396828 -113868 -853439 -118388 1553924 2008999
37554 2008999 873754 157685 1052585 2206417 2148481 1656241 2287744 3847593 4930453
37545 4930453 5132500 5021162 4426026 2675935 619928 519528 3110994 6155794 7044560
37536 7044560 5906803 4837402 4676063 4249381 2878073 1860536 2513518 4016499 4595939
37527 4595939 4078802 3670360 3623051 3053275 2201624 2752478 5022414 6727664 5961000
37518 5961000 3870699 2743415 2799511 2876005 3084089 4249491 5336846 4244294 1310432
37509 1310432 -534206 329362 2387487 3691448 4180919 4498242 4586154 4495714 4760635
37500D760635L24658n59790q84313M57001J143121j187299l799352j983281L041610
37491A312990M807157J093107k737177k016609P73574J141812k54113K1214J738464
37482E880419J771822k45238j516825r01217l29761j145159k066610j520447J71988
37473I8972J683723K300043K076130J326868L61884o55375j557225j861005j216586
37464B557429j79933L97889O78126J216975J269808k73316k211192j894033O00596
37455B162349J979294N85458j170859q81378L28601N54982N49294J576867K304623
37446G989231J065254o99580o06620N87068M18682j027471j684388j290357j186379
37437C565440j144526P4998J524326J015590q94313j375194J15894J191908P98769
$$ plain form
37500 4760635 5085293 4525503 3641190 4098191 5241312 4054013 254661 -1728620 1312990
37491 1312990 6120147 7213254 4476077 2459468 3233042 4374854 4120741 4141955 5880419
37482 5880419 7652241 7407003 5890178 4988961 4659200 3514041 1447431 -73016 98972
37473 98972 1782695 4082738 6158868 7485736 7847620 7192245 5635020 3774015 2557429
37464 2557429 2377496 2775385 3453511 4670486 5940294 5666978 3455786 1561753 2162349
37455 2162349 4141643 4727101 3556242 2674864 3003465 3558447 4107741 5684608 7989231
37446 7989231 9054485 8354905 7748285 8335353 8754035 7726564 6042176 4751819 3565440
37437 3565440 2420914 2495912 4020238 5035828 4141515 2766321 2882215 4074123 4872892
37428D872892O39453J533849J680169q5195k048909k219998j064209k29530k40304
37419B838218o59581j130061j260515o08430N67560J470824J827975J770095R91662
37410E807747n52985j605849j035500J75621L59409l6682N17446J384519N27118
37401E540844j596908k159348m07697J235074J301184J278018K274149K871035
37393A0336351K099997J798189L783683O699731P708637N784438J806710k852433
37385C7165303o300554o599405m140578k006662k243565l290800k782759j161479
37377H639501l79876m94297k6044J194529K011601K357199L375302N059592N713765
37368B7451272M216918J448857r87363k434428l151647l419176l254712k753729
$$ plain form
37428 4872892 5512345 7046194 8726363 8641168 6592259 4372261 3308052 3078522 2838218
37419 2838218 2178637 1048576 -211939 -820369 -252809 1218015 3045990 4816085 5807747
37410 5807747 5254762 3648913 2613413 2789034 3148443 3111761 3629207 5013726 5540844
37401 5540844 3943936 1784588 1376891 2611965 3913149 5191167 7465316 10336351
37393 10336351 12436348 14234537 18018220 24717951 32426588 38211026 40017736 37165303
37385 37165303 30864749 24265344 20124766 18118104 15874539 12583739 9800980 8639501
37377 8639501 8259625 7765328 7739284 8933813 10945414 13302613 16677915 21737507 27451272
37368 27451272 31668190 33117047 32129684 29695256 26543609 23124433 19869721 17115992
37360A7115992k273756k081261j883249j146257j76150k79416k058611l992510
37352C224782l835690j365301J283501K060094R25668n85538r15185K65345J690746
37343B748422J794066Q21742N52373J189067M74284k403275m254034k150476J570795
37334C42964K343901K41880n40711J398563L073348K796076K446512K766414J341948
37325A6210895k491477n184364m156059j582786k92033K78469J096903N77057
37317D456605j778975k660383j26398K071820K05299k674285j389705K563001
37309F66979L430717R47115N10404L507494M618762P02795l880828m034248j142006
37300E327184K21269p60449j419323n64107M76594O32007Q3580q37930j672823
$$ plain form
37360 17115992 14842236 12760975 10877726 9731469 9555319 9275903 7217292 3224782
37352 3224782 -610908 -1976209 -692708 1367386 2293054 1707516 792331 1057676 2748422
37343 2748422 4542488 5364230 5916603 7105670 7579954 5176679 922645 -1227831 342964
37334 342964 2686865 2928745 2388034 3786597 6859945 9656021 12102533 14868947 16210895
37325 16210895 13719418 8535054 4378995 2796209 2504176 2782645 3879548 4456605
37317 4456605 2677630 17247 -109151 1962669 2167968 -506317 -1896022 666979
37309 666979 4097696 5044811 5555215 9062709 13681471 14384266 10503438 6469190 5327184
37300 5327184 5548453 4788004 3368681 2804574 3281168 3913175 3996755 3158825 1486002
37291A486002j450226r062J047140L16742j172837j263506L26028J773743J672965
37282B726989M93993m32036m08566K23589N67349O3036p73418p91545K74429J193291
37272C137111P11502p17311j418026o65424L72091K43846p14603p26360Q87430
37263A110256K390828J701063p03863k176798j238669P64489J733786J244557
37255D825649J75112q42261j511036j399021o26035l08466j083841j785630q74938
37246c430467J229012K540269K024793N89394l37313k34107M09800O04936l55378
37237C040939j921092k445605j097435Q08914J302971K21935q14824o92402k4163
37228a620762L6381n70120p56376K86621J811558K066825N22101j052614p75569
$$ plain form
37291 1486002 35776 26714 1073854 1390596 217759 -1045747 -719719 1054024 2726989
37282 2726989 3220982 2788946 2380380 2603969 3171318 3234354 2460936 1669391 1943820 3137111
37272 3137111 3848613 3131302 1713276 1047852 1419943 1663789 949186 222826 1110256
37263 1110256 3501084 5202147 4498284 2321486 1082817 1847306 3581092 4825649
37255 4825649 5000761 4158500 2647464 1248443 622408 313942 -769899 -2555529 -3430467
37246 -3430467 -2201455 338814 2363607 2953001 2615688 2381581 2791381 3396317 3040939
37237 3040939 1119847 -1325758 -2423193 -1614279 -311308 -89373 -904197 -1596599 -1620762
37228 -1620762 -1584381 -2154501 -2910877 -2624256 -812698 1254127 1776228 723614 -51955
37219e1955N85048O84653p40330j422343j60614J424014J644021J008638M66725
37210C437857l90391j718346k097333p97585M58247Q1636p54372k92893O99547
37201a373633N22314k51283J00536J282876J700210J330198J099150L76404j815989
37192B970783l784359k719969P92661K993165K004861j66148j153512j008055
37184g0573o50281n843J093783J862243J539195M09604p34683j366486j313062
37175G63897p77157j50462N84017J545901J800097J11398k464167k942556o40509
37166b169541J443855J172776K71106M77076R3255k196426l407239o81173L115121
37157a881190L359198R87045K34896J023854n898k119531j270334J865787J968033
$$ plain form
37219 -51955 533093 1217746 477416 -944927 -1105541 318473 1962494 2971132 3437857
37210 3437857 3047466 1329120 -768213 -1565798 -1107551 -1025915 -1780287 -2073180 -1373633
37201 -1373633 -851319 -1102602 -1002066 280810 1981020 3311218 4410368 4786772 2970783
37192 2970783 -813576 -3533545 -2740884 252281 2257142 2090994 937482 -70573
37184 -70573 -720854 -726697 367086 2229329 3768524 4178128 3443445 2076959 763897
37175 763897 -13260 -163722 420295 1966196 3766293 3877691 1413524 -1529032 -2169541
37166 -2169541 -725686 447090 718196 1195272 1288527 -907899 -4315138 -4996311 -1881190
37157 -1881190 1478008 2465053 2699949 3723803 3717905 1598374 328040 2193827 4161860
37148D161860j791058l787208j058058K291061K369987J005942R18703J046409
37140E157638J9891p21050m36902r38540k149050r95205K348795K814321j349801
37131C750097m549873k437397J150603R95243j137661q96525O48964K4869j449494
37122c901174l35018J991739J802877O7924M43403K130762J316305j602917k577108
37113f63207q14901P21120R18096J074698Q41158q76700k056951k44368K159479
37104A058424J243216j174410l01711K791444K582281j034556k295020L32066
37096C201734J711370n44810k132274k25152J801762J162713L07369J045927N94016
37087F922655k275733l386653l01441K481836Q46050j778422n76067K083103J053567
$$ plain form
37148 4161860 2370802 -1416406 -2474464 -183403 2186584 3192526 4111229 5157638
37140 5157638 5177529 4456479 4019577 3081037 931987 -63218 2285577 5099898 3750097
37131 3750097 -799776 -3237173 -2086570 -1091327 -2228988 -3125513 -2476549 -2451680 -3901174
37122 -3901174 -4236192 -2244453 -441576 -373652 69751 2200513 3516818 1913901 -663207
37113 -663207 -1478108 -756988 161108 1235806 2076964 1200264 -856687 -1101055 1058424
37104 1058424 2301640 1127230 825519 3616963 6199244 5164688 2869668 3201734
37096 3201734 4913104 4368294 2236020 2010868 3812630 4975343 5282712 6328639 6922655
37087 6922655 4646922 1260269 958828 3440664 4286714 2508292 1932225 4015328 5068895
37078E068895k297528k562974K70729J276823n13469q58185J673226L020359O72814
37069E750690k080267j561486O86067P61614j635375l118408j542473J291874
37061a447764K160476N06083r76672p3707J739270J425687q72600j874391k81130
37052C05252J270277O96539k84572M09562J490687Q83166m37280m64707O861q96935
37042B978850k181152j468881O57026J494824O98388L15448Q13842O42055m06863
37033C543537q54882n88518q88447j323961j16857K041664K181271j05651j572928
37024B315228l74144J162480N86841r07145j037290k36461k82175r26613o15052
37015c14331M72555O61382k93181p25561K72710J386504R32318q14792j983717
$$ plain form
37078 5068895 2771367 208393 479122 1755945 1242476 384291 2057517 5077876 5750690
37069 5750690 3670423 2108937 2795004 3556618 1921243 -1197165 -2739638 -1447764
37061 -1447764 712712 1218795 242123 168416 1907686 3333373 2460773 586382 305252
37052 305252 1575529 2272068 1987496 2397058 3887745 4770911 4333631 3868924 3875785 2978850
37042 2978850 797698 -671183 -14157 1480667 2179055 2494503 3308345 3950400 3543537
37033 3543537 2688655 2100137 1211690 -112271 -229128 1812536 3993807 3888156 2315228
37024 2315228 1941084 3103564 3690405 2783260 1745970 1509509 1227334 300721 -314331
37015 -314331 158224 819606 526425 -199136 73574 1460078 2392396 1577604 -406113
37006d06113j506107l39662J06609J35826J180376L086716L644367J677435r67469
36997F611978j944822j536186j438039j664555r58240N00442J241514R68905O00556
36988B381553K78443l21520k84775J178638K185723K92772k955798l279942M5839
36979d79067K952562K608208P98979j93613j021339k277053j980347P68910K864223
36970D041463J504192j191767j585236k12005j4660q05465p6203J733269J538923
36961D932511q76220k081499m15220J665840J709196M11017n74572j025666j036324
36952B709063j31295J129939J001903o37377j501978l01616J162215Q24204o61157
36943C593901j458944j356397j138388n54952R97790K567644K400073M36380j375584
$$ plain form
37006 -406113 -1912220 -2251882 -2145273 -2009447 -829071 2257645 5902012 7579447 6611978
36997 6611978 4667156 3130970 1692931 28376 -929864 -429422 812092 1780997 2381553
36988 2381553 2659996 2338476 2053701 3232339 5418062 5710834 2755036 -524906 -479067
36979 -479067 2473495 5081703 5880682 5687069 4665730 2388677 408330 1177240 4041463
36970 4041463 5545655 4353888 2768652 2556647 2541987 1736522 1660319 3393588 4932511
36961 4932511 4056291 1974792 1559572 3225412 4934608 5345625 4771053 3745387 2709063
36952 2709063 2577768 3707707 4709610 4072233 2570255 2268639 3430854 4255058 3593901
36943 3593901 2134957 778560 -359828 -914780 83010 2650654 5050727 5487107 4111523
36934D111523j344525K39706J645278J512933K27201n21086R5516P76260J8354
36925F761160j267952r11792Q82324J421610l38311j966292j149635J014796J979438
36916F425346J187346k72373j822250l122032k968895p80589J665580K147630
36908B459763J028879L38604M74326J07705r28171j087478K26280J501404J311041
36899E432353J69924n06692k70597J11889k83971j432037k054033q92110J330427
36890A605153K215964P77703r98534r09132M56127J086010O05810q8871j004930
36881C745300k356705k732688q52314J548873J721059K87073J43939J271501Q01854
36872C577892j292540j280421J894015L854935J360546k301357k228162Q00930
$$ plain form
36934 4111523 2766998 3006704 4651982 6164915 6392116 5871030 5966546 6742806 6761160
36925 6761160 5493208 4581416 5463740 6885350 6547039 4580747 3431112 4445908 6425346
36916 6425346 7612692 7340319 5518069 2396037 -572858 -1353447 312133 2459763
36908 2459763 3488642 3827246 4301572 4409277 3481106 2393628 2619908 4121312 5432353
36899 5432353 5602277 5095585 4824988 4936877 4652906 3220869 1166836 274726 1605153
36890 1605153 3821117 4598820 3600286 2691154 3147281 4233291 4839101 4750230 3745300
36881 3745300 1388595 -1344093 -2196407 -647534 1073525 1360598 1504537 2776038 3577892
36872 3577892 2285352 1004931 2898946 6753881 8114427 5813070 3584908 4385838
36864D385838K180558O11576j033251r78835m83114o29559q19079q04287j217780
36855A212067j670320r34722O68322J486754J250925J072581P76429p93789k536933
36846E31314j601143J784575L391649Q35923k639185k782900l05590R05153j15061
36837D735o62137P59169K233328J765828J75266n69018j39731L23860J28692l62784
36827C657208m97814K0663Q93115J298461P13834j87079k20901N10876N43825
36818F732188p23652j853519j348967J52551R10951N85953K33089K55684O0090
36809E004368l34986j66308L04128k37440j704151j987182Q199K306657K385216
36800E578501N01003j139708j464265j015596k78587N27670O69081j32067n73793
$$ plain form
36864 4385838 6566396 7177972 6144721 5165886 4682772 4053213 3234134 2429847 1212067
36855 1212067 -458253 -1392975 -724653 762101 2013026 3085607 3862036 3068247 531314
36846 531314 -1069829 714746 4106395 4942318 2303133 -479767 -785357 119796 4735
36837 4735 -657402 101767 2335095 4100923 4276189 3707171 3567440 3891300 4019992 3657208
36827 3657208 3159394 3180057 4073172 5371633 6085467 5898388 5677487 6188363 6732188
36818 6732188 6008536 4155017 2806050 2958601 3869552 4455505 4688594 4944278 5004368
36809 5004368 4669382 4503074 4807202 4569762 2865611 878429 886628 3193285 5578501
36800 5578501 6079504 4939796 3475531 2459935 2181348 2709018 3378099 3246032 2672239
36791B672239L30214R75609o88220l273364l276023l61901J953731J652565R12831
36782H97681J946429L192012J985467j148734l327327l069419j236693O59283
36774a01301J453674P37086l84024j47497J224266J460928q5016r94148L24879
36765C488847J773196R43093r33822j290472n04208o02649j250671o00820Q79250
36756A901744J075329J43079J54895J090191Q10233q12901j322143J62145J518718
36747D721290J257463N33199M50138J91987q14334j355653n62897M23084L43938
36738E188215k36102j22785O51828J096682M33401j306061k858984k300124M30119
36729I76189K296098P08415k418109l041549r27124L66129n26353r14845Q28656
$$ plain form
36791 2672239 3002453 3978062 3289842 16478 -3259545 -3621446 -1667715 -15150 897681
36782 897681 2844110 6036122 8021589 6872855 3545528 476109 -760584 -101301
36774 -101301 1352373 2089459 1705435 1557938 2782204 4243132 4158116 3163968 3488847
36765 3488847 5262043 6205136 5271314 3980842 3476634 2873985 1623314 1022494 1901744
36756 1901744 2977073 3120152 3275047 4365238 5175471 4362570 3040427 3202572 4721290
36747 4721290 5978753 6511952 6962090 7154077 6339743 4984090 4421193 4844277 5188215
36738 5188215 4952113 4829328 5481156 6577838 7011239 5705178 2846194 546070 976189
36729 976189 3272287 3980702 1562593 -1478956 -2406080 -2039951 -2566304 -3481149 -2652493
36720b652493K405898J729741L07921J45831L71451m97078j563455j411553o71494
36711a835231l20583L53387J697069J885596j80241k263291j865990n1301O26967
36702a953618K29731M61220J142376Q26657j87640m74670j72660k48600j13806
36693d91010J091395J863128K30809k414697k768604n87089J131100R56243O48834
36684c39891J450200J962937Q89421o68251j010356j37294Q37494J162892N92889
36675D740041o90594j777303j747939r05486k29907K11258R45033J477871P36926
36666B759900q81121j660847r84272j915L46462M31085P10876Q32860M31075k19881
36656A764222o54125n64631J80504J092288J073618j77009j392242j413771p85685
$$ plain form
36720 -2652493 -246595 1483146 1791067 1936898 2308349 1811271 247816 -1163737 -1835231
36711 -1835231 -2155814 -1802427 -105358 1780238 1599997 -663294 -2529284 -2580585 -1953618
36702 -1953618 -1723887 -1262667 -120291 706366 518726 44056 -128604 -377204 -491010
36693 -491010 600385 2463513 2694322 279625 -2488979 -3076068 -1944968 -988725 -339891
36684 -339891 1110309 3073246 3962667 3294416 2284060 2146766 2984260 4147152 4740041
36675 4740041 4049447 2272144 524205 -381281 -611188 -399930 545103 2022974 2759900
36666 2759900 1878779 217932 -766340 -768255 -421793 9292 720168 1553028 1984103 1764222
36656 1764222 1110097 545466 725970 1818258 2891876 2714867 1322625 -91146 -876831
36647h76831m42300K7008J113300J633581M61158j017627p47082M79886K35003
36638H66096j276164j379135N20032J845992J083450M1291N86610J705963J475841
36629E469976K2598j135442j347819j040906n96684m7947O72558J560070K049854
36620E606258J023817j595019l752101l304664p82026J465186K278879K060193
36612C000523J007199o44093j387747k03128J092399K52007j343571o31473J666340
36603B808456J849661m31239j504156j76649K47420j771970k935490j071677P37468
36594b248176k93675j384638R20834M094668L113865j542347m514779l131320
36586d985568J40571K234384K460313J168403r96825k398662j780528k48104L68805
$$ plain form
36647 -876831 -1319131 -1292123 -178823 1454758 1915916 898289 151207 631093 866096
36638 866096 -410068 -1789203 -1269171 576821 1660271 1701562 2288172 3994135 5469976
36629 5469976 5492574 4357132 3009313 1968407 1371723 1323776 1996334 3556404 5606258
36620 5606258 6630075 5035056 1282955 -2021709 -2803735 -1338549 940330 3000523
36612 3000523 4007722 3363629 1975882 1772754 2865153 3117160 1773589 1142116 2808456
36603 2808456 4658117 4226878 2722722 2546073 2793493 1021523 -1913967 -2985644 -2248176
36594 -2248176 -2541851 -3926489 -3005655 1089013 4202878 2660531 -1854248 -4985568
36586 -4985568 -4844997 -2610613 -150300 1018103 21278 -2377384 -4157912 -4406016 -4037211
36577d037211L85010J102547J920132J431704L50064K48070L48883j052783k727399
36568b030983j808582J231842K648969Q87433j392292j490913P0628J334345J426241
36559H76688M59775r68937j588683n93990Q08955Q11166k16452m05373M77684
36550c39167R17959L88175k53253q00240j587450j736027k74817J416522J295221
36541i73077L03874R31795K549564K131237l61230j612453n19979K66106o29347
36532B086490j197445m40325m17882j892361k212610k1470J889231J157399l92905
36523a441878l88382K77065K04046M58736J558199J115122j830241l618202j258371
36514d923906K282457K580945O19985K46994J364371J068805l62565k96503P02248
$$ plain form
36577 -4037211 -3652201 -2549654 -629522 802182 1152246 1400316 1749199 696416 -2030983
36568 -2030983 -3839565 -2607723 41246 928679 -463613 -1954526 -1883898 -549553 876688
36559 876688 1336463 367526 -1221157 -1815147 -1006192 -195026 -411478 -816851 -339167
36550 -339167 578792 966967 713714 -86526 -1673976 -3410003 -3684820 -2268298 -973077
36541 -973077 -669203 262592 2812156 4943393 4582163 2969710 2449731 2715837 2086490
36532 2086490 889045 448720 30838 -1861523 -4074133 -4095603 -2206372 -1048973 -1441878
36523 -1441878 -1830260 -1553195 -1349149 -890413 667786 1782908 -47333 -3665535 -4923906
36514 -4923906 -2641449 -60504 559481 806475 2170846 3239651 2877086 2580583 3282831
36505C282831j96089k294266k078260N14757J928956J105188M36038M61348q29825
36496B330678k856268k353852M87693J545472r8851m74688J787955K539938k33429
36487B674648k044829M69747L186168J224647k602338k432763Q90400J566672
36479B932352j453204l307780j471839J029782J463468J099821J528115J659586
36471C480301M32581q39393q34952m09305o64861r06789j32634J043205J346414
36462B514567N61159o45401j550205j441693p5248J383434J131203q73858k378075
36453a374117j450412J145468K858975K165491K4802j289434o77126O06365O89747
36444B699759k68300m50581N19011Q37568k88247j042284k35050K66802j128948
$$ plain form
36505 3282831 3086742 792476 -1285784 -771027 1157929 2263117 2699155 3160503 2330678
36496 2330678 -525590 -2879442 -2391749 -846277 -945128 -1419816 368139 2908077 2674648
36487 2674648 629819 1099566 4285734 5510381 2908043 475280 1365680 2932352
36479 2932352 1479148 -1828632 -3300471 -2270689 -807221 292600 1820715 3480301
36471 3480301 3912882 3073489 2238537 1829232 1164371 257582 124948 1168153 2514567
36462 2514567 3075726 2430325 880120 -561573 -636821 746613 1877816 1003958 -1374117
36453 -1374117 -2824529 -1679061 1179914 3345405 3370207 2080773 1403647 2010012 2699759
36444 2699759 2431459 1980878 2499889 3337457 3049210 2006926 1771876 2038678 909730
36435I09730k205639k07102K941185K855514m60239k387555o92510J498517R59812
36426C211713j215509k346820k139648j679386r04167N97016J955387K155462
36418c65952J572691J016291M89254r1894l21442k34673l64879m54966J21407
36409A365837N60946l67687j491855n25034J538682J217191j430186k173117K30363
36400a074860J387611j153238k954445L4787L976745L032075q40358j136499K275663
36391C547481L313962L41779j281638J254536L517295J754417p47465N16223L822659
36382A6039249M373439J727699o04527j146727j733286l457079m790446l987402
36374F420920j324272J196103J469331p40969k920681k256339M93809J612082
$$ plain form
36435 909730 -1295909 -1503011 1438174 4293688 3833449 1445894 753384 2251901 3211713
36426 3211713 1996204 -350616 -2490264 -4169650 -5073817 -4476801 -2521414 -365952
36418 -365952 1206739 2223030 2712284 2620390 2298948 2064275 1699396 1244430 1365837
36409 1365837 1926783 1559096 67241 -457793 1080889 2298080 867894 -1305223 -1074860
36400 -1074860 312751 -840487 -3794932 -3760145 216600 3248675 2408317 1271818 3547481
36391 3547481 6861443 7203222 5921584 7176120 10693415 12447832 11700367 12216590 16039249
36382 16039249 20412688 22140387 21535860 20389133 18655847 15198768 10408322 6420920
36374 6420920 5096648 6292751 7762082 7021113 4100432 1844093 2337902 3949984
36366C949984k34000j893027o57450J448606R99676j350882k054964k07298J435595
36357A436240P80776j073498j959947j150895O60693K250171K402556Q51030j079614
36348C117512j673055o63739P31958J218062L12822j361666k094614n70228J930221
36339I47273K414036L20232j265964k04964J245565J98078j869138j588344L44663
36330E41437K37487j963488k057245J370790M022543K337385j072031j655684
36322A761194L42046J148946l36452j543675q49761L67538O60950N93971R55520
36313C100277J061435N5997j462057k191704j679632m21789Q49746J437567R56508
36304A706348j07102p18569o39342p75772j624602k112091r33136J341966K602973
$$ plain form
36366 3949984 3715984 1822957 1165507 2614113 3613789 2262907 207943 645 1436240
36357 1436240 2217016 1143518 -816429 -1967324 -1306631 943540 3346096 4197126 3117512
36348 3117512 1444457 780718 1512676 2730738 3043560 1681894 -412720 -982948 947273
36339 947273 3361309 3681541 2415577 2210613 3456178 3654256 1785118 196774 541437
36330 541437 778924 -1184564 -3241809 -1871019 2151524 4488909 3416878 1761194
36322 1761194 2103240 3252186 2915734 1372059 522298 889836 1550786 2144757 3100277
36313 3100277 4161712 4217709 2755652 563948 -1115684 -1537473 -687727 749840 1706348
36304 1706348 1599246 880677 241335 -534437 -2159039 -4271130 -5204266 -3862300 -1259327
36295a259327J735818r0486j008060n70815K33476N14470L15002J82419N35329
36286E87826J316509J784006R54717j072929k602778k140014m83634K65830k20342
36277a610809j07163J388818K311782Q95802j395252j800045k99017N85916k73334
36268c03302j245666q40322K16071O49448N71684O08075N00949j71897r01775
36259i16735r99639o24747j38430O55551J662066J891556Q64335l32834o70890
36250A390233q42719j705837k071143k67651K550180L214457R73118j318850j300710
36241F21078j56611j68455j168207j409118o52293j24403k9805O23787J733525
36232g30502J776112L55501p22877N646J330517R63983j133950k485443j323839
$$ plain form
36295 -1259327 476491 386005 -622055 -1192870 -959394 -444924 -129922 52497 587826
36286 587826 1904335 3688341 4643058 3570129 967351 -1172663 -1656297 -1390467 -1610809
36277 -1610809 -1717972 -329154 1982628 2878430 1483178 -316867 -615884 -29968 -303302
36268 -303302 -1548968 -2389290 -2173219 -1523771 -952087 -344012 156937 -14960 -916735
36259 -916735 -1916374 -2541121 -2679551 -2024000 -361934 1529622 2393957 2061123 1390233
36250 1390233 547514 -1158323 -3229466 -3497117 -946937 2267520 3240638 1921788 621078
36241 621078 464467 296012 -872195 -2281313 -2933606 -3058009 -3087814 -2464027 -730502
36232 -730502 1045610 1401111 678234 683880 2014397 2978380 1844430 -641013 -1964852
36223a964852J030547J843342N43534n92949K14220J468171N37201k010676k675493
36214a606955k45468J956051R50938j208969p69361J438427J250732j723309k989080
36205b946994k66519K799477K356916j17841j117664o38950o76591q53755J99906
36196a262015J076592k58798j939478o51204K234922K208909q29480k132726k185
36187a555463J600428J75380j217138N0247J289680l49138k241538o40371K650057
36178b37856L095233O07160j185012j193418j343301j823933q77085J032654J495207
36169d30351N49585M32222J003745j6136k063838j826206R16576K385191J004411
36160A955199k89627L45894O38982q22336j415071N12040J921762K87846j512145
$$ plain form
36223 -1964852 -934305 909037 1452571 859622 1073842 2542013 3079214 1068538 -1606955
36214 -1606955 -1852423 103628 1054566 -154403 -923764 514663 1765395 42086 -2946994
36205 -2946994 -3213513 -414036 1942880 1825039 707375 68425 -608166 -1461921 -1262015
36196 -1262015 -185423 -444221 -2383699 -3034903 -799981 1408928 579448 -1553278 -1555463
36187 -1555463 44965 220345 -996793 -946546 343134 -6004 -2247542 -2887913 -237856
36178 -237856 2857377 3464537 2279525 1086107 -257194 -2081127 -2958212 -1925558 -430351
36169 -430351 119234 551456 1555201 1539065 -524773 -2350979 -1434403 950788 1955199
36160 1955199 1665572 2011466 2650448 1828112 413041 925081 2846843 3134689 1622544
36151A622544j20140J939514K36671l682555m317632r15416J784560J395122O93459
36142a363873J613631J840227m21879k692359k070352L51506J679294J357936
36134B94131N82764k89687j169888q53770J112191K491141R48767k254064l699274
36125b837689k421345n86409K24174P82685J813654K294247J411117M08465P91571
36116A880470J740114J189683q01591j702335j54092J664141Q95866j612430k051969
36107A047857Q46905L411544J852206k234777l886230j606058R82964P81265p11938
36098D83738o57586M93214L37001j152143j667491l59750J184255J729800J679164
36089B070202J305434R4841j496688j829162o01183L19421k89449j110542n27370
$$ plain form
36151 1622544 1502404 3441918 3678589 -3966 -4321598 -5237014 -3452454 -2057332 -1363873
36142 -1363873 249758 2089985 1668106 -1024253 -3094605 -2743099 -1063805 294131
36134 294131 876895 587208 -582680 -1436450 -324259 2166882 3115649 861585 -2837689
36125 -2837689 -5259034 -5845443 -5621269 -4838584 -3024930 -730683 680434 1088899 1880470
36116 1880470 3620584 4810267 4008676 2306341 2152249 3816390 4712256 3099826 1047857
36107 1047857 1894762 5306306 7158512 4923735 1037505 -568553 414411 1195676 483738
36098 483738 -173848 319366 656367 -495776 -2163267 -2523017 -1338762 391038 2070202
36089 2070202 3375636 3470477 1973789 144627 -456556 -137135 -426584 -1537126 -2064496
36080b064496Q33989J373046J018934P48008N93269q0918r69381j168723o95603
36071d11875k08009K85982R77018J095548j05451j603382j602614j06450J135806
36062e43427J068835J47725r21734j512426o63529J527003K617825N83643k449582
36053a45667k434121N17956K047855L70450j049314M49909K288907J397152m41498
36044C001629j36895R39964l03626k400944j399804J825606K233252j167137l466203
36035h74158j612312J205440J227295l66259o20682J62594m3470j024337j106318
36026c052207j22443J000122J997393K506437J438500q34387j807315n42321L61374
36017I45153r67773k091434k36577K588570K497940l5639j251302k85562K90884
$$ plain form
36080 -2064496 -1230507 142539 1161473 1909481 2502750 2421832 1452451 283728 -411875
36071 -411875 -619884 -333902 643116 1738664 1633213 29831 -1572783 -1679233 -543427
36062 -543427 525408 673133 -248601 -1761027 -2424556 -897553 1720272 2303915 -145667
36053 -145667 -2579788 -2061832 -13977 356473 -692841 -242932 2045975 3443127 3001629
36044 3001629 2864734 3804698 3501072 1100128 -299676 1525930 3759182 2592045 -874158
36035 -874158 -2486470 -1281030 -53735 -419994 -1040676 -878082 -921552 -1945889 -3052207
36026 -3052207 -3174650 -2174528 -177135 2329302 3767802 2933415 1126100 583779 945153
36017 945153 -22620 -2114054 -2350631 237939 2735879 2700240 1448938 1163376 1454260
36008A454260l67776l48788O80832O09855q47242j231214J28582O31952j015902
35999c05441k452837j693191j03971N93145J037219J832970J621320m6086q90146
35990d07018M12089J565897N16722q49087j47655J003835j79818k428587k319704
35981b833326q098J313448Q45008O62210J108948K27946j835072k231144k40873
35972b990953J280096O92621O2474J034525J759327M04311j232659n56112J511468
35963A965098K050092O11951o45945n43499r0117l48655j060296j442728j044149
35954e48248P6559J117745R76621k23226q21514J43025J264616O41782j260127
35945A367233k073348o12422J706309K548120J046578j413218k469013j189604
$$ plain form
36008 1454260 1086484 737696 1418528 2028383 1181141 -50073 78509 710461 -305441
35999 -305441 -2758278 -4451469 -4555440 -3962295 -2925076 -1092106 529214 483128 -407018
35990 -407018 5071 1570968 2087690 1238603 1090948 2094783 1914965 -513622 -2833326
35981 -2833326 -2841424 -1527976 -682968 -20758 1088190 1316136 -518936 -2750080 -2990953
35972 -2990953 -1710857 -1018236 -955762 78763 1838090 2242401 1009742 453630 1965098
35963 1965098 4015190 4627141 3981196 3437697 3347580 2998925 1938629 495901 -548248
35954 -548248 -471689 646056 1622677 1399451 577937 720962 1985578 2627360 1367233
35945 1367233 -706115 -1318537 387772 2935892 3982470 2569252 100239 -1089365
35937a089365P60849J148186J90131N3957J249020J686655J65242j532971j555931
35928A075773q20093q90220r80154L55224K030607J816101p204j192198j091324
35919B96512q91895p76319J96216J502565J428136J56689k45391O71705J071123
35910C409341K35072k35087M58018P93439j82818j056722o55846p8387l79841
35901B307169m04534J064854K760172K627827P84203j083252k128283k453053
35893C475103j906760n13126P52729J108108J058303J136636P08248n90053j506325
35884C722863r51455K7887j19490q50141n09497Q91671J887311J933538J590043
35875G622730Q29359p40851k203825j982263k76390R92981Q96825M55994O00705
$$ plain form
35937 -1089365 -328516 819670 1009801 1063758 2312778 3999433 4164675 2631704 1075773
35928 1075773 255680 -634540 -1614694 -1259470 771137 2587238 2580034 1387836 296512
35919 296512 -595383 -1371702 -1175486 327079 1755215 1911904 1666513 2338218 3409341
35910 3409341 3644413 3409326 3867344 4660783 4477965 3421243 2765397 2687010 2307169
35901 2307169 1902635 2967489 5727661 8355488 9139691 8056439 5928156 3475103
35893 3475103 1568343 1055217 1807946 2916054 3974357 5110993 5819241 5229188 3722863
35884 3722863 2771408 2799295 2679805 1829664 1320167 2211838 4099149 6032687 7622730
35875 7622730 8452089 7711238 5507413 3525150 3248760 4241741 5138566 5594560 6195265
35866F195265Q38442N20555M8020R6416O11161J146081J433382J198827J39887
35857A2228036j439027k485524k168050q30549K44010P3360r69948j525272r55525
35848B171511k75267o04490j206728n06873J146716J681273N50482l90082j5169
35839B551373L64459l54490j044213o16340p7264l67114l78548O13507Q79605
35830A570975o51347j553212L90746K744989J812317j123411j649254N59862J497430
35821C599095j65808j089305O29378K260424J270380q67933j906210k162135k321235
35812g53349j328859R98024K314219J269642r9060N0045L00373q12394j522222
35803D16419l3468J679274R74424p78180o10708P57136M08819j170944o75779
$$ plain form
35866 6195265 7033707 7554262 7602282 7698698 8309859 9455940 10889322 12088149 12228036
35857 12228036 10789009 8303485 6135435 5304886 5548896 5622256 4652308 3127036 2171511
35848 2171511 1896244 1291754 85026 -421847 724869 2406142 2956624 2566542 2551373
35839 2551373 2915832 2561342 1517129 900789 823525 456411 77863 691370 1570975
35830 1570975 919628 -633584 -242838 2502151 4314468 3191057 1541803 2101665 3599095
35821 3599095 3433287 2343982 2973360 5233784 6504164 5636231 3730021 1567886 -753349
35812 -753349 -2082208 -1084184 1230035 2499677 2400617 2450662 2751035 1938641 416419
35803 416419 382951 2062225 3036649 2258469 1647761 2404897 2813716 1642772 966993
35794I66993K060282L278289J236066j151163j081187J50887p5457j572658k257305
35785A554747j525541n73522k07355p2506K25471M54408L03059K9366L54835J558034
35775B100996K596009J798558r01955l170516k845297p59572M62769Q5650p9264
35766g12622J123968K245786J441748p43974k109252j625108l41890L00060M0845
35757c80439m52377o21183l53504K56540Q85366R18439J67570l45953O13335K305612
35747B993406K195180n33335k993155k089072R58119K154378M22011j273398q18621
35738A015513L00203L19452O0978N36414N76338o55652j305356Q1094J281982
35729B210966l51976k992607k523322J138468L746786K778334L07559o98546M1093
$$ plain form
35794 966993 3027275 6305564 7541630 6390467 5309280 5460167 5384710 3812052 1554747
35785 1554747 29206 -544316 -751671 -824177 -598706 -144298 158761 188127 542962 2100996
35775 2100996 4697005 6495563 5593608 2423092 -422205 -1181777 -719008 -633358 -712622
35766 -712622 411346 2657132 4098880 3354906 1245654 -379454 -721344 -421284 -380439
35757 -380439 -832816 -1453999 -1807503 -1550963 -665597 252842 420412 74459 687794 2993406
35747 2993406 5188586 4655251 1662096 -426976 531143 2685521 3107532 1834134 1015513
35738 1015513 1315716 1635168 1696146 2232560 2808898 2153246 847890 928984 2210966
35729 2210966 1858990 -1133617 -3656939 -2518471 1228315 4006649 4314208 3615662 3656755
35720C656755J071573J291983K96212j422722k167103p78438J224132J288711
35712D461103m57412j497262q95459k67127n14176n21442J84517L61232l20366
35703E33608l14292Q62448J341080K5481j427894j342795m46208O7031O06169
35694i5372J537111J698417N34731l84084J1447K87776p20440j449492m84896
35685I35198M37942n54532j633934k28910J940480J260996j350414j422733J604815
35676I88908L067643N16827k409985j968311J07560L28507o72468r3659J486947
35667A351969J039686j361503k263252l45188J579097J046744p44108j525605
35659a222160j173278n44509O06417K310085K728852N04964k198830j851326J391381
$$ plain form
35720 3656755 4728328 6020311 6316523 4893801 2726698 1948260 3172392 4461103
35712 4461103 4003691 2506429 1610970 1343843 829667 308225 492742 853974 533608
35703 533608 219316 1081764 2422844 2448325 1020431 -322364 -768572 -701541 -95372
35694 -95372 1441739 3140156 3674887 3290803 3302250 3590026 2869586 1420094 935198
35685 935198 1373140 818608 -815326 -1044236 896244 2157240 806826 -615907 988908
35676 988908 4056551 4573378 2163393 195082 302642 631149 -41319 -134978 1351969
35667 1351969 2391655 1030152 -1233100 -1578288 809 1047553 303445 -1222160
35659 -1222160 -2395438 -2939947 -2333530 -23445 2705407 3210371 1011541 -839785 551596
35650E51596L521500K129852n41097j267346l32121k76063j621424k384967j445643
35641a665713q774O14826O72469O93994L07279n81200q62544J24964J101552N88164
35631I85017o30133o09834N66830Q02048n91510j612958o73266R03839J042832
35622A82865J54364J69962J140169J144123l91274j545272q10534O93443J033780
35613A771626R9286q37976j145209j095817q62927n05714m29470p81077r29328
35604d716606n03345j91623m50713m28124M21520Q03139l51173j298883L78607
35595f337201L506780M224295J471845j474843j893535j047451j114965j432872
35587d097947k25013J834253K475796J267069j53142p33696r07979j097163r94739
$$ plain form
35650 551596 4073096 6202948 5661851 4394505 4062384 3786321 2164897 -220070 -1665713
35641 -1665713 -1674487 -1059661 -387192 306802 614081 32881 -829663 -704699 396853 985017
35631 985017 354884 -254950 311880 1113928 522418 -1090540 -1763806 -859967 182865
35622 182865 337229 507191 1647360 2791483 2400209 854937 44403 737846 1771626
35613 1771626 1870912 1032936 -112273 -1208090 -2071017 -2576731 -3006201 -3787278 -4716606
35604 -4716606 -5219951 -5411574 -5862287 -6290411 -5868891 -5065752 -5416925 -6715808 -6337201
35595 -6337201 -2830421 1393874 2865719 1390876 -502659 -1550110 -2665075 -4097947
35587 -4097947 -4322960 -2488707 -12911 1254158 1101016 367320 -540659 -1637822 -2632561
35578b632561l64938N27800J200701J124446J66488q15748q76221p08308j758344
35569d136685l164520k053180J857491M673818L464337M43895o79011j22895l76090
35560i2840j180851m06491J246942R77225r49614j247689P28079J718947P1895
35551H65603j562565p98423P87038P42334l62138n17050M34772J293534J577414
35542B460519J261490J3348j704116k292884j237039j63446m13071j155907j131378
35533d362484n07980K45927J454861K819733K866579J329380J09086K87432L68215
35524D610749o91790j157603L31137J634461K63744k194662k342323l79806N40866
35515F14773k78616l43643J149471J623501m52284k704257k283083J84156J990491
$$ plain form
35578 -2632561 -2997499 -2469699 -1268998 -144552 21936 -793812 -1670033 -2378341 -4136685
35569 -4136685 -7301205 -9354385 -7496894 -2823076 641261 1085156 406145 283250 -92840
35560 -92840 -1273691 -1680182 -433240 543985 -405629 -1653318 -925239 793708 865603
35551 865603 -696962 -1495385 -708347 33987 -328151 -845201 -410429 883105 2460519
35542 2460519 3722009 3735357 2031241 -261643 -1498682 -1662128 -2075199 -3231106 -4362484
35533 -4362484 -4870464 -4624537 -3169676 -349943 2516636 3846016 3955102 4242534 4610749
35524 4610749 3918959 2761356 3092493 4726954 4990698 2796036 453713 73907 614773
35515 614773 336157 -7486 1141985 2765486 2313202 -391055 -2674138 -2489982 -499491
35506d99491K016072J135127J50005q13038j401049j114870k35786L88309M92080
35497A17359N36418O78937L66708p14294j800445j762850n82499N15939O65697
35488a979030M40466P00481R85349K15962j263553j797308p95990M22670P09148
$$ plain form
35506 -499491 1516581 2651708 2801713 1988675 587626 -527244 -763030 -374721 117359
35497 117359 653777 1332714 1699422 985128 -815317 -2578167 -3160666 -2644727 -1979030
35488 -1979030 -1538564 -838083 147266 363228 -900325 -2697633 -3493623 -3070953 -2361805
$$ [...]
##END NTUPLES=NMR SPECTRUM
##END=
