##TITLE=31Pdec_P-O
 
 24 sc
 2.4.2024
##JCAMPDX= 6.0         $$ Bruker NMR JCAMP-DX V2.0
##DATA TYPE= NMR SPECTRUM
##DATA CLASS= NTUPLES
##ORIGIN= UXNMR, Bruker Analytische Messtechnik GmbH
##OWNER= root
$$ XWIN-NMR		Version 3.5
$$ Tue Apr  2 14:29:43 2024 Russian Standard Time (UT+4h)  she@DPX200
##.OBSERVE FREQUENCY= 81.013821
##.OBSERVE NUCLEUS= ^31P
##.ACQUISITION MODE= SIMULTANEOUS
##.ACQUISITION SCHEME= undefined
##.AVERAGES= 24
##.DIGITISER RES= 16
##SPECTROMETER/DATA SYSTEM= spect
##.PULSE SEQUENCE= zgpg30
##.SOLVENT NAME= D2O
##.SHIFT REFERENCE= (INTERNAL, D2O, 0, 248.564)
##AUDIT TRAIL= $$ (NUMBER, WHEN, WHO, WHERE, WHAT)
$$ ##TITLE= Audit trail, XWIN-NMR		Version 3.5
$$ ##JCAMPDX= 5.01
$$ ##ORIGIN= Bruker BioSpin GmbH
$$ ##OWNER= she
$$ F:/spectra/data/she/nmr/P31/1/pdata/1/auditp.txt
$$ ##AUDIT TRAIL=  $$ (NUMBER, WHEN, WHO, WHERE, WHAT)
(   1,<2024-04-02 14:27:37.10 +0400>,<she>,<DPX200>,
      <created by zg, POWCHK disabled, PULCHK disabled
       configuration hash MD5:
       00 E9 B6 7A A2 85 ED C7 34 08 36 98 17 FE 4E 26
       data hash MD5: 32K
       3D 41 19 72 A1 C5 AB 55 48 F9 CD CA B5 D5 72 FB>)
(   2,<2024-04-02 14:27:39.45 +0400>,<she>,<DPX200>,
      <Start of raw data processing
       efp BC_mod = 2 LB = 10 FT_mod = 6 PKNL = 1 PHC0 = -13225.12 PHC1 = 86.28333 SI = 64K 
       data hash MD5: 64K
       99 26 B4 B9 DC 0D A6 1B 2E 3F D5 D9 0B 48 6B FF>)
(   3,<2024-04-02 14:28:06.95 +0400>,<she>,<DPX200>,
      <pk PHC0 = -31.16444 PHC1 = 14.6 
       data hash MD5: 64K
       AA 35 02 21 BF 92 51 1E 6E 18 83 AE 3C D0 9E 8D>)
(   4,<2024-04-02 14:28:10.73 +0400>,<she>,<DPX200>,
      <abs ABSG = 5 
       data hash MD5: 64K
       45 8B 85 67 B0 0D 48 8A 20 89 6D 19 8E 57 BF 6B>)
$$ ##END=
$$ 
$$ hash MD5
$$ AE 98 71 98 4B E2 03 4B E6 38 01 88 8D 2B D3 81
##$RELAX= 
##$RELAX= 
##$RELAX= 
##$RELAX= 
##$RELAX= 
##$RELAX= 
##$RELAX= 
##$RELAX= 
##$RELAX= 
$$ Bruker specific parameters
$$ --------------------------
##$DU= <F:/spectra>
##$EXPNO= 1
##$NAME= <P31>
##$PROCNO= 1
##$TYPE= <nmr>
##$USER= <she>
##$AMP= (0..31)
100 100 100 100 100 100 100 100 100 100 100 100 100 100 100 100 100 100 
100 100 100 100 100 100 100 100 100 100 100 100 100 100 
##$AQSEQ= 0
##$AQ_mod= 1
##$AUNM= <au_zg>
##$AUTOPOS= <>
##$BF1= 81.014009
##$BF2= 200.13
##$BF3= 200.13
##$BF4= 200.13
##$BF5= 200.13
##$BF6= 200.13
##$BF7= 200.13
##$BF8= 200.13
##$BYTORDA= 1
##$CFDGTYP= 0
##$CFRGTYP= 5
##$CHEMSTR= <none>
##$CNST= (0..31)
1 1 145 1 1 1 1 1 1 1 1 1 1 1 1 1 1 1 1 1 1 1 1 1 1 1 1 1 1 1 1 1 
##$CPDPRG= <waltz16>
##$CPDPRG1= <>
##$CPDPRG2= <waltz16>
##$CPDPRG3= <>
##$CPDPRG4= <mlev>
##$CPDPRG5= <mlev>
##$CPDPRG6= <mlev>
##$CPDPRG7= <mlev>
##$CPDPRG8= <mlev>
##$CPDPRGB= <>
##$CPDPRGT= <>
##$D= (0..31)
0 1 0 0 0 0 0 0 0 0 0 0.03 2e-05 3e-06 0 0 0 0 0 0 0 0 0 0 0 0 0 0 0 0 
0 0 
##$DATE= 1712053656
##$DBL= (0..7)
120 120 120 11 120 120 24 19 
##$DBP= (0..7)
150 150 150 150 150 150 150 150 
##$DBP07= 0
##$DBPNAM0= <>
##$DBPNAM1= <>
##$DBPNAM2= <>
$$ [...]
##$SUBNAM3= <"">
##$SUBNAM4= <"">
##$SUBNAM5= <"">
##$SUBNAM6= <"">
##$SUBNAM7= <"">
##$SUBNAM8= <"">
##$SUBNAM9= <"">
##$SW= 501.771253377433
##$SWIBOX= (0..15)
0 1 3 0 0 0 0 0 0 0 0 0 0 0 0 0 
##$SW_h= 40650.406504065
##$TD= 32768
##$TD0= 1
##$TE= 0
##$TE2= 300
##$TE3= 300
##$TEG= 300
##$TL= (0..7)
0 120 53 12 22 120 120 120 
##$TP= (0..7)
150 150 150 150 150 150 150 150 
##$TP07= 0
##$TPNAME0= <>
##$TPNAME1= <>
##$TPNAME2= <>
##$TPNAME3= <>
##$TPNAME4= <>
##$TPNAME5= <>
##$TPNAME6= <>
##$TPNAME7= <>
##$TPOAL= (0..7)
0.5 0.5 0.5 0.5 0.5 0.5 0.5 0.5 
##$TPOFFS= (0..7)
0 0 0 0 0 0 0 0 
##$TUNHIN= 0
##$TUNHOUT= 0
##$TUNXOUT= 0
##$USERA1= <user>
##$USERA2= <user>
##$USERA3= <user>
##$USERA4= <user>
##$USERA5= <user>
##$V9= 5
##$VALIST= <valist>
##$VCLIST= <CCCCCCCCCCCCCCC>
##$VD= 0
##$VDLIST= <DDDDDDDDDDDDDDD>
##$VPLIST= <PPPPPPPPPPPPPPP>
##$VTLIST= <TTTTTTTTTTTTTTT>
##$WBST= 1024
##$WBSW= 4
##$XGAIN= (0..3)
0 0 0 0 
##$XL= 0
##$YL= 0
##$YMAX_a= 423857
##$YMIN_a= -307765
##$ZGOPTNS= <>
##$ZL1= 120
##$ZL2= 120
##$ZL3= 120
##$ZL4= 120
##$ABSF1= 248.5645
##$ABSF2= -253.2056
##$ABSG= 5
##$ABSL= 3
##$ALPHA= 0
##$AQORDER= 0
##$ASSFAC= 0
##$ASSFACI= 0
##$ASSFACX= 0
##$ASSWID= 0
##$AUNMP= <proc_1d>
##$AZFE= 0.1
##$AZFW= 0.5
##$BCFW= 0
##$BC_mod= 2
##$BYTORDP= 0
##$COROFFS= 0
##$CY= -3
##$DATMOD= 1
##$DC= 0
##$DFILT= <>
##$DTYPP= 0
##$F1P= 0
##$F2P= 0
##$FCOR= 1
##$FTSIZE= 65536
##$FT_mod= 6
##$GAMMA= 0
##$GB= 0
##$INTBC= 1
##$INTSCL= 6.047779e-11
##$ISEN= 30
##$LB= 10
##$LEV0= 0
##$LPBIN= 0
##$MAXI= 10000
##$MC2= 0
##$MEAN= 0
##$ME_mod= 0
##$MI= 50
##$NCOEF= 0
##$NC_proc= 0
##$NLEV= 6
##$NOISF1= 182.463
##$NOISF2= 159.3651
##$NSP= 0
##$NTH_PI= 0
##$NZP= 0
##$OFFSET= 248.5645
##$PC= 4
##$PHC0= -13256.28
##$PHC1= 100.8833
##$PH_mod= 1
##$PKNL= yes
##$PPARMOD= 0
##$PSCAL= 0
##$PSIGN= 0
##$REVERSE= no
##$SF= 81.0140089999694
##$SI= 65536
##$SIGF1= 159.3651
##$SIGF2= -187.1042
##$SINO= 113.3802
##$SIOLD= 16384
##$SREGLST= <1H.CDCl3>
##$SSB= 0
##$STSI= 65536
##$STSR= 0
##$SW_p= 40650.406504065
##$SYMM= 0
##$S_DEV= 0
##$TDeff= 32768
##$TDoff= 0
##$TI= <>
##$TILT= no
##$TM1= 0
##$TM2= 0
##$TOPLEV= 0
##$USERP1= <user>
##$USERP2= <user>
##$USERP3= <user>
##$USERP4= <user>
##$USERP5= <user>
##$WDW= 1
##$XDIM= 65536
##$YMAX_p= 365164690
##$YMIN_p= -64756
$$ End of Bruker specific parameters
$$ ---------------------------------
##NTUPLES= NMR SPECTRUM
##VAR_NAME=  FREQUENCY,     SPECTRUM/REAL,   SPECTRUM/IMAG
##SYMBOL=    X,             R,               I
##VAR_TYPE=  INDEPENDENT,   DEPENDENT,       DEPENDENT
##VAR_FORM=  AFFN,          ASDF,            ASDF
##VAR_DIM=   65536,         65536,           65536
##UNITS=     HZ,            ARBITRARY UNITS, ARBITRARY UNITS
##FACTOR=    0.620285442955139, 1,           1
##FIRST=     20137.2065510682, 0,            0
##LAST=      -20513.1999529968, 0,           0
##MIN=       -20513.1999529968, -64756,      0
##MAX=       20137.2065510682, 365164690,    0
$$ Real data points
##PAGE= N=1
##DATA TABLE= (X++(R..R)), XYDATA
$$ [...]
40109 -9512 -10037 -10592 -11238 -12015 -12943 -14025 -15257 -16614 -18059 -19538 -20989 -22347 -23555 -24560 -25328 -25836
40093 -25836 -26073 -26042 -25753 -25223 -24472 -23534 -22458 -21322 -20216 -19222 -18396 -17753 -17266 -16874 -16505 -16091 -15585 -14967
40075 -14967 -14239 -13422 -12539 -11623 -10696 -9784 -8911 -8096 -7362 -6723 -6194 -5773 -5452 -5219 -5049 -4907 -4741 -4499 -4147
40056 -4147 -3695 -3189 -2699 -2277 -1945 -1675 -1419 -1122 -744 -289 211 693 1092 1352 1441 1352 1101 724 262 -226
40036 -226 -696 -1103 -1425 -1650 -1780 -1822 -1775 -1635 -1396 -1052 -609 -84 504 1136 1800 2479 3159 3827 4479 5136
40016 5136 5830 6590 7414 8264 9067 9740 10215 10455 10457 10237 9824 9245 8534 7721 6846 5941 5030 4125 3226 2332
39996 2332 1444 568 -292 -1139 -1979 -2810 -3641 -4481 -5340 -6235 -7167 -8125 -9080 -10004 -10868 -11649 -12315 -12828 -13142
39977 -13142 -13212 -13010 -12536 -11812 -10885 -9811 -8646 -7458 -6314 -5287 -4444 -3825 -3444 -3277 -3275 -3365 -3481 -3567 -3602
39958 -3602 -3598 -3600 -3668 -3844 -4155 -4594 -5134 -5732 -6341 -6905 -7377 -7712 -7880 -7868 -7689 -7367 -6932 -6408 -5809 -5151 -4447
39937 -4447 -3722 -3009 -2345 -1768 -1308 -996 -847 -867 -1045 -1359 -1774 -2258 -2779 -3313 -3831 -4305 -4709 -5030 -5280 -5490
39917 -5490 -5708 -5966 -6278 -6636 -7009 -7351 -7603 -7708 -7615 -7301 -6764 -6039 -5176 -4241 -3298 -2406 -1600 -896 -292 215
39897 215 627 930 1104 1127 976 639 116 -570 -1375 -2227 -3056 -3809 -4462 -5015 -5484 -5886 -6221 -6477 -6616 -6594
39877 -6594 -6373 -5940 -5296 -4471 -3501 -2440 -1339 -252 776 1720 2552 3242 3735 3973 3894 3465 2698 1659
39859 1659 454 -777 -1900 -2783 -3337 -3521 -3339 -2852 -2143 -1305 -415 472 1333 2158 2947 3683 4340 4876
39841 4876 5261 5481 5541 5476 5329 5159 5018 4949 4966 5071 5250 5482 5740 5995 6209 6346 6373 6273 6045 5708 5295
39820 5295 4834 4352 3862 3363 2844 2288 1682 1037 375 -264 -853 -1365 -1785 -2099 -2286 -2337 -2246 -2025 -1690 -1260
39800 -1260 -741 -128 584 1391 2266 3163 4028 4802 5434 5889 6150 6216 6106 5848 5469 5007 4495 3971 3467 3010
39780 3010 2616 2293 2038 1834 1650 1452 1218 937 626 304 3 -260 -482 -676 -865 -1070 -1300 -1536 -1743
39761 -1743 -1881 -1907 -1802 -1565 -1221 -821 -430 -112 79 115 1 -240 -557 -884 -1147 -1291 -1293 -1179 -1025 -939 -1034
39740 -1034 -1406 -2106 -3136 -4457 -6003 -7688 -9416 -11079 -12580 -13836 -14797 -15449 -15814 -15940 -15890 -15730 -15509
39723 -15509 -15264 -15006 -14734 -14436 -14098 -13692 -13196 -12581 -11836 -10970 -10025 -9062 -8157 -7380 -6780 -6382 -6185 -6169 -6306
39704 -6306 -6558 -6876 -7206 -7488 -7681 -7761 -7735 -7635 -7509 -7395 -7316 -7277 -7270 -7287 -7330 -7402 -7507 -7641 -7793 -7948 -8096 -8226
39682 -8226 -8326 -8380 -8360 -8236 -7985 -7596 -7080 -6461 -5765 -5019 -4234 -3422 -2593 -1768 -964 -205 487 1093 1590 1956
39662 1956 2174 2236 2144 1916 1583 1168 700 186 -363 -932 -1495 -2015 -2457 -2791 -3005 -3099 -3086 -2980 -2803 -2568 -2295
39641 -2295 -1999 -1714 -1472 -1316 -1275 -1355 -1525 -1736 -1929 -2068 -2143 -2179 -2217 -2303 -2456 -2660 -2861 -2992 -2993 -2833 -2509 -2047
39619 -2047 -1478 -849 -205 402 919 1310 1558 1681 1723 1734 1738 1745 1725 1646 1470 1182 779 281 -289 -902 -1526 -2134
39597 -2134 -2701 -3201 -3611 -3894 -4015 -3944 -3670 -3209 -2612 -1943 -1280 -682 -184 217 555 885 1258 1712 2252 2874
39577 2874 3562 4310 5105 5926 6726 7443 8007 8373 8520 8468 8259 7942 7548 7092 6578 6024 5466 4963 4580 4365
39557 4365 4348 4521 4853 5285 5745 6144 6400 6451 6271 5872 5311 4658 3989 3360 2818 2386 2074 1872 1758 1694
39537 1694 1629 1511 1294 947 473 -101 -718 -1312 -1812 -2171 -2375 -2458 -2486 -2547 -2711 -3029 -3517 -4168 -4963 -5875 -6868
39516 -6868 -7895 -8904 -9850 -10695 -11432 -12069 -12624 -13101 -13485 -13727 -13769 -13560 -13084 -12364 -11462 -10461 -9447 -8492
39498 -8492 -7652 -6960 -6436 -6069 -5832 -5665 -5496 -5247 -4871 -4372 -3810 -3297 -2961 -2924 -3269 -4013 -5099 -6405 -7774
39479 -7774 -9036 -10050 -10709 -10956 -10781 -10233 -9410 -8458 -7530 -6759 -6213 -5892 -5719 -5585 -5378 -5023 -4483 -3768 -2914
39460 -2914 -1978 -1023 -104 741 1508 2216 2896 3578 4274 4979 5663 6290 6819 7221 7486 7627 7663 7612 7475 7250
39440 7250 6935 6541 6093 5622 5155 4706 4275 3852 3412 2933 2384 1748 1019 215 -637 -1496 -2319 -3061 -3694
39421 -3694 -4196 -4574 -4848 -5061 -5267 -5505 -5803 -6156 -6531 -6859 -7056 -7029 -6719 -6105 -5229 -4175 -3060 -1991 -1066
39402 -1066 -338 173 494 663 731 728 669 552 380 152 -127 -456 -820 -1195 -1544 -1834 -2043 -2169 -2228 -2244 -2244 -2251 -2276
39379 -2276 -2312 -2344 -2356 -2344 -2330 -2337 -2390 -2487 -2607 -2711 -2761 -2725 -2586 -2347 -2036 -1700 -1386 -1129 -936 -789 -655 -507 -321
39356 -321 -85 208 565 996 1509 2105 2767 3467 4162 4803 5334 5708 5888 5855 5596 5113 4408 3498 2411 1193
39336 1193 -100 -1406 -2655 -3769 -4684 -5348 -5746 -5890 -5831 -5642 -5406 -5189 -5027 -4926 -4851 -4759 -4596 -4329 -3944
39317 -3944 -3460 -2913 -2366 -1879 -1520 -1335 -1349 -1562 -1945 -2458 -3057 -3712 -4414 -5165 -5968 -6814 -7679 -8519 -9279 -9895
39297 -9895 -10312 -10492 -10436 -10174 -9766 -9285 -8803 -8395 -8128 -8068 -8251 -8689 -9346 -10162 -11062 -11979 -12847 -13615 -14228 -14646
39277 -14646 -14842 -14816 -14582 -14174 -13636 -13021 -12390 -11804 -11310 -10928 -10646 -10431 -10243 -10049 -9841 -9625 -9418 -9236 -9095
39258 -9095 -9008 -8988 -9035 -9143 -9293 -9462 -9611 -9704 -9700 -9566 -9279 -8834 -8238 -7507 -6655 -5691 -4623 -3467 -2251 -1005
39238 -1005 238 1471 2688 3899 5112 6331 7543 8724 9835 10848 11745 12535 13237 13877 14463 14983
39222 14983 15408 15695 15791 15634 15173 14376 13260 11882 10335 8715 7109 5567 4116 2768 1528 401
39206 401 -613 -1531 -2361 -3112 -3787 -4377 -4874 -5281 -5619 -5927 -6257 -6648 -7114 -7637 -8179 -8694 -9150 -9521 -9787
39187 -9787 -9923 -9901 -9692 -9276 -8655 -7854 -6926 -5942 -4991 -4149 -3478 -3004 -2732 -2642 -2709 -2900 -3194 -3577 -4054 -4637
39167 -4637 -5345 -6189 -7159 -8230 -9354 -10478 -11556 -12556 -13454 -14240 -14908 -15448 -15842 -16070 -16108 -15962 -15658 -15259
39149 -15259 -14846 -14502 -14305 -14304 -14518 -14918 -15443 -16010 -16541 -16972 -17283 -17475 -17575 -17615 -17628 -17645 -17687 -17769 -17882 -18002 -18090 -18115
39127 -18115 -18051 -17891 -17641 -17321 -16961 -16613 -16332 -16174 -16174 -16342 -16660 -17090 -17578 -18059 -18469 -18747 -18851 -18759 -18483 -18056
39107 -18056 -17532 -16972 -16437 -15967 -15572 -15230 -14893 -14516 -14074 -13583 -13085 -12648 -12326 -12155 -12133 -12241 -12435 -12673 -12921
39088 -12921 -13151 -13359 -13540 -13710 -13878 -14065 -14287 -14565 -14909 -15327 -15807 -16323 -16837 -17307 -17697 -17986 -18166 -18227 -18146 -17893
39068 -17893 -17434 -16765 -15934 -15037 -14207 -13574 -13225 -13192 -13430 -13850 -14337 -14777 -15073 -15162 -15019 -14667 -14161 -13588 -13031 -12558
39048 -12558 -12206 -11980 -11868 -11841 -11874 -11940 -12021 -12099 -12161 -12186 -12161 -12073 -11911 -11670 -11337 -10904 -10355 -9691 -8921 -8090 -7259 -6510
39026 -6510 -5915 -5514 -5306 -5240 -5236 -5213 -5108 -4884 -4532 -4062 -3521 -2978 -2535 -2287 -2307 -2612 -3160 -3865 -4630 -5385 -6097
39005 -6097 -6768 -7413 -8040 -8638 -9175 -9609 -9903 -10037 -10021 -9888 -9682 -9450 -9227 -9041 -8903 -8800 -8704 -8570 -8360 -8055
38985 -8055 -7656 -7187 -6687 -6192 -5745 -5380 -5116 -4959 -4892 -4888 -4911 -4925 -4895 -4797 -4608 -4323 -3945 -3494 -3007 -2519 -2072 -1696
38963 -1696 -1417 -1248 -1200 -1287 -1530 -1945 -2537 -3296 -4196 -5195 -6246 -7297 -8283 -9145 -9837 -10341 -10661 -10814 -10828 -10731
38943 -10731 -10557 -10335 -10087 -9807 -9472 -9029 -8423 -7620 -6613 -5436 -4151 -2834 -1558 -392 616 1430 2036
38926 2036 2450 2697 2813 2817 2705 2451 2023 1402 593 -369 -1435 -2546 -3654 -4721 -5729 -6677 -7578 -8443
38908 -8443 -9276 -10063 -10781 -11404 -11902 -12251 -12435 -12446 -12284 -11959 -11495 -10927 -10309 -9693 -9122 -8617 -8174 -7763 -7342 -6867
38888 -6867 -6317 -5702 -5051 -4399 -3757 -3118 -2447 -1721 -929 -90 754 1561 2290 2915 3417 3793 4032 4127 4064 3832
38868 3832 3438 2921 2354 1824 1418 1200 1196 1386 1705 2064 2366 2539 2549 2404 2139 1798 1421 1021 587 86
38848 86 -519 -1268 -2167 -3197 -4307 -5423 -6459 -7331 -7970 -8334 -8422 -8252 -7871 -7327 -6664 -5931 -5175 -4456 -3829
38829 -3829 -3349 -3053 -2954 -3036 -3271 -3624 -4061 -4560 -5095 -5644 -6174 -6658 -7059 -7347 -7494 -7471 -7245 -6791 -6101 -5185
38809 -5185 -4079 -2841 -1538 -250 946 1978 2788 3336 3607 3612 3372 2920 2285 1491 554 -493 -1607
38792 -1607 -2728 -3781 -4686 -5376 -5811 -5985 -5937 -5728 -5433 -5136 -4904 -4783 -4789 -4919 -5155 -5478 -5872 -6323 -6813 -7324
38772 -7324 -7843 -8348 -8818 -9221 -9520 -9686 -9692 -9534 -9214 -8750 -8171 -7512 -6820 -6142 -5535 -5046 -4714 -4540 -4507 -4568 -4675
38751 -4675 -4797 -4917 -5038 -5162 -5284 -5384 -5431 -5396 -5255 -5009 -4662 -4227 -3715 -3128 -2473 -1758 -1016 -287 383 967
38731 967 1450 1831 2117 2301 2383 2355 2220 1983 1656 1262 823 367 -100 -594 -1141 -1762 -2455 -3195 -3932 -4613
38711 -4613 -5187 -5616 -5876 -5954 -5850 -5571 -5132 -4554 -3867 -3111 -2348 -1660 -1143 -896 -990 -1464 -2318 -3507 -4958
38692 -4958 -6563 -8196 -9725 -11031 -12025 -12659 -12941 -12922 -12700 -12388 -12105 -11941 -11957 -12176 -12593 -13175 -13858 -14558 -15179
38673 -15179 -15625 -15830 -15756 -15404 -14805 -14010 -13069 -12028 -10925 -9796 -8679 -7625 -6700 -5967 -5492 -5320 -5461 -5891
38655 -5891 -6544 -7334 -8169 -8967 -9662 -10207 -10577 -10774 -10821 -10757 -10617 -10435 -10239 -10046 -9872 -9723 -9597 -9489 -9387 -9269
38635 -9269 -9119 -8914 -8645 -8319 -7958 -7605 -7299 -7077 -6953 -6922 -6958 -7024 -7088 -7127 -7128 -7090 -7015 -6924 -6848 -6832 -6920 -7139 -7495 -7971
38611 -7971 -8540 -9168 -9824 -10475 -11095 -11662 -12165 -12600 -12959 -13240 -13433 -13544 -13584 -13576 -13544 -13499 -13439 -13336 -13148 -12830 -12338
38590 -12338 -11646 -10753 -9695 -8529 -7331 -6168 -5091 -4127 -3287 -2574 -1971 -1456 -989 -524 -23 534 1146
38573 1146 1787 2426 3033 3603 4149 4701 5292 5926 6585 7218 7770 8181 8410 8433 8254 7900 7412 6840 6241 5664
38553 5664 5155 4741 4433 4222 4095 4039 4054 4150 4334 4601 4934 5304 5687 6061 6410 6709 6929 7038 7016 6870 6628
38532 6628 6333 6028 5735 5467 5215 4959 4678 4353 3979 3558 3103 2618 2105 1558 966 329 -345 -1047 -1761
38513 -1761 -2470 -3153 -3787 -4336 -4751 -4972 -4943 -4627 -4014 -3140 -2078 -942 141 1055 1706 2037 2023 1676 1046
38494 1046 223 -669 -1504 -2171 -2613 -2818 -2811 -2630 -2305 -1868 -1345 -765 -173 375 812 1067 1092 866 411 -213
38474 -213 -923 -1626 -2252 -2759 -3155 -3480 -3787 -4115 -4473 -4850 -5227 -5597 -5975 -6387 -6874 -7462 -8160 -8953 -9796 -10636
38454 -10636 -11415 -12090 -12636 -13062 -13395 -13666 -13903 -14110 -14281 -14389 -14404 -14304 -14078 -13745 -13337 -12894 -12452 -12040 -11691
38435 -11691 -11437 -11314 -11350 -11553 -11907 -12376 -12912 -13477 -14033 -14554 -15009 -15376 -15638 -15787 -15822 -15745 -15563 -15293 -14957 -14589
38415 -14589 -14215 -13838 -13434 -12960 -12381 -11691 -10932 -10186 -9551 -9115 -8932 -9012 -9320 -9782 -10298 -10757 -11061 -11141 -10967 -10545
38395 -10545 -9905 -9100 -8187 -7243 -6349 -5592 -5060 -4824 -4931 -5387 -6146 -7123 -8197 -9262 -10224 -11031 -11644 -12040
38377 -12040 -12200 -12109 -11770 -11204 -10453 -9578 -8648 -7732 -6888 -6142 -5496 -4920 -4374 -3820 -3232 -2612 -1980 -1370 -830
38358 -830 -393 -80 106 179 140 -17 -324 -811 -1503 -2402 -3481 -4699 -5997 -7307 -8551 -9645 -10510 -11098
38340 -11098 -11403 -11465 -11346 -11123 -10860 -10606 -10395 -10238 -10129 -10055 -10002 -9972 -9961 -9973 -10000 -10043 -10115 -10228 -10399 -10629 -10906 -11204
38318 -11204 -11491 -11737 -11913 -11990 -11945 -11744 -11367 -10800 -10039 -9098 -8005 -6810 -5574 -4365 -3255 -2299 -1549 -1045
38300 -1045 -810 -849 -1132 -1607 -2198 -2826 -3418 -3903 -4233 -4372 -4308 -4056 -3650 -3142 -2587 -2039 -1552 -1169 -925 -829
38280 -829 -862 -981 -1121 -1218 -1217 -1089 -826 -431 78 682 1352 2042 2707 3298 3776 4120 4324 4405 4388 4292 4135 3921
38258 3921 3658 3355 3030 2703 2386 2090 1825 1587 1368 1139 859 488 1 -596 -1283 -2016 -2758 -3480 -4153
38239 -4153 -4755 -5267 -5672 -5961 -6128 -6170 -6099 -5927 -5667 -5321 -4887 -4359 -3730 -2995 -2149 -1188 -116 1053 2290
38220 2290 3550 4769 5874 6791 7463 7857 7972 7821 7423 6806 5993 5021 3930 2774 1607 466 -626
38203 -626 -1662 -2640 -3553 -4392 -5139 -5780 -6303 -6697 -6969 -7130 -7211 -7252 -7294 -7379 -7543 -7812 -8204 -8719 -9344 -10057 -10830
38182 -10830 -11640 -12457 -13250 -13990 -14669 -15305 -15940 -16624 -17393 -18247 -19149 -20027 -20793 -21374 -21715 -21801 -21637 -21248 -20664
38163 -20664 -19910 -19017 -18013 -16924 -15781 -14602 -13407 -12213 -11028 -9864 -8725 -7615 -6537 -5490 -4474
38148 -4474 -3484 -2516 -1583 -698 114 828 1426 1889 2205 2367 2366 2199 1870 1406 850 250 -346 -919 -1478 -2043
38128 -2043 -2649 -3310 -4019 -4745 -5436 -6044 -6529 -6862 -7043 -7080 -7008 -6881 -6771 -6762 -6917 -7275 -7836 -8570 -9431 -10356 -11267
38107 -11267 -12077 -12705 -13091 -13217 -13107 -12823 -12445 -12051 -11695 -11408 -11195 -11055 -10978 -10966 -11026 -11167 -11398 -11708 -12060 -12396
38087 -12396 -12641 -12735 -12650 -12393 -11998 -11500 -10930 -10313 -9677 -9063 -8508 -8049 -7709 -7496 -7403 -7414 -7499 -7639 -7813 -8006 -8206
38066 -8206 -8394 -8552 -8655 -8693 -8679 -8657 -8696 -8867 -9223 -9780 -10508 -11339 -12185 -12955 -13583 -14030 -14288 -14368 -14280 -14027 -13605
38045 -13605 -12992 -12173 -11133 -9885 -8480 -6994 -5509 -4088 -2747 -1469 -219 1019 2215 3295 4177
38030 4177 4802 5168 5321 5343 5314 5293 5315 5396 5528 5695 5874 6053 6228 6402 6580 6767 6960 7164 7373 7581 7765
38009 7765 7875 7847 7602 7071 6227 5092 3742 2288 838 -523 -1763 -2886 -3923 -4908 -5862 -6780 -7641
37992 -7641 -8408 -9043 -9519 -9820 -9949 -9933 -9817 -9669 -9546 -9488 -9517 -9635 -9839 -10119 -10460 -10832 -11183 -11449 -11574 -11514 -11266
37971 -11266 -10866 -10384 -9931 -9619 -9553 -9800 -10373 -11241 -12341 -13591 -14921 -16263 -17565 -18776 -19839 -20687 -21257
37954 -21257 -21510 -21448 -21108 -20553 -19856 -19090 -18329 -17644 -17076 -16634 -16264 -15874 -15356 -14615 -13600 -12319 -10826 -9204
37936 -9204 -7549 -5950 -4478 -3180 -2077 -1167 -426 173 660 1054 1361 1585 1739 1845 1929 2022 2144 2307
37918 2307 2508 2722 2910 3023 3028 2916 2703 2425 2124 1838 1609 1471 1463 1615 1951 2488 3223 4123 5122 6139
37898 6139 7090 7921 8607 9141 9523 9740 9768 9579 9149 8478 7591 6535 5371 4157 2950 1799 745 -170
37880 -170 -915 -1468 -1817 -1977 -1992 -1926 -1841 -1779 -1759 -1778 -1821 -1859 -1865 -1812 -1692 -1513 -1297 -1084 -908 -804 -793 -867 -1000 -1153
37856 -1153 -1287 -1373 -1404 -1390 -1363 -1350 -1368 -1421 -1487 -1533 -1520 -1420 -1219 -931 -582 -210 150 480 779 1053 1318 1574 1809
37833 1809 2002 2119 2136 2023 1760 1339 768 76 -685 -1469 -2232 -2949 -3596 -4147 -4572 -4841 -4943 -4897 -4733 -4486
37813 -4486 -4183 -3830 -3429 -2982 -2503 -2009 -1535 -1110 -769 -534 -424 -442 -583 -829 -1157 -1541 -1957 -2392 -2833 -3269
37793 -3269 -3692 -4092 -4459 -4785 -5065 -5303 -5507 -5698 -5905 -6160 -6480 -6869 -7301 -7738 -8139 -8464 -8697 -8838 -8904 -8917
37773 -8917 -8884 -8796 -8627 -8354 -7970 -7498 -6985 -6490 -6066 -5731 -5475 -5248 -5001 -4694 -4316 -3871 -3373 -2817 -2186 -1447
37753 -1447 -573 438 1561 2745 3927 5054 6082 6980 7727 8307 8698 8887 8870 8660 8290 7808 7266 6708
37735 6708 6171 5688 5284 4974 4765 4659 4661 4784 5035 5399 5831 6255 6580 6735 6691 6465 6116 5727 5372 5113
37715 5113 4984 4994 5131 5362 5644 5931 6170 6311 6304 6102 5683 5049 4244 3334 2408 1551 840 329 50 -4 117
37694 117 337 568 726 762 660 445 168 -106 -321 -439 -447 -368 -246 -132 -74 -101 -228 -469 -837 -1351 -2008 -2778
37672 -2778 -3615 -4450 -5210 -5841 -6308 -6602 -6739 -6749 -6669 -6543 -6408 -6293 -6218 -6179 -6162 -6148 -6121 -6072 -5989 -5854 -5648 -5361
37650 -5361 -5004 -4616 -4239 -3890 -3569 -3244 -2890 -2497 -2076 -1651 -1257 -917 -657 -506 -489 -630 -949 -1442 -2080 -2809
37630 -2809 -3552 -4235 -4797 -5207 -5468 -5601 -5642 -5634 -5611 -5601 -5621 -5672 -5738 -5799 -5827 -5797 -5684 -5458 -5087 -4548 -3829 -2947 -1948
37607 -1948 -906 82 913 1494 1756 1679 1284 631 -212 -1188 -2255 -3386 -4552 -5728 -6881 -7976 -8984
37590 -8984 -9889 -10679 -11350 -11904 -12338 -12668 -12907 -13076 -13192 -13257 -13258 -13176 -12985 -12665 -12216 -11658 -11045 -10466 -10019 -9794 -9859
37569 -9859 -10237 -10894 -11753 -12706 -13639 -14456 -15085 -15485 -15635 -15532 -15188 -14631 -13899 -13051 -12152 -11276 -10484 -9821 -9297
37550 -9297 -8897 -8576 -8273 -7924 -7463 -6853 -6096 -5232 -4338 -3505 -2819 -2333 -2067 -2002 -2101 -2325 -2641 -3016 -3427 -3840
37530 -3840 -4221 -4544 -4785 -4938 -5008 -5017 -4990 -4951 -4902 -4820 -4661 -4377 -3929 -3305 -2509 -1570 -529 557 1625 2601 3422
37509 3422 4050 4473 4718 4842 4910 4998 5167 5462 5896 6433 7014 7569 8033 8367 8546 8556 8399 8093 7669 7180
37489 7180 6687 6243 5880 5606 5398 5212 5008 4752 4447 4124 3832 3618 3507 3486 3516 3546 3530 3444 3289 3078 2838
37468 2838 2588 2342 2107 1891 1697 1538 1423 1356 1349 1415 1570 1836 2233 2761 3395 4078 4726 5246 5568 5660 5544
37447 5544 5278 4936 4576 4228 3873 3467 2960 2307 1496 549 -486 -1537 -2521 -3378 -4071 -4592 -4962 -5212 -5385
37428 -5385 -5533 -5703 -5933 -6243 -6624 -7044 -7456 -7810 -8066 -8195 -8181 -8007 -7669 -7162 -6495 -5689 -4779 -3814 -2840 -1900
37408 -1900 -1017 -195 567 1279 1947 2567 3141 3671 4158 4606 5014 5376 5687 5940 6130 6248 6289 6237 6085 5828
37388 5828 5478 5079 4697 4403 4252 4270 4447 4752 5143 5568 5994 6395 6766 7115 7444 7742 7978 8122 8137 8014
37368 8014 7768 7437 7074 6723 6405 6132 5920 5790 5762 5844 6002 6173 6277 6236 6002 5570 4972 4269 3529 2800
37348 2800 2102 1433 786 154 -456 -1040 -1591 -2098 -2534 -2873 -3086 -3155 -3094 -2942 -2766 -2643 -2621 -2711 -2880 -3062 -3188
37327 -3188 -3203 -3078 -2804 -2401 -1902 -1351 -794 -262 228 681 1115 1553 2012 2489 2960 3380 3704 3899 3954 3872
37307 3872 3670 3369 2986 2538 2034 1491 941 433 14 -270 -412 -431 -372 -293 -255 -306 -477 -774 -1178 -1645 -2129
37286 -2129 -2579 -2963 -3259 -3460 -3556 -3553 -3466 -3328 -3181 -3066 -3013 -3031 -3117 -3262 -3451 -3668 -3886 -4073 -4203 -4259 -4234 -4138 -3992
37263 -3992 -3814 -3625 -3436 -3255 -3079 -2901 -2691 -2409 -2010 -1458 -744 109 1062 2060 3046 3979 4833 5595 6269
37244 6269 6863 7381 7818 8172 8436 8613 8709 8735 8693 8583 8385 8072 7612 6994 6230 5376 4507 3708 3051 2586
37224 2586 2334 2288 2421 2686 3029 3400 3759 4070 4312 4470 4537 4526 4468 4408 4393 4467 4655 4975 5430 6012 6705 7484
37202 7484 8311 9161 10012 10856 11680 12466 13191 13821 14320 14655 14794 14709 14387 13826 13043 12073 10957 9753 8530
37183 8530 7355 6290 5376 4621 4000 3486 3051 2674 2352 2095 1927 1885 2002 2287 2726 3286 3919 4597 5298
37164 5298 6018 6759 7532 8352 9222 10120 10998 11779 12385 12765 12897 12814 12585 12285 11995 11770 11640 11604 11650 11742 11842
37143 11842 11915 11941 11918 11860 11783 11684 11546 11343 11049 10647 10133 9514 8794 7992 7130 6242 5368 4552 3821 3190 2655
37122 2655 2199 1804 1459 1170 960 866 931 1186 1656 2345 3233 4284 5441 6633 7787 8842 9753 10492
37104 10492 11053 11445 11692 11828 11894 11916 11902 11829 11651 11324 10820 10140 9307 8366 7369 6363 5393 4493 3689 3011
37084 3011 2477 2101 1882 1816 1887 2064 2307 2577 2838 3081 3305 3516 3724 3925 4109 4263 4377 4444 4465 4449 4405
37063 4405 4326 4190 3963 3612 3129 2531 1860 1166 494 -126 -692 -1209 -1682 -2105 -2451 -2684 -2787 -2769 -2667 -2531
37043 -2531 -2412 -2351 -2372 -2506 -2779 -3204 -3777 -4459 -5182 -5870 -6450 -6864 -7080 -7083 -6874 -6474 -5934 -5322 -4724 -4218 -3849
37022 -3849 -3625 -3527 -3519 -3565 -3620 -3642 -3587 -3426 -3162 -2828 -2471 -2123 -1786 -1423 -985 -431 260 1071 1953 2842 3661 4344
37000 4344 4840 5128 5208 5102 4851 4501 4109 3728 3413 3199 3105 3125 3239 3407 3591 3756 3883 3965 4014 4049 4088 4156
36978 4156 4282 4489 4785 5161 5573 5966 6276 6448 6444 6252 5882 5358 4707 3948 3084 2117 1063 -24 -1069
36959 -1069 -1972 -2643 -3020 -3090 -2884 -2479 -1973 -1455 -983 -585 -257 13 237 421 569 672 724 717 652 534 388
36938 388 240 114 18 -60 -155 -313 -580 -991 -1575 -2329 -3231 -4229 -5266 -6288 -7259 -8167 -9007 -9770 -10447 -11012
36918 -11012 -11433 -11673 -11686 -11439 -10913 -10123 -9111 -7948 -6732 -5563 -4529 -3700 -3106 -2734 -2527 -2408 -2297 -2135
36900 -2135 -1895 -1584 -1239 -915 -671 -556 -597 -802 -1156 -1631 -2192 -2805 -3440 -4076 -4696 -5292 -5857 -6389 -6879 -7319
36880 -7319 -7703 -8037 -8326 -8570 -8759 -8874 -8892 -8797 -8597 -8315 -7990 -7669 -7391 -7191 -7097 -7117 -7248 -7469 -7761 -8106 -8486
36859 -8486 -8894 -9306 -9696 -10036 -10307 -10515 -10690 -10875 -11102 -11358 -11584 -11696 -11609 -11267 -10662 -9821 -8795 -7643 -6435
36840 -6435 -5241 -4131 -3172 -2414 -1866 -1497 -1240 -1027 -816 -612 -452 -389 -461 -675 -1007 -1414 -1851 -2277 -2650
36821 -2650 -2942 -3123 -3182 -3127 -2995 -2848 -2756 -2791 -3006 -3436 -4089 -4943 -5939 -6985 -7974 -8799 -9375 -9662 -9671 -9463 -9141
36800 -9141 -8835 -8668 -8725 -9045 -9596 -10303 -11054 -11748 -12306 -12698 -12942 -13088 -13195 -13314 -13482 -13722 -14037 -14429 -14886 -15391
36780 -15391 -15920 -16452 -16972 -17471 -17954 -18420 -18862 -19264 -19613 -19895 -20106 -20245 -20313 -20325 -20314 -20336 -20452 -20709 -21124 -21674
36760 -21674 -22310 -22960 -23553 -24027 -24331 -24438 -24343 -24058 -23607 -23016 -22297 -21450 -20474 -19371 -18172 -16923 -15684 -14508
36742 -14508 -13424 -12443 -11550 -10723 -9943 -9199 -8487 -7810 -7164 -6553 -5981 -5450 -4968 -4533 -4131 -3733 -3316 -2866 -2384
36723 -2384 -1891 -1408 -961 -586 -320 -194 -222 -389 -649 -939 -1190 -1358 -1432 -1427 -1377 -1316 -1272 -1271 -1343 -1520 -1831 -2299 -2919
36700 -2919 -3673 -4519 -5409 -6278 -7062 -7704 -8164 -8431 -8521 -8474 -8345 -8198 -8097 -8102 -8265 -8618 -9166 -9881 -10705 -11569 -12414
36679 -12414 -13197 -13893 -14490 -14969 -15309 -15494 -15533 -15451 -15298 -15128 -14982 -14882 -14817 -14750 -14617 -14343 -13869 -13158 -12209 -11054
36659 -11054 -9753 -8391 -7069 -5889 -4939 -4264 -3869 -3723 -3754 -3875 -3987 -4011 -3899 -3642 -3275 -2853 -2432 -2055
36641 -2055 -1746 -1511 -1353 -1271 -1270 -1354 -1523 -1775 -2095 -2445 -2774 -3028 -3162 -3163 -3041 -2826 -2553 -2256 -1973 -1733 -1562
36620 -1562 -1469 -1444 -1456 -1460 -1421 -1318 -1154 -951 -737 -533 -348 -179 -26 112 230 311 336 277 115 -151 -494 -861
36598 -861 -1191 -1436 -1575 -1609 -1553 -1414 -1178 -827 -342 283 1043 1924 2911 3992 5154 6360 7563 8695 9689
36579 9689 10500 11131 11623 12044 12460 12927 13475 14111 14815 15546 16241 16835 17264 17477 17443 17139 16567 15745 14706
36560 14706 13508 12221 10923 9691 8597 7696 7016 6555 6287 6171 6158 6196 6233 6227 6157 6034 5897 5793 5759 5816
36540 5816 5969 6209 6522 6877 7229 7516 7682 7689 7516 7155 6608 5879 4977 3922 2736 1449 90 -1306
36522 -1306 -2711 -4103 -5471 -6813 -8110 -9326 -10395 -11242 -11806 -12067 -12033 -11750 -11266 -10636 -9900 -9092 -8242
36505 -8242 -7386 -6557 -5792 -5129 -4596 -4210 -3966 -3843 -3797 -3774 -3721 -3599 -3382 -3056 -2611 -2050 -1387 -656 90 796
36485 796 1403 1859 2123 2171 2017 1708 1324 954 672 514 472 503 549 550 472 313 102 -122 -331 -516 -693 -888
36463 -888 -1118 -1386 -1684 -1997 -2311 -2613 -2891 -3126 -3298 -3395 -3424 -3399 -3342 -3266 -3172 -3041 -2841 -2533 -2087 -1507 -841 -177
36441 -177 382 753 886 767 420 -107 -746 -1417 -2032 -2517 -2825 -2949 -2909 -2746 -2497 -2193 -1845 -1459 -1044 -620
36421 -620 -220 111 326 389 286 27 -362 -845 -1387 -1950 -2488 -2937 -3229 -3304 -3140 -2757 -2208 -1573 -931 -347
36401 -347 133 487 709 805 794 702 560 393 212 5 -240 -532 -857 -1183 -1466 -1665 -1755 -1727 -1590 -1366 -1083
36380 -1083 -768 -441 -122 162 387 535 613 652 705 832 1079 1458 1954 2515 3075 3556 3892 4036 3957 3648 3128
36359 3128 2441 1646 813 5 -728 -1347 -1822 -2135 -2294 -2344 -2350 -2395 -2549 -2857 -3319 -3904 -4557 -5221 -5840 -6374 -6798
36338 -6798 -7114 -7338 -7507 -7665 -7849 -8085 -8387 -8754 -9177 -9636 -10099 -10529 -10877 -11109 -11208 -11192 -11100 -10990 -10918 -10935 -11077
36317 -11077 -11351 -11743 -12214 -12716 -13212 -13678 -14114 -14522 -14897 -15216 -15451 -15575 -15579 -15473 -15293 -15095 -14949 -14922 -15064 -15386
36297 -15386 -15865 -16454 -17091 -17708 -18241 -18634 -18844 -18843 -18628 -18218 -17641 -16924 -16081 -15114 -14019 -12807 -11525 -10256
36279 -10256 -9102 -8152 -7457 -7006 -6728 -6511 -6234 -5810 -5199 -4425 -3554 -2671 -1845 -1112 -473 90 597 1053 1443
36260 1443 1739 1902 1893 1688 1282 701 -4 -770 -1542 -2285 -2992 -3677 -4365 -5071 -5810 -6580 -7377 -8186 -8977 -9703
36240 -9703 -10306 -10720 -10898 -10809 -10455 -9852 -9042 -8088 -7074 -6089 -5206 -4477 -3911 -3489 -3180 -2964 -2832 -2795 -2870 -3074
36220 -3074 -3410 -3864 -4405 -4993 -5578 -6115 -6553 -6855 -6986 -6932 -6708 -6355 -5937 -5527 -5182 -4940 -4792 -4704 -4626 -4509
36200 -4509 -4317 -4034 -3659 -3205 -2689 -2126 -1533 -937 -374 109 469 688 784 814 856 981 1237 1634 2148 2727
36180 2727 3316 3862 4322 4661 4863 4928 4873 4717 4481 4183 3829 3420 2953 2439 1903 1389 934 564 279 58
36160 58 -126 -292 -446 -588 -724 -870 -1051 -1286 -1577 -1904 -2227 -2498 -2676 -2740 -2694 -2571 -2427 -2311 -2266 -2311 -2448
36139 -2448 -2671 -2966 -3326 -3754 -4254 -4824 -5445 -6085 -6692 -7228 -7661 -7984 -8196 -8302 -8306 -8228 -8092 -7937 -7805 -7737 -7754
36118 -7754 -7858 -8023 -8208 -8366 -8460 -8459 -8353 -8138 -7817 -7413 -6963 -6517 -6137 -5877 -5766 -5795 -5928 -6102 -6254 -6339 -6332 -6238
36096 -6238 -6065 -5829 -5532 -5173 -4751 -4284 -3799 -3324 -2885 -2493 -2136 -1797 -1455 -1099 -721 -321 103 547 1008
36077 1008 1473 1928 2351 2725 3042 3311 3546 3773 4019 4303 4626 4973 5312 5618 5870 6058 6178 6220 6172 6013
36057 6013 5736 5353 4895 4407 3938 3521 3170 2875 2614 2384 2206 2120 2180 2425 2871 3494 4251 5078 5914 6710
36037 6710 7437 8090 8670 9191 9660 10095 10505 10901 11272 11600 11854 12016 12088 12111 12148 12268 12513 12893 13370 13875
36017 13875 14311 14588 14628 14391 13880 13142 12255 11313 10401 9576 8873 8304 7875 7589 7453 7465 7613 7864 8174 8489
35997 8489 8754 8919 8946 8818 8531 8099 7554 6947 6333 5774 5313 4986 4802 4739 4745 4757 4725 4631 4490 4328 4161 3984
35975 3984 3774 3519 3229 2931 2668 2465 2335 2262 2226 2200 2172 2143 2120 2111 2120 2153 2222 2345 2537 2807 3139 3494 3810
35952 3810 4022 4075 3940 3599 3060 2348 1509 612 -261 -1028 -1611 -1958 -2034 -1834 -1376 -702 124 1024 1913 2707
35932 2707 3333 3739 3908 3842 3556 3079 2445 1701 904 125 -576 -1175 -1680 -2144 -2638 -3231 -3962 -4829 -5790 -6781
35912 -6781 -7741 -8631 -9437 -10158 -10782 -11275 -11585 -11652 -11424 -10871 -9990 -8798 -7330 -5634 -3774 -1824 130 1997
35894 1997 3679 5080 6129 6787 7068 7024 6745 6316 5802 5227 4587 3866 3056 2171 1245 333 -496 -1173 -1639
35875 -1639 -1863 -1851 -1638 -1273 -794 -226 413 1107 1838 2582 3311 3998 4615 5143 5571 5907 6170 6387 6577 6745
35855 6745 6875 6939 6913 6770 6495 6069 5489 4770 3952 3100 2285 1558 941 418 -49 -499 -954 -1415 -1856 -2247
35835 -2247 -2560 -2786 -2940 -3057 -3182 -3351 -3594 -3924 -4341 -4834 -5382 -5952 -6501 -6982 -7357 -7605 -7723 -7729 -7648 -7504
35815 -7504 -7317 -7089 -6819 -6518 -6222 -5978 -5852 -5899 -6149 -6600 -7213 -7916 -8621 -9240 -9704 -9977 -10056 -9975 -9783 -9531
35795 -9531 -9262 -8998 -8746 -8511 -8295 -8114 -8003 -8006 -8167 -8517 -9048 -9715 -10431 -11093 -11601 -11889 -11933 -11752 -11399 -10944
35775 -10944 -10453 -9964 -9495 -9053 -8653 -8320 -8086 -7977 -8002 -8149 -8387 -8666 -8925 -9104 -9148 -9018 -8706 -8246 -7707 -7189
35755 -7189 -6798 -6625 -6724 -7096 -7699 -8457 -9279 -10074 -10763 -11287 -11615 -11746 -11693 -11478 -11126 -10663 -10111 -9494 -8842 -8191
35735 -8191 -7581 -7041 -6591 -6243 -6007 -5880 -5849 -5885 -5950 -6008 -6028 -6001 -5929 -5829 -5715 -5609 -5531 -5499 -5522 -5586 -5655 -5686 -5644 -5513
35711 -5513 -5305 -5055 -4803 -4587 -4419 -4289 -4159 -3980 -3709 -3317 -2806 -2217 -1618 -1078 -640 -300 -18 266 597
35692 597 988 1431 1902 2377 2840 3278 3685 4067 4434 4803 5189 5595 6019 6451 6867 7240 7538 7735 7800 7711
35672 7711 7445 6996 6380 5637 4836 4055 3384 2905 2678 2727 3043 3589 4307 5129 5981 6791 7501 8067 8467 8704
35652 8704 8799 8784 8686 8520 8293 8008 7682 7334 6992 6683 6423 6218 6057 5929 5825 5745 5698 5694 5747 5870 6059 6300
35630 6300 6568 6833 7074 7291 7502 7745 8050 8430 8869 9337 9780 10132 10325 10289 9982 9400 8569 7554 6430
35611 6430 5287 4219 3310 2630 2221 2092 2211 2522 2947 3415 3870 4267 4581 4797 4907 4911 4806 4584 4243
35592 4243 3792 3257 2687 2136 1651 1268 1001 856 830 916 1097 1348 1638 1940 2235 2517 2777 3000 3165 3249
35572 3249 3226 3075 2785 2353 1792 1143 461 -183 -733 -1164 -1491 -1758 -2015 -2293 -2602 -2924 -3233 -3494 -3675 -3748
35552 -3748 -3697 -3520 -3234 -2886 -2553 -2329 -2304 -2531 -3019 -3716 -4527 -5328 -5988 -6382 -6419 -6040 -5234 -4042 -2547 -865
35532 -865 882 2595 4200 5664 6982 8172 9253 10238 11115 11868 12479 12944 13283 13525 13709 13850 13952
35515 13952 14011 14024 14007 13974 13933 13894 13859 13846 13878 13977 14151 14391 14675 14962 15205 15349 15351 15185 14860 14411 13883 13318 12734
35492 12734 12136 11522 10901 10289 9702 9149 8628 8139 7687 7283 6943 6671 6464 6302 6156 5986 5757 5443 5033
35473 5033 4532 3965 3361 2755 2175 1633 1132 671 254 -103 -380 -544 -564 -414 -84 419 1068 1819 2619 3416
35453 3416 4165 4829 5385 5821 6145 6391 6601 6822 7091 7430 7851 8357 8952 9634 10389 11175 11941 12617 13141
35434 13141 13475 13608 13557 13361 13066 12713 12326 11923 11517 11133 10808 10575 10452 10427 10456 10476 10425 10256 9938 9465 8857
35413 8857 8165 7461 6821 6302 5931 5700 5572 5492 5392 5215 4943 4600 4241 3915 3635 3364 3024 2531 1826 889
35393 889 -235 -1462 -2680 -3779 -4680 -5334 -5731 -5885 -5832 -5620 -5292 -4887 -4438 -3976 -3536 -3148 -2840 -2622 -2492
35374 -2492 -2440 -2449 -2497 -2564 -2624 -2661 -2658 -2607 -2510 -2374 -2215 -2062 -1948 -1913 -1998 -2246 -2679 -3296 -4055 -4890 -5716 -6444 -7001 -7333
35350 -7333 -7415 -7248 -6869 -6337 -5724 -5107 -4543 -4068 -3695 -3415 -3208 -3043 -2873 -2646 -2302 -1796 -1105 -243 746 1801
35330 1801 2860 3878 4821 5660 6373 6937 7344 7601 7729 7762 7728 7659 7564 7439 7263 7014 6680 6270 5811 5338
35310 5338 4880 4456 4073 3737 3467 3294 3259 3395 3710 4191 4805 5510 6267 7036 7793 8516 9208 9894 10611 11403
35290 11403 12290 13269 14301 15325 16278 17115 17815 18376 18814 19155 19423 19645 19841 20023 20193 20342 20459 20535 20561
35271 20561 20542 20489 20418 20336 20235 20089 19860 19505 19002 18351 17585 16746 15874 14986 14083 13158 12207 11249 10315 9438
35251 9438 8638 7915 7260 6661 6121 5653 5284 5049 4982 5104 5418 5901 6501 7151 7772 8296 8670 8862 8861 8680
35231 8680 8339 7885 7377 6895 6524 6333 6368 6637 7126 7794 8587 9444 10310 11134 11878 12501 12975 13273 13393 13345
35211 13345 13158 12876 12555 12263 12066 12017 12153 12484 12991 13635 14352 15075 15749 16345 16867 17331 17746 18106 18387
35192 18387 18567 18637 18613 18534 18445 18390 18405 18506 18685 18902 19102 19216 19184 18973 18570 17992 17260 16393 15407 14311 13119
35171 13119 11856 10554 9263 8041 6933 5968 5154 4474 3916 3461 3107 2845 2663 2552 2499 2507 2587 2747 2985
35152 2985 3266 3539 3743 3831 3792 3657 3484 3339 3269 3298 3427 3635 3910 4240 4615 5025 5456 5886 6293 6646 6909
35131 6909 7041 7018 6832 6502 6067 5582 5107 4695 4376 4158 4016 3916 3810 3652 3406 3047 2562 1968 1301 620
35111 620 -3 -506 -842 -992 -963 -778 -472 -79 359 814 1269 1729 2222 2784 3438 4184 4987 5774 6452 6930
35091 6930 7137 7056 6717 6206 5632 5101 4683 4397 4215 4083 3940 3747 3489 3177 2839 2514 2235 2040 1952 1987
35071 1987 2134 2358 2607 2828 2988 3069 3076 3009 2869 2644 2321 1897 1392 856 353 -48 -296 -371 -273 -24 349
35050 349 816 1355 1945 2564 3192 3817 4430 5036 5645 6265 6909 7580 8261 8922 9507 9955 10214 10259 10096 9759
35030 9759 9305 8812 8366 8051 7933 8048 8397 8944 9637 10422 11259 12130 13035 13968 14919 15862 16750 17527 18143
35011 18143 18557 18761 18772 18640 18420 18163 17906 17672 17471 17315 17206 17139 17092 17021 16879 16621 16219 15671 14997 14236
34991 14236 13424 12583 11717 10820 9889 8949 8044 7245 6626 6255 6179 6413 6935 7697 8632 9664 10719 11741
34973 11741 12691 13554 14320 14979 15513 15897 16114 16162 16058 15834 15523 15153 14744 14313 13887 13483 13125 12828 12599
34954 12599 12436 12336 12304 12357 12518 12800 13202 13702 14267 14867 15469 16055 16620 17171 17727 18314 18955 19672 20474 21360
34934 21360 22319 23335 24383 25429 26438 27374 28205 28894 29405 29701 29755 29562 29141 28540 27811 26998 26120 25174
34916 25174 24148 23031 21822 20532 19190 17836 16512 15261 14111 13083 12191 11460 10928 10632 10592 10801
34900 10801 11219 11786 12436 13106 13746 14324 14812 15194 15444 15535 15448 15185 14770 14258 13711 13193 12757 12446 12298 12339
34880 12339 12578 12996 13545 14154 14733 15198 15473 15508 15278 14771 13981 12906 11556 9971 8222 6415 4670
34863 4670 3103 1807 844 225 -74 -122 1 229 519 870 1292 1783 2312 2821 3239 3506 3580 3449 3132
34844 3132 2677 2144 1602 1120 754 550 524 677 984 1409 1908 2445 2990 3527 4039 4510 4927 5284 5591 5872
34824 5872 6151 6440 6745 7061 7387 7715 8026 8286 8446 8456 8274 7892 7330 6635 5870 5101 4390 3786 3312 2962
34804 2962 2710 2528 2402 2334 2350 2484 2761 3194 3764 4425 5107 5731 6223 6526 6616 6506 6244 5910 5589 5371
34784 5371 5314 5448 5761 6210 6742 7303 7848 8350 8803 9218 9631 10079 10595 11187 11834 12482 13064 13516 13797 13910
34764 13910 13894 13816 13753 13769 13904 14159 14507 14911 15324 15711 16047 16335 16590 16855 17177 17598 18153 18860 19722 20741
34744 20741 21912 23225 24658 26175 27721 29228 30631 31879 32952 33852 34596 35193 35637 35901 35954 35779
34728 35779 35374 34760 33966 33032 32019 30992 30018 29146 28392 27736 27133 26521 25846 25065 24152 23102 21927 20658
34710 20658 19347 18062 16877 15851 15018 14379 13906 13560 13307 13118 12963 12798 12573 12244 11789 11215 10557 9872
34692 9872 9225 8675 8271 8049 8022 8185 8519 8996 9590 10286 11075 11955 12915 13931 14956 15941 16832 17590 18196
34673 18196 18643 18933 19065 19032 18835 18493 18048 17569 17136 16812 16635 16601 16666 16762 16818 16788 16666 16502 16378 16402 16659
34652 16659 17201 18024 19078 20292 21586 22898 24162 25328 26347 27186 27824 28255 28492 28561 28500 28348 28137
34635 28137 27888 27621 27348 27081 26826 26579 26332 26081 25834 25607 25427 25330 25345 25484 25736 26057 26380 26620 26696 26566
34615 26566 26227 25721 25110 24470 23877 23391 23051 22859 22784 22767 22749 22697 22611 22518 22457 22462 22545 22701 22908 23137 23350 23514
34593 23514 23599 23587 23467 23244 22933 22562 22172 21801 21481 21227 21033 20879 20734 20563 20345 20074 19777 19493 19267 19117
34573 19117 19032 18970 18878 18715 18461 18127 17764 17445 17256 17262 17498 17951 18584 19334 20142 20964 21781 22587 23397 24225 25077
34552 25077 25949 26814 27628 28340 28903 29282 29459 29440 29235 28864 28336 27654 26817 25831 24717 23523 22324 21212
34534 21212 20287 19633 19291 19255 19456 19781 20099 20287 20259 19979 19457 18740 17898 17013 16175 15456 14908 14549 14375 14376
34514 14376 14543 14861 15310 15852 16439 17030 17589 18097 18547 18941 19288 19600 19889 20162 20417 20645 20838 20991 21110
34495 21110 21210 21315 21449 21636 21884 22195 22560 22979 23463 24026 24677 25413 26212 27040 27866 28671 29457 30234 31014
34476 31014 31796 32573 33324 34030 34669 35227 35689 36049 36301 36427 36405 36205 35808 35212 34440 33531 32530 31493 30470
34457 30470 29522 28714 28102 27728 27605 27726 28064 28582 29232 29952 30683 31367 31957 32415 32712 32826 32738 32441 31938
34438 31938 31248 30403 29444 28414 27348 26280 25247 24293 23469 22821 22376 22133 22066 22133 22292 22517 22802 23150
34420 23150 23567 24051 24591 25175 25803 26483 27223 28022 28870 29754 30662 31583 32507 33415 34289 35105 35835 36451 36923
34401 36923 37220 37330 37245 36971 36529 35955 35311 34667 34084 33600 33223 32940 32740 32619 32580 32614 32696 32786 32841 32840 32776 32672
34379 32672 32562 32488 32478 32545 32672 32834 32997 33129 33201 33190 33065 32804 32390 31825 31119 30299 29409 28500 27648 26939 26450
34358 26450 26241 26343 26750 27433 28335 29375 30462 31498 32398 33090 33523 33667 33509 33060 32354 31445 30410 29327
34340 29327 28277 27317 26483 25790 25218 24747 24354 24027 23769 23600 23533 23584 23755 24034 24387 24770 25132 25440 25686
34321 25686 25903 26152 26511 27045 27777 28685 29702 30752 31766 32712 33587 34409 35197 35953 36661 37284 37786 38126
34303 38126 38289 38264 38050 37644 37043 36257 35308 34243 33119 31989 30900 29885 28964 28147 27433 26811 26274 25816
34285 25816 25452 25209 25138 25287 25695 26368 27274 28349 29511 30683 31805 32850 33817 34719 35564 36358 37097 37781
34267 37781 38416 39014 39582 40120 40615 41040 41365 41569 41641 41591 41443 41232 40993 40733 40438 40072 39610 39050 38428 37802
34247 37802 37236 36791 36518 36457 36641 37085 37780 38690 39745 40849 41900 42811 43528 44031 44334 44464 44451 44314 44068
34228 44068 43724 43301 42825 42330 41844 41390 40977 40606 40268 39949 39622 39253 38808 38265 37623 36906 36149 35387 34640
34209 34640 33910 33196 32509 31880 31350 30960 30734 30670 30752 30940 31190 31441 31646 31768 31789 31724 31606 31483 31398 31395 31495
34188 31495 31705 32011 32395 32832 33304 33795 34289 34760 35178 35509 35718 35778 35674 35400 34966 34393 33714 32959 32167
34169 32167 31370 30597 29870 29196 28580 28033 27583 27271 27137 27207 27492 27980 28649 29462 30368 31309 32235 33123 33988
34150 33988 34883 35881 37049 38426 40010 41754 43576 45380 47065 48546 49757 50652 51203 51398 51244 50766
34134 50766 50012 49052 47975 46877 45840 44920 44143 43515 43034 42693 42477 42368 42341 42362 42391 42382 42286 42057 41666 41113
34114 41113 40440 39725 39068 38570 38298 38283 38512 38944 39520 40168 40825 41424 41917 42270 42477 42552 42530 42455 42363 42282 42230
34093 42230 42223 42282 42441 42739 43198 43819 44574 45411 46278 47133 47953 48728 49464 50171 50862 51544 52215 52868 53478 54014
34073 54014 54435 54699 54783 54685 54429 54064 53662 53299 53036 52906 52909 53009 53150 53269 53319 53283 53171 53010 52814 52581 52297
34052 52297 51951 51549 51112 50660 50208 49762 49330 48926 48574 48295 48095 47963 47867 47775 47665 47530 47389 47295 47330 47575
34032 47575 48099 48913 49964 51139 52298 53307 54052 54474 54557 54328 53848 53196 52453 51681 50918 50171 49432 48692
34014 48692 47951 47234 46566 45984 45513 45164 44945 44865 44932 45155 45533 46054 46689 47398 48139 48875 49578 50240 50864 51467
33994 51467 52065 52671 53289 53904 54486 54989 55369 55593 55654 55565 55351 55033 54618 54094 53435 52628 51677 50618 49508
33975 49508 48415 47410 46551 45884 45440 45239 45286 45574 46080 46781 47638 48615 49670 50753 51810 52796 53688 54487
33957 54487 55222 55937 56680 57495 58417 59469 60653 61965 63386 64894 66456 68028 69554 70980 72261 73366
33941 73366 74278 74985 75493 75812 75965 75972 75860 75645 75329 74900 74334 73602 72693 71627 70459 69272 68156 67183
33923 67183 66399 65811 65401 65130 64951 64809 64655 64445 64149 63753 63251 62642 61924 61104 60202 59259 58330 57471 56729
33904 56729 56121 55638 55236 54864 54481 54073 53657 53267 52945 52727 52627 52634 52723 52870 53055 53269 53515 53799 54141 54563
33884 54563 55097 55763 56562 57476 58465 59479 60473 61401 62225 62903 63411 63740 63914 63978 63995 64034 64166 64444 64895 65505
33864 65505 66227 66979 67685 68280 68730 69036 69221 69323 69365 69364 69326 69254 69153 69034 68914 68823 68793 68852 69024 69311 69713 70218
33842 70218 70809 71455 72117 72749 73304 73744 74040 74166 74101 73822 73319 72600 71717 70760 69854 69129 68688 68582 68800
33823 68800 69280 69937 70681 71434 72134 72727 73166 73408 73434 73254 72904 72428 71873 71281 70683 70100 69556 69069 68668
33804 68668 68374 68198 68132 68148 68210 68284 68348 68398 68447 68516 68622 68761 68910 69045 69155 69253 69382 69599 69956 70489 71199 72058
33782 72058 73018 74029 75056 76089 77133 78213 79358 80591 81916 83305 84693 85992 87106 87960 88510
33767 88510 88746 88690 88386 87895 87283 86627 85995 85438 84989 84659 84445 84346 84373 84553 84923 85512 86329 87346 88497
33748 88497 89696 90867 91951 92923 93779 94527 95175 95718 96148 96458 96651 96739 96733 96631 96413 96040 95465 94665 93648
33729 93648 92469 91211 89964 88813 87809 86984 86347 85892 85609 85482 85503 85668 85975 86418 86980 87639 88363 89117
33711 89117 89866 90579 91235 91828 92355 92810 93189 93488 93723 93925 94150 94454 94887 95489 96282 97284 98496 99903
33693 99903 101456 103085 104701 106231 107620 108842 109887 110743 111393 111819 112018 112008 111838 111572 111273 110990 110756
33676 110756 110598 110541 110607 110809 111149 111605 112146 112714 113232 113614 113780 113679 113303 112693 111931 111128 110395 109821 109457
33657 109457 109311 109358 109548 109818 110111 110381 110608 110791 110945 111072 111166 111213 111203 111132 111016 110880 110758 110688 110706 110845 111130
33636 111130 111566 112140 112823 113576 114356 115134 115905 116679 117473 118299 119145 119989 120798 121551 122232 122830 123336 123730 123981
33617 123981 124052 123916 123584 123111 122590 122137 121854 121817 122067 122609 123427 124487 125742 127135 128608 130094 131524
33600 131524 132828 133951 134852 135513 135940 136171 136267 136311 136376 136518 136755 137061 137372 137617 137722 137639 137347 136860 136223
33581 136223 135493 134731 133987 133293 132664 132105 131623 131230 130935 130743 130647 130633 130688 130807 131018 131360 131876 132590 133493 134550
33561 134550 135702 136871 137988 139003 139886 140648 141314 141917 142480 143008 143497 143944 144342 144682 144949 145124 145192 145144
33543 145144 144989 144746 144448 144137 143873 143724 143769 144066 144652 145520 146622 147893 149252 150631 151970 153233 154408
33526 154408 155512 156569 157601 158630 159676 160767 161923 163146 164401 165627 166753 167725 168520 169141 169618
33511 169618 169987 170287 170553 170816 171106 171467 171946 172593 173436 174470 175640 176853 178018 179069 179993 180810 181562
33494 181562 182287 183007 183725 184442 185163 185903 186691 187552 188499 189521 190580 191616 192577 193434 194184 194852 195486 196139
33476 196139 196854 197643 198486 199333 200112 200756 201219 201501 201641 201717 201828 202087 202595 203437 204651 206233 208116 210193
33458 210193 212334 214414 216349 218120 219759 221341 222948 224633 226414 228264 230129 231948 233675 235295
33444 235295 236818 238285 239753 241279 242914 244684 246599 248636 250768 252959 255173 257382 259567 261705
33430 261705 263770 265715 267481 269011 270267 271249 271993 272559 273024 273470 273973 274587 275333 276192 277113 278027 278887
33413 278887 279680 280433 281200 282036 282983 284052 285231 286509 287886 289381 291018 292823 294787 296877 299024
33398 299024 301143 303158 305013 306687 308196 309587 310923 312266 313659 315122 316653 318238 319868 321535
33384 321535 323231 324946 326667 328384 330090 331776 333430 335027 336538 337931 339190 340301 341263 342074 342743
33369 342743 343287 343723 344068 344332 344524 344654 344735 344779 344800 344814 344837 344900 345049 345338 345821 346541 347516 348738 350168 351757
33349 351757 353439 355152 356848 358500 360102 361664 363207 364757 366344 367986 369687 371423 373152 374826
33335 374826 376412 377900 379315 380694 382073 383472 384893 386304 387659 388901 389977 390851 391505 391951 392227
33320 392227 392384 392478 392550 392641 392775 392969 393244 393612 394081 394656 395334 396111 396990 397982 399109 400391 401838 403440
33302 403440 405157 406934 408704 410403 411991 413460 414834 416150 417446 418744 420047 421355 422674 424040
33288 424040 425526 427232 429265 431706 434589 437900 441588 445585 449807 454162 458553 462879 467045 470974
33274 470974 474615 477946 480971 483706 486170 488377 490328 492020 493458 494656 495643 496455 497127 497691 498165
33259 498165 498565 498901 499201 499499 499844 500291 500886 501655 502592 503673 504866 506143 507483 508872 510290 511716
33243 511716 513122 514483 515791 517051 518303 519603 521027 522645 524506 526627 528982 531503 534094 536651
33229 536651 539080 541312 543317 545100 546702 548181 549597 551003 552433 553904 555416 556956 558511 560063
33215 560063 561611 563160 564721 566297 567887 569485 571083 572672 574242 575782 577285 578750 580179 581591
33201 581591 583018 584499 586084 587814 589724 591820 594099 596551 599165 601933 604842 607865 610960 614063
33187 614063 617102 620016 622766 625352 627807 630193 632588 635071 637710 640555 643637 646963 650515 654260
33173 654260 658160 662177 666270 670387 674481 678507 682425 686217 689879 693416 696838 700157 703385 706535
33159 706535 709601 712566 715404 718089 720603 722953 725162 727253 729258 731201 733109 735021 736976 739014
33145 739014 741152 743393 745723 748128 750616 753216 755968 758916 762100 765540 769231 773134 777174 781253
33131 781253 785267 789125 792766 796165 799333 802303 805136 807891 810641 813457 816412 819576 823015 826786
33117 826786 830938 835498 840458 845779 851388 857191 863088 868981 874794 880470 885975 891290 896411 901335
33103 901335 906059 910578 914893 919014 922965 926791 930554 934326 938176 942155 946288 950583 955040 959669
33089 959669 964502 969575 974919 980544 986421 992498 998701 1004963 1011234 1017488 1023708 1029892 1036050 1042203
33075 1042203 1048375 1054600 1060917 1067375 1074024 1080919 1088112 1095648 1103543 1111778 1120302 1129034 1137887 1146780
33061 1146780 1155656 1164487 1173287 1182106 1191025 1200128 1209464 1219034 1228780 1238600 1248367 1257959 1267285 1276298
33047 1276298 1285001 1293434 1301659 1309733 1317702 1325601 1333462 1341308 1349151 1356993 1364833 1372663 1380478 1388278
33033 1388278 1396098 1403997 1412067 1420412 1429131 1438300 1447951 1458083 1468672 1479688 1491095 1502869 1514990
33020 1514990 1527442 1540215 1553312 1566753 1580566 1594772 1609369 1624341 1639655 1655274 1671163
33009 1671163 1687295 1703645 1720179 1736862 1753663 1770562 1787562 1804675 1821924 1839313 1856829
32998 1856829 1874441 1892110 1909788 1927409 1944901 1962193 1979229 1995988 2012487 2028786 2044958
32987 2044958 2061071 2077171 2093279 2109405 2125565 2141796 2158153 2174707 2191518 2208628 2226073
32976 2226073 2243879 2262090 2280760 2299961 2319757 2340184 2361243 2382910 2405152 2427937 2451252
32965 2451252 2475111 2499558 2524654 2550474 2577089 2604551 2632873 2662045 2692033 2722795 2754276
32954 2754276 2786419 2819173 2852518 2886465 2921068 2956410 2992579 3029640 3067627 3106539 3146338
32943 3146338 3186943 3228239 3270087 3312341 3354865 3397557 3440382 3483378 3526643 3570321 3614567
32932 3614567 3659523 3705300 3752003 3799740 3848637 3898828 3950445 4003614 4058451 4115065 4173555
32921 4173555 4234014 4296526 4361153 4427937 4496912 4568107 4641549 4717275 4795339 4875806 4958742
32910 4958742 5044201 5132216 5222799 5315940 5411628 5509886 5610776 5714398 5820876 5930350
32900 5930350 6042956 6158808 6278004 6400629 6526757 6656450 6789767 6926771 7067521
32891 7067521 7212055 7360378 7512480 7668338 7827941 7991305 8158489 8329601 8504784
32882 8504784 8684233 8868206 9057025 9251075 9450790 9656650 9869183 10088957 10316597
32873 10316597 10552791 10798284 11053864 11320345 11598572 11889395 12193639 12512080 12845433
32864 12845433 13194356 13559447 13941280 14340462 14757662 15193656 15649368 16125906 16624592
32855 16624592 17146958 17694752 18269946 18874713 19511402 20182521 20890754 21638978 22430286
32846 22430286 23268027 24155848 25097728 26097993 27161370 28293065 29498843 30785094
32838 30785094 32158920 33628224 35201776 36889276 38701448 40650185 42748697 45011715
32830 45011715 47455749 50099407 52963691 56072280 59451822 63132231 67146964 71533302
32822 71533302 76332675 81590985 87358874 93691856 100650317 108299257 116707601 125946979
32814 125946979 136089835 147206588 159361482 172606701 186974360 202465671 219036650
32807 219036650 236579872 254902364 273700664 292536095 310816641 327795776 342601466
32800 342601466 354307305 362048282 365164690 363336105 356658235 345630685 331058500
32793 331058500 313904175 295139354 275633401 256092513 237043331 218846281 201723623
32786 201723623 185791256 171087967 157599587 145277676 134053265 123846556 114573583
32779 114573583 106150612 98496918 91536352 85198102 79416989 74133493 69293742 64849680
32771 64849680 60759550 56988548 53509101 50300023 47344296 44626130 42128689 39833435
32763 39833435 37720963 35772331 33970079 32298731 30744889 29297071 27945409 26681358
32755 26681358 25497452 24387106 23344441 22364153 21441440 20571952 19751719 18977110 18244841
32746 18244841 17551972 16895869 16274170 15684748 15125677 14595169 14091543 13613235 13158791
32737 13158791 12726851 12316107 11925267 11553028 11198051 10858987 10534532 10223478 9924760
32728 9924760 9637484 9360955 9094666 8838257 8591448 8353989 8125616 7906012 7694802
32719 7694802 7491593 7296001 7107669 6926276 6751528 6583159 6420894 6264436 6113466
32710 6113466 5967655 5826676 5690229 5558076 5430048 5306030 5185931 5069650 4957075
32701 4957075 4848061 4742437 4640028 4540665 4444190 4350470 4259388 4170858 4084813 4001190 3919936
32690 3919936 3841002 3764330 3689862 3617547 3547342 3479214 3413136 3349097 3287089 3227079 3168995
32679 3168995 3112719 3058123 3005079 2953473 2903225 2854278 2806601 2760172 2714973 2670983 2628154
32668 2628154 2586405 2545627 2505701 2466509 2427963 2390015 2352651 2315891 2279753 2244269 2209462
32657 2209462 2175364 2142004 2109421 2077658 2046739 2016656 1987372 1958832 1930977 1903750 1877112
32646 1877112 1851038 1825500 1800458 1775866 1751690 1727913 1704536 1681574 1659043 1636949 1615282
32635 1615282 1594012 1573106 1552523 1532213 1512136 1492266 1472589 1453108 1433844 1414844 1396171
32624 1396171 1377899 1360091 1342791 1326004 1309693 1293790 1278218 1262911 1247828 1232953 1218282
32613 1218282 1203797 1189461 1175236 1161097 1147058 1133169 1119507 1106151 1093166 1080581 1068389
32602 1068389 1056563 1045065 1033852 1022895 1012172 1001673 991387 981308 971424 961714 952129 942606
32590 942606 933077 923488 913816 904077 894322 884609 874996 865516 856180 846967 837831 828723 819622 810540
32576 810540 801538 792703 784119 775840 767866 760145 752591 745117 737654 730175 722702 715283 707977 700836
32562 700836 693911 687243 680862 674783 668997 663471 658148 652964 647869 642813 637754 632653 627475 622186
32548 622186 616755 611159 605397 599492 593496 587479 581526 575716 570108 564735 559592 554646 549837 545099
32534 545099 540366 535595 530767 525886 520994 516152 511418 506840 502447 498243 494208 490305 486488 482716
32520 482716 478958 475195 471425 467650 463864 460053 456198 452271 448251 444133 439936 435712 431524 427440
32506 427440 423515 419784 416254 412917 409766 406799 404015 401399 398915 396500 394071 391551 388883 386049
32492 386049 383073 380023 376997 374094 371374 368851 366492 364246 362062 359905 357756 355597 353389 351069
32478 351069 348558 345771 342659 339223 335531 331702 327877 324181 320695 317445 314396 311481 308613 305728
32464 305728 302789 299794 296774 293774 290850 288056 285451 283087 280998 279181 277609 276234 275009 273898
32450 273898 272892 271994 271206 270512 269881 269258 268568 267732 266679 265361 263757 261869 259719 257336 254752 252000
32434 252000 249119 246157 243180 240261 237479 234896 232540 230401 228432 226572 224765 222977 221209 219482
32420 219482 217818 216227 214700 213217 211750 210267 208745 207178 205588 204015 202524 201166 199965 198910
32406 198910 197956 197050 196141 195200 194216 193194 192137 191051 189937 188800 187645 186470 185291 184126 183007
32391 183007 181970 181034 180195 179422 178662 177855 176949 175913 174740 173449 172085 170702 169350 168062 166847 165694
32375 165694 164586 163504 162445 161413 160414 159444 158487 157511 156490 155405 154257 153064 151847 150630 149433
32360 149433 148272 147159 146101 145098 144147 143243 142386 141569 140776 139973 139115 138156 137059 135797 134363 132767
32344 132767 131025 129175 127266 125355 123501 121751 120132 118655 117306 116067 114922 113872 112928 112112 111434
32329 111434 110888 110442 110050 109662 109233 108738 108178 107594 107051 106621 106360 106280 106344 106484 106609 106639 106523 106234 105769 105146
32309 105146 104391 103532 102586 101561 100459 99282 98045 96789 95580 94505 93655 93108 92910 93065 93532 94250
32293 94250 95143 96143 97188 98224 99201 100064 100754 101217 101397 101253 100763 99934 98806 97449 95959 94443 92999
32276 92999 91697 90560 89584 88723 87918 87100 86211 85211 84092 82870 81589 80321 79134 78085 77199 76469
32260 76469 75857 75309 74778 74248 73719 73216 72767 72399 72122 71943 71856 71861 71960 72157 72463 72881 73413 74051 74786 75592
32240 75592 76424 77224 77932 78516 78970 79318 79598 79835 80039 80199 80300 80327 80260 80077 79743 79227 78513 77610 76549
32221 76549 75388 74184 72988 71839 70762 69777 68911 68182 67603 67165 66831 66544 66253 65916 65510 65028 64475
32204 64475 63868 63239 62631 62088 61638 61276 60975 60691 60383 60038 59663 59289 58953 58680 58479 58352 58301 58335 58473 58729
32184 58729 59120 59657 60350 61206 62219 63367 64608 65878 67104 68209 69135 69849 70351 70662 70800 70779 70608
32167 70608 70297 69867 69348 68772 68162 67531 66890 66245 65594 64920 64194 63378 62440 61367 60174 58901 57604 56347
32149 56347 55176 54119 53168 52294 51456 50612 49730 48798 47829 46865 45957 45152 44475 43919 43442 42987 42492 41905
32131 41905 41195 40362 39436 38479 37557 36728 36031 35483 35084 34824 34696 34691 34798 35016 35349 35804 36387 37086 37877 38725
32111 38725 39592 40437 41217 41881 42372 42641 42672 42483 42119 41638 41093 40531 39991 39514 39135 38891 38803 38885 39146 39586
32091 39586 40194 40932 41729 42497 43141 43589 43800 43775 43536 43119 42557 41870 41058 40108 38999 37716 36255 34639
32073 34639 32911 31142 29403 27759 26268 24979 23930 23150 22647 22412 22426 22665 23109 23746 24562 25528 26600
32056 26600 27711 28784 29739 30517 31088 31450 31625 31634 31500 31224 30802 30224 29490 28616 27639 26611 25591 24645
32038 24645 23831 23198 22775 22574 22573 22733 22996 23302 23592 23811 23912 23859 23640 23269 22790 22268 21775 21376 21126 21056
32018 21056 21176 21484 21965 22593 23338 24159 25012 25864 26694 27487 28229 28891 29423 29771 29884 29743 29360 28790 28114
31999 28114 27424 26814 26360 26101 26040 26137 26317 26493 26585 26550 26394 26169 25955 25837 25888 26151 26634 27306 28106 28951 29749
31978 29749 30415 30891 31150 31199 31062 30766 30328 29768 29116 28423 27755 27180 26749 26483 26369 26357 26382 26380 26305 26140 25891
31957 25891 25578 25225 24846 24445 24024 23583 23125 22653 22163 21647 21088 20471 19773 18981 18089 17107 16060 14984
31939 14984 13919 12909 11984 11169 10488 9955 9577 9344 9232 9214 9276 9414 9635 9941 10331 10788 11288 11808 12331
31920 12331 12854 13385 13930 14488 15052 15607 16148 16675 17193 17694 18154 18535 18807 18960 19021 19036 19063 19159 19369 19725
31900 19725 20236 20881 21608 22346 23029 23616 24101 24518 24923 25376 25916 26550 27246 27950 28601 29136 29510 29699 29691 29494
31880 29494 29124 28604 27967 27259 26524 25814 25163 24585 24069 23596 23141 22683 22201 21670 21058 20336 19488 18514 17438
31861 17438 16300 15140 13992 12884 11844 10904 10098 9454 8992 8720 8630 8703 8907 9198 9546 9938 10390 10947
31843 10947 11668 12619 13853 15396 17230 19296 21503 23741 25903 27895 29639 31082 32190 32949 33371
31828 33371 33500 33407 33177 32886 32576 32248 31867 31393 30786 30036 29141 28108 26943 25654 24255 22762 21204
31811 21204 19604 17998 16425 14940 13594 12437 11504 10805 10332 10065 9972 10014 10136 10274 10363 10350 10202 9915
31793 9915 9512 9036 8537 8065 7652 7325 7091 6947 6888 6908 7011 7211 7530 8000 8647 9487 10510 11686 12957
31774 12957 14248 15470 16546 17427 18090 18544 18806 18908 18887 18785 18650 18519 18417 18352 18326 18331 18361 18411 18483 18580 18701
31753 18701 18835 18962 19062 19119 19134 19109 19041 18921 18720 18404 17936 17296 16483 15524 14463 13356 12253 11204 10238
31734 10238 9377 8629 8007 7527 7204 7053 7074 7264 7618 8130 8806 9644 10630 11731 12902 14096 15271 16390
31716 16390 17418 18322 19058 19596 19905 19966 19769 19315 18618 17706 16633 15466 14288 13181 12206 11389 10716 10130
31698 10130 9559 8940 8236 7445 6595 5731 4898 4136 3465 2894 2422 2036 1720 1460 1238 1039 844 630 366
31679 366 28 -399 -909 -1471 -2041 -2577 -3056 -3467 -3810 -4088 -4306 -4469 -4583 -4651 -4657 -4573 -4371 -4032 -3556 -2976 -2335
31658 -2335 -1679 -1050 -483 -2 376 641 788 829 792 719 654 630 660 737 843 951 1038 1084 1079 1026 951 905 958 1185
31634 1185 1652 2401 3438 4727 6197 7754 9308 10786 12128 13300 14278 15058 15644 16047 16282 16360 16284
31617 16284 16058 15679 15148 14474 13671 12770 11805 10820 9855 8949 8136 7451 6922 6566 6384 6360 6466 6671 6945
31598 6945 7261 7601 7948 8284 8584 8816 8951 8964 8842 8575 8159 7595 6880 6026 5065 4053 3064 2170 1428
31579 1428 869 495 286 209 227 311 444 612 818 1067 1377 1760 2219 2745 3314 3892 4446 4939 5346 5654
31559 5654 5864 5997 6084 6162 6255 6370 6487 6568 6563 6427 6130 5678 5101 4449 3770 3092 2422 1755 1085 417 -225
31538 -225 -809 -1302 -1691 -1987 -2232 -2479 -2787 -3208 -3774 -4491 -5327 -6211 -7041 -7691 -8045 -8011 -7554 -6687 -5470 -3990
31518 -3990 -2348 -638 1057 2685 4211 5608 6853 7925 8819 9552 10151 10639 11019 11285 11432 11470 11424
31501 11424 11334 11246 11200 11220 11301 11417 11518 11547 11448 11190 10767 10195 9504 8717 7851 6906 5874 4743 3506 2177
31481 2177 794 -572 -1841 -2925 -3752 -4277 -4495 -4434 -4159 -3745 -3269 -2793 -2340 -1896 -1412 -837 -144 654
31463 654 1502 2316 3011 3509 3756 3710 3354 2683 1724 527 -833 -2272 -3707 -5059 -6260 -7257 -8016 -8531
31445 -8531 -8818 -8911 -8841 -8630 -8284 -7789 -7118 -6241 -5143 -3835 -2356 -769 845 2417 3886 5206 6352
31428 6352 7311 8088 8694 9143 9448 9597 9571 9340 8893 8248 7458 6611 5808 5162 4769 4698 4976 5575 6419 7401
31408 7401 8417 9382 10258 11034 11723 12342 12910 13444 13968 14498 15037 15562 16027 16376 16552 16517 16262 15813 15219
31389 15219 14540 13833 13132 12448 11760 11038 10257 9428 8613 7909 7427 7248 7411 7900 8650 9569 10555 11521 12408
31370 12408 13195 13890 14509 15062 15535 15903 16138 16223 16161 15976 15708 15401 15089 14792 14510 14227 13915 13544 13091 12558
31350 12558 11969 11368 10819 10384 10113 10029 10130 10389 10755 11168 11568 11908 12166 12356 12524 12726 13021 13437 13973
31331 13973 14598 15266 15932 16557 17111 17567 17896 18071 18071 17897 17578 17174 16757 16406 16191 16163 16364 16807 17480 18337
31311 18337 19306 20302 21239 22049 22683 23112 23321 23308 23088 22696 22189 21644 21147 20782 20603 20624 20820 21141 21541 21988
31291 21988 22478 23014 23598 24217 24838 25420 25919 26307 26578 26747 26846 26918 27009 27153 27366 27647 27968 28305 28641 28981
31271 28981 29350 29785 30319 30960 31699 32514 33382 34287 35211 36132 37021 37845 38595 39290 39981 40734 41611 42652 43868
31252 43868 45240 46740 48337 50021 51797 53694 55751 58004 60479 63192 66150 69355 72807 76499
31238 76499 80406 84492 88714 93036 97439 101938 106590 111491 116759 122510 128845 135845 143572 152080
31224 152080 161422 171656 182844 195051 208336 222753 238339 255111 273070 292208 312495 333860
31212 333860 356144 379056 402138 424761 446144 465402 481608 493876 501463 503868 500911 492764
31200 492764 479920 463106 443191 421072 397604 373551 349550 326092 303516 282033 261756
31189 261756 242740 225014 208594 193477 179636 167003 155488 144967 135307 126389 118130 110498
31177 110498 103509 97197 91594 86705 82499 78913 75863 73249 70953 68854 66831 64780 62626 60331
31163 60331 57895 55348 52730 50080 47426 44784 42151 39527 36921 34367 31918 29642 27604 25847
31149 25847 24388 23208 22272 21539 20978 20562 20263 20032 19802 19498 19059 18445 17657 16726 15695 14615 13524
31132 13524 12459 11456 10553 9793 9204 8797 8547 8404 8299 8170 7970 7685 7329 6923 6496 6069 5654 5257
31114 5257 4883 4539 4231 3973 3777 3660 3640 3716 3878 4096 4331 4547 4712 4795 4774 4630 4356 3957 3460 2917 2399
31093 2399 1987 1751 1730 1923 2292 2767 3274 3743 4121 4384 4527 4575 4560 4518 4470 4412 4320 4156 3891 3501 2978 2323
31071 2323 1546 660 -304 -1298 -2261 -3129 -3854 -4420 -4844 -5165 -5438 -5711 -6014 -6363 -6759 -7199 -7669 -8159 -8662
31052 -8662 -9177 -9714 -10279 -10868 -11453 -11996 -12454 -12788 -12972 -12980 -12794 -12410 -11846 -11145 -10374 -9600 -8886 -8268 -7761 -7355
31032 -7355 -7033 -6772 -6553 -6356 -6151 -5902 -5565 -5110 -4519 -3789 -2927 -1955 -913 139 1124 1958 2578 2948 3082
31013 3082 3027 2857 2652 2474 2356 2300 2286 2286 2272 2223 2130 1982 1767 1478 1119 717 319 -17 -235 -293 -179 81
30991 81 429 789 1081 1242 1234 1041 669 138 -520 -1263 -2047 -2829 -3579 -4288 -4974 -5668 -6407 -7208 -8066 -8944 -9786
30970 -9786 -10526 -11107 -11485 -11641 -11579 -11339 -10987 -10616 -10317 -10161 -10176 -10336 -10576 -10801 -10907 -10792 -10379 -9638 -8588 -7296
30950 -7296 -5860 -4374 -2917 -1549 -309 766 1663 2384 2963 3443 3865 4248 4574 4802 4881 4776 4490 4061
30932 4061 3550 3038 2605 2314 2197 2250 2430 2668 2875 2962 2844 2450 1745 725 -567 -2050 -3618 -5161
30914 -5161 -6576 -7790 -8757 -9457 -9892 -10073 -10006 -9696 -9146 -8375 -7422 -6350 -5234 -4146 -3152 -2291 -1585 -1041
30896 -1041 -649 -391 -238 -150 -88 -10 116 309 558 837 1110 1353 1557 1742 1943 2197 2531 2954 3463 4043
30876 4043 4677 5351 6060 6793 7541 8277 8963 9550 9989 10245 10311 10211 9989 9698 9378 9049 8714 8359 7966 7521
30856 7521 7010 6427 5771 5042 4255 3433 2605 1801 1038 329 -311 -856 -1269 -1514 -1573 -1455 -1208 -901 -613 -413
30836 -413 -341 -394 -530 -663 -690 -505 -29 771 1882 3247 4784 6400 8003 9501 10808 11843 12538 12856
30818 12856 12796 12399 11743 10922 10029 9136 8276 7456 6655 5844 4992 4070 3052 1920 669 -683 -2102 -3531
30800 -3531 -4906 -6175 -7304 -8272 -9062 -9653 -10014 -10114 -9931 -9458 -8715 -7738 -6580 -5305 -3979 -2669 -1423
30783 -1423 -273 771 1717 2577 3369 4107 4809 5483 6137 6771 7381 7966 8519 9029 9465 9780 9928 9871 9593
30764 9593 9111 8473 7749 7015 6341 5775 5333 5005 4767 4599 4485 4424 4416 4443 4480 4498 4484 4453 4441 4492 4643 4906 5278
30741 5278 5739 6253 6775 7251 7626 7848 7885 7730 7406 6956 6437 5907 5417 5010 4704 4496 4359 4260 4174 4095 4038
30720 4038 4018 4042 4089 4124 4097 3977 3756 3458 3129 2821 2578 2417 2333 2309 2314 2328 2339 2355 2399 2495 2659 2891 3174 3484
30696 3484 3783 4025 4145 4073 3749 3139 2253 1136 -139 -1496 -2863 -4174 -5378 -6423 -7261 -7859 -8200
30679 -8200 -8300 -8189 -7910 -7497 -6967 -6326 -5580 -4752 -3893 -3061 -2317 -1705 -1250 -951 -788 -730 -737 -780 -841 -920 -1021
30658 -1021 -1146 -1289 -1434 -1561 -1656 -1706 -1701 -1638 -1526 -1383 -1246 -1159 -1152 -1234 -1384 -1559 -1713 -1812 -1843 -1808 -1724 -1616 -1518 -1470
30634 -1470 -1516 -1695 -2029 -2513 -3107 -3737 -4321 -4787 -5090 -5225 -5225 -5133 -4990 -4819 -4621 -4377 -4061 -3642 -3113 -2482 -1777
30613 -1777 -1044 -339 280 767 1090 1248 1263 1173 1021 843 657 458 227 -56 -393 -755 -1094 -1361 -1526 -1589
30593 -1589 -1572 -1506 -1408 -1287 -1127 -909 -607 -207 290 864 1477 2077 2604 3006 3242 3297 3175 2898 2499 2013 1484
30572 1484 953 455 0 -421 -828 -1243 -1667 -2083 -2462 -2774 -2990 -3097 -3092 -2981 -2774 -2477 -2090 -1607 -1027 -358
30552 -358 374 1130 1873 2575 3220 3800 4309 4750 5129 5452 5732 5972 6166 6298 6360 6353 6292 6200 6098 5999 5902 5797
30530 5797 5675 5537 5398 5277 5186 5130 5113 5141 5219 5348 5522 5727 5940 6137 6287 6371 6387 6357 6319 6320 6390 6528 6698
30507 6698 6837 6877 6761 6473 6047 5556 5092 4745 4577 4607 4811 5127 5468 5741 5870 5803 5520 5026 4349 3536
30487 3536 2649 1764 962 315 -122 -327 -302 -70 332 870 1511 2233 3025 3873 4758 5649 6503 7270 7904 8365
30467 8365 8637 8730 8690 8583 8480 8434 8460 8548 8667 8793 8915 9022 9109 9162 9162 9092 8938 8700 8395 8047 7684 7338 7027
30444 7027 6757 6508 6250 5942 5560 5098 4582 4057 3575 3180 2895 2714 2607 2522 2407 2219 1927 1524 1023 449
30424 449 -160 -769 -1341 -1844 -2256 -2575 -2817 -3015 -3197 -3372 -3527 -3634 -3669 -3620 -3496 -3308 -3064 -2765 -2421 -2051
30404 -2051 -1690 -1381 -1155 -1030 -999 -1036 -1104 -1170 -1217 -1249 -1291 -1369 -1499 -1675 -1864 -2019 -2102 -2086 -1972 -1787 -1563 -1331 -1114
30381 -1114 -921 -752 -594 -425 -215 50 358 665 907 1031 1007 830 524 120 -346 -835 -1302 -1703 -2004 -2181
30361 -2181 -2228 -2154 -1992 -1791 -1614 -1525 -1576 -1796 -2175 -2674 -3215 -3715 -4102 -4329 -4388 -4286 -4045 -3681 -3213 -2665 -2070
30340 -2070 -1461 -868 -306 216 706 1173 1632 2108 2620 3179 3776 4385 4960 5468 5888 6226 6496 6707 6851
30321 6851 6905 6839 6636 6308 5898 5466 5074 4762 4547 4418 4359 4355 4401 4502 4668 4902 5199 5533 5863 6138 6312
30300 6312 6349 6238 5975 5581 5083 4520 3941 3395 2935 2605 2431 2419 2545 2757 2983 3144 3172 3023 2686 2177
30280 2177 1527 785 6 -749 -1440 -2046 -2579 -3069 -3544 -4011 -4449 -4805 -5011 -5010 -4780 -4348 -3785 -3183 -2629 -2171
30260 -2171 -1815 -1541 -1313 -1098 -870 -613 -326 -13 311 638 960 1265 1545 1781 1948 2020 1978 1820 1572 1292
30240 1292 1049 914 934 1118 1449 1895 2424 3001 3591 4149 4631 4997 5216 5274 5179 4957 4665 4365 4132 4023
30220 4023 4078 4310 4708 5239 5858 6524 7205 7882 8547 9196 9829 10445 11033 11568 12014 12337 12504 12498 12314 11960
30200 11960 11448 10795 10016 9117 8104 6981 5759 4463 3117 1752 388 -961 -2287 -3579 -4821
30185 -4821 -5982 -7023 -7906 -8601 -9093 -9384 -9483 -9400 -9142 -8713 -8113 -7350 -6446 -5437 -4377 -3339 -2395 -1616
30167 -1616 -1057 -749 -693 -865 -1210 -1663 -2145 -2590 -2943 -3177 -3290 -3298 -3229 -3108 -2948 -2754 -2524 -2258 -1964 -1650 -1320
30146 -1320 -969 -588 -185 222 600 902 1081 1090 885 443 -234 -1111 -2129 -3228 -4354 -5471 -6553 -7576
30128 -7576 -8525 -9392 -10182 -10906 -11580 -12212 -12794 -13305 -13717 -14008 -14170 -14210 -14139 -13972 -13713 -13368 -12940 -12442 -11894 -11327
30108 -11327 -10776 -10280 -9865 -9542 -9309 -9154 -9059 -9005 -8967 -8914 -8804 -8594 -8235 -7689 -6932 -5969 -4832 -3588 -2317
30089 -2317 -1093 29 1029 1914 2700 3406 4033 4579 5039 5413 5717 5979 6241 6539 6896 7311 7756 8194
30071 8194 8586 8918 9197 9453 9713 9992 10272 10514 10661 10664 10499 10177 9729 9197 8618 8018 7404 6778 6140 5489
30051 5489 4830 4170 3509 2843 2163 1479 820 242 -185 -412 -422 -255 11 271 409 323 -60 -775 -1795 -3040
30031 -3040 -4393 -5722 -6904 -7845 -8491 -8821 -8844 -8580 -8056 -7305 -6371 -5311 -4190 -3086 -2076 -1238 -634
30014 -634 -296 -212 -330 -571 -861 -1135 -1356 -1506 -1590 -1619 -1603 -1553 -1470 -1361 -1233 -1101 -982 -892 -857 -907 -1079 -1403 -1898
29991 -1898 -2563 -3379 -4301 -5275 -6250 -7199 -8124 -9054 -10024 -11039 -12063 -13023 -13845 -14488 -14963 -15328 -15659 -16015 -16414
29972 -16414 -16824 -17184 -17422 -17475 -17297 -16863 -16173 -15276 -14260 -13247 -12356 -11674 -11235 -11027 -11000 -11091 -11236 -11380 -11491
29953 -11491 -11561 -11602 -11646 -11733 -11905 -12187 -12582 -13060 -13562 -14008 -14311 -14405 -14252 -13847 -13207 -12370 -11378 -10273 -9096 -7892
29933 -7892 -6713 -5618 -4674 -3936 -3451 -3236 -3286 -3559 -3997 -4533 -5117 -5717 -6327 -6951 -7594 -8245 -8875 -9438 -9885
29914 -9885 -10173 -10279 -10202 -9967 -9613 -9188 -8745 -8324 -7946 -7611 -7289 -6936 -6498 -5927 -5179 -4226 -3060 -1699 -187
29895 -187 1408 3005 4507 5821 6871 7605 7995 8043 7774 7229 6473 5590 4679 3839 3150 2646 2319 2122
29877 2122 1994 1877 1732 1542 1303 1031 749 486 275 135 70 56 57 33 -33 -134 -228 -260 -180 39 397 872
29855 872 1427 2023 2638 3262 3909 4604 5376 6240 7190 8194 9199 10142 10964 11605 12019 12169 12032 11610 10928
29836 10928 10031 8979 7830 6644 5464 4334 3292 2376 1616 1026 598 309 118 -14 -138 -286 -483
29819 -483 -732 -1013 -1286 -1504 -1630 -1638 -1526 -1309 -1020 -710 -443 -279 -271 -445 -798 -1300 -1911 -2583 -3280 -3975 -4639
29798 -4639 -5241 -5744 -6101 -6267 -6200 -5874 -5277 -4424 -3357 -2143 -860 417 1637 2770 3806 4749 5603
29781 5603 6366 7031 7582 8006 8295 8448 8470 8368 8150 7832 7433 6987 6538 6132 5817 5625 5570 5648 5840 6112
29761 6112 6419 6701 6895 6948 6823 6508 6018 5397 4714 4047 3479 3080 2898 2950 3226 3684 4259 4878 5467 5968
29741 5968 6346 6583 6673 6611 6381 5974 5389 4651 3803 2899 1987 1100 254 -541 -1278 -1936 -2483 -2887 -3121 -3167
29721 -3167 -3021 -2688 -2189 -1566 -877 -191 428 935 1309 1556 1702 1785 1853 1953 2130 2414 2818 3336 3948 4624
29701 4624 5327 6009 6610 7071 7333 7347 7083 6527 5686 4596 3312 1914 500 -824 -1944 -2757 -3186 -3202
29683 -3202 -2834 -2163 -1301 -365 544 1346 1989 2455 2761 2961 3123 3299 3513 3756 3995 4198 4344 4434 4474 4465 4414
29662 4414 4320 4186 4027 3847 3654 3436 3172 2829 2388 1841 1203 509 -196 -867 -1465 -1978 -2418 -2818 -3229 -3698
29642 -3698 -4266 -4963 -5788 -6725 -7732 -8755 -9738 -10632 -11412 -12067 -12596 -13004 -13292 -13467 -13541 -13531 -13455 -13336 -13185 -13016
29622 -13016 -12838 -12659 -12481 -12303 -12117 -11909 -11667 -11386 -11072 -10752 -10461 -10228 -10071 -9986 -9956 -9956 -9954 -9916 -9801 -9580 -9241
29601 -9241 -8801 -8293 -7752 -7195 -6621 -6008 -5336 -4585 -3754 -2864 -1955 -1086 -318 305 769 1087 1296 1433 1523 1572
29581 1572 1564 1475 1283 980 580 112 -382 -867 -1306 -1682 -1986 -2219 -2388 -2501 -2558 -2557 -2485 -2330 -2094 -1795 -1467 -1148
29559 -1148 -877 -687 -611 -685 -935 -1365 -1947 -2623 -3314 -3935 -4424 -4761 -4980 -5150 -5357 -5675 -6150 -6800 -7617 -8581
29539 -8581 -9668 -10854 -12118 -13430 -14752 -16032 -17220 -18278 -19192 -19976 -20660 -21273 -21833 -22336 -22748 -23019 -23097
29522 -23097 -22940 -22520 -21838 -20920 -19824 -18628 -17422 -16279 -15233 -14281 -13390 -12518 -11629 -10712 -9782 -8865 -7996
29505 -7996 -7184 -6421 -5686 -4960 -4240 -3541 -2876 -2261 -1707 -1222 -808 -463 -180 40 184 223 132 -98 -454 -894
29485 -894 -1359 -1778 -2088 -2232 -2168 -1875 -1345 -598 327 1360 2412 3389 4207 4804 5152 5250 5122 4805 4342 3780
29465 3780 3171 2557 1987 1494 1102 814 623 509 449 419 400 380 357 336 325 324 329 335 343 370 437 546 686 818 900
29440 900 901 807 625 375 89 -195 -438 -613 -711 -747 -750 -756 -797 -900 -1093 -1407 -1868 -2498 -3296 -4242 -5294 -6395
29418 -6395 -7495 -8559 -9561 -10484 -11297 -11953 -12391 -12551 -12389 -11901 -11130 -10149 -9062 -7972 -6970 -6131 -5495
29401 -5495 -5073 -4836 -4724 -4661 -4567 -4375 -4048 -3575 -2978 -2291 -1551 -794 -61 605 1168 1595 1875 2014 2026 1942 1797
29380 1797 1634 1498 1416 1393 1418 1481 1579 1726 1943 2239 2612 3035 3464 3848 4136 4295 4311 4186 3943 3617 3254
29359 3254 2904 2608 2398 2287 2267 2302 2341 2321 2198 1967 1663 1350 1104 990 1058 1332 1800 2421 3129 3856 4549
29338 4549 5182 5753 6274 6754 7187 7550 7816 7969 8015 7974 7860 7676 7407 7042 6579 6042 5461 4876 4324 3833
29318 3833 3423 3104 2871 2714 2610 2530 2450 2356 2257 2171 2125 2132 2192 2292 2407 2524 2632 2724 2787 2791 2697 2462 2050 1457
29294 1457 703 -167 -1098 -2035 -2926 -3723 -4382 -4877 -5196 -5350 -5367 -5292 -5182 -5104 -5133 -5336 -5753 -6393 -7227 -8206 -9271
29273 -9271 -10365 -11436 -12438 -13334 -14097 -14726 -15245 -15695 -16109 -16499 -16846 -17106 -17226 -17168 -16926 -16516 -15983 -15375 -14747
29254 -14747 -14157 -13663 -13313 -13133 -13103 -13173 -13270 -13328 -13313 -13220 -13073 -12901 -12731 -12581 -12463 -12391 -12371 -12402 -12471 -12551 -12615 -12634 -12593 -12484
29230 -12484 -12310 -12070 -11752 -11329 -10774 -10067 -9210 -8216 -7107 -5909 -4657 -3404 -2222 -1186 -363 214 554
29213 554 696 701 624 494 316 77 -235 -621 -1066 -1548 -2044 -2535 -3000 -3430 -3808 -4116 -4329 -4422 -4377 -4183 -3842
29192 -3842 -3371 -2794 -2153 -1489 -842 -245 282 734 1106 1407 1640 1798 1860 1800 1598 1262 821 313 -240 -843
29172 -843 -1517 -2285 -3145 -4069 -4990 -5829 -6500 -6929 -7067 -6904 -6467 -5824 -5067 -4291 -3578 -2977 -2496 -2111 -1783 -1479
29152 -1479 -1188 -923 -700 -535 -430 -379 -377 -437 -584 -855 -1274 -1845 -2540 -3312 -4108 -4882 -5608 -6280 -6917 -7542 -8169
29131 -8169 -8778 -9315 -9694 -9821 -9635 -9115 -8288 -7228 -6028 -4789 -3599 -2523 -1604 -870 -331 7 164 171
29113 171 76 -68 -227 -388 -565 -787 -1077 -1439 -1850 -2273 -2672 -3038 -3387 -3756 -4168 -4614 -5054 -5434 -5715 -5899
29093 -5899 -6035 -6205 -6490 -6958 -7645 -8559 -9678 -10952 -12309 -13668 -14952 -16108 -17103 -17931 -18600 -19133 -19562
29076 -19562 -19914 -20204 -20437 -20592 -20640 -20531 -20217 -19665 -18868 -17858 -16689 -15426 -14129 -12853 -11650 -10562 -9625
29059 -9625 -8872 -8337 -8050 -8029 -8258 -8678 -9197 -9711 -10130 -10394 -10485 -10420 -10244 -10019 -9805 -9652 -9598 -9664 -9859 -10166 -10550
29038 -10550 -10957 -11335 -11651 -11879 -12010 -12041 -11981 -11857 -11702 -11548 -11423 -11337 -11288 -11264 -11249 -11220 -11156 -11037 -10840 -10541 -10123 -9578
29016 -9578 -8920 -8167 -7338 -6437 -5461 -4405 -3282 -2132 -1024 -39 751 1295 1582 1628 1483 1211 874 530
28998 530 235 34 -34 43 256 560 885 1167 1352 1415 1351 1165 864 453 -60 -658 -1315 -2006 -2714 -3419 -4097
28977 -4097 -4707 -5194 -5494 -5558 -5356 -4898 -4229 -3418 -2548 -1693 -912 -245 284 674 939 1106 1194 1218 1176 1069 907
28956 907 716 526 363 249 196 208 283 404 550 694 814 907 982 1065 1181 1353 1603 1956 2430 3035 3758 4566
28934 4566 5414 6248 7022 7700 8266 8726 9120 9501 9917 10394 10915 11436 11895 12235 12425 12467 12400 12281 12179 12151
28914 12151 12230 12409 12654 12905 13097 13179 13112 12881 12484 11944 11288 10557 9795 9044 8345 7738 7262 6950 6824 6879
28894 6879 7091 7406 7764 8097 8347 8474 8465 8330 8094 7792 7464 7148 6886 6719 6675 6756 6938 7186 7466 7765 8087
28873 8087 8453 8876 9354 9864 10361 10796 11121 11308 11351 11268 11087 10830 10514 10148 9741 9307 8862 8419 7996 7609
28853 7609 7271 6980 6714 6442 6128 5748 5294 4776 4231 3721 3324 3122 3169 3469 3975 4592 5215 5757 6164 6418
28833 6418 6526 6492 6321 6014 5580 5040 4428 3786 3153 2559 2018 1533 1106 743 465 307 311 509 923 1557
28813 1557 2407 3453 4657 5962 7299 8599 9803 10875 11799 12576 13216 13726 14119 14409 14614 14751 14829
28796 14829 14851 14808 14688 14473 14142 13679 13083 12369 11566 10700 9780 8810 7785 6703 5579 4435 3308 2224
28778 2224 1195 212 -750 -1717 -2688 -3641 -4526 -5277 -5828 -6131 -6153 -5898 -5401 -4731 -3981 -3237 -2558 -1960 -1419
28759 -1419 -889 -332 280 945 1643 2337 2989 3572 4071 4493 4852 5168 5452 5702 5901 6031 6081 6063 6013 5979 6006
28738 6006 6113 6279 6460 6599 6654 6609 6473 6271 6028 5763 5483 5186 4873 4548 4226 3924 3658 3438 3272 3168
28718 3168 3144 3220 3417 3748 4212 4788 5439 6123 6796 7422 7973 8425 8759 8959 9032 8994 8877 8709 8493 8212 7823
28697 7823 7277 6532 5566 4385 3034 1594 172 -1111 -2153 -2883 -3272 -3339 -3143 -2780 -2365 -2003 -1775 -1703
28679 -1703 -1755 -1858 -1929 -1902 -1749 -1483 -1142 -787 -481 -278 -207 -267 -423 -627 -827 -991 -1106 -1178 -1229 -1277 -1337 -1410 -1485
28656 -1485 -1542 -1545 -1457 -1248 -911 -456 90 694 1320 1942 2541 3114 3668 4221 4793 5395 6011 6605 7134 7560 7862
28635 7862 8045 8136 8180 8236 8356 8581 8923 9355 9808 10193 10419 10415 10149 9637 8940 8137 7308 6507 5758 5058 4409
28614 4409 3821 3320 2934 2674 2526 2459 2442 2461 2529 2670 2905 3235 3638 4077 4517 4926 5280 5552 5715 5734 5583
28593 5583 5250 4750 4133 3470 2847 2343 2012 1878 1933 2138 2435 2749 3008 3152 3147 2999 2761 2529 2409 2491 2807
28572 2807 3326 3969 4635 5231 5692 5986 6129 6163 6137 6098 6065 6037 5998 5933 5828 5676 5468 5193 4837 4379 3801 3086
28550 3086 2221 1210 75 -1133 -2342 -3460 -4406 -5130 -5608 -5834 -5808 -5524 -4985 -4205 -3226 -2116 -967
28533 -967 122 1056 1753 2157 2244 2035 1590 1001 379 -181 -599 -837 -885 -763 -512 -181 181 538 877 1210
28513 1210 1569 1979 2442 2934 3402 3781 4018 4070 3916 3558 3012 2307 1477 551 -446 -1496 -2573 -3635 -4622
28494 -4622 -5464 -6102 -6505 -6683 -6673 -6525 -6284 -5981 -5634 -5244 -4811 -4336 -3833 -3339 -2901 -2571 -2392 -2390 -2576 -2947
28474 -2947 -3501 -4228 -5111 -6113 -7185 -8258 -9254 -10089 -10693 -11019 -11057 -10828 -10382 -9781 -9083 -8342 -7604 -6904 -6260
28455 -6260 -5674 -5123 -4572 -3980 -3313 -2553 -1695 -760 225 1235 2250 3254 4239 5196 6109 6966 7753 8467
28437 8467 9111 9697 10234 10720 11139 11457 11625 11605 11373 10935 10323 9580 8750 7866 6940 5973 4968 3929 2874
28418 2874 1834 852 -11 -684 -1088 -1159 -870 -246 637 1670 2730 3714 4550 5202 5673 5976 6132 6142 6005
28399 6005 5717 5294 4770 4197 3628 3110 2673 2326 2065 1866 1705 1559 1415 1263 1097 894 621 242 -256
28380 -256 -854 -1491 -2085 -2560 -2865 -2980 -2901 -2631 -2173 -1537 -735 217 1310 2535 3879 5306 6750 8124
28362 8124 9344 10338 11064 11502 11656 11542 11193 10654 9985 9255 8527 7855 7273 6796 6419 6128 5903 5721 5558
28343 5558 5391 5195 4946 4612 4156 3548 2770 1825 732 -486 -1807 -3207 -4653 -6101 -7491 -8757 -9840
28326 -9840 -10704 -11339 -11759 -11997 -12096 -12094 -12014 -11862 -11623 -11288 -10855 -10332 -9739 -9095 -8419 -7732 -7048 -6386 -5772 -5236 -4802
28305 -4802 -4480 -4254 -4088 -3943 -3782 -3574 -3298 -2945 -2503 -1972 -1348 -632 157 983 1777 2462 2969 3250 3295 3122
28285 3122 2770 2286 1711 1081 431 -199 -760 -1201 -1474 -1550 -1412 -1072 -550 117 891 1730 2598 3465 4300 5067
28265 5067 5723 6220 6511 6554 6326 5839 5150 4354 3575 2929 2499 2323 2399 2685 3114 3603 4061 4407 4583 4568
28245 4568 4371 4025 3569 3048 2508 1997 1560 1237 1060 1048 1209 1531 1975 2482 2978 3411 3760 4038 4281 4522
28225 4522 4779 5052 5322 5574 5797 5994 6175 6345 6496 6601 6620 6509 6240 5822 5296 4726 4173 3687 3291 2992
28205 2992 2781 2639 2540 2454 2356 2225 2037 1772 1417 966 430 -170 -803 -1413 -1937 -2308 -2478 -2430 -2187 -1799 -1329
28184 -1329 -824 -312 219 795 1440 2152 2891 3580 4132 4471 4560 4423 4124 3759 3419 3175 3064 3081 3197 3364
28164 3364 3540 3697 3817 3883 3876 3782 3595 3332 3029 2744 2539 2467 2554 2790 3143 3558 3976 4344 4623 4789 4841 4790
28142 4790 4652 4442 4167 3825 3413 2941 2436 1943 1511 1185 995 955 1066 1320 1694 2162 2678 3179 3596 3866
28122 3866 3947 3830 3531 3092 2566 2015 1486 1012 590 198 -196 -621 -1074 -1530 -1942 -2253 -2423 -2431 -2292 -2043
28102 -2043 -1746 -1469 -1277 -1221 -1327 -1599 -2003 -2483 -2963 -3358 -3596 -3627 -3428 -3012 -2420 -1708 -936 -166 549 1166
28082 1166 1643 1945 2049 1946 1658 1234 747 290 -41 -164 -31 364 984 1758 2609 3463 4261 4958 5524
28063 5524 5940 6205 6322 6302 6143 5839 5372 4726 3904 2950 1951 1027 295 -168 -342 -264 -6 356 764 1188
28043 1188 1609 2012 2372 2657 2845 2947 3003 3075 3229 3503 3900 4380 4882 5337 5680 5864 5868 5707 5429 5106 4814
28022 4814 4615 4543 4598 4750 4941 5109 5195 5156 4966 4624 4139 3535 2843 2104 1372 697 118 -344 -696 -962 -1182
28001 -1182 -1412 -1703 -2106 -2633 -3256 -3905 -4490 -4922 -5136 -5097 -4808 -4311 -3673 -2986 -2337 -1794 -1387 -1113 -952 -873
27981 -873 -846 -833 -789 -675 -468 -168 207 637 1100 1571 2018 2406 2695 2855 2879 2783 2599 2364 2115 1882 1690
27960 1690 1560 1501 1511 1574 1670 1778 1880 1955 1986 1950 1830 1615 1302 897 408 -154 -774 -1420 -2047 -2599 -3027 -3310
27938 -3310 -3463 -3533 -3583 -3676 -3861 -4169 -4615 -5200 -5913 -6731 -7618 -8525 -9383 -10122 -10683 -11038 -11190 -11168 -11006 -10723 -10315
27917 -10315 -9752 -8996 -8026 -6848 -5510 -4081 -2636 -1230 101 1360 2558 3709 4807 5825 6723
27902 6723 7464 8029 8425 8682 8838 8931 8995 9071 9193 9392 9682 10053 10478 10921 11345 11716 12004 12180 12213 12078 11760
27881 11760 11251 10556 9689 8676 7560 6396 5242 4156 3178 2339 1659 1149 816 666 691 868 1147 1456
27863 1456 1710 1833 1772 1522 1126 669 253 -28 -123 -15 262 650 1070 1436 1679 1749 1630 1330 875 305
27843 305 -346 -1055 -1802 -2559 -3285 -3921 -4422 -4757 -4917 -4916 -4774 -4515 -4168 -3766 -3343 -2937 -2581 -2306 -2128 -2044 -2040
27822 -2040 -2094 -2184 -2297 -2417 -2527 -2608 -2640 -2613 -2527 -2397 -2249 -2117 -2035 -2033 -2127 -2320 -2598 -2932 -3292 -3655 -4020 -4392 -4787
27799 -4787 -5202 -5623 -6011 -6321 -6510 -6557 -6461 -6247 -5962 -5657 -5378 -5161 -5019 -4949 -4926 -4923 -4911 -4868 -4788 -4679 -4558 -4456
27777 -4456 -4403 -4417 -4496 -4608 -4705 -4742 -4699 -4590 -4452 -4320 -4213 -4113 -3987 -3790 -3483 -3027 -2385 -1527 -443 842 2269
27756 2269 3750 5192 6517 7667 8621 9378 9956 10376 10661 10829 10895 10881 10829 10799 10861 11073 11461 12016 12689 13407
27736 13407 14084 14634 14987 15104 14988 14689 14280 13836 13404 12999 12601 12172 11672 11067 10352 9535 8643 7701 6722
27717 6722 5699 4626 3505 2343 1163 -17 -1184 -2323 -3423 -4483 -5501 -6483 -7425 -8311 -9120 -9834
27701 -9834 -10448 -10982 -11462 -11922 -12390 -12877 -13384 -13913 -14457 -15008 -15545 -16041 -16453 -16738 -16853 -16756 -16414 -15808 -14943 -13844
27681 -13844 -12557 -11130 -9620 -8082 -6562 -5101 -3726 -2456 -1311 -316 492 1080 1433 1566 1527 1382
27665 1382 1194 1008 852 740 688 720 866 1155 1602 2206 2936 3741 4550 5285 5877 6271 6437 6375 6111 5701
27645 5701 5215 4735 4326 4031 3860 3800 3820 3896 4010 4149 4321 4553 4886 5369 6037 6895 7923 9081 10312
27626 10312 11554 12735 13781 14628 15229 15561 15622 15433 15035 14479 13827 13137 12464 11837 11267 10735 10210 9666
27608 9666 9086 8468 7821 7155 6475 5783 5075 4350 3608 2857 2097 1335 578 -154 -832 -1419 -1874 -2162 -2261 -2170
27588 -2170 -1905 -1497 -981 -392 251 938 1667 2430 3215 3998 4745 5414 5963 6357 6583 6644 6565 6375 6105 5772
27568 5772 5388 4956 4476 3947 3374 2772 2161 1562 995 465 -32 -515 -1004 -1514 -2045 -2583 -3117 -3641 -4152
27549 -4152 -4649 -5125 -5572 -5985 -6354 -6673 -6918 -7063 -7075 -6931 -6627 -6193 -5687 -5187 -4769 -4490 -4375 -4407 -4542 -4725
27529 -4725 -4908 -5065 -5190 -5288 -5377 -5466 -5565 -5672 -5768 -5820 -5771 -5564 -5156 -4527 -3690 -2690 -1593 -481 565 1469
27509 1469 2179 2662 2926 3013 2991 2936 2908 2938 3023 3126 3196 3170 2999 2661 2169 1571 922 279 -320 -856 -1323 -1726
27487 -1726 -2074 -2382 -2652 -2884 -3067 -3182 -3213 -3148 -2982 -2714 -2338 -1859 -1288 -657 -17 575 1055 1357 1417 1189
27467 1189 663 -132 -1127 -2223 -3316 -4302 -5094 -5629 -5869 -5805 -5457 -4861 -4071 -3149 -2164 -1189 -296 454 1024
27448 1024 1405 1622 1729 1789 1861 1990 2202 2509 2915 3417 3993 4602 5199 5741 6205 6586 6877 7062 7111 6982
27428 6982 6647 6098 5347 4437 3414 2331 1231 140 -920 -1932 -2871 -3708 -4407 -4942 -5300 -5497 -5567 -5543
27410 -5543 -5447 -5275 -5012 -4646 -4163 -3563 -2857 -2079 -1274 -498 206 811 1311 1709 2010 2214 2313 2292 2130 1804
27390 1804 1295 613 -214 -1138 -2097 -3028 -3887 -4636 -5251 -5709 -5984 -6042 -5851 -5398 -4690 -3764 -2665 -1436 -113
27371 -113 1280 2724 4195 5655 7049 8312 9383 10221 10812 11161 11293 11250 11092 10877 10665 10499 10402 10382
27353 10382 10437 10556 10726 10937 11183 11471 11812 12227 12734 13349 14079 14922 15861 16876 17934 18988 19983 20852
27335 20852 21530 21963 22126 22019 21672 21128 20435 19641 18793 17924 17050 16172 15262 14275 13158 11873 10410 8806
27317 8806 7145 5542 4117 2967 2142 1650 1469 1569 1924 2503 3277 4219 5293 6463 7680 8880 9985
27300 9985 10915 11602 12017 12170 12112 11913 11646 11372 11130 10936 10783 10655 10521 10361 10155 9895 9578 9210 8806 8386
27280 8386 7973 7592 7259 6995 6816 6743 6804 7025 7414 7957 8611 9320 10019 10647 11146 11474 11607 11546 11317 10953
27260 10953 10480 9917 9268 8543 7752 6920 6075 5251 4482 3809 3268 2889 2694 2696 2902 3310 3895 4613 5397 6173
27240 6173 6868 7422 7801 7989 7985 7796 7433 6914 6264 5529 4768 4051 3453 3036 2842 2889 3164 3622 4193 4785
27220 4785 5308 5693 5905 5955 5887 5763 5640 5558 5533 5557 5621 5702 5768 5778 5687 5455 5070 4554 3959 3349 2778 2266 1806
27197 1806 1366 899 368 -243 -914 -1590 -2187 -2621 -2832 -2793 -2523 -2069 -1499 -878 -254 349 926 1480 1997 2450
27177 2450 2793 2974 2953 2715 2273 1675 997 338 -204 -551 -656 -511 -141 410 1093 1869 2694 3532 4347 5118
27157 5118 5835 6507 7158 7808 8464 9094 9633 10000 10124 9976 9587 9035 8423 7845 7370 7031 6829 6745 6754 6830 6955
27136 6955 7112 7288 7469 7636 7770 7850 7867 7823 7734 7621 7512 7432 7416 7499 7709 8049 8491 8970 9403 9710 9820 9698
27114 9698 9333 8744 7962 7030 5997 4911 3823 2779 1819 963 219 -439 -1059 -1698 -2404 -3187 -4014 -4818
27096 -4818 -5520 -6059 -6406 -6574 -6605 -6559 -6488 -6426 -6380 -6333 -6254 -6120 -5923 -5665 -5365 -5047 -4741 -4482 -4309 -4250 -4324 -4524
27074 -4524 -4833 -5212 -5618 -6003 -6321 -6543 -6646 -6622 -6473 -6207 -5842 -5409 -4940 -4465 -4000 -3558 -3146 -2780 -2486 -2293
27054 -2293 -2233 -2342 -2646 -3160 -3879 -4773 -5785 -6831 -7816 -8640 -9200 -9410 -9200 -8538 -7433 -5952 -4210 -2354
27036 -2354 -530 1144 2597 3798 4747 5458 5954 6259 6410 6447 6407 6316 6192 6058 5931 5833 5777 5761 5771 5786 5790
27015 5790 5767 5703 5580 5386 5116 4786 4434 4109 3856 3713 3705 3842 4126 4540 5048 5603 6153 6651 7065 7372 7547
26994 7547 7570 7416 7071 6549 5907 5239 4649 4229 4034 4068 4292 4628 4973 5219 5279 5109 4715 4148 3481 2790
26974 2790 2135 1560 1090 738 506 388 369 425 531 661 806 965 1144 1343 1558 1787 2028 2275 2500 2658
26954 2658 2689 2551 2236 1776 1231 660 108 -403 -855 -1225 -1465 -1526 -1364 -966 -351 426 1301 2206 3088 3920
26934 3920 4700 5449 6197 6970 7782 8630 9494 10350 11175 11952 12679 13354 13976 14546 15064 15547 16007 16462 16922
26915 16922 17377 17801 18148 18357 18373 18164 17738 17140 16432 15673 14900 14124 13341 12549 11767 11034 10415 9970 9732
26896 9732 9701 9839 10089 10389 10688 10945 11131 11227 11222 11123 10940 10684 10366 9999 9599 9177 8739 8292 7847 7423 7050
26875 7050 6749 6530 6378 6257 6125 5944 5692 5369 4988 4572 4142 3724 3334 2981 2664 2370 2089 1806 1506
26856 1506 1171 785 341 -147 -657 -1151 -1588 -1932 -2159 -2268 -2285 -2256 -2240 -2284 -2408 -2603 -2843 -3087 -3293 -3421 -3440
26835 -3440 -3325 -3084 -2753 -2400 -2111 -1969 -2028 -2299 -2747 -3300 -3882 -4436 -4931 -5359 -5724 -6020 -6228 -6318 -6262 -6043
26815 -6043 -5663 -5140 -4500 -3768 -2965 -2109 -1218 -305 619 1544 2459 3341 4162 4888 5494 5977 6364 6703 7049
26796 7049 7440 7891 8394 8925 9443 9886 10182 10260 10067 9586 8840 7882 6790 5645 4526 3495 2593 1857
26778 1857 1321 1024 1009 1308 1921 2807 3883 5036 6155 7146 7940 8495 8794 8846 8686 8367 7943 7449 6912
26759 6912 6340 5740 5129 4537 4011 3596 3327 3211 3230 3347 3511 3660 3732 3675 3455 3071 2540 1901 1201 490
26739 490 -176 -744 -1159 -1379 -1378 -1159 -745 -184 482 1207 1948 2661 3298 3820 4203 4447 4575 4611 4569 4438 4200
26718 4200 3840 3370 2826 2267 1753 1332 1031 854 788 812 895 1009 1134 1249 1341 1398 1409 1376 1310 1239 1200 1230 1362
26695 1362 1609 1969 2424 2956 3550 4193 4868 5537 6147 6629 6918 6960 6719 6195 5407 4402 3246 2004 743
26676 743 -486 -1656 -2756 -3781 -4722 -5554 -6241 -6750 -7059 -7175 -7126 -6959 -6724 -6470 -6212 -5930 -5564 -5023 -4226
26657 -4226 -3135 -1766 -185 1510 3229 4892 6438 7832 9055 10107 10999 11741 12332 12762 13003 13028
26641 13028 12829 12422 11846 11154 10391 9585 8748 7892 7039 6230 5505 4885 4359 3883 3399 2870 2295 1714 1173
26622 1173 708 330 24 -217 -395 -496 -516 -462 -367 -268 -193 -140 -71 76 374 867 1564 2426 3387 4369 5295 6110
26600 6110 6777 7280 7618 7798 7833 7741 7542 7261 6910 6486 5972 5348 4600 3744 2820 1889 1018 262 -344 -795
26580 -795 -1106 -1302 -1408 -1440 -1393 -1258 -1039 -766 -499 -304 -234 -307 -502 -759 -990 -1093 -985 -617 11 856 1847
26559 1847 2913 3996 5059 6080 7030 7873 8563 9050 9299 9285 9012 8511 7842 7089 6354 5741 5344 5223
26541 5223 5399 5847 6510 7311 8171 9028 9830 10545 11151 11640 12001 12234 12338 12320 12202 12023 11841 11719 11709 11835
26521 11835 12074 12363 12598 12671 12488 11999 11215 10194 9031 7828 6673 5631 4742 4023 3466 3045 2719 2453
26503 2453 2224 2023 1856 1723 1618 1530 1456 1399 1378 1413 1526 1729 2022 2396 2826 3279 3729 4165 4596 5041 5522
26482 5522 6045 6602 7177 7745 8293 8806 9276 9695 10057 10351 10559 10655 10620 10455 10184 9855 9524 9238 9021 8867
26462 8867 8748 8618 8438 8181 7839 7431 6995 6586 6263 6075 6050 6181 6431 6748 7072 7356 7568 7692 7722 7656
26442 7656 7495 7236 6868 6375 5735 4939 3999 2958 1880 830 -139 -996 -1729 -2337 -2820 -3169 -3370 -3408 -3280
26423 -3280 -3004 -2614 -2163 -1716 -1332 -1060 -929 -956 -1143 -1479 -1939 -2473 -3007 -3463 -3773 -3895 -3823 -3568 -3151 -2589
26403 -2589 -1897 -1088 -188 766 1735 2678 3569 4403 5182 5910 6583 7185 7700 8116 8430 8640 8748 8769 8731 8680
26383 8680 8659 8701 8809 8961 9117 9238 9301 9309 9285 9257 9246 9267 9317 9399 9518 9692 9937 10263 10657 11081 11486 11819 12043
26360 12043 12131 12061 11809 11352 10677 9806 8781 7663 6510 5373 4294 3306 2434 1690 1083 614 284 90
26342 90 29 102 307 636 1056 1521 1972 2358 2639 2794 2817 2715 2504 2209 1865 1522 1232 1038 969 1036 1234 1550
26320 1550 1962 2437 2940 3430 3865 4210 4446 4579 4636 4658 4668 4680 4677 4636 4534 4353 4087 3737 3303 2794 2216 1585
26298 1585 916 226 -469 -1157 -1823 -2446 -2999 -3447 -3750 -3877 -3811 -3558 -3150 -2628 -2031 -1386 -709 -21 649 1267
26278 1267 1797 2221 2549 2819 3093 3441 3908 4508 5212 5970 6728 7436 8047 8514 8791 8845 8672 8314 7843 7342
26258 7342 6878 6481 6151 5871 5618 5369 5104 4804 4455 4050 3589 3079 2531 1958 1374 795 237 -283 -749
26239 -749 -1147 -1471 -1717 -1889 -1997 -2068 -2140 -2254 -2440 -2697 -2995 -3274 -3482 -3579 -3558 -3442 -3269 -3080 -2891 -2701 -2497
26218 -2497 -2273 -2038 -1818 -1643 -1531 -1480 -1461 -1426 -1316 -1085 -709 -203 386 1002 1594 2129 2582 2930 3155 3259
26198 3259 3278 3288 3379 3633 4096 4771 5624 6599 7633 8665 9650 10564 11398 12160 12851 13462 13965 14314 14462 14365
26178 14365 13997 13354 12452 11312 9955 8402 6674 4810 2862 911 -949 -2612 -3972 -4951 -5507 -5653
26162 -5653 -5441 -4954 -4273 -3465 -2565 -1590 -545 554 1674 2764 3762 4600 5231 5635 5828 5865 5817 5768 5782
26143 5782 5902 6132 6444 6779 7065 7235 7241 7067 6731 6276 5759 5242 4775 4399 4136 3985 3926 3915 3910 3874 3790 3656
26121 3656 3485 3304 3136 2995 2884 2781 2654 2468 2194 1815 1326 732 46 -712 -1522 -2350 -3162 -3910 -4545
26102 -4545 -5012 -5263 -5254 -4969 -4413 -3622 -2657 -1598 -524 485 1367 2080 2599 2916 3035 2966 2718 2310 1769
26083 1769 1138 468 -187 -788 -1312 -1751 -2111 -2402 -2635 -2816 -2952 -3044 -3092 -3095 -3052 -2965 -2842 -2700 -2554 -2431 -2350 -2319
26061 -2319 -2329 -2357 -2364 -2320 -2203 -2013 -1774 -1527 -1309 -1141 -1024 -939 -850 -723 -521 -223 173 655 1186 1726 2236 2693
26039 2693 3099 3474 3849 4253 4699 5173 5643 6055 6353 6483 6414 6151 5735 5239 4746 4329 4033 3864 3792 3758
26019 3758 3691 3532 3259 2888 2473 2072 1732 1479 1316 1234 1217 1247 1300 1339 1321 1210 985 656 258 -163 -579 -976
25997 -976 -1362 -1755 -2159 -2552 -2880 -3062 -3029 -2740 -2210 -1498 -689 123 858 1445 1832 1987 1892 1553 990 238
25977 238 -647 -1591 -2504 -3293 -3875 -4187 -4201 -3923 -3394 -2687 -1882 -1066 -306 344 855 1209 1411 1472 1421 1296 1140
25956 1140 994 890 845 860 926 1038 1201 1427 1729 2118 2590 3136 3744 4400 5087 5781 6461 7106 7708 8267
25936 8267 8795 9304 9806 10300 10773 11206 11580 11894 12155 12379 12576 12741 12854 12894 12862 12792 12739 12758 12879 13106 13409
25915 13409 13759 14132 14520 14923 15339 15765 16190 16610 17016 17405 17770 18107 18415 18698 18959 19200 19422 19616 19773
25896 19773 19878 19919 19880 19739 19471 19042 18429 17636 16686 15622 14512 13434 12478 11734 11270 11114 11245 11581 12009
25877 12009 12397 12625 12602 12287 11688 10862 9905 8923 8016 7260 6685 6291 6052 5941 5938 6042 6255 6574 6973 7403
25857 7403 7798 8089 8211 8117 7787 7218 6434 5473 4399 3282 2208 1256 490 -54 -377 -507 -488 -366 -179
25838 -179 35 246 428 567 685 830 1072 1468 2041 2760 3549 4301 4908 5290 5414 5297 4994 4576 4117 3675
25818 3675 3287 2968 2713 2512 2352 2224 2124 2052 2008 1986 1973 1951 1889 1764 1551 1244 849 393 -77 -512 -861
25797 -861 -1098 -1217 -1229 -1149 -992 -763 -478 -165 130 357 475 464 332 105 -178 -484 -774 -1015 -1182 -1251 -1207
25776 -1207 -1044 -769 -411 -15 360 668 871 948 892 706 413 62 -284 -564 -736 -783 -709 -518 -213 201 710
25755 710 1279 1877 2464 3012 3489 3865 4108 4197 4134 3945 3681 3410 3196 3089 3114 3262 3496 3757 3978 4091 4049
25734 4049 3818 3403 2827 2138 1396 661 -8 -571 -998 -1272 -1386 -1343 -1164 -873 -503 -82 372 850 1343 1836
25714 1836 2299 2688 2956 3049 2925 2562 1967 1174 256 -693 -1571 -2277 -2739 -2917 -2808 -2442 -1868 -1146 -337 492
25694 492 1284 1979 2527 2900 3088 3109 2997 2788 2520 2228 1941 1690 1506 1417 1442 1590 1863 2255 2764 3387 4121
25673 4121 4949 5838 6728 7555 8258 8797 9162 9361 9417 9366 9257 9154 9120 9203 9418 9743 10128 10523 10885 11208 11510
25652 11510 11812 12119 12408 12634 12753 12740 12606 12394 12178 12044 12074 12330 12838 13588 14535 15613 16746 17855 18872
25633 18872 19746 20448 20967 21314 21509 21567 21496 21278 20884 20290 19494 18516 17399 16187 14929 13675 12475 11390
25615 11390 10461 9704 9096 8580 8080 7527 6886 6161 5399 4674 4062 3620 3376 3323 3424 3623 3854 4059 4186
25596 4186 4200 4082 3813 3394 2833 2145 1351 468 -481 -1476 -2476 -3430 -4278 -4968 -5479 -5825 -6052 -6215 -6364
25577 -6364 -6528 -6712 -6896 -7045 -7123 -7102 -6972 -6733 -6397 -5980 -5500 -4978 -4437 -3911 -3440 -3057 -2791 -2641 -2577 -2548 -2490
25556 -2490 -2361 -2158 -1917 -1698 -1559 -1533 -1630 -1843 -2168 -2597 -3123 -3720 -4348 -4953 -5486 -5919 -6241 -6454 -6548 -6496 -6267
25535 -6267 -5826 -5155 -4260 -3160 -1895 -508 951 2435 3896 5283 6550 7650 8544 9196 9577 9669 9474
25518 9474 9021 8357 7556 6693 5850 5092 4467 3992 3660 3444 3310 3235 3206 3222 3275 3350 3431 3525 3667 3915 4327 4924
25496 4924 5688 6556 7444 8270 8969 9499 9843 10002 9991 9840 9587 9278 8949 8618 8283 7916 7484 6966 6361 5691
25476 5691 4985 4262 3530 2778 1998 1201 415 -312 -944 -1451 -1816 -2034 -2095 -1990 -1716 -1284 -716 -48 684 1450
25456 1450 2223 2975 3670 4261 4691 4911 4884 4599 4065 3320 2417 1433 445 -477 -1293 -1988 -2573 -3067 -3481 -3825
$$ [...]
##END NTUPLES=NMR SPECTRUM
##END=
