##TITLE=31Pdec_MetGLU2808-3
 CDcl3 24 sc
 30.8.2023
##JCAMPDX= 6.0         $$ Bruker NMR JCAMP-DX V2.0
##DATA TYPE= NMR SPECTRUM
##DATA CLASS= NTUPLES
##ORIGIN= UXNMR, Bruker Analytische Messtechnik GmbH
##OWNER= root
$$ XWIN-NMR		Version 3.5
$$ Wed Aug 30 14:03:46 2023 Russian Standard Time (UT+4h)  she@DPX200
##.OBSERVE FREQUENCY= 81.013821
##.OBSERVE NUCLEUS= ^31P
##.ACQUISITION MODE= SIMULTANEOUS
##.ACQUISITION SCHEME= undefined
##.AVERAGES= 24
##.DIGITISER RES= 16
##SPECTROMETER/DATA SYSTEM= spect
##.PULSE SEQUENCE= zgpg30
##.SOLVENT NAME= CDCl3
##.SHIFT REFERENCE= (INTERNAL, CDCl3, 0, 248.564)
##AUDIT TRAIL= $$ (NUMBER, WHEN, WHO, WHERE, WHAT)
$$ ##TITLE= Audit trail, XWIN-NMR		Version 3.5
$$ ##JCAMPDX= 5.01
$$ ##ORIGIN= Bruker BioSpin GmbH
$$ ##OWNER= she
$$ F:/spectra/data/she/nmr/P31/1/pdata/1/auditp.txt
$$ ##AUDIT TRAIL=  $$ (NUMBER, WHEN, WHO, WHERE, WHAT)
(   1,<2023-08-30 14:02:24.00 +0400>,<she>,<DPX200>,
      <created by zg, POWCHK disabled, PULCHK disabled
       configuration hash MD5:
       00 E9 B6 7A A2 85 ED C7 34 08 36 98 17 FE 4E 26
       data hash MD5: 32K
       D8 6A 88 C4 50 D6 97 B3 C7 69 42 98 BE A2 88 2E>)
(   2,<2023-08-30 14:02:26.20 +0400>,<she>,<DPX200>,
      <Start of raw data processing
       efp BC_mod = 2 LB = 5 FT_mod = 6 PKNL = 1 PHC0 = -10850.49 PHC1 = 107.885 SI = 64K 
       data hash MD5: 64K
       14 EA 19 58 6F 90 AC 9B ED 6E 23 91 79 66 B3 9D>)
(   3,<2023-08-30 14:02:36.90 +0400>,<she>,<DPX200>,
      <abs ABSG = 5 
       data hash MD5: 64K
       EE C9 6B 9A 2C A2 59 85 2C C0 36 5E 3B 4F FD 24>)
$$ ##END=
$$ 
$$ hash MD5
$$ 5D E5 C2 3A 2A CD 78 BB 31 1D 97 B5 39 5B 71 AF
##$RELAX= 
##$RELAX= 
##$RELAX= 
##$RELAX= 
##$RELAX= 
##$RELAX= 
##$RELAX= 
##$RELAX= 
##$RELAX= 
$$ Bruker specific parameters
$$ --------------------------
##$DU= <F:/spectra>
##$EXPNO= 1
##$NAME= <P31>
##$PROCNO= 1
##$TYPE= <nmr>
##$USER= <she>
##$AMP= (0..31)
100 100 100 100 100 100 100 100 100 100 100 100 100 100 100 100 100 100 
100 100 100 100 100 100 100 100 100 100 100 100 100 100 
##$AQSEQ= 0
##$AQ_mod= 1
##$AUNM= <au_zg>
##$AUTOPOS= <>
##$BF1= 81.014009
##$BF2= 200.13
##$BF3= 200.13
##$BF4= 200.13
##$BF5= 200.13
##$BF6= 200.13
##$BF7= 200.13
##$BF8= 200.13
##$BYTORDA= 1
##$CFDGTYP= 0
##$CFRGTYP= 5
##$CHEMSTR= <none>
##$CNST= (0..31)
1 1 145 1 1 1 1 1 1 1 1 1 1 1 1 1 1 1 1 1 1 1 1 1 1 1 1 1 1 1 1 1 
##$CPDPRG= <waltz16>
##$CPDPRG1= <>
##$CPDPRG2= <waltz16>
##$CPDPRG3= <>
##$CPDPRG4= <mlev>
##$CPDPRG5= <mlev>
##$CPDPRG6= <mlev>
##$CPDPRG7= <mlev>
##$CPDPRG8= <mlev>
##$CPDPRGB= <>
##$CPDPRGT= <>
##$D= (0..31)
0 1 0 0 0 0 0 0 0 0 0 0.03 2e-05 3e-06 0 0 0 0 0 0 0 0 0 0 0 0 0 0 0 0 
0 0 
##$DATE= 1693389743
##$DBL= (0..7)
120 120 120 11 120 120 24 19 
##$DBP= (0..7)
150 150 150 150 150 150 150 150 
##$DBP07= 0
##$DBPNAM0= <>
##$DBPNAM1= <>
##$DBPNAM2= <>
##$DBPNAM3= <>
##$DBPNAM4= <>
##$DBPNAM5= <>
##$DBPNAM6= <>
##$DBPNAM7= <>
##$DBPOAL= (0..7)
0.5 0.5 0.5 0.5 0.5 0.5 0.5 0.5 
##$DBPOFFS= (0..7)
0 0 0 0 0 0 0 0 
$$ [...]
##$SUBNAM3= <"">
##$SUBNAM4= <"">
##$SUBNAM5= <"">
##$SUBNAM6= <"">
##$SUBNAM7= <"">
##$SUBNAM8= <"">
##$SUBNAM9= <"">
##$SW= 501.771253377433
##$SWIBOX= (0..15)
0 1 3 0 0 0 0 0 0 0 0 0 0 0 0 0 
##$SW_h= 40650.406504065
##$TD= 32768
##$TD0= 1
##$TE= 0
##$TE2= 300
##$TE3= 300
##$TEG= 300
##$TL= (0..7)
0 120 53 12 22 120 120 120 
##$TP= (0..7)
150 150 150 150 150 150 150 150 
##$TP07= 0
##$TPNAME0= <>
##$TPNAME1= <>
##$TPNAME2= <>
##$TPNAME3= <>
##$TPNAME4= <>
##$TPNAME5= <>
##$TPNAME6= <>
##$TPNAME7= <>
##$TPOAL= (0..7)
0.5 0.5 0.5 0.5 0.5 0.5 0.5 0.5 
##$TPOFFS= (0..7)
0 0 0 0 0 0 0 0 
##$TUNHIN= 0
##$TUNHOUT= 0
##$TUNXOUT= 0
##$USERA1= <user>
##$USERA2= <user>
##$USERA3= <user>
##$USERA4= <user>
##$USERA5= <user>
##$V9= 5
##$VALIST= <valist>
##$VCLIST= <CCCCCCCCCCCCCCC>
##$VD= 0
##$VDLIST= <DDDDDDDDDDDDDDD>
##$VPLIST= <PPPPPPPPPPPPPPP>
##$VTLIST= <TTTTTTTTTTTTTTT>
##$WBST= 1024
##$WBSW= 4
##$XGAIN= (0..3)
0 0 0 0 
##$XL= 0
##$YL= 0
##$YMAX_a= 940
##$YMIN_a= -1960
##$ZGOPTNS= <>
##$ZL1= 120
##$ZL2= 120
##$ZL3= 120
##$ZL4= 120
##$ABSF1= 248.5645
##$ABSF2= -253.2056
##$ABSG= 5
##$ABSL= 3
##$ALPHA= 0
##$AQORDER= 0
##$ASSFAC= 0
##$ASSFACI= 0
##$ASSFACX= 0
##$ASSWID= 0
##$AUNMP= <proc_1d>
##$AZFE= 0.1
##$AZFW= 0.5
##$BCFW= 0
##$BC_mod= 2
##$BYTORDP= 0
##$COROFFS= 0
##$CY= -3
##$DATMOD= 1
##$DC= 0
##$DFILT= <>
##$DTYPP= 0
##$F1P= 0
##$F2P= 0
##$FCOR= 1
##$FTSIZE= 65536
##$FT_mod= 6
##$GAMMA= 0
##$GB= 0
##$INTBC= 1
##$INTSCL= 6.047779e-11
##$ISEN= 30
##$LB= 5
##$LEV0= 0
##$LPBIN= 0
##$MAXI= 10000
##$MC2= 0
##$MEAN= 0
##$ME_mod= 0
##$MI= 50
##$NCOEF= 0
##$NC_proc= -11
##$NLEV= 6
##$NOISF1= 182.463
##$NOISF2= 159.3651
##$NSP= 0
##$NTH_PI= 0
##$NZP= 0
##$OFFSET= 248.5645
##$PC= 4
##$PHC0= -10850.49
##$PHC1= 107.885
##$PH_mod= 1
##$PKNL= yes
##$PPARMOD= 0
##$PSCAL= 0
##$PSIGN= 0
##$REVERSE= no
##$SF= 81.0140089999694
##$SI= 65536
##$SIGF1= 159.3651
##$SIGF2= -187.1042
##$SINO= 113.3802
##$SIOLD= 16384
##$SREGLST= <1H.CDCl3>
##$SSB= 0
##$STSI= 65536
##$STSR= 0
##$SW_p= 40650.406504065
##$SYMM= 0
##$S_DEV= 0
##$TDeff= 32768
##$TDoff= 0
##$TI= <>
##$TILT= no
##$TM1= 0
##$TM2= 0
##$TOPLEV= 0
##$USERP1= <user>
##$USERP2= <user>
##$USERP3= <user>
##$USERP4= <user>
##$USERP5= <user>
##$WDW= 1
##$XDIM= 65536
##$YMAX_p= 349705276
##$YMIN_p= -187130522
$$ End of Bruker specific parameters
$$ ---------------------------------
##NTUPLES= NMR SPECTRUM
##VAR_NAME=  FREQUENCY,     SPECTRUM/REAL,   SPECTRUM/IMAG
##SYMBOL=    X,             R,               I
##VAR_TYPE=  INDEPENDENT,   DEPENDENT,       DEPENDENT
##VAR_FORM=  AFFN,          ASDF,            ASDF
##VAR_DIM=   65536,         65536,           65536
##UNITS=     HZ,            ARBITRARY UNITS, ARBITRARY UNITS
##FACTOR=    0.620285442955139, 1,           1
##FIRST=     20137.2065510682, 0,            0
##LAST=      -20513.1999529968, 0,           0
##MIN=       -20513.1999529968, -187130522,  0
##MAX=       20137.2065510682, 349705276,    0
$$ Real data points
##PAGE= N=1
##DATA TABLE= (X++(R..R)), XYDATA
$$ [...]
##PAGE= N=2
##DATA TABLE= (X++(I..I)), XYDATA
12945G003948J067098M83240M66462J015187J596294J853853J918789K035370
12937A7440241K161943K033502J436064L58549q94777j642816j238151Q7628J014250
12928B0756433L25246j620216l073402k741204j081852M05802P34142m4801j378359
12919A2281789k653708l263614k872204j766240n92281L30985J134378J810986
12911D410091J912124J053610m87577j885936k412833j937994r43126j08913K28439
12902a72115K76749M14578P09746R67618J163813J533434K160772K719938K788303
12893A2562836K324454J712164J318921J011225J33046j886274m791699p489880
12885D894793q918168q823473p594213n620242l167354o91312J237109K414886
$$ y = [7003948, 8071046, 8554286, 9020748, 10035935, 11632229, 13486082, 15404871, 17440241, 19602184, 21635686, 23071750, 23430299, 22535522, 20892706, 19654555, 19742183, 20756433, 21081679, 19461463, 16388061, 13646857, 12565005, 12970807, 13704949, 13660148, 12281789, 9628081, 6364467, 3492263, 1726023, 1133742, 1464727, 2599105, 4410091, 6322215, 7375825, 6888248, 5002312, 2589479, 651485, -291641, -400554, -172115, 104634, 519212, 1228958, 2196576, 3360389, 4893823, 7054595, 9774533, 12562836, 14887290, 16599454, 17918375, 18929600, 19062646, 17176372, 12384673, 4894793, -4023375, -12846848, -20441061, -26061303, -29228657, -29919969, -28682860, -26267974]
12877b6267974L092426L510888L637217L401054K892956K254995J641677J314370
12869d522391J433341J662069J312364M4082j797817l559309m653915m588937
12861a4670513l210011j189148K79327P65602J247747K955280N801511Q500253
12853D80048J0077266J0628373J0542373R650536P550101M430753J137652j551092
12845E2946010l465203m861452n886123o319176n853011m604548l281257k715275
12837A5959965l149532l980486m229896l328221j567808Q6041O60389j51433j785381
12828a486362l246965l891007l901022l980974m476191m854930m268395k637684
12820c2743530q64590K39672R30527K056062L807659N464544O374543O630784
$$ y = [-26267974, -23175548, -19664660, -16027443, -12626389, -9733433, -7478438, -5836761, -4522391, -3089050, -1426981, -114617, -70535, -1868352, -5427661, -10081576, -14670513, -17880524, -19069672, -18790345, -18024743, -16776996, -13821716, -8020205, 480048, 10557314, 21185687, 31728060, 41378596, 48928697, 53359450, 54497102, 52946010, 49480807, 44619355, 38733232, 32414056, 26561045, 21956497, 18675240, 15959965, 12810433, 8829947, 4600051, 1271830, -295978, -209937, 450452, 299019, -1486362, -4733327, -8624334, -12525356, -16506330, -20982521, -25837451, -30105846, -32743530, -33608120, -33368448, -32437921, -30381859, -26574200, -21109656, -14735113, -8104329]
12812h104329O586448O218872N372330M296255L472576L022999K643907K062722
12804B5571780J272185L96768l65560p14572m86114L1921K64858j12137r78063
12795B4881066k076880l239325m221271m618573m183788l115392j850897o67225
12787I07715L05441P61423L10996q70025j758813j333478K49297J748616K288193
12778B609365K254983K372812K349060J207389j138272l466558m615717m575494
12770c002432l894012k699072r05781J079266K545478L133874K764209J237319
12762B58849j331753l800203m568119l156857p59509R59796J252783M65335n81449
12753a1261127j106423o97456M59663J751163K626571K810193K194668R95201
$$ y = [-8104329, -1517881, 4700991, 10073321, 14369576, 17842152, 20865151, 23509058, 25571780, 26843965, 27240733, 26875173, 26160601, 25674487, 25706408, 25971266, 25859129, 24881066, 22804186, 19564861, 15343590, 10725017, 6541229, 3425837, 1574940, 907715, 1213156, 1974579, 2285575, 1415550, -343263, -1676741, -1427444, 321172, 2609365, 4864348, 7237160, 9586220, 10793609, 9655337, 6188779, 1573062, -3002432, -6896444, -9595516, -10501297, -9422031, -6876553, -3742679, -978470, 258849, -1072904, -4873107, -9441226, -12598083, -13357592, -12397796, -11145013, -10679678, -11261127, -12367550, -13065006, -12605343, -10854180, -8227609, -5417416, -3222748, -2227547]
12745b227547P104R6369J158462K052197J880357R21173j5340o50934j167037
12736B054804j510094j448990j100832o85048J73132K099000M709916O402558
12728A0694446N917314L774121J685332P44011O44243N54241J38247n21957j518304
12719B2111694l010145m517393m861859l234858k09956K643066M191757M573897
12711A7686203M608676M706359M558176L705970K145096L63968j061642j852185
12703C4860621k019099j558137m03787J097507J961288J413407q027q94376q19079
12694C3630318j025492k607231m604599m970474l287491j411353j134321k161486
12686A2427871k942279k731225k042433j523992j251962j059007q75146o39384
$$ y = [-2227547, -2220443, -2124074, -965612, 1086585, 2966942, 3888115, 3872775, 3221841, 2054804, 544710, -904280, -2005112, -2690160, -2517028, -418028, 4291888, 10694446, 16611760, 20385881, 22071213, 22815224, 23459467, 24013708, 24151955, 23629998, 22111694, 19101549, 14584156, 9722297, 6487439, 6277483, 8920549, 13112306, 17686203, 22294879, 27001238, 31559414, 35265384, 37410480, 37774448, 36712806, 34860621, 32841522, 31283385, 30879598, 31977105, 33938393, 35351800, 35343773, 34449397, 33630318, 32604826, 29997595, 25392996, 20422522, 17135031, 15723678, 14589357, 12427871, 9485592, 6754367, 4711934, 3187942, 1935980, 876973, 1827, -637557]
12678f37557l11316m0123j6389j91784m43532q80702j558342j967542j335610
12669g382897M54951K625409M236306M792020M136768K348223J1295j850443k516315
12660F855317k085131j123708j12580O12479Q10888N99992N02754R00311J615984
12651H576306K234043K506193K194822R66914j065093l009211l950347l859533
12643D594094l272400k327412p77342J170767K750585L436918L249802K232557
12635A1057569L30890k034218l974317n042831n556600n700518m982529l110181
12627a9012735q43758P38256J516339K187649L020854L457675L017160K045291
12619c873269J374921J544533K434151L410944L777644L287254K258521J113853
$$ y = [-637557, -948873, -988996, -1005385, -1197169, -1640701, -2521403, -4079745, -6047287, -7382897, -6927946, -4302537, -66231, 4725789, 8862557, 11210780, 11222075, 9371632, 6855317, 4770186, 3646478, 3533898, 4146377, 4957265, 5557257, 6060011, 6960322, 8576306, 10810349, 13316542, 15511364, 16478278, 15413185, 12403974, 8453627, 4594094, 1321694, -1005718, -1783060, -612293, 2138292, 5575210, 8825012, 11057569, 11388459, 9354241, 5379924, 337093, -5219507, -10920025, -15902554, -19012735, -19856493, -19118237, -17601898, -15414249, -12393395, -8935720, -5918560, -3873269, -2498348, -953815, 1480336, 4891280, 8668924, 11956178, 14214699, 15328552]
12611A5328552J682r09260j076851p0865J615443K761312K610695J555062N08567
12602B2324337p0098l47730n94467p92493p10125j95219O22793J398372J865818
12593B3501188K045496K108034K115083J988387J629096R45414q0569j153594
12585C3098535j675540j340506o69786o10177j554809l016914m255260m887681
12577A5087862m843546m118978k859349j513855o49224n35976q68348q61387J50348
12568a012453J915585L193153K887220J282232k32736p29532o30821r40899k067338
12559C664411l667992n211014o198361o046268m293829j104490K599497N597897
12551a4660149P055820O997308O242885N705110N589122N402626M797374M122313
$$ y = [15328552, 15330234, 14420974, 13344123, 13273258, 14888701, 17650013, 20260708, 21815770, 22324337, 22254239, 21906509, 21312042, 20519549, 19809424, 19614205, 20236998, 21635370, 23501188, 25546684, 27654718, 29769801, 31758188, 33387284, 34332698, 34252129, 33098535, 31422995, 30082489, 29412703, 28802526, 27247717, 24230803, 19975543, 15087862, 10244316, 6125338, 3265989, 1752134, 1102910, 566934, -301414, -1162801, -1012453, 903132, 4096285, 6983505, 8265737, 8033001, 7303469, 6672648, 5731749, 3664411, -3581, -5214595, -11412956, -17459224, -21753053, -22857543, -20258046, -14660149, -7604329, -607021, 5635864, 11340974, 16930096, 22332722, 27130096, 31252409]
12543C1252409L964486M389506M871396M770326L643049J330348j850259n024515
12535D7346746p203985p941865p520338o600582n785946n334680n070911m653037
12527b764598m037377l474657k912525j776882K37226K399354L516711L252087
12519e560661K385635J712260J171124K56867j137514k608426l703753m172887
12511a1657355l902241k913116j438747J38405J422916K061622J828317Q05756
12503a3654443n92565j887356k732168k784115j624322Q30866L793944N788406
12495a2861753N676227L597642Q56370j161766k008756k238965k595213l190913
12487a3927127l458955k820259j332661L33380J516545K098493K415847K754556
$$ y = [31252409, 35216895, 39606401, 44477797, 49248123, 52891172, 54221520, 52371261, 47346746, 40142761, 32200896, 24680558, 18079976, 12294030, 6959350, 1888439, -2764598, -6801975, -10276632, -13189157, -14966039, -14728813, -12329459, -8812748, -5560661, -3175026, -1462766, -291642, -34775, -1172289, -3780715, -7484468, -11657355, -15559596, -18472712, -19911459, -19773054, -18350138, -16288516, -14460199, -13654443, -14247008, -16134364, -18866532, -21650647, -23274969, -22444103, -18650159, -12861753, -7185526, -3587884, -2731514, -3893280, -5902036, -8141001, -10736214, -13927127, -17386082, -20206341, -21539002, -21205622, -19689077, -17590584, -15174737, -12420181]
12479a2420181L070629L180459L027991K699719K393599K508235L469612N110822
12471A3040885O395919O241423M621467K410973J32090k495662n509834p936999
12463A6900262q734893q085096o987585n782261l935586j375315Q01922J378271
12455a5820281K76495j570417l157375l833572l266872j632947K75154J658672
12447b7071143K489675L349910M519508N590036O020697N716819M936802L962076
12439I514380L086981K678796K903020L430079L675428L371006K719092J953372
12431C3332154R86773l30840j759513k743192k948612k534768j883975j338136
12423B0779891j290420k152968l826432n357220n622633m482973k918781j890587
$$ y = [-12420181, -9349552, -6169093, -3141102, -441383, 1952216, 4460451, 7930063, 13040885, 19436804, 25678227, 30299694, 32710667, 32842757, 30347095, 24837261, 16900262, 8165369, 80273, -6907312, -12689573, -16625159, -18000474, -17198552, -15820281, -15543786, -17114203, -20271578, -24105150, -27372022, -29004969, -28729815, -27071143, -24581468, -21231558, -16712050, -11122014, -5101317, 615502, 5552304, 9514380, 12601361, 15280157, 18183177, 21613256, 25288684, 28659690, 31378782, 33332154, 34318927, 33988087, 32228574, 29485382, 26536770, 24002002, 22118027, 20779891, 19489471, 17336503, 13510071, 8152851, 2530218, -1952755, -4871536, -6762123]
12415f762123j406429r43238m21371k77554o73913j142302j181974q83673p12598
12406a4405175q48337r96497p93711j68448P17620J673983K508505K984328K932246
12397f395486K410871J647883Q12365o3834r42872j694545k195441k365259k016924
12388a0803242q62800J085092L189775M565573M898436M716071M691477M765568
12380A6245950M116772K032748j213659m337358n896514n286948l038189k63190
12372B359612K079370L461390L722398L135754K464674K457734L006444L055513
12364B5742889J685925p75925k983329l900438l728261l519252m060396n160270
12356C300943n859761n268569l321256q20415J277844K620721L472951M083378
$$ y = [-6762123, -8168552, -9111790, -9533161, -9810715, -10484628, -11626930, -12808904, -13692577, -14405175, -15253512, -16250009, -17043720, -17212168, -16494548, -14820565, -12312060, -9327732, -6395486, -3984615, -2336732, -1524367, -1588201, -2531073, -4225618, -6421059, -8786318, -10803242, -11666042, -10580950, -7391175, -2825602, 2072834, 6788905, 11480382, 16245950, 20362722, 22395470, 21181811, 16844453, 10947939, 5660991, 2622802, 2359612, 4438982, 7900372, 11622770, 14758524, 17223198, 19680932, 22687376, 25742889, 27428814, 26652889, 23669560, 19769122, 16040861, 12521609, 8461213, 3300943, -2558818, -7827387, -11148643, -11969058, -10691214, -8070493, -4597542, -514164]
12348e14164M272129L731509K542986J180269L2324q90384j715290k310985k299633
12339D028761j521938m15292K30270L9160m24183o6053J623475L871693N183534
12330A2549427M685338K874827J047147J25998J33826N80600J012444J125508
12322B4135115O86346l36472j608517k621042l084408l022983k527416j627321
12314I993302m81556M89443Q48552N19717j29531n35369k46135Q44393K331934
12305A3634750L348672L023690J154341j549624m014811n638994o502932o787956
12297c332864o263171m612156k172123n922R18652N08722n22229j328258j511422
12288a8320771j300064j303267j872194k538078k325654q64952J034581K210311
$$ y = [-514164, 3757965, 7489474, 10032460, 11212729, 11245053, 10354669, 8639379, 6328394, 4028761, 2506823, 2091531, 2321801, 2360961, 1936778, 1870725, 3494200, 7365893, 12549427, 17234765, 20109592, 21156739, 21282737, 21416563, 21997163, 23009607, 24135115, 24821461, 24484989, 22876472, 20255430, 17171022, 14148039, 11620623, 9993302, 9511746, 10001189, 10849741, 11369458, 11239927, 10704558, 10458423, 11302816, 13634750, 16983422, 20007112, 21161453, 19611829, 15597018, 9958024, 3455092, -3332864, -9596035, -14208191, -16380314, -16386236, -15467584, -14958862, -15481091, -16809349, -18320771, -19620835, -20924102, -22796296, -25334374, -27660028, -28524980, -27490399, -25280088]
12280b5280088K319782J834185J152632L60273j89541J71335J527669K930147
12272a5173606L297262K552112J576956J255284J776151K587850K753920J675672
12264B301601j25319j167032m23214J481089K869870K770174J739526J031954
12256A0478649J345382K396965L326857L387536K504893J287448L65308k10135
12248B4882903p27798j206898j466879j684804k273935l091609l352505k613504
12240H464971j354119k26017P97651K002320L003521K910574J399698q83531l033421
12231A3081647m544583n196657m829384l635756k423414k093749k729705l414481
12223a5786082l127634j770340j81293Q13923J140357J194658J176064J094059
$$ y = [-25280088, -22960306, -21126121, -19973489, -19613216, -19802757, -19631422, -18103753, -15173606, -11876344, -9324232, -7747276, -6491992, -4715841, -2127991, 625929, 2301601, 2176282, 1009250, 586036, 2067125, 4936995, 7707169, 9446695, 10478649, 11824031, 14220996, 17547853, 20935389, 23440282, 24727730, 25093038, 24882903, 24155105, 22948207, 21481328, 19796524, 17522589, 14430980, 11078475, 8464971, 7110852, 6884835, 7682486, 9684806, 12688327, 15598901, 16998599, 16115068, 13081647, 8537064, 3340407, -1488977, -5124733, -7548147, -9641896, -12371601, -15786082, -18913716, -20684056, -20865349, -20051426, -18911069, -17716411, -16540347, -15446288]
12215a5446288J266318K179113L648866M647894M378834L197322K055071J318084
12207G245214O28317k96327j327612k292623l032336l076188j960641j09506J221503
12198c000199J266414N62124P8754R038q2370l00119k70238J79031P71380J226277
12188D40092J483837J446388R04509j77431j558241k879205l671091l390411j963536
12179i365089k68648N06401J43809m55319n52345m25959o44706j089214j273032
12170a3424102j242802j467726j964920k182938j818789j216345p63510k85826
12162b4366958O82909K184948L577676L996286L150906J761592J027993J418827
12154f565821K122726J993939Q77972m20301j341445k115776l006593l654346
$$ y = [-15446288, -14179970, -12000857, -8351991, -3704097, 674737, 3872059, 5927130, 7245214, 7873531, 7577204, 6249592, 3956969, 924633, -2151555, -4112196, -4221702, -3000199, -1733785, -1171661, -1092907, -1083869, -1166239, -1466358, -1736596, -1557565, -786185, 440092, 1923929, 3370317, 4274826, 4097395, 2539154, -340051, -4011142, -7401553, -9365089, -9633737, -9127336, -8983527, -9438846, -9991191, -10417150, -11061856, -12151070, -13424102, -14666904, -16134630, -18099550, -20282488, -22101277, -23317622, -24081132, -24366958, -23684049, -21499101, -17921425, -13925139, -10774233, -9012641, -7984648, -6565821, -4443095, -2449156, -1571184, -1991485, -3332930, -5448706, -8455299, -12109645]
12146a2109645l541014k686826j539996n41118j07086n47249j425353j381445
12138b3879732O15590L848654O348089O927606O174764N298895M678057L973821
12130A3985744L131022K517555K146305J385544k97670k557565m321390m640439
12122A1349106l387138j328597L46375P40181j96374j647034k526063k259740
12114A090716j122174J22907Q78814J043231Q15766L59210k99208j158974k141106
12105d10818l019277l389849k853967j414926L53235J704972K296689K283211
12097d450730J967340J563181J222636J006550Q14382O03946O86385J466516K798869
12088G679075L956019M413161M320217L965066L175317J699813q3598j403652
$$ y = [-12109645, -15650659, -18337485, -19877481, -20418599, -20525685, -21072934, -22498287, -23879732, -23264142, -19415488, -13067399, -6139793, 34971, 5333866, 10011923, 13985744, 17116766, 19634321, 21780626, 23166170, 22868500, 20310935, 15989545, 11349106, 7961968, 6633371, 6979746, 7719927, 7523553, 5876519, 3350456, 1090716, -31458, 91449, 970263, 2013494, 2829260, 3188470, 2889262, 1730288, -410818, -3430095, -6819944, -9673911, -11088837, -10735602, -9030630, -6733941, -4450730, -2483390, -920209, 302427, 1308977, 2123359, 2727305, 3413690, 4880206, 7679075, 11635094, 16048255, 20368472, 24333538, 27508855, 29208668, 29125070, 27721418]
12080B7721418j988119k221158k382707k255077j701670j232915j642489l183755
12072A1113528n237499o670459o532960m735406k205025j33434J083267J948486
12064a1369502K881355L571933L565737L034620K483290J974061J210782K92214
12056G644490j65058K94165J555997L170756M525439M816255L509020J108918
12048B6459982j016005j945194k031811k169915k633401l015585k978537k582913
12040H086621k063087j709041j818043k325262k600444k076898j037659l40713
12032e884526m06732r48733j655669k496741l152405k778194q44581K052468M599221
12023a1515892N818687N495494L893689J555317o81407j939276j831271o85981
$$ y = [27721418, 25733299, 23512141, 21129434, 18874357, 17172687, 15939772, 14297283, 11113528, 5876029, -794430, -7327390, -12062796, -14267821, -14401255, -13317988, -11369502, -8488147, -4916214, -1350477, 1684143, 4167433, 6141494, 7352276, 7644490, 7479432, 7773597, 9329594, 12500350, 17025789, 21842044, 25351064, 26459982, 25443977, 23498783, 21466972, 19297057, 16663656, 13648071, 10669534, 8086621, 6023534, 4314493, 2496450, 171188, -2429256, -4506154, -5543813, -5884526, -6291258, -7239991, -8895660, -11392401, -14544806, -17323000, -18167581, -16115113, -11515892, -5697205, -201711, 3691978, 5247295, 4565888, 2626612, 795341, 109360]
12015A09360P69483J919367K547053K725601K437081J425354l20651k014484k527683
12006G070481j678686o49082o55131j456991j708077o74018R34186J866769J568723
11997D618174L72387j060724k151551k506262j985078p50280P91446K092357K647529
11988B067998K323124J527909Q82892P05145R12720J253985J336417O31774r78072
11979A0663892k583334k733534q77608J953549M086811M542503L367137J210039
11971A9629455r98804k341190k474847j887161j325017j139794j407368k281909
11963E773365l676155m799511m665733l144863j100274N18990J323020J320937
11955h450224P40489J53664K08128Q92113J426545J200740N55647L85693J201005
$$ y = [109360, 878843, 2798210, 5345263, 8070864, 10507945, 11933299, 11612648, 9598164, 7070481, 5391795, 4742713, 4087582, 2630591, 922514, 248496, 1182682, 3049451, 4618174, 4990561, 3929837, 1778286, -727976, -2713054, -3463334, -2671888, -579531, 2067998, 4391122, 5919031, 6801923, 7507068, 8419788, 9673773, 11010190, 11641964, 10663892, 8080558, 5347024, 4469416, 6422965, 10509776, 15052279, 18419416, 19629455, 18630651, 16289461, 13814614, 11927453, 10602436, 9462642, 8055274, 5773365, 2097210, -2702301, -7368034, -10512897, -11613171, -11094181, -9771161, -8450224, -7709735, -7556071, -7347943, -6455830, -5029285, -3828545, -3272898, -2887205, -1686200]
11946a686200K787769M489537N521388N279663L788976J838219M20643K6786N43504
11937B3010285J590682K678348L233617K920336K022718J267986J162572J571469
11929C9458013J868934J335982m58072l282578o093147p484322o603968l758382
11921A4982460j37033L075631N383789O880489P591559P129269N176769K172762
11913E2255695q63691l255593n038428o262389o425148n087458k788649p75823
11905B1758516J58753J49753l28782r39545j299561r80626j11518L86379l65922
11896A8427447k201232l957367m424199l143676n91704K076730L607195L398444
11888A3191638J872511Q1975j028111j063135k46695P31608J190624J090650J061420
$$ y = [-1686200, 1101569, 5591106, 11112494, 16392157, 20181133, 22019352, 22439995, 22466781, 23010285, 24600967, 27279315, 30512932, 33433268, 35455986, 36723972, 37886544, 39458013, 41326947, 42662929, 42204857, 38922279, 32829132, 25344810, 18740842, 14982460, 14845427, 17921058, 23304847, 30185336, 37776895, 44906164, 50082933, 52255695, 51392004, 48136411, 43097983, 36835594, 30410446, 25322988, 22534339, 21758516, 21917269, 22067022, 21738240, 20798695, 19499134, 18518508, 18406990, 18793369, 18427447, 16226215, 12268848, 7844649, 4700973, 4109269, 6185999, 9793194, 13191638, 15064149, 15146124, 14118013, 13054878, 12808183, 13539791, 14730415, 15821065, 16882485]
11879A6882485J558120K189830K213905J482991M16114q49624k598757m614436
11871A6680628n728586m880340k481003k64259L34695n02646j276599o62446J283326
11862B502770L310332M300512M268025L880909L213981J593819j075266l451130
11854A8543952l951596k662738j326687j296074k137335k560769k110155j330093
11846A168505o70351p7822K90455k45768k019701m218487n416803m779925k481971
11837a8451868P69465M091433O402920O776663N289979L237920J979871J545876
11829A1642259P76627j003365k812350k912684q07505K094908L980440M443796
11821A5402126M465821M839892N204039M707506L071289O66148j997537m347158
$$ y = [16882485, 18440605, 20630435, 22844340, 24327331, 24743445, 23893821, 21295064, 16680628, 10952042, 6071702, 3590699, 3326440, 3661135, 3158489, 1881890, 1219444, 2502770, 5813102, 10113614, 14381639, 18262548, 21476529, 23070348, 21995082, 18543952, 14592356, 11929618, 10602931, 9306857, 7169522, 4608753, 2498598, 1168505, 498154, 420332, 710787, 465019, -1554682, -5773169, -11189972, -15969897, -18451868, -17682403, -13590970, -7188050, -411387, 4878592, 8116512, 10096383, 11642259, 12418886, 11415521, 8603171, 5690487, 4882982, 6977890, 10958330, 15402126, 19867947, 24707839, 29911878, 34619384, 37690673, 38356821, 36359284, 32012126]
11813C2012126n642830n501866m526871l788215l550745l098096k033626j088436
11805B781441j118806j793759j991549j293858l65335J60589M74940J025062J700358
11796d20917J999415J718478J095729M35425o6780k10425J31633P25568R99334
11787F407460N41790m42961j267373j381846q65417k91383j18053k67075l32067
11778A983075j14680J70339K12931J7445m6469M24220J440674K466455K776367
11769I330357K142293J169936Q06118J449090K599907L366572L211487K245583
11761B6321343R62788k54032j435877k821486m267190m978847m100483j639650
11753G786566J351708L571547M363580L951773L097033K541775K446647K201272
$$ y = [32012126, 26369296, 20867430, 16340559, 12552344, 9001599, 5903503, 3869877, 2781441, 1662635, -131124, -2122673, -3416531, -3781866, -3621277, -3146337, -2121275, -420917, 1578498, 3296976, 4392705, 4828130, 4761350, 4550925, 4682558, 5408126, 6407460, 6949250, 6506289, 5238916, 3857070, 2991653, 2700270, 2582217, 2315142, 1983075, 1868395, 2038734, 2251665, 2269110, 2222641, 2646861, 4087535, 6553990, 9330357, 11472650, 12642586, 13448704, 14897794, 17497701, 20864273, 24075760, 26321343, 27284131, 27030099, 25594222, 22772736, 18505546, 13526699, 9426216, 7786566, 9138274, 12709821, 17073401, 21025174, 24122207, 26663982, 29110629, 31311901]
11745C1311901J024381j086247l207005m439732m783209m860387m992843m812131
11737D154728l684101j340701J736558M332782N100387L543994M76506k654013
11729A1666140m831722n778285n537843m294432k628485j446574j302393j892603
11721a6046197k394520k263680j661868j187339j205362j382064r60129L41742
11713b6759417J795864K319224J693416Q57062Q84353J927943L313877M401602
11705i566076N057229N421966N562220N403963M790001L512474J468643j038070
11697B0612350l214289m226417l909931l003598k512610k742291l023692k452931
11689d473409q20200J249593K919722L728519L686876L107603K414294J904877
$$ y = [31311901, 32336282, 31250035, 28043030, 23603298, 18820089, 13959702, 8966859, 4154728, 470627, -870074, 866484, 5199266, 10299653, 13843647, 14320153, 11666140, 6834418, 1056133, -4481710, -8776142, -11404627, -12851201, -14153594, -16046197, -18440717, -20704397, -22366265, -23553604, -24758966, -26141030, -27101159, -26759417, -24963553, -22644329, -20950913, -20093851, -19209498, -17281555, -13967678, -9566076, -4508847, 913119, 6475339, 11879302, 16669303, 20181777, 21650420, 20612350, 17398061, 13171644, 9261713, 6258115, 3745505, 1003214, -2020478, -4473409, -5293609, -4044016, -1124294, 2604225, 6291101, 9398704, 11812998, 13717875]
11681A3717875J572252J251214R73898J012121J477508K039103K194807J757712
11673B5996490R65254J70440m69633j053291j801421k847627m049642m973455
11665A1937115n131188m332076k883546j451871n86164k20976L02672J509267
11657h56767L011449L631882K458119k45860l199458n066176n242250l951206
11649i460267j861915L50234K250313L622488M299988M123641L133549J727250
11641H185281M98716j24344q2383M21227J169743K103106L277088M619005N710072
11632B5777511N922672M912367K985358R06763o75479j607976k111628k416937
11624C3692651k574866k571540k520278k639039l004613l404905l537440l338028
$$ y = [13717875, 15290127, 16541341, 17515239, 18527360, 20004868, 22043971, 24238778, 25996490, 26961744, 27132184, 26662551, 25609260, 23807839, 20960212, 16910570, 11937115, 6805927, 2473851, -409695, -1861566, -2447730, -2668706, -2366034, -856767, 2154682, 5786564, 8244683, 7998823, 4799365, -266811, -5509061, -9460267, -11322182, -10971948, -8721635, -5099147, -799159, 3324482, 6458031, 8185281, 8683997, 8559653, 8477270, 8898497, 10068240, 12171346, 15448434, 20067439, 25777511, 31700183, 36612550, 39597908, 40504671, 39829192, 38221216, 36109588, 33692651, 31117785, 28546245, 26025967, 23386928, 20382315, 16977410, 13439970, 10101942]
11616A0101942l016567k796466k771290l009348l541761m104270m137407l355641
11608a6630808k231748j577547j587570j580861q03451P74821K621884M294202
11600a6721078N570136O112671N538648M021666K487778J875695K259060K861048
11592A4005624K837504J898001L35895j217723k070383j854632q82081l8310j75337
11583A2838558j514442l479728m958333m898416l090187n25054J280026J515010
11575b832566N32527q76268k230615l203286l259291k077376j90507J388093K281498
11566a0467791L080875M439310O179270P460699P568502O384182M320305J984151
11558C0949503k16358k250017m182374n768090o538684o285264n192652l503347
$$ y = [10101942, 7085375, 4288909, 1517619, -1491729, -5033490, -9137760, -13275167, -16630808, -18862556, -20440103, -22027673, -23608534, -24411985, -23637164, -21015280, -16721078, -11150942, -5038271, 500377, 4522043, 7009821, 8885516, 11144576, 14005624, 16843128, 18741129, 19077024, 17859301, 15788918, 13934286, 13052205, 13013895, 12838558, 11324116, 7844388, 2886055, -2012361, -5102548, -5627602, -4347576, -2832566, -2300039, -3176307, -5406922, -8610208, -11869499, -13946875, -14137382, -12749289, -10467791, -7386916, -2947606, 3231664, 10692363, 18260865, 24645047, 28965352, 30949503, 30733145, 28483128, 24300754, 18532664, 11993980, 5708716, 516064, -2987283]
11550b987283j408237O53554K018076K386583K099113J562067O86542p78551k570589
11541A661275l949081m340544l691800k297162n74578J030858K187536K754041
11533g219455K626716J673492K2786j755881l054536l719500l909142l661439
11525a8996959l000866k338991k210757k495734k379050j346970J13150J089739
11517c1566438J272918J100591J062315J212267J331199J238098Q49599J87657
11509b3311794m59714n00863N32487K348936L818336L827414K365200O32054q3926
11500a0831870M15246J259792J546300J131394N06641K16812M72774J080638J602813
11491b599460J726551J558361J411197J263911P00289m28455j532366j847352
$$ y = [-2987283, -4395520, -3741966, -1723890, 662693, 2761806, 4323873, 5010415, 4231864, 1661275, -2287806, -6628350, -10320150, -12617312, -13191890, -12161032, -9973496, -7219455, -4592739, -2919247, -2896461, -4652342, -7706878, -11426378, -15335520, -18996959, -21997825, -24336816, -26547573, -29043307, -31422357, -32769327, -32656177, -31566438, -30293520, -29192929, -28130614, -26918347, -25587148, -24349050, -23499451, -23311794, -23771508, -24272371, -23739884, -21390948, -17572612, -13745198, -11379998, -10747944, -10831870, -10416624, -9156832, -7610532, -6479138, -5972497, -5755685, -5282911, -4202273, -2599460, -872909, 685452, 2096649, 3360560, 4060849, 3632394, 2100028, 252676]
11483B52676j436705j249575j992696l158836l437869k058728M50200K780729
11475i850804L860414L319669J372568j288589l518667m156515k826725k63343
11467a3351992K297431L974256M502988M022464K960935J964239J470928J271652
11459I112901Q22300J17824q2758Q04627K202663K710390J553363m76849j717494
11450A5046967j280641J03463R32503M67990p72824j931844k733185l231650l059648
11441C541131j587841J065373L668002M841001M233365K575693P82014p17757
11433A8400981j826287k325960j896370o60326N18362O99332l367l19269P18867
11424A3305963K410273L065942K079878O84859L70910J138304J819710J670888
$$ y = [252676, -1184029, -2433604, -4426300, -7585136, -11023005, -13081733, -12631533, -9850804, -5990390, -2670721, -1298153, -2586742, -6105409, -10261924, -13088649, -13351992, -11054561, -7080305, -2577317, 1445147, 4406082, 6370321, 7841249, 9112901, 9935201, 10053025, 9970267, 10774894, 12977557, 15687947, 17241310, 16764461, 15046967, 13766326, 13869789, 14802292, 15270282, 14497458, 12565614, 9832429, 6600779, 3541131, 1953290, 3018663, 6686665, 11527666, 15761031, 18336724, 19118738, 18400981, 16574694, 14248734, 12352364, 11692038, 12210400, 12909732, 12906365, 12587096, 13305963, 15716236, 18782178, 20862056, 21546915, 21917825, 23056129, 24875839, 26546727]
11416B6546727R14725q7282j317653k506274k760002j415283R21747K663405K626531
11407B5586641R27972j433345l566764n155293o194424o581450o038649m341433
11399f796745j580907J709203M636439O311570O372262N232137L701785K281987
11391B1867731Q77062p97838k680523m333893n348941n652695n481978n175470
11383f726545m946618m727614m229823l234834j808151j77051J494186L042058
11375b1314392M084021M145514L169641J774058P96382N38389N31309O7059j102435
11366g310454k618961l964458m890150n363625n276097m448812k960167j275694
11358c8108418O4368Q04482R97702Q82474Q92671J562612L029697M581718N034180
$$ y = [26546727, 27461452, 27374170, 26056517, 23550243, 20790241, 19374958, 20296705, 22960110, 25586641, 26514613, 25081268, 21514504, 16359211, 10164787, 3583337, -2455312, -6796745, -8377652, -6668449, -2032010, 4279560, 10651822, 15883959, 19585744, 21867731, 22744793, 21946955, 19266432, 14932539, 9583598, 3930903, -1551075, -6726545, -11673163, -16400777, -20630600, -23865434, -25673585, -25850636, -24356450, -21314392, -17230371, -13084857, -9915216, -8141158, -7344776, -6806387, -6275078, -6208019, -7310454, -9929415, -13893873, -18784023, -24147648, -29423745, -33872557, -36832724, -38108418, -38044050, -37239568, -36241866, -35359392, -34466721, -32904109, -29874412, -25292694, -20258514]
11349b0258514L820273J645339p7414m19034M55080J677851K451641K449847J719986
11340f534945M38799j172395k769845l856320l962022k954372j187605P06785
11332b1291920K247467L366590M262955N006510N332970M887375L657770K058861
11324I528578N15540r29696k422988l754986m296141l668988k330725j207650
11316h567056p41553n23664P3655J124408K106785K397080J632181j49210k334389
11307d981763l785042l538689j714910M58068J688838J607630P16965l20485j117596
11298a0986984j506683j407774q30535P2018R26592J173049M96968n93316r77328
11289a3633993j33188J053611J209928J97985n84987K25645K500520M883612O093894
$$ y = [-20258514, -16438241, -14792902, -14870316, -15289350, -14834270, -13156419, -10704778, -8254931, -6534945, -6096146, -7268541, -10038386, -13894706, -17856728, -20811100, -21998705, -21291920, -19044453, -15677863, -11414908, -6408398, -1075428, 3811947, 7469717, 9528578, 10044118, 9114422, 6691434, 2936448, -1359693, -5028681, -7359406, -8567056, -9308609, -9832273, -9758618, -8634210, -6527425, -4130345, -2498164, -2647374, -4981763, -8766805, -12305494, -14020404, -13562336, -11873498, -10265868, -9548903, -9869388, -10986984, -12493667, -13901441, -14731976, -14659958, -13733366, -12560317, -12063349, -12656665, -13633993, -13767181, -12713570, -11503642, -11305657, -11890644, -11664999, -9164479, -4280867, 1813027]
11280A813027N689611L956339J550291q42878k893616m717627o383768p412352
11272i240973p042405n030543k017796Q83911K753119L271990K829866K276498
11264a1316333K305953K920547L581278L901726M036792M347655M880238N317789
11256A9975645N340752M884914M095863L193440K433984K093623K319644K902131
11248D7239996L249145K757073J320692n56485k214046l340816l970350m089528
11240D0395681l487632k107622m37294O51743N77630m60551j756387k853103l862715
11231B6659750m948143n743343n655908m711065l670117l123996k786690j948384
11223e927896l87542J455095K986789L785065L590607K464289R75900j61368p24694
$$ y = [1813027, 7502638, 11458977, 13009268, 12166390, 9272774, 4555147, -1828621, -9240973, -16283378, -21313921, -23331717, -22447806, -19694687, -16422697, -13592831, -11316333, -9010380, -6089833, -2508555, 1393171, 5429963, 9777618, 14657856, 19975645, 25316397, 30201311, 34297174, 37490614, 39924598, 42018221, 44337865, 47239996, 50489141, 53246214, 54566906, 54010421, 51796375, 48455559, 44485209, 40395681, 36908049, 34800427, 34363133, 35014876, 35592506, 35131955, 33375568, 30522465, 26659750, 21711607, 15968264, 10312356, 5601291, 1931174, -1192822, -3979512, -5927896, -6315438, -4860343, -1873554, 1911511, 5502118, 7966407, 8942307, 8780939, 8056245]
11214H056245r34904p85330R1293J676804L115565L382678K230117K85651j489247
11205A5628872k226617j535451n9706O06316o55458l013359m274364l253552j087010
11196A29671J61078k46832j344639j956911j816480j207255k64192R53547K107743
11187c484270K793077L000552L045919L109663L145171L206041L527481M169126
11179B2512760M811795N075626M902260M453454L725137K502358P76647r64916
11171D7795121k104881k602320l135765m318167n829358o616815o051231m623656
11163A2512928l315833k534850j987074j415736r69936p67926n35068L3782P64769
11154A785056J141099Q99799L30420L316K79362J031194J785682K185211K297248
$$ y = [8056245, 7121341, 6336011, 6427304, 8104108, 11219673, 14602351, 16832468, 17118119, 15628872, 13402255, 11866804, 11807098, 12413414, 11757956, 8744597, 4470233, 1216681, 129671, 290749, 43917, -1300722, -3257633, -5074113, -6281368, -6545560, -5592013, -3484270, -691193, 2309359, 5355278, 8464941, 11610112, 14816153, 18343634, 22512760, 27324555, 32400181, 37302441, 41755895, 45481032, 47983390, 48760037, 47795121, 45690240, 43087920, 39952155, 35633988, 29804630, 23187815, 17136584, 12512928, 9197095, 6662245, 4675171, 3259435, 2289499, 1521573, 986505, 1020287, 1785056, 2926155, 3825954, 4156374, 4159690, 4439052, 5470246, 7255928, 9441139, 11738387]
11145A1738387K359070K267357J580447J32410j552537k597740k414583r96748
11137A0516063J133468L104626M100078L918101L096786K335712J894431J645545
11129C1744810J446251J183223O58377j98949j072863j531875j532390j384894
11121B9311690j280452j168647j084460j235301j663036k079535k133124j653281
11113A7013854o43558O71560J737441J939897J171977p0483j289029k466965l807799
11104A4256895n200210o169239o298801n594119m488468l514804k845074k161751
11096b2015571j173688k08994O9697l60449o02957J76960J783858L313622M160958
11087a4856564M296647L774671K560244R11875n57204j413036j681317j429033
$$ y = [11738387, 14097457, 16364814, 17945261, 18077671, 16525134, 13927394, 11512811, 10516063, 11649531, 14754157, 18854235, 22772336, 25869122, 28204834, 30099265, 31744810, 33191061, 34374284, 35032661, 34833712, 33760849, 32228974, 30696584, 29311690, 28031238, 26862591, 25778131, 24542830, 22879794, 20800259, 18667135, 17013854, 16370296, 17041856, 18779297, 20719194, 21891171, 21820688, 20531659, 18064694, 14256895, 9056685, 2887446, -3411355, -9005474, -13493942, -17008746, -19853820, -22015571, -23189259, -23398253, -23328556, -23689005, -24291962, -24115002, -22331144, -19017522, -14856564, -10559917, -6785246, -4225002, -3313127, -3870331, -5283367, -6964684, -8393717]
11079h393717m29467J404808L437090M569196M202240K789380J383843P17963
11071I681336P15632P88155N35567J56209J59729P12565J407844J767445J814817
11062A7739299J922940K156364K084877J371535K68575p28639j543623k487176
11054B0784152l600203m404681m447104l811764k915437k049586j380732j155017
11046b980372j444847j689472r35516J191874L921696N939789O484914N745195
11038A6233261M349410K773255J287929J78994l44746n12871r76772k130566l473085
11029A7384809l924878k900270q91417J095723K426848K966646K640134J375405
11021B0173000m78970k081603k663820k050889o24661R71300K037312K080251
$$ y = [-8393717, -8823184, -7418376, -3981286, 587910, 4790150, 7579530, 8963373, 9681336, 10396968, 11185123, 11720690, 11876899, 12036628, 12749193, 14157037, 15924482, 17739299, 19662239, 21818603, 23903480, 25275015, 25543590, 24814951, 23271328, 20784152, 17183949, 12779268, 8332164, 4520400, 1604963, -444623, -1825355, -2980372, -4425219, -6114691, -7050207, -5858333, -1936637, 4003152, 10488066, 16233261, 20582671, 23355926, 24643855, 24822849, 24478103, 23965232, 22988460, 20857894, 17384809, 13459931, 10559661, 9668244, 10763967, 13190815, 16157461, 18797595, 20173000, 19694030, 17612427, 14948607, 12897718, 12273057, 13244357, 15281669, 17361920]
11013A7361920J157569j37002j182814j753765j916568j773998j489089j338256
11005H927997j453508j591281j373739o94652K79559J364542K345238K832585
10997A0636741K539183J768937J264309J354224J522990J124521L60268J39138
10989B0710311Q76632J748210J409907o06200l396209n519329o101381n138598
10981C983343l124115p36471J253626K247508K213438J649846J036726M88674
10973I012575L9134k7172N31354J367463J660094R36099l46076j113494n30643
10964A1529334J377308L681526N023718M395817J811974j652525m546884n873156
10956A5747112n430809l680230j500634Q7485M13667l37027j169842j017515M44755
$$ y = [17361920, 18519489, 18382487, 17199673, 15445908, 13529340, 11755342, 10266253, 8927997, 7474489, 5883208, 4509469, 3814817, 4094376, 5458918, 7804156, 10636741, 13175924, 14944861, 16209170, 17563394, 19086384, 20210905, 20571173, 20710311, 21586943, 23335153, 24745060, 24138860, 20742651, 15223322, 9121941, 3983343, 859228, 122757, 1376383, 3623891, 5837329, 7487175, 8523901, 9012575, 9051709, 9024537, 9555891, 10923354, 12583448, 13519547, 13173471, 12059977, 11529334, 12906642, 16588168, 21611886, 26007703, 27819677, 26167152, 21620268, 15747112, 10316303, 6636073, 5135439, 5222924, 5636591, 5299564, 4129722, 3112207, 3556962]
10947C556962K581396M240455M498395L312832J626690N91869M31479K29278q93810
10938B0175546k585776l615773l270681j914906k42049J347962K442416K424587
10930A4761326J165855m93046j523053j726999j508968r68661Q1080J355056K138197
10921A3280787K194119J995574J901345J712047J249317P46419L09965m48341
10913B2941232j770148l170269m014700m353563m627563m782536m311225l145375
10905g234147j913834j152584p02514j48332M43952N72854L5337o49037o99836
10896a1448141P9763J072346J547299J459264J352498J562545J813821J624072
10888i36533P94939n53960k069123l132064l126194k010561l83904J178354K479628
$$ y = [3556962, 6138358, 10378813, 14877208, 18190040, 19816730, 20408599, 20840078, 21069356, 20175546, 17589770, 13973997, 10703316, 8788410, 8546361, 9894323, 12336739, 14761326, 15927181, 15434135, 13911082, 12184083, 10675115, 9706454, 9787534, 11142590, 13280787, 15474906, 17470480, 19371825, 21083872, 22333189, 23079608, 23389573, 22941232, 21171084, 18000815, 13986115, 9632552, 5004989, 222453, -4088772, -7234147, -9147981, -10300565, -11003079, -11151411, -10707459, -10134605, -10099268, -10748305, -11448141, -11368378, -10296032, -8748733, -7289469, -5936971, -4374426, -2560605, -936533, -141594, -695554, -2764677, -5896741, -9022935, -11033496, -11417400, -10239046, -7759418]
10879g759418L209680K693897P20265j741676l337603l722604l569980l320721
10871a6828160k647923j250245N07517K016494K965137L177954K406792P09360
10863h943074j236097k557232k806471k030843n74987Q90987J480520P36161q23296
10854a5864332k065804k156722j023610Q27477K649193L801178M206915M455774
10846e169931N057724N559931M851011K543955l33441k353554l098909l157960
10838C898826k983619k411195j349696k32966O47879J762120L660127N890100
10830H881576P227389O957052N358878K947294P906k828132m348538l847439k121362
10821A8234624o82002n6029N67168J995281L862847M945141M313961K084503p24315
$$ y = [-7759418, -4549738, -1855841, -1135576, -2877252, -6214855, -9937459, -13507439, -16828160, -19476083, -20726328, -20218811, -18202317, -15237180, -12059226, -9652434, -8943074, -10179171, -12736403, -15542874, -17573717, -18148704, -17257717, -15777197, -15041036, -15864332, -17930136, -20086858, -21110468, -20282991, -17633798, -13832620, -9625705, -5169931, -112207, 5447724, 10298735, 12842690, 12509249, 10155695, 7056786, 3898826, 915207, -1495988, -2845684, -3078650, -2430771, -668651, 2991476, 8881576, 16108965, 23066017, 28424895, 31372189, 31380095, 28551963, 24203425, 20355986, 18234624, 17552622, 17496593, 18063761, 20059042, 23921889, 28867030, 33180991, 35265494, 34541179]
10812C4541179k977049m222107m729428m727568l943602k223943k80013P85780
10804A2223249O42759r7172q24375j461152k013916k272595k216358k169635k234304
10795d23499k033774j362216o46367l42139k17798L18692J415209K681310L678507
10786C067925M149548L996515L426423K919962K655130K156217R69672m53863
10778B2887529j054634l07809J375073L337722N197715O508078O435567M272918
10770D8652159K62002m257439p574766q665164p842400o424671n526039n094069
10762C529613m259085k533728l56471J522456K766934L424995L583777L373390
10754A1051881L075667K896086K731032K401535J985581J631266J125507J74j841949
$$ y = [34541179, 31564130, 27342023, 22612595, 17885027, 13941425, 11717482, 11437469, 12223249, 12866008, 12768836, 11944461, 10483309, 8469393, 6196798, 3980440, 1810805, -423499, -2457273, -3819489, -4465856, -4807995, -5025793, -4707101, -3291892, -610582, 3067925, 7217473, 11213988, 14640411, 17560373, 20215503, 22371720, 23341392, 22887529, 21832895, 21525086, 22900159, 26237881, 31435596, 37943674, 44379241, 48652159, 48914161, 44656722, 37081956, 28416792, 20574392, 14149721, 8623682, 3529613, -729472, -3263200, -3619671, -2097215, 669719, 4094714, 7678491, 11051881, 14127548, 17023634, 19754666, 22156201, 24141782, 25773048, 26898555, 26898729, 25056780]
10745B5056780l821658n103101n211633m245860k688639j109775P9272P00313
10737C655699O49399k10667j733706l070639l016780j173994J381453K972274
10729e46961K857238J627776J99910j047668j977985k123723r84796J233707L608880
10720B846378N215587N592708M661289K671344L13078j544623k485103k750122
10712A4520536k744121k588490k268038j899652j608619j345268j089368j114879
10704a37899j788336l100636m524228n318014m961131l465277j410688M09102
10696b4297107J486064J731637J239441K21135q17248j286691j154971j029627
10688b3907367j310204j610238j408603r13379p13924q20462p33617l79833k16633
$$ y = [25056780, 21235122, 16132021, 10920388, 6674528, 3985889, 2876114, 2955386, 3655699, 4305098, 4094431, 2360725, -709914, -3726694, -4900688, -3519235, -546961, 2310277, 3938053, 4137963, 3090295, 1112310, -1011413, -1996209, -762502, 2846378, 8061965, 13654673, 18315962, 20987306, 21300384, 19755761, 17270658, 14520536, 11776415, 9187925, 6919887, 5020235, 3411616, 2066348, 976980, -137899, -1926235, -5026871, -9551099, -14869113, -19830244, -23295521, -24706209, -24297107, -22811043, -21079406, -19839965, -19618830, -20436078, -21722769, -22877740, -23907367, -25217571, -26827809, -28236412, -29149791, -29863715, -30684177, -31417794, -31797627, -32014260]
10679c2014260l01931m7651P46695J309231R03459p9499o85615p23502q02995
10670c1696068j168601j218374l08370J521789L781849N942661P338516P190986
10662h615612N309047K630130N91074j35154q2541k08208q94654j727929k010899
10653e144746j377250n4875J297152K000782J718044N63585r54926k054200j953687
10644e960121l80172K061473M152330M886805M148085K644340J255812M29161
10636A3237713Q2766k8015P8388O08409J626684K801266L629861L901027L821241
10627B9759340L668906L426120K813227J642912J00684j316870k162582k374637
10619C5557100k221714j891647j267578k69917O81297Q35164j61054j863028l434583
$$ y = [-32014260, -32316191, -32363842, -31617147, -30307916, -29404457, -29483956, -30169571, -30893073, -31696068, -32864669, -34083043, -34391413, -32869624, -29087775, -23145114, -15806598, -8615612, -3306565, -676435, -85361, -220515, -303056, -511264, -1405918, -3133847, -5144746, -6521996, -6576871, -5279719, -3278937, -1560893, -997308, -1952234, -4006434, -5960121, -6340293, -4278820, -126490, 4760315, 8908400, 11552740, 12808552, 13237713, 13320479, 13292464, 13370852, 13979261, 15605945, 18407211, 22037072, 25938099, 29759340, 33428246, 36854366, 39667593, 41310505, 41411189, 40094319, 37931737, 35557100, 33335386, 31443739, 30176161, 29906244, 30587541, 31422705, 31261651, 29398623, 25964040]
10610B5964040m310020m408140l910935l031984j951947q61155m5098J48043l88163
10601G204641j236573j740129j709803j641878k037680k666747k740068j754196
10593h322433R473J771310K885744L228619L105777K845985K546099K282446K383819
10584A2736839L110557M036126M208377L186610J589065L27931l82079r02137
10576B7911289j357656j445547r80824k53589J75724j31606j140602k183830k419420
10567A8173939j732378r05952o21063p08173q10429j229609k329539l470915l532349
10558B833532k435333j212250m83006J85957J177875K043139K282443K101560
10550F493917J798110J055604m63129k259819l406061l560321l061443k235027
$$ y = [25964040, 21654020, 17245880, 13334945, 10302961, 8351014, 7489859, 7444761, 7592804, 7204641, 5968068, 4227939, 2518136, 876258, -1161422, -3828169, -6568237, -8322433, -8312960, -6541650, -3655906, -427287, 2678490, 5524475, 8070574, 10353020, 12736839, 15847396, 19883522, 24091899, 27278509, 28867574, 29195505, 28813426, 27911289, 26553633, 25108086, 24127262, 23873673, 24049397, 23917791, 22777189, 20593359, 18173939, 16441561, 15535609, 14914546, 14206373, 13395944, 12166335, 9836796, 6365881, 2833532, 398199, -814051, -1297057, -1111100, 66775, 2109914, 4392357, 6493917, 8292027, 9347631, 8884502, 6624683, 3218622, -341699, -3403142, -5638169]
10542e638169j114357K55375J634129K695766L170879L064136K848542L136999
10534A0053300L970378M722157M854065M402266L578219K395131R99922q3708
10526C4891730m65666l59639k39327l12691n71344j003748j487654j787591j858304
10517B6805766j806037j454053m55186J020568K295402L041689L449578L354468
10509C6252195K078041m07326k930167m259029m169585l080132j499501k15269
10501B1769227J3965m93813o37549l59339q98538k680968m617305o369835r460618
10492c734773j5159976k3796136l7461064n9017621q3791701r5527092p8547096
10485c97035459l5815136J0468259L9014545M6644673M4035690M0231532L6459386
$$ y = [-5638169, -6752526, -6497151, -4863022, -2167256, 1003623, 4067759, 6916301, 10053300, 14023678, 18745835, 23599900, 28002166, 31580385, 33975516, 34975438, 34891730, 34426064, 34066425, 33827098, 33514407, 32943063, 31939315, 30451661, 28664070, 26805766, 24999729, 23545676, 23090490, 24111058, 26406460, 29448149, 32897727, 36252195, 38330236, 37922910, 34992743, 30733714, 26564129, 23483997, 21984496, 21769227, 21783192, 21289379, 20651830, 20292491, 19393953, 16712985, 12095680, 5725845, -3734773, -18894749, -42690885, -80151949, -139169570, -222961271, -318488363, -397035459, -432850595, -422382336, -383367791, -336723118, -292687428, -252455896, -215996510]
10478b15996510L1565810K6405364K2071096J8283241J5008616J2985077J1788240
10471g7889066R738234O499854L690695K221931J089033l59792r52111L25019
10463e5636203K492920M038093M907090N695012N895055M504614J879507l83682
10455b6607594j326513j412430j474228j726496j977199k208057k606802l178158
10447d2517477l483479k871315j120798J187334L167610M442107N174219N418846
10439c0602953M930183L680160K139333R22396M45578Q67692J918489K809335
10431a2889787K835448K134537J404937R12859L41535m17652j045471j450948
10423h174542j863893k052629j287594M54646J961515K066998R92596j21361o04468
$$ y = [-215996510, -184430700, -158025336, -135954240, -117670999, -102662383, -89677306, -77889066, -68150832, -61650978, -57960283, -55738352, -54649319, -55009111, -55961222, -55636203, -53143283, -49105190, -44198100, -38503088, -32608033, -28103419, -26223912, -26607594, -27934107, -29346537, -30820765, -32547261, -34524460, -36732517, -39339319, -42517477, -46000956, -48872271, -49993069, -48805735, -45638125, -41196018, -36021799, -30602953, -25672770, -21992610, -19853277, -18930881, -18485303, -17617611, -15699122, -12889787, -10054339, -7919802, -6514865, -5602006, -5260471, -5678123, -6723594, -8174542, -10038435, -12091064, -13378658, -12924012, -10962497, -8895499, -7902903, -8024264, -8628732]
10414h628732o59958p59076j179642j889546k420812k088815p44604R21130K162003
10405a5288052K943000L551144L842858L431569K368933J108876P536o35940l24979
10396A004945J138537K948962L733470K818864O82823j728295l534899l862285
10388C202122k147468J013976L841615M751499L635569J535078o31159k595402
10380A2605830m224448n096427m852077l725679k457213j670339j436543j424448
10372a2281344j302539q72747L6892J449888K862487L297365K158552M9982j597987
10363f199451j895229j311045r80595j368491j880607j753270r96991k61705M1153
10354a6606231J50130M80187J088163J810284K619600L421647L628344K533417
$$ y = [-8628732, -9288690, -10047766, -11227408, -13116954, -15537766, -17626581, -18371185, -17450055, -15288052, -12345052, -8793908, -4951050, -1519481, 849452, 1958328, 1965864, 1329924, 1004945, 2143482, 5092444, 8825914, 11644778, 12327601, 10599306, 7064407, 3202122, 1054654, 2068630, 5910245, 10661744, 14297313, 15832391, 15201232, 12605830, 8381382, 3284955, -1567122, -5292801, -7750014, -9420353, -10856896, -12281344, -13583883, -14456630, -14419738, -12969850, -10107363, -6809998, -4651446, -4601464, -6199451, -8094680, -9405725, -10386320, -11754811, -13635418, -15388688, -16385679, -16647384, -16606231, -16456101, -15975914, -14887751, -13077467, -10457867, -7036220, -3407876, -874459]
10346h74459L59810j498623j733521m95627Q23933J097007L99852m90137j061404
10337c473169j308358j354641j280189j320103j874185l070900m408463n055726
10329b3145734m593870l361176j989859p21682O33838K094448L128041L085453
10321b4870541J951263M95783l55796k30879N89727J594019K392445K702974K261539
10312a3469466R99885p21191k296321l372515l972201m046807l234146j410135
10304c1522897O76917J800257J412331J11676j152563j998467k507015k558659
10296c5738420j799717k79396J334301K435820L151329M020696N096428N728519
10288a6050440N386642M405642L613840L376162L383774L336391L309914L224077
$$ y = [-874459, -514649, -2013272, -3746793, -4242420, -3418487, -2321480, -1921628, -2411765, -3473169, -4781527, -6136168, -7416357, -8736460, -10610645, -13681545, -18090008, -23145734, -27739604, -31100780, -33090639, -33812321, -33178483, -31084035, -27955994, -24870541, -22919278, -22423495, -22779291, -23010170, -22420443, -20826424, -18433979, -15731005, -13469466, -12469581, -13190772, -15487093, -18859608, -22831809, -26878616, -30112762, -31522897, -30845980, -29045723, -27633392, -27521716, -28674279, -30672746, -33179761, -35738420, -37538137, -37817533, -36483232, -34047412, -30896083, -26875387, -21778959, -16050440, -10663798, -6258156, -2644316, 731846, 4115620, 7452011, 10761925, 13986002]
10280A3986002K423357L15324k679820n210658o048628m930256k629656n74490
10272e348825j24081j544797l551774m328035l205438j078001Q14830K000853
10264a6365268K565801K495881J752713O89713j44049n81289q87228j249439j470052
10255a3193217j199263l35638Q36777J875004K537689K844050K731516J940502
10247a962580N84954m17822j44994J049559J699732Q88597q61537k606484m124467
10238e895042n506209o328633o122517n270357m505177l679243j973101O11867
10230c8668412K869534L803338L739858L668264M027119M565253M970098N146851
10222e878097N103281M971191N037628N434450N809052N493778M045962J655632
$$ y = [13986002, 16409359, 16724683, 14044863, 8834205, 2785577, -2144679, -4774335, -5348825, -5472906, -7017703, -10569477, -14897512, -18102950, -19180951, -18366121, -16365268, -13799467, -11303586, -9550873, -8861160, -9005209, -9586498, -10473726, -11723165, -13193217, -14392480, -14728118, -13891341, -12016337, -9478648, -6634598, -3903082, -1962580, -1377626, -1795448, -1940442, -890883, 808849, 1697446, 835909, -1770575, -5895042, -11401251, -17729884, -23852401, -29122758, -33627935, -37307178, -39280279, -38668412, -35798878, -31995540, -28255682, -24587418, -20560299, -15995046, -11024948, -5878097, -774816, 4196375, 9234003, 14668453, 20477505, 25971283, 30017245, 31672877]
10214C1672877q53649k502182k944161k855781l240601m225952m844804m190360
10206F015387k511164r30362l05341o00436j145037j167644k23198J470270L021491
10197C623966L484908K707135J508019R22809J248331J814618J631451K31028
10189A7172265k061959m520803o464311p306442o529098m076208q27227J732956
10181a2880827K659500K311772J818430J846978K033823J555841R6674j750551
10173b308360k918536k703597j309289L47854J383259J537881J089509K99379
10165d581900q83527k479245l953484m325087l017805n26677K008072L892753
10157a3866900N266573O345510O717726N780230L645370J128518j127536l041977
$$ y = [31672877, 30819228, 28317046, 25372885, 22517104, 19276503, 15050551, 10205747, 6015387, 3504223, 2573861, 2268520, 1668084, 523047, -644597, -867795, 602475, 3623966, 7108874, 9816009, 11324028, 12246837, 13495168, 15309786, 16941237, 17172265, 15110306, 10589503, 4125192, -3181250, -9710348, -13786556, -14613783, -12880827, -10221327, -7909555, -6091125, -4244147, -2210324, -654483, -557809, -2308360, -5226896, -7930493, -9239782, -8891928, -7508669, -5970788, -4881279, -4581900, -5465427, -7944672, -11898156, -16223243, -19241048, -19767725, -17759653, -13866900, -8600327, -2254817, 4462909, 10243139, 13888509, 15017027, 13889491, 10847514]
10149A0847514m531105n068572m180053k145864J41152J967847L238995M195267
10141D465181M929657N226332M767093L487628J791902L53679m22809p38652j090653
10132B2769358j635266k021672j951432j764265k224409l663731n517317o837791
10124b846525p116291o427121m998561l081849j219015r8560J25556N313K557
10115b5654496j25576p82167j721848k298684k279229j812895p46533J277925
10107c4143503L909633N968209O635017O361266O226924O654844P033248O385441
10099A5031079M201089Q77289k383379m313084m520746l669293k664068j880139
10091F78748j248314o81705o5264R08555K420872M040091M885292M410170K944546
$$ y = [10847514, 6316409, 1247837, -2932216, -5078080, -4936928, -2969081, 269914, 4465181, 9394838, 14621170, 19388263, 22875891, 24667793, 25021472, 24598663, 23860011, 22769358, 21134092, 19112420, 17160988, 15396723, 13172314, 9508583, 3991266, -2846525, -9962816, -16389937, -21388498, -24470347, -25689362, -25787922, -25662366, -25657053, -25654496, -25780072, -26562239, -28284087, -30582771, -32862000, -34674895, -35421428, -34143503, -30233870, -24265661, -17630644, -11269378, -5042454, 1612390, 8645638, 15031079, 19232168, 20109457, 17726078, 13412994, 8892248, 5222955, 2558887, 678748, -569566, -1251271, -1316535, -407980, 2012892, 6052983, 10938275, 15348445, 18292991]
10082A8292991J444799P24676Q32630J110111R08191K24665m63660q64542j064953
10073B1144908j124836r20474n19728k95045m18633n78905m58319j82525j1543
10064A6634900J03678L02048M05568J33991m29840r66604j419739k024232k846043
10055I893727l500044l285077j561388J661511N241634P363109O987726M795402
10047B7596600K398671Q15982L3903k85058l45491m38032r58924j956307k992753
10038B3868591l605655l652244l175335k276274j233433m57177j70214k63908
10030I034351m67473m94646j39041M64501P38944K03150q55198j568859j379033
10021E536696m32602Q39767K059324K742209K371565R81439o52448j737903k179267
$$ y = [18292991, 19737790, 20462466, 21295096, 22405207, 23313398, 23538063, 23074403, 22209861, 21144908, 20020072, 19099598, 18579870, 18284825, 17866192, 17287287, 16828968, 16646443, 16634900, 16738578, 17040626, 17446194, 17580185, 17150345, 16183741, 14764002, 12739770, 9893727, 6393683, 3108606, 1547218, 3208729, 8450363, 15813472, 22801198, 27596600, 29995271, 30811253, 30845156, 30560098, 30214607, 29776575, 28817651, 26861344, 23868591, 20262936, 16610692, 13435357, 11159083, 9925650, 9468473, 9298259, 9034351, 8566878, 8072232, 7933191, 8397692, 9136636, 9339786, 8484588, 6915729, 5536696, 5104094, 5943861, 8003185, 10745394, 13116959, 14098398, 13445950, 11708047, 9528780]
10012I528780k328739k311787k003744j550581j439882j892960k456025k437183
10004f892121j660188n52052N20774J683852L057536M053234L704332J856042
9996E771409l87296j692837j704490r91077j85118L91072N46455K72140p1071
9987A949187r3781R3577R0577j20597j96747j37496m34970j331929k312349k542538
9977e037066j597085L10770K513196M186341M730878M036164K345990p020k561146
9968H921022m648317n736108n783874n017852l587228j794696l33626L03949M93057
9959a7183673R70449J811318K487573K711700K491394J581752j54233j897799
9951g181519k463871j916475j569313k089569k631663k266346j222203j11694
$$ y = [9528780, 7200041, 4888254, 2884510, 1333929, -105953, -1998913, -4454938, -6892121, -8552309, -9104361, -8583587, -6899735, -3842199, 211035, 3915367, 5771409, 5384113, 3691276, 1986786, 995709, 810591, 1201663, 1748118, 2020258, 1949187, 1855406, 1948983, 2039560, 1918963, 1722216, 1584720, 1149750, -182179, -2494528, -5037066, -6634151, -6323381, -3810185, 376156, 5107034, 9143198, 11489188, 11482168, 8921022, 4272705, -1463403, -7247277, -12265129, -15852357, -17647053, -17980679, -17676730, -17183673, -16213224, -14401906, -11914333, -9202633, -6711239, -5129487, -5283720, -7181519, -9645390, -11561865, -13131178, -15220747, -17852410, -20118756, -21340959, -21452653]
9943b1452653J073563K368389L036124K348041P67508l92059k54646J048434K591181
9934h866118L071887J739755n27753j737457r84030M80482R35198J86608q04847
9925f506275j468255j881039k151203k496793l409597m849489n786825n381410
9917c3930886m077821k789225j748693j010897j106284j996397k301318j015917
9909d9977438P57687J302169P60999M21880J83834j332925m509090q373642j2179145
9900g2945671j5667118j8512713k1345441k5673774k9407232k4035027k256240
9893b09843216K9933522N4163455N6700262M1736979K4618169J5049122J1294417
9886B3652710Q252286M767749K112536K71183j568878l247612m316110n040607
$$ y = [-21452653, -20379090, -18010701, -14974577, -12626536, -11859028, -12251087, -12505733, -11457299, -8866118, -5794231, -4054476, -4582229, -6319686, -7303716, -6823234, -5888036, -5701428, -6506275, -7974530, -9855569, -12006772, -14503565, -17913162, -22762651, -28549476, -33930886, -38008707, -40797932, -42546625, -43557522, -44663806, -46660203, -48961521, -49977438, -49219751, -47917582, -47156583, -46734703, -46550869, -47883794, -52392884, -60766526, -72945671, -88612789, -107125502, -128470943, -154144717, -183551949, -207586976, -209843216, -179909694, -125746239, -69045977, -27308998, -2690829, 12358293, 23652710, 31904996, 36672745, 38785281, 39056464, 37487586, 34239974, 29923864, 24883257]
9878B4883257n526627n124832l600447j739445j70221J212159K147443J709747
9870A3791034j88156k191515l125972l193785k998463k539658j867029j611965
9862c925509k026923k385262k063227j357516n93982N61232K091822K925697K256688
9853d516980Q12241j78020n64328p91538n41087Q12641K691765L554366K745973
9844D025033J191639J34478o9948J77574L61005J72262l43757q61361j286087
9835C500838k060580l529574n121388n665144m558499k329383j63370Q38338K44988
9826a8843774j292270k321038j811983j33341J503653K373324K562519K234510
9818a5728400J321528O1004p75384n05598Q48976K622326L890203L877069K489963
$$ y = [24883257, 19356630, 14231798, 10631351, 8891906, 8721685, 9933844, 12081287, 13791034, 13602878, 11411363, 8285391, 5091606, 2093143, -446515, -2313544, -3925509, -5952432, -8337694, -10400921, -11758437, -12352419, -11791187, -9699365, -6773668, -4516980, -3704739, -3882759, -4447087, -5238625, -5779712, -4967071, -2275306, 1279060, 4025033, 5216672, 5351150, 5281202, 5458776, 5819781, 5992043, 5648286, 4786925, 3500838, 1440258, -2089316, -7210704, -12875848, -17434347, -19763730, -19927100, -19088762, -18843774, -20136044, -22457082, -24269065, -24402406, -22898753, -20525429, -17962910, -15728400, -14406872, -14345868, -15121252, -15626850, -14777874, -12155548, -8265345, -4388276, -1898313]
9809a898313O12513n01025l38188N28174J205973J334076J214946J456645K467889
9800F082690L892538M528477L335330P14737j686758k721672k836427l064310
9792H244605l415246k966489j433210Q7955K59897r61837k251262k239497p37782
9783e412866J227894K364046K110899R23643k97177j049032j512786k035704k514722
9774f195805k510941j916779j175439o85019k65464M87330J483224K130120J999836
9765f648937J166879r8712j561560k809367l194952k305666l84282J828083L512583
9756a0495931M059873L371891K118329J324091J328829J393182P01323m76830
9748C324757j083423o12423L41902R02424Q45551O22758Q15844J705814L038988
$$ y = [-1898313, -1285800, -1786825, -2125013, -1596839, -390866, 943210, 2158156, 3614801, 6082690, 9975228, 14503705, 17839035, 18553772, 16867014, 14145342, 11308915, 8244605, 4829359, 1862870, 429660, 517615, 777512, -184325, -2435587, -4675084, -5412866, -4184972, -1820926, 289973, 1213616, 916439, -132593, -1645379, -3681083, -6195805, -8706746, -10623525, -11798964, -12483983, -12749447, -12262117, -10778893, -8648773, -6648937, -5482058, -5580770, -7142330, -9951697, -13146649, -15452315, -15836597, -14008514, -10495931, -6436058, -3064167, -945838, 378253, 1707082, 3100264, 3801587, 3324757, 2241334, 1628911, 1970813, 2873237, 3718788, 4341546, 5157390, 6863204, 9902192]
9739I902192L998313L665448J819845p54342k895619l965491m101108l762982
9731C906256l246142k624844j991258j564878j461458j372180o45241J109311
9723g890434L448031N227769N418973L871732J375133r85260k569221l358352
9715D538371l489118k825504j220495Q98184K600892L289092L214858L025536
9707A0031816L068985L338550L737988L978228L420466J546388j335748m134945
9699B3651728n762966n761476m407794k598765j463829j527804k148031k161207
9691b180144j146617L03913J511653K333653K757697K544424J676848O81123N805
9682H488355n91302j544218k616784l066329k538148j318742J59222J462940J819821
$$ y = [9902192, 13900505, 17565953, 19385798, 18631456, 15735837, 11770346, 7669238, 3906256, 660114, -1964730, -3955988, -5520866, -6982324, -8354504, -8999745, -7890434, -4442403, 785366, 6204339, 10076071, 11451204, 10465944, 7896723, 4538371, 1049253, -1776251, -2996746, -2098562, 502330, 3791422, 7006280, 10031816, 13100801, 16439351, 20177339, 24155567, 27576033, 29122421, 27786673, 23651728, 17888762, 12127286, 7719492, 5120727, 3656898, 2129094, -18937, -2180144, -3326761, -3022848, -1511195, 822458, 3580155, 6124579, 7801427, 8482550, 8488355, 7897053, 6352835, 3736051, 669722, -1868426, -3187168, -3027946, -1565006, 254815]
9673B54815L73084k798869o304483q518923q899467p977143o331036m093597j476035
9664d5771654P66368J822758J699452J307717J572017K543912L477641L743560
9656b8838229L571214L802309M863193O040608N971916M054078J350858j40665
9648F75282O74819K917634M590907M450861K918177J278378L44111O5890J61666
9639A8077725O61151J665111K791822L159122K033339m97693l444697n463672
9631A8982208n637658m041092j706717J30263J003990J423897J966156K303938
9623A4424985J528102n15828k676935l634969l317281k750870k638232k611215
9615b192243k007349q91082Q0571N92028J060164K065684L664184N370955O648604
$$ y = [254815, 627899, -2170970, -8475453, -16994376, -25893843, -33870986, -40202022, -44295619, -45771654, -45005286, -43182528, -41483076, -40175359, -38603342, -36059430, -32581789, -28838229, -25267015, -21464706, -16601513, -10560905, -4588989, -534911, 815947, 675282, 1350101, 4267735, 8858642, 13309503, 16227680, 17506058, 17850169, 17916059, 18077725, 18738876, 20403987, 23195809, 26354931, 28388270, 27890577, 24445880, 18982208, 13344550, 9303458, 7596741, 7727004, 8730994, 10154891, 12121047, 14424985, 15953087, 15437259, 12760324, 9125355, 5808074, 3057204, 418972, -2192243, -4199592, -5090674, -5010103, -4418075, -3357911, -1292227, 2371957, 7742912, 14391516]
9606A4391516P213076O895669N461781K836543m36806l173171m252359l477803
9598B5458446j742255l60351k09582j315969k987037m259340m417190l356585
9590F810137j592503R8609J145336J420040J096980L17747r27049k527757l983447
9581A858093m621500m132892k731747p79439J488823L766440N522784O332104
9573F702666O192399N281998L609513J262409j123713k598361k713113j875437
9565A4738361q80417l24704m09923r28783j357569j306121j011284j081977j626406
9556E811177j988711j596194p59040k87251n09733j036908j375791j351811q70198
9547c964460L17938K290273M527598O127610O537128N921211M718485L031224
$$ y = [14391516, 21604592, 28500261, 33962042, 36798585, 36361779, 33188608, 28936249, 25458446, 23716191, 23355840, 23146258, 21830289, 18843252, 14583912, 10166722, 6810137, 5217634, 5316243, 6461579, 7881619, 8978599, 9296346, 8369297, 5841540, 1858093, -2763407, -6896299, -9628046, -10407485, -8918662, -5152222, 370562, 6702666, 12895065, 18177063, 21786576, 23048985, 21925272, 19326911, 16613798, 14738361, 13857944, 13533240, 13123317, 12194534, 10836965, 9530844, 8519560, 7437583, 5811177, 3822466, 2226272, 1467232, 1179981, 670248, -366660, -1742451, -3094262, -3964460, -3646522, -1356249, 3171349, 9298959, 15836087, 21757298, 26475783, 29507007]
9539B9507007P44310j815179l785084m596473m604302m526254m439969l799767
9531B684289k408611q57917J73667O57143R82075J283444J351150J118583R44868
9522E928691J303051K207380K958112K565499O24201k202805m671866n864920
9514B847343n509902l694466p54883K565722N354371P112264P821391P458420
9506B3200260N953157L711873J528766l49507k462836m949915o680565o328639
9498A3622594m073423j521176N748M82273N21267M27914J90720j09328l47991
9489I198598o63180j362716k450383l362399l308786j967483K13209K526061M672635
9480C495556O576856P655048O971471M435620J265962j201531k661085l297115
$$ y = [29507007, 30251317, 28436138, 24651054, 20054581, 15450279, 10924025, 6484056, 2684289, 275678, -582239, -408572, 248571, 1230646, 2514090, 3865240, 4983823, 5928691, 7231742, 9439122, 12397234, 14962733, 15586934, 13384129, 8712263, 2847343, -2662559, -6357025, -7111908, -4546186, 808185, 7920449, 15741840, 23200260, 29153417, 32865290, 34394056, 34044549, 31581713, 26631798, 19951233, 13622594, 9549171, 8027995, 8033743, 8516016, 9037283, 9465197, 9655917, 9546589, 9198598, 8535418, 7172702, 4722319, 1359920, -1948866, -3916349, -3703140, -1177079, 3495556, 10072412, 17727460, 24698931, 29134551, 30400513, 29198982, 26537897, 23240782]
9472B3240782k793674q79488J480821K622553K037450P52889l09180j343229k629931
9463B2178993l505870l202141k160205j661824k325256l568134m436629m459851
9455c140917l753179k734021j816575j174363p81920o87659r87321j453368j610226
9446a8139549j431820j532202k247774k893598k484792j011107N49005J412958
9438b7778879J690168J888022K200922K448164K431310K210287K120809K448263
9430a0340934K951342K934608K100005J106092Q27754J190603J297964P39232
9422B806666J79384M15655J326806K114477K281650K007855J729329J686759J837278
9413A6385859J959873J832697J449769J055708Q58331P17927K30324q15824k073694
$$ y = [23240782, 20447108, 19567620, 21048441, 23670994, 25708444, 26461333, 26152153, 24808924, 22178993, 18673123, 15470982, 13310777, 11648953, 9323697, 5755563, 1318934, -3140917, -6894096, -9628117, -11444692, -12619055, -13400975, -14088634, -15075955, -16529323, -18139549, -19571369, -21103571, -23351345, -26244943, -28729735, -29740842, -29191837, -27778879, -26088711, -24200689, -21999767, -19551603, -17120293, -14910006, -12789197, -10340934, -7389592, -4454984, -2354979, -1248887, -421133, 769470, 2067434, 2806666, 2986050, 3401705, 4728511, 6842988, 9124638, 11132493, 12861822, 14548581, 16385859, 18345732, 20178429, 21628198, 22683906, 23542237, 24260164, 24490488, 23674664, 21600970]
9404B1600970k819235k646087k000165j804877k394903l007043k556321p62980
9396C609359J716868M000695N363700N156368L130166O3398k570392l973763m662684
9387A1833715n384742n870871n245916l427829j464237m27629m05263o31340k60783
9378a1284895J025430K803508M126221M179431K875832P75791j441479l207776
9370a47937l937474l142204q54654K248352N209386P175976P622152O612218M863476
9361B5649291L148303J541388m05840k737393m826689o143526o716357o586012
9353B923165n450647l368266j264109j6516O26790J444033K266280K015762K74795
9344e48713k040098l795367m607909m332492k487377R79635M846153P448805Q267547
$$ y = [21600970, 18781735, 16135648, 14135483, 12330606, 9935703, 6928660, 4372339, 3609359, 5326227, 9326922, 14690622, 19846990, 22977156, 23040554, 20470162, 16496399, 11833715, 6448973, 578102, -4667814, -8095643, -9559880, -9987509, -10392772, -11024112, -11284895, -10259465, -7455957, -3329736, 849695, 3725527, 4501318, 3059839, -147937, -4085411, -7227615, -8082269, -5833917, -624531, 6551445, 14173597, 20785815, 25649291, 28797594, 30338982, 29933142, 27195749, 22369060, 16225534, 9509177, 2923165, -2527482, -5895748, -7159857, -7176373, -6549583, -5105550, -2839270, -823508, -548713, -2588811, -6384178, -10992087, -15324579, -17811956, -16832321, -11986168, -4537363, 3730184]
9335C730184Q011801P253776N763382L316960M14095k200949m227807n598026
9327A6463416n984114n101450l389964j871747j188882j064258q41522l31551
9319c310072Q0207O0714k01499k80210j46022k83583j074897k216225k946384
9310a0317971k812775k010553r70569J11683J184260J989481K097486J321389
9302i407569k5240j301347j917700j627898o09615P08827K003981L282995M686843
9293d206723O040717O709285O057869M124083J754649o3316j051434j727161k584963
9284A5053006l339529l186176j762895L87102K340857L542376L962800L829574
9276B0827115L426142K937167K206000Q06145j322374l436184m610441m810569
$$ y = [3730184, 11741985, 18995761, 24759143, 28076103, 28490198, 26289249, 22061442, 16463416, 10479302, 5377852, 1987888, 116141, -1072741, -2136999, -2978521, -3310072, -3229865, -3169151, -3370650, -3650860, -3796882, -4080465, -5155362, -7371587, -10317971, -13130746, -15141299, -16111868, -16000185, -14815925, -12826444, -10728958, -9407569, -9432809, -10734156, -12651856, -14279754, -14889369, -14180542, -12176561, -8893566, -4206723, 1833994, 8543279, 14601148, 18725231, 20479880, 20416564, 19365130, 17637969, 15053006, 11713477, 8527301, 6764406, 7151508, 9492365, 13034741, 16997541, 20827115, 24253257, 27190424, 29396424, 30202569, 28880195, 25444011, 20833570, 16023001]
9268A6023001m921466n578533o354290o330074n156014l276576j397855p4896
9260a7066703M25425L35316M15572J338940K943762M369359M960476M766473M160267
9251F648887L346511K367440J265168O6856j129773j930256j826271q13717M47270
9242H442115J284487J516984J119582j17279k087575l877127m455482l811564
9234a985859k843906k154881j559049q38151k73950r5426N5497O37536J514443
9225g543746K170834K400550K378492K174777J572662L96442j147349k431701
9217b9039k702841j660785J21064J592238K165917K013699J417491L92130p69161
9208B540713j207540l94967J023865J906143J896003J487743J133632R98261J307466
$$ y = [16023001, 11101535, 5523002, -831288, -7161362, -12317376, -15593952, -16991807, -17066703, -16641278, -16305962, -15890390, -14551450, -11607688, -7238329, -2277853, 2488620, 6648887, 9995398, 12362838, 13628006, 13694862, 12565089, 10634833, 8808562, 7994845, 8442115, 9726602, 11243586, 12363168, 12245889, 10158314, 6281187, 1825705, -1985859, -4829765, -6984646, -8543695, -9381846, -9655796, -9751222, -9695725, -9058189, -7543746, -5372912, -2972362, -593870, 1580907, 3153569, 3550011, 2402662, -29039, -2731880, -4392665, -4271601, -2679363, -513446, 1500253, 2917744, 3309874, 2540713, 1333173, 938206, 1962071, 3868214, 5764217, 7251960, 8385592, 9383853, 10691319]
9199A0691319K019596K254455J103377q20399j679232o64205R95339J822182J938422
9190A7660854K263353K644910K016276K08713j492017j786847o49496R74483K138743
9181B3978972K373543J737045P39864p670k63974j86164M6664M27791J019338
9172B9865409J874251K905774L570336K973515Q24651j834995l434585l424523
9164C3319833k541945j604206p24825J58343P32742P05735K38283m18741j293886
9155B8571333k309044k943090k750888j905965p97348N61347K175706L410029
9147B4012080L368508J913636k24148k306980l997202m932309m644128l246267
9139I943190j662507o85347j05745P67299J942839K661830K489608J955803J815443
$$ y = [10691319, 12710915, 14965370, 16068747, 15248348, 13569116, 12904911, 13900250, 15722432, 17660854, 19924207, 22569117, 24585393, 24794106, 23302089, 21515242, 20865746, 21840229, 23978972, 26352515, 28089560, 28829424, 28821754, 28557780, 28371616, 28418280, 28846071, 29865409, 31739660, 34645434, 38215770, 41189285, 42013936, 40178941, 36744356, 33319833, 30777888, 29173682, 28448857, 28607200, 29339942, 30045677, 30283960, 29865219, 28571333, 26262289, 23319199, 20568311, 18662346, 17864998, 18426345, 20602051, 24012080, 27380588, 29294224, 29070076, 26763096, 22765894, 17833585, 13189457, 9943190, 8280683, 7595336, 7489591, 8256890, 10199729, 12861559, 15351167, 17306970, 19122413]
9130A9122413K027757J937128J374398J024120J426762K010054J634623K9401
9122C0586656j817857k798406k738387k101329j146908R1154J229355J526126
9114B2830404N29185j559809m081444o096843o476051m449779m28904L964456
9106D231215O932354P551881N991199L206758N75848p40424o36854j82083n68993
9097B6360901j988381l696493m940126n442836n138784l961621k069927L1375
9089h45892J814798L046903L680791L607037K702745J088854p98579k428142l439992
9080H428523l742023l459884k879014k392893k336997k744802l345230l940116
9072a6412436m687883n774651o856872p187854o405209m863675l033930r78960
$$ y = [19122413, 21150170, 23087298, 24461696, 25485816, 26912578, 28922632, 30557255, 30586656, 28768799, 25970393, 23232006, 21130677, 19983769, 20074923, 21304278, 22830404, 23359589, 21799780, 17718336, 11621493, 5145442, 695663, 266759, 4231215, 11163569, 18715450, 24706649, 27913407, 28489255, 27748831, 27111977, 26929894, 26360901, 24372520, 20676027, 15735901, 10293065, 5154281, 1192660, -877267, -845892, 968906, 4015809, 7696600, 11303637, 14006382, 15095236, 14296657, 11868515, 8428523, 4686500, 1226616, -1652398, -4045291, -6382288, -9127090, -12472320, -16412436, -21100319, -26874970, -33731842, -40919696, -47324905, -52188580, -55222510, -56201470]
9064e6201470J244437L069140L895282L933499L950627M145203L891591K804449
9056b9267242J477894P52078O46066N29155J41478r9120J84339P68637J185214
9047b3681501J359291J627928K170963K628872K432425J530433O48005O17135
9039a0666449J447939K296355K441034K029656J652525J440140R86076R7317q25825
9030H98768j320276j451123j589139j739675j408848k21593J485064K830282L163274
9021F46734K629920J977485J864015K384472L146237L612833L379909K389632
9013B2031237J092818K80456M84745J468126K385373K446730J392067m95490k546898
9004B8539164l897533l903658k657647j000744J78795O62613Q35494R90401Q97372
$$ y = [-56201470, -54957033, -51887893, -47992611, -44059112, -40108485, -35963282, -32071691, -29267242, -27789348, -27037270, -26391204, -25862049, -25720571, -25819691, -25635352, -24866715, -23681501, -22322210, -20694282, -18523319, -15894447, -13462022, -11931589, -11283584, -10666449, -9218510, -6922155, -4481121, -2451465, -798940, 641200, 1627276, 1724593, 898768, -421508, -1872631, -3461770, -5201445, -6610293, -6831886, -5346822, -2516540, 646734, 3276654, 5254139, 7118154, 9502626, 12648863, 16261696, 19641605, 22031237, 23124055, 23404511, 23889256, 25357382, 27742755, 30189485, 31581552, 31086062, 28539164, 24641631, 20737973, 18080326, 17079582, 17258377, 17920990, 18756484, 19746885, 20644257]
8995B0644257J23143j329158k788352l326795k457899n78812J196056J777353
8987A3259793R16457o21634j779682k162613k227057k542923l052180l178038
8979a387877k523929j296810j54319J85816o39229k254296l625683l944292l533702
8970a9174321l493071m257324m891057m094959j603379J705288M707444O577196
8962b4524183O771717N234626K727064M36764r48576j509250j483813q97818P7662
8953a4115807R33433J329463J465739J661662J884835K014072K250553K828600
8945B52550L499531L754985L504447L118734K776266K141384Q29936j030448k807984
8936A6039401l791248l615905k525887j320494q41256j307927k159203k588185
$$ y = [20644257, 20767400, 19438242, 16649890, 13323095, 10865196, 10286384, 11482440, 13259793, 14176250, 13554616, 11774934, 9612321, 7385264, 4842341, 1790161, -1387877, -3911806, -5208616, -5362935, -5177119, -5816348, -8070644, -11696327, -15640619, -19174321, -22667392, -26924716, -31815773, -35910732, -37514111, -35808823, -31101379, -24524183, -17752466, -12517840, -9790776, -9354012, -10302588, -11811838, -13295651, -14193469, -14115807, -13182374, -11852911, -10387172, -8725510, -6840675, -4826603, -2576050, 252550, 3752081, 7507066, 11011513, 14130247, 16906513, 19047897, 19877833, 18847385, 16039401, 12248153, 8632248, 6106361, 4785867, 3944611, 2636684, 477481, -2110704]
8928b110704k216533j292349l52937K74941P10959J269963J958140K342231K061691
8919B645402J347855P74224N33480K98489j13478l09335J52638J028885J576939
8910G935099J456975J111225J158823J701199K404248L022213L512458L694705
8902B5996945L169337J772747n3609j574315k418664k773486k927308k819316
8894A8372331k165582r28673N13676J677565K306133K336646J714814M94527q69026
8885B3452411j615445j312236k97648P23366J431424J929895K071108J265965
8877B7648840o85463k882975l948436l364267j869823n48816J01167J22977m30966
8868A4142238j602151l177968m508510m812204l755088j828948j02884N82438
$$ y = [-2110704, -4327237, -5619586, -5972523, -5697582, -4986623, -3716660, -1758520, 583711, 2645402, 3993257, 4767481, 5300961, 5599450, 5485972, 5176637, 5329275, 6358160, 7935099, 9392074, 10503299, 11662122, 13363321, 15767569, 18789782, 22302240, 25996945, 29166282, 30939029, 30885420, 29311105, 26892441, 24118955, 21191647, 18372331, 16206749, 15278076, 15791752, 17469317, 19775450, 22112096, 23826910, 24321437, 23452411, 21836966, 20524730, 20227082, 20950448, 22381872, 24311767, 26382875, 27648840, 26963377, 24080402, 20131966, 16767699, 14897876, 14349060, 14450227, 14573204, 14142238, 12540087, 9362119, 4853609, 41405, -3713683, -5542631, -5645515, -5063077]
8860e063077K23715n86137j349609j876355j967995j384413k65744P83270J256569
8851a0229776J180719R09673Q30348J386530K906013N050580O814478P487983
8843A6336548P324970O860391N990465M392774K544710J374260Q05541m24674
8835D5204985l038787n970903p455993o959156n408947l818045k460514j445607
8827H647033j282586k295075l761859m243027k942654n19112J612537K649095
8819b135648K907351L077624L274444K962614J655353m86245k654661l849352
8811D751480l461684j681862O25803K580049L817301M333067M041956K876168
8803A7882278J290250K14329K38822J018203J644121J463549M28418j127596k801323
$$ y = [-5063077, -4839362, -5425499, -6775108, -8651463, -10619458, -12003871, -12269615, -11486345, -10229776, -9049057, -8139384, -7309036, -5922506, -3016493, 2034087, 8848565, 16336548, 23661518, 30521909, 36512374, 40905148, 43449858, 44824118, 45629659, 45204985, 42166198, 36195295, 28739302, 21780146, 16371199, 12553154, 10092640, 8647033, 7364447, 5069372, 1307513, -2935514, -5878168, -6397280, -4784743, -2135648, 771703, 3849327, 7123771, 10086385, 11741738, 11255493, 8600832, 4751480, 1289796, -392066, 233737, 2813786, 6631087, 10964154, 15006110, 17882278, 19172528, 19386857, 19625679, 20643882, 22288003, 23751552, 24179970, 23052374, 20251051]
8794B0251051m263979n259257n495409m633769k647224k57705J320140J370820
8786C84668K91944r62878j850527k401977k682190k571271k079383j451006q23127
8777a4145747q2649Q05418J586978J961199J798542J044058k36934j510830j871862
8768a0651827r35310N38915J352035J127145M74426R353k09505j56240N85043
8759g865965K211284L997060M758721L999612K261264M11674j062584k097467
8751F613599k790693l227702l344688k917634j874632n56153O28550J738835L083053
8742b647465M444569N039710M457779L208593K074162J341208R91400J149654
8734B0059610J762893K139824J486989j43359j955167l365301m280991m493910
$$ y = [20251051, 15987072, 10727815, 5232406, 598637, -2048587, -2306292, -986152, 384668, 676612, -286266, -2136793, -4538770, -7220960, -9792231, -11871614, -13322620, -14145747, -14228396, -13422978, -11836000, -9874801, -8076259, -7032201, -7269135, -8779965, -10651827, -11587137, -11048222, -9696187, -8569042, -8094616, -8085263, -8294768, -8451008, -7865965, -5654681, -1657621, 3101100, 7100712, 9361976, 9773650, 8711066, 6613599, 3822906, 595204, -2749484, -5667118, -7541750, -8097903, -7469353, -5730518, -2647465, 1797104, 6836814, 11294593, 14503186, 16577348, 17918556, 18909956, 20059610, 21822503, 23962327, 25449316, 25305957, 23350790, 19985489, 15704498, 11210588]
8726A1210588l594282j799205k41221R4415n68121j184438j095703m71566K24115
8717B574582P31375R92689J085895J297236J988628L185018M375124M872805M428895
8708B5532247L477095K727154K439041K092458Q58820j552489m535985p028250
8700B4010091q216387p895412o375101m180490j789723M14271K012222K585981
8692E65452K096366J101131K87600k07562p32951j409493j883151j883943j610862
8683c677413j336731j001024m94340k3114J76386K34536L76086M98302M92970
8674d754342P88122J925014L533219M323618L391733J170230j143540k747610
8666F486444l523350l526001k756529j482732l75007m2253m68798j003834r21063
$$ y = [11210588, 7616306, 5817101, 5575880, 5670295, 5102174, 3917736, 2822033, 2350467, 2574582, 3305957, 4298646, 5384541, 6681777, 8670405, 11855423, 16230547, 21103352, 25532247, 29009342, 31736496, 34175537, 36267995, 37126815, 35574326, 31038341, 24010091, 15793704, 7898292, 1523191, -2657299, -4447022, -4032751, -2020529, 565452, 2661818, 3762949, 4050549, 3842987, 3110036, 1700543, -182608, -2066551, -3677413, -5014144, -6015168, -6509508, -6532622, -6356236, -6121700, -5745614, -5247312, -4754342, -3966220, -2041206, 1492013, 5815631, 9207364, 10377594, 9234054, 6486444, 2963094, -562907, -3319436, -4802168, -5177175, -5219428, -5688226, -6692060, -7613123]
8657g613123j4249J295674K396486K983087L088290K728773J798183M63833n65563
8648F561391n56599M10947J439649J816911J742842J777888J853846J415111N47051
8639A7009037K52379J145310K340104K319750P57782j202683k504960l290439
8631A6826280m188807n161483n585820n079557l673165j453195J297702L674606
8623c343439M536363L564483J626229n81m92158L26609K062097L804760M586748
8614A6671111M198173L337390K681506K065540R24716o73905j926834k231920
8606B5045777j823243j317666r33763m54665J21619K23719p60192k601935m118784
8597A3380867m177303k800496j078916K2767M92224Q11599J070348R68250N75369
$$ y = [-7613123, -7627372, -6331698, -3935212, -952125, 2136165, 4864938, 6663121, 7126954, 6561391, 6004792, 6415739, 7855388, 9672299, 11415141, 13193029, 15046875, 16461986, 17009037, 17261416, 18406726, 20746830, 23066580, 23824362, 22621679, 20116719, 16826280, 12637473, 7475990, 1890170, -3189387, -6862552, -8315747, -7018045, -3343439, 1192924, 4757407, 6383636, 6383055, 5890897, 6217506, 8279603, 12084363, 16671111, 20869284, 24206674, 26888180, 28953720, 29878436, 29204531, 27277697, 25045777, 23222534, 21904868, 20971105, 20516440, 20638059, 20861778, 20101586, 17499651, 13380867, 9203564, 6403068, 5324152, 5346919, 5839143, 6650742, 7721090, 8689340, 9264709]
8588I264709N75538J532959L147547M439324M589665L543031J953563O74237J60820
8579B9881393J81405J06569m52073j330376k132863k693140l104053l448922l694592
8570A3313348l771723l589086l046065k215264j419324q83199l93534L51006J041784
8561f12057Q47923n57397k351745l257013k755287j423970k61994N4054n52083
8552a0869569j604865k392756k528054k222676j828034j241440j33527J305098
8544b1515823K343016K576540K392285K323369K311178J929812J051522j06400
8536f694501j400288k763212l830560m029959l226090k010016j148665q60504
8528b5963795p35006k35620Q37314K257267L529506M110199L653417K251154M76254
$$ y = [9264709, 9840247, 11373206, 14520753, 18960077, 23549742, 27092773, 29046336, 29720573, 29881393, 30062798, 30169367, 29717294, 28386918, 26254055, 23560915, 20456862, 17007940, 13313348, 9541625, 5952539, 2906474, 691210, -728114, -1611313, -2004847, -1653841, -612057, 235866, -321531, -2673276, -5930289, -8685576, -10109546, -10371540, -10317486, -10869569, -12474434, -14867190, -17395244, -19617920, -21445954, -22687394, -22820921, -21515823, -19172807, -16596267, -14203982, -11880613, -9569435, -7639623, -6588101, -6694501, -8094789, -10858001, -14688561, -18718520, -21944610, -23954626, -25103291, -25963795, -26698801, -26934421, -26097107, -23839840, -20310334, -16200135, -12546718, -10295564, -9819310]
8519i819310r53557j701239j969696k036684j738440o81490J008161K473997K908408
8510a2509850K392012J723976J503456J619827J637411J434343J324097J620619
8502G45891K188263K475109K030472R65707j87049j045699j620935j955971j831551
8493A764237j122528l06165k15007j129046k300951k585624j564011K3743J016312
8484f419040J010926P36058J174287K422570L631042M013148L592948K901848
8476A3063787K343975K095327K238875K567436K480955J568102K18104p78775
8468B5797786j189503j423317j646462j379591k38080J335760K409831K385423
8460B6051847J253228o41284k692237m096440m317460l561673k503773j493341
$$ y = [-9819310, -10772867, -12474106, -14443802, -16480486, -18218926, -18900416, -17892255, -15418258, -12509850, -10117838, -8393862, -6890406, -5270579, -3633168, -2198825, -874728, 745891, 2934154, 5409263, 7439735, 8405442, 8218393, 7172694, 5551759, 3595788, 1764237, 641709, 335544, 120537, -1008509, -3309460, -5895084, -7459095, -7435352, -6419040, -5408114, -4672056, -3497769, -1075199, 2555843, 6568991, 10161939, 13063787, 15407762, 17503089, 19741964, 22309400, 24790355, 26358457, 26576561, 25797786, 24608283, 23184966, 21538504, 20158913, 19920833, 21256593, 23666424, 26051847, 27305075, 26663791, 23971554, 19875114, 15557654, 11995981, 9492208, 7998867]
8452G998867l08701J222010K660877L285668K878460J965199J263742J055295
8444B2021417J131620J179599J057789P61245L05602k70158q33297j120659p89843
8435B3443315L54606K021117L403735L775240L160818K175782J158734j34924
8427C9358423j755838k955864k979728k334182k563744m473819p005903q266463
8419G022882p463171n452874l478672j831716Q542K172430L788252L767277K032995
8410E65945k71380j769612j848389p68005P67653J941639K119486J287615J42605
8401B167557n53911o58390m87803k07891K13777N80460N25228O5261l66356n74857
8391G03075q40120j283767j438312q18606L56658J402817J965492K211891K319726
$$ y = [7998867, 7690166, 8912176, 11573053, 14858721, 17737181, 19702380, 20966122, 22021417, 23153037, 24332636, 25390425, 26151670, 26457272, 26187114, 25353817, 24233158, 23443315, 23797921, 25819038, 29222773, 32998013, 36158831, 38334613, 39493347, 39358423, 37602585, 34646721, 31666993, 29332811, 26769067, 22295248, 15289345, 7022882, -440289, -5893163, -9371835, -11203551, -11195009, -9022579, -5234327, -1467050, 565945, 294565, -1475047, -3323436, -4091441, -3323788, -1382149, 737337, 2024952, 2167557, 1613646, 955256, 467453, 259562, 473339, 1053799, 1579027, 1644288, 1277932, 703075, -137045, -1420812, -2859124, -3677730, -3321072, -1918255, 47237, 2259128, 4578854]
8382D578854K168276J603608P06618l70534j654844l211377m767549n693757n528360
8373a2169065m465678l145963j975652q88632J94043J038002J450173J601353
8365a8361419J620910J191331R8472j002933j056728R8435J469713K046070J668817
8356a2227332P38708k28742n43744L65048K088580L277026L115484K256447J703026
8347E44501J331975L59544j120911k093405k067148j623691j342730j030592m12633
8338g455090M7453m56789k167604m571127o800905p951428p354859n028658j814666
8329d3553673J167862L189018M026828L780421K896221K181474K316483L191895
8321b0803471L937132L787227K882382K092081K030318K362730K210806J174488
$$ y = [4578854, 6747130, 8350738, 9057356, 8686822, 7031978, 3820601, -946948, -6640705, -12169065, -16634743, -19780706, -21756358, -22644990, -22450947, -21412945, -19962772, -18361419, -16740509, -15549178, -15450706, -16453639, -17510367, -17411932, -15942219, -13896149, -12227332, -11488624, -11717366, -12261110, -11896062, -9807482, -6530456, -3414972, -1158525, 544501, 1876476, 2236020, 1115109, -978296, -3045444, -4669135, -6011865, -7042457, -7455090, -7407637, -7864426, -10032030, -14603157, -21404062, -29355490, -36710349, -41739007, -43553673, -42385811, -39196793, -35169965, -31389544, -28493323, -26311849, -23995366, -20803471, -16866339, -13079112, -10196730, -8104649, -6074331, -3711601, -1500795, -326307]
8313c26307k51549j270294j495061r94437o3755O95539M56549j011696k637092
8304f898103k780760q99041J896694M029619M758422M193342K702166Q53098m57803
8295G397634n88584L2950J26056j196078l547956n674592o561654o127149m999528
8286b1138901l724846k194269P1527K998358N473153O062372M317257J286642
8278f848707j279588k190036j427268J53700J557756K243622K291686K148131
8270c350704K187463K443097K693460K757049K668930K580435K557382K540328
8262A7077440K452336K214659J645590N27280j079984k678945l650426l725683
8254A2782267l107230k262522j723503j865547k510173k751528j561807J197793
$$ y = [-326307, -577856, -1848150, -3343211, -4337648, -4401403, -3705864, -3249315, -4261011, -6898103, -9678863, -10577904, -8681210, -4651591, 106831, 4300173, 7002339, 7855437, 7397634, 6809050, 6842000, 6968056, 5771978, 2224022, -3450570, -10012224, -16139373, -21138901, -24863747, -27058016, -26986489, -23988131, -18514978, -12452606, -8135349, -6848707, -8128295, -10318331, -11745599, -11591899, -10034143, -7790521, -5498835, -3350704, -1163241, 1279856, 3973316, 6730365, 9399295, 11979730, 14537112, 17077440, 19529776, 21744435, 23390025, 23917305, 22837321, 20158376, 16507950, 12782267, 9675037, 7412515, 5689012, 3823465, 1313292, -1438236, -3000043, -1802250]
8246a802250M464685O736793P087280N599631L217018J261429O79985J389264
8238B8633835K426529K876946K534313J669753N67026m68617j036388j037619
8230C6165778r77639j458447k465975l498158m212197m476106l952692k346305
8222A2778259k12445J136467R43453j65989j030622j273585j356916j623953j865168
8213G329501j806602j556691j453251j750359k503785l479594m088792l671299
8205a2980872k027776L72022K682114M077224M039911K676192Q80916j13059L74618
8196a8710K031101L965515N372651N815820N236486L931361K334431O27053j292984
8187B8002724l356874n133693o331538p191970p988388q311547p340499m853326
$$ y = [-1802250, 2662435, 9399228, 16486508, 22086139, 25303157, 26564586, 27244571, 28633835, 31060364, 33937310, 36471623, 38141376, 38708402, 38239785, 37203397, 36165778, 35188139, 33729692, 31263717, 27765559, 23553362, 19077256, 15124564, 12778259, 12565814, 13702281, 14645734, 14479745, 13449123, 12175538, 10818622, 9194669, 7329501, 5522899, 3966208, 2512957, 762598, -1741187, -5220781, -9309573, -12980872, -15008648, -14636626, -11954512, -7877288, -3837377, -1161185, -280269, -393328, -18710, 2012391, 5977906, 11350557, 17166377, 22402863, 26334224, 28668655, 29295708, 28002724, 24645850, 19512157, 13180619, 5988649, -1999739, -10311286, -17651785, -22505111]
8179b2505111j607840J313764L215579L883971L484387K580206J870434J587220
8171f177390J344417P88274J59344n1000K06006N13013N75823N77966R85060K151796
8161A073309L979468N735628O381505N452030L616018K060220J280389P50927
8153C0329494j90446j489024k565677l053525l049824k786696k363075j808068
8145A3023159j184742n65104m9192J20116l94468j683920l300468m469611m730382
8136c234612m326659l831319l390580k543497r23098J030902K337004K471677
8128a2410182J880903J405360J410871J682920J999226K403704K796916K604307
8120C774025J257584r94228l062916l943699l496240k263779q37699L49265R08095
$$ y = [-22505111, -24112951, -22799187, -19583608, -15699637, -12215250, -9635044, -7764610, -6177390, -4832973, -4044699, -3885355, -3936355, -3730349, -3217336, -2641513, -2063547, -1078487, 1073309, 5052777, 10788405, 17169910, 22621940, 26237958, 28298178, 29578567, 30329494, 30139048, 28650024, 26084347, 23030822, 19980998, 17194302, 14831227, 13023159, 11838417, 11273313, 11224121, 11344237, 10949769, 9265849, 5965381, 1495770, -3234612, -7561271, -11392590, -14783170, -17326667, -18249765, -17218863, -14881859, -12410182, -10529279, -9123919, -7713048, -6030128, -4030902, -1627198, 1169718, 3774025, 5031609, 4037381, 974465, -2969234, -6465474, -8729253, -9566952, -9217687, -8309592]
8111h309592P15216K84582M38871J351583K190265J972904O06353j150463k580478
8102d480759l550587m192781m351696l550086j508908J372139M187026O281036
8094i794616P703861Q681085Q800367P242598L957234J12761k940648m767966
8086A8994676n576876n351791l936240j761754K58803J664731K716787L604555
8078A0612891L908562L104382J240291j095999l172119m316096m128099k838950
8070C314863j295555l43320k60084p69905j320977j295347l68037J047666J955714
8061F65018J645263K72236j500054l084007l967787l572353j676662J055046L359573
8052f803727M271085L638973J973422R0091j240480j733999j810694k172858l084772
$$ y = [-8309592, -7594376, -7309794, -6870923, -5519340, -3329075, -1356171, -749818, -1900281, -4480759, -8031346, -12224127, -16575823, -20125909, -21634817, -20262678, -16075652, -9794616, -2090755, 6590330, 15390697, 22633295, 26590529, 26703290, 23762642, 18994676, 13417800, 8066009, 4129769, 2368015, 2626818, 4291549, 7008336, 10612891, 14521453, 17625835, 18866126, 17770127, 14598008, 10281912, 6153813, 3314863, 2019308, 1675988, 1415904, 645999, -674978, -1970325, -2338362, -1290696, 665018, 2310281, 2582517, 1082463, -2001544, -5969331, -9541684, -11218346, -10163300, -6803727, -2532642, 1106331, 3079753, 3169844, 1929364, 195365, -1615329, -3788187, -6872959]
8043f872959m121547m520929l681835j556046J172112L477864M919550O041756
8035e142034P477473Q804297Q859100P216535M746298K496467O28091j133341
8027C3952886k540330l034022k728135k479080k863244l591561m107792m322805
8019H285917m488657m694603m830666m822584m546442l673652k033407j33328
8011b0937422J086692J197116P60195P54403J703881L430738N342885O704644
8003D3132O838499N461527K930541L7028k464039m122170m793912m607103l875512
7994d552009k879198j750976o57299O9615J89763j38159m79469m47179K13819
7985a0431092J567225L181534M188257M198790M011647M723815O099127O566316
$$ y = [-6872959, -10994506, -15515435, -19197270, -20753316, -19581204, -16103340, -11183790, -5142034, 2335439, 11139736, 19998836, 27215371, 31961669, 34458136, 35086227, 33952886, 31412556, 28378534, 25650399, 23171319, 20308075, 16716514, 12608722, 8285917, 3797260, -897343, -5728009, -10550593, -15097035, -18770687, -20804094, -20937422, -19850730, -18653614, -17893419, -17139016, -15435135, -12004397, -6661512, 43132, 6881631, 12343158, 15273699, 15310727, 12846688, 8724518, 3930606, -676497, -4552009, -7431207, -9182183, -9839482, -9769867, -9580104, -9718263, -10197732, -10644911, -10431092, -8863867, -5682333, -1494076, 2704714, 6716361, 11440176, 17539303, 24105619]
$$ [...]
##END NTUPLES=NMR SPECTRUM
##END=
