##TITLE=31Pdec_MetGLU2808-2
 CDcl3 24 sc
 30.8.2023
##JCAMPDX= 6.0         $$ Bruker NMR JCAMP-DX V2.0
##DATA TYPE= NMR SPECTRUM
##DATA CLASS= NTUPLES
##ORIGIN= UXNMR, Bruker Analytische Messtechnik GmbH
##OWNER= root
$$ XWIN-NMR		Version 3.5
$$ Wed Aug 30 14:12:19 2023 Russian Standard Time (UT+4h)  she@DPX200
##.OBSERVE FREQUENCY= 81.013821
##.OBSERVE NUCLEUS= ^31P
##.ACQUISITION MODE= SIMULTANEOUS
##.ACQUISITION SCHEME= undefined
##.AVERAGES= 24
##.DIGITISER RES= 16
##SPECTROMETER/DATA SYSTEM= spect
##.PULSE SEQUENCE= zgpg30
##.SOLVENT NAME= CDCl3
##.SHIFT REFERENCE= (INTERNAL, CDCl3, 0, 248.564)
##AUDIT TRAIL= $$ (NUMBER, WHEN, WHO, WHERE, WHAT)
$$ ##TITLE= Audit trail, XWIN-NMR		Version 3.5
$$ ##JCAMPDX= 5.01
$$ ##ORIGIN= Bruker BioSpin GmbH
$$ ##OWNER= she
$$ F:/spectra/data/she/nmr/P31/1/pdata/1/auditp.txt
$$ ##AUDIT TRAIL=  $$ (NUMBER, WHEN, WHO, WHERE, WHAT)
(   1,<2023-08-30 14:11:30.82 +0400>,<she>,<DPX200>,
      <created by zg, POWCHK disabled, PULCHK disabled
       configuration hash MD5:
       00 E9 B6 7A A2 85 ED C7 34 08 36 98 17 FE 4E 26
       data hash MD5: 32K
       CB 29 D5 7F 7D B3 E7 AA B7 50 EF E1 75 7B C9 66>)
(   2,<2023-08-30 14:11:33.06 +0400>,<she>,<DPX200>,
      <Start of raw data processing
       efp BC_mod = 2 LB = 5 FT_mod = 6 PKNL = 1 PHC0 = -10850.49 PHC1 = 107.885 SI = 64K 
       data hash MD5: 64K
       34 B9 FF 22 DD 6C 7A ED 99 8D 5A 0A 1D 2C C4 39>)
(   3,<2023-08-30 14:11:50.56 +0400>,<she>,<DPX200>,
      <pk PHC0 = 233.5215 PHC1 = -121.2 
       data hash MD5: 64K
       3A FD 3C 4F C7 C4 CF 7C ED D1 1F ED A4 0E 12 21>)
(   4,<2023-08-30 14:11:53.56 +0400>,<she>,<DPX200>,
      <abs ABSG = 5 
       data hash MD5: 64K
       38 A1 2B 4A 58 AF C5 2F 5B EE 48 D2 92 58 61 E2>)
$$ ##END=
$$ 
$$ hash MD5
$$ 0C 81 44 04 24 54 04 DE B5 D4 7A 80 13 E1 F4 DE
##$RELAX= 
##$RELAX= 
##$RELAX= 
##$RELAX= 
##$RELAX= 
##$RELAX= 
##$RELAX= 
##$RELAX= 
##$RELAX= 
$$ Bruker specific parameters
$$ --------------------------
##$DU= <F:/spectra>
##$EXPNO= 1
##$NAME= <P31>
##$PROCNO= 1
##$TYPE= <nmr>
##$USER= <she>
##$AMP= (0..31)
100 100 100 100 100 100 100 100 100 100 100 100 100 100 100 100 100 100 
100 100 100 100 100 100 100 100 100 100 100 100 100 100 
##$AQSEQ= 0
##$AQ_mod= 1
##$AUNM= <au_zg>
##$AUTOPOS= <>
##$BF1= 81.014009
##$BF2= 200.13
##$BF3= 200.13
##$BF4= 200.13
##$BF5= 200.13
##$BF6= 200.13
##$BF7= 200.13
##$BF8= 200.13
##$BYTORDA= 1
##$CFDGTYP= 0
##$CFRGTYP= 5
##$CHEMSTR= <none>
##$CNST= (0..31)
1 1 145 1 1 1 1 1 1 1 1 1 1 1 1 1 1 1 1 1 1 1 1 1 1 1 1 1 1 1 1 1 
##$CPDPRG= <waltz16>
##$CPDPRG1= <>
##$CPDPRG2= <waltz16>
##$CPDPRG3= <>
##$CPDPRG4= <mlev>
##$CPDPRG5= <mlev>
##$CPDPRG6= <mlev>
##$CPDPRG7= <mlev>
##$CPDPRG8= <mlev>
##$CPDPRGB= <>
##$CPDPRGT= <>
##$D= (0..31)
0 1 0 0 0 0 0 0 0 0 0 0.03 2e-05 3e-06 0 0 0 0 0 0 0 0 0 0 0 0 0 0 0 0 
0 0 
##$DATE= 1693390290
##$DBL= (0..7)
120 120 120 11 120 120 24 19 
##$DBP= (0..7)
150 150 150 150 150 150 150 150 
##$DBP07= 0
##$DBPNAM0= <>
##$DBPNAM1= <>
$$ [...]
##$SUBNAM3= <"">
##$SUBNAM4= <"">
##$SUBNAM5= <"">
##$SUBNAM6= <"">
##$SUBNAM7= <"">
##$SUBNAM8= <"">
##$SUBNAM9= <"">
##$SW= 501.771253377433
##$SWIBOX= (0..15)
0 1 3 0 0 0 0 0 0 0 0 0 0 0 0 0 
##$SW_h= 40650.406504065
##$TD= 32768
##$TD0= 1
##$TE= 0
##$TE2= 300
##$TE3= 300
##$TEG= 300
##$TL= (0..7)
0 120 53 12 22 120 120 120 
##$TP= (0..7)
150 150 150 150 150 150 150 150 
##$TP07= 0
##$TPNAME0= <>
##$TPNAME1= <>
##$TPNAME2= <>
##$TPNAME3= <>
##$TPNAME4= <>
##$TPNAME5= <>
##$TPNAME6= <>
##$TPNAME7= <>
##$TPOAL= (0..7)
0.5 0.5 0.5 0.5 0.5 0.5 0.5 0.5 
##$TPOFFS= (0..7)
0 0 0 0 0 0 0 0 
##$TUNHIN= 0
##$TUNHOUT= 0
##$TUNXOUT= 0
##$USERA1= <user>
##$USERA2= <user>
##$USERA3= <user>
##$USERA4= <user>
##$USERA5= <user>
##$V9= 5
##$VALIST= <valist>
##$VCLIST= <CCCCCCCCCCCCCCC>
##$VD= 0
##$VDLIST= <DDDDDDDDDDDDDDD>
##$VPLIST= <PPPPPPPPPPPPPPP>
##$VTLIST= <TTTTTTTTTTTTTTT>
##$WBST= 1024
##$WBSW= 4
##$XGAIN= (0..3)
0 0 0 0 
##$XL= 0
##$YL= 0
##$YMAX_a= 1288
##$YMIN_a= -1990
##$ZGOPTNS= <>
##$ZL1= 120
##$ZL2= 120
##$ZL3= 120
##$ZL4= 120
##$ABSF1= 248.5645
##$ABSF2= -253.2056
##$ABSG= 5
##$ABSL= 3
##$ALPHA= 0
##$AQORDER= 0
##$ASSFAC= 0
##$ASSFACI= 0
##$ASSFACX= 0
##$ASSWID= 0
##$AUNMP= <proc_1d>
##$AZFE= 0.1
##$AZFW= 0.5
##$BCFW= 0
##$BC_mod= 2
##$BYTORDP= 0
##$COROFFS= 0
##$CY= -3
##$DATMOD= 1
##$DC= 0
##$DFILT= <>
##$DTYPP= 0
##$F1P= 0
##$F2P= 0
##$FCOR= 1
##$FTSIZE= 65536
##$FT_mod= 6
##$GAMMA= 0
##$GB= 0
##$INTBC= 1
##$INTSCL= 6.047779e-11
##$ISEN= 30
##$LB= 5
##$LEV0= 0
##$LPBIN= 0
##$MAXI= 10000
##$MC2= 0
##$MEAN= 0
##$ME_mod= 0
##$MI= 50
##$NCOEF= 0
##$NC_proc= -11
##$NLEV= 6
##$NOISF1= 182.463
##$NOISF2= 159.3651
##$NSP= 0
##$NTH_PI= 0
##$NZP= 0
##$OFFSET= 248.5645
##$PC= 4
##$PHC0= -10616.97
##$PHC1= -13.31499
##$PH_mod= 1
##$PKNL= yes
##$PPARMOD= 0
##$PSCAL= 0
##$PSIGN= 0
##$REVERSE= no
##$SF= 81.0140089999694
##$SI= 65536
##$SIGF1= 159.3651
##$SIGF2= -187.1042
##$SINO= 113.3802
##$SIOLD= 16384
##$SREGLST= <1H.CDCl3>
##$SSB= 0
##$STSI= 65536
##$STSR= 0
##$SW_p= 40650.406504065
##$SYMM= 0
##$S_DEV= 0
##$TDeff= 32768
##$TDoff= 0
##$TI= <>
##$TILT= no
##$TM1= 0
##$TM2= 0
##$TOPLEV= 0
##$USERP1= <user>
##$USERP2= <user>
##$USERP3= <user>
##$USERP4= <user>
##$USERP5= <user>
##$WDW= 1
##$XDIM= 65536
##$YMAX_p= 408883441
##$YMIN_p= -86118140
$$ End of Bruker specific parameters
$$ ---------------------------------
##NTUPLES= NMR SPECTRUM
##VAR_NAME=  FREQUENCY,     SPECTRUM/REAL,   SPECTRUM/IMAG
##SYMBOL=    X,             R,               I
##VAR_TYPE=  INDEPENDENT,   DEPENDENT,       DEPENDENT
##VAR_FORM=  AFFN,          ASDF,            ASDF
##VAR_DIM=   65536,         65536,           65536
##UNITS=     HZ,            ARBITRARY UNITS, ARBITRARY UNITS
##FACTOR=    0.620285442955139, 1,           1
##FIRST=     20137.2065510682, 0,            0
##LAST=      -20513.1999529968, 0,           0
##MIN=       -20513.1999529968, -86118140,   0
##MAX=       20137.2065510682, 408883441,    0
$$ Real data points
##PAGE= N=1
##DATA TABLE= (X++(R..R)), XYDATA
$$ [...]
12938D608566j368976n30170L12111R63712J007401L79794m15226r52157j419522
$$ 4608566 3239590 2709420 3021531 3985243 4992644 5372438 4957212 4005055 2585533
12929B585533k222983l332784m378148n198912n882799o286747n935482m557728
$$ 2585533 362550 -2970234 -7348382 -12547294 -18430093 -24716840 -30652322 -35210050
12921c5210050k478504l04600J618921L277125M668380N673863O217396O316579
$$ -35210050 -37688554 -37993154 -36374233 -33097108 -28428728 -22754865 -16537469 -10220890
12913a0220890N901268M770898K905274P82731p43971j008878j15280R48106R37519
$$ -10220890 -4319622 451276 3356550 4139281 3395310 2386432 2271152 3219258 4156777
12904D156777n57620k546551l395765k343090j55552J768512K701239K848802
$$ 4156777 3599157 1052606 -2343159 -4686249 -4841801 -3073289 -372050 2476752
12896B476752K648764K196274J277896l29688k540754m704205n814909n350525
$$ 2476752 5125516 7321790 8599686 8269998 5729244 1025039 -4789870 -10140395
12888a0140395l864120k416106j462739o68973K40121R58175J063548N67182k12396
$$ -10140395 -14004515 -16420621 -17883360 -18552333 -18312212 -17354037 -16290489 -15723307 -15935703
12879a5935703r52521j302175r68139j62953L60007J37040l27813j09877J026954
$$ -15935703 -16888224 -18190399 -19158538 -19321491 -18961484 -18824444 -19152257 -19262134 -18235180
12870a8235180K443360L463102L968291M109790L860789L144746K215851J613445
$$ -18235180 -15791820 -12328718 -8360427 -4250637 -389848 2754898 4970749 6584194
12862F584194J702963K371897L162964L561286L104309J430046j424157m647844
$$ 6584194 8287157 10659054 13822018 17383304 20487613 21917659 20493502 15845658
12854A5845658o883101p228890o079152m734185m109154l989902l572235k458925
$$ 15845658 8962557 1733667 -4345485 -9079670 -13188824 -17178726 -20750961 -23209886
12846b3209886r57511M09001J416007K163239K780152L251256L549114L811791
$$ -23209886 -24167397 -23758396 -22342389 -20179150 -17398998 -14147742 -10598628 -6786837
12838f786837M183682M460385M174683L236062K235415J780382J691274J259582
$$ -6786837 -2603155 1857230 6031913 9267975 11503390 13283772 14975046 16234628
12830A6234628K15861j022213k059985k942198l671363l785142k790306q31534
$$ 16234628 16450489 15428276 13368291 10426093 6754730 2969588 179282 -652252
12822f52252J297899K698361K891818K096340J057002K96694n32804k166930m495096
$$ -652252 645647 3344008 6235826 8332166 9389168 9685862 9153058 6986128 2491032
12813B491032o305564o534475n348628l689558k194048r74619k9583P29052J638705
$$ 2491032 -3814532 -10349007 -15697635 -19387193 -21581241 -22555860 -22585443 -21856391 -20217686
12804b0217686K907767M145840M723687M540733M030144L469652K706314J562889
$$ -20217686 -17309919 -13164079 -8440392 -3899659 130485 3600137 6306451 7869340
12796G869340J59840j179620k071515k196153j612713q88688n68319n51211l49763
$$ 7869340 8029180 6849560 4778045 2581892 969179 80491 -487828 -1039039 -1388802
12787a388802P6334J61863n02488j582669k290585k029905p29554J153828K830442
$$ -1388802 -1312468 -1150605 -1653093 -3235762 -5526347 -7556252 -8285806 -7131978 -4301536
12778d301536L596431L239344K009123K50200j766370l675480m925703n019447
$$ -4301536 -705105 2534239 4543362 4793562 3027192 -648288 -5573991 -10593438
12770a0593438l902008k175626q33921m52844n10695J60347J999581M087988N165317
$$ -10593438 -14495446 -16671072 -17504993 -17957837 -18468532 -18308185 -16308604 -12220616 -7055299
12761g055299M924637L912153K555835R57486n58071j470128j737421j830665
$$ -7055299 -2130662 1781491 4337326 5294812 4736741 3266613 1529192 -301473
12753c01473j928556j622048o45271N64936J340879J515038J438271J470011J591909
$$ -301473 -2230029 -3852077 -4497348 -3932412 -2591533 -1076495 361776 1831787 3423696
12744C423696J375319L48399j347608k725938k750018j381194M98413K130968
$$ 3423696 4799015 5147414 3799806 1073868 -1676150 -3057344 -2558931 -427963
12736d27963L377434M213580M380891L763505K633452J320046O5146p01325n68790
$$ -427963 2949471 7163051 11543942 15307447 17940899 19260945 19326091 18624766 18055976
12727A8055976R1687J86242q38057k252077k988526k885972k549991k417277k480258
$$ 18055976 18147663 18333905 17495848 15243771 12255245 9369273 6819282 4402005 1921747
12718A921747k566105k341087j382868J58689J302090J334476R34040J387305
$$ 1921747 -644358 -2985445 -4368313 -4209624 -2907534 -1573058 -639018 748287
12710G48287K733122L509408K528302K13019k103176l594927m272232m396227
$$ 748287 3481409 6990817 9519119 9732138 7628962 4034035 -238197 -4634424
12702d634424m132214l620591k956906k081530r15471L71710J346799J603226
$$ -4634424 -8766638 -12387229 -15344135 -17425665 -18341136 -17969426 -16622627 -15019401
12694a5019401J107685L44052N4366O47738J815171K803591L012339K255772P25689
$$ -15019401 -13911716 -13567664 -13513298 -12865560 -11050389 -8246798 -5234459 -2978687 -2252998
12685b252998r20189j620085p10807J123461K205380J540067j45904j333500j359090
$$ -2252998 -3173187 -4793272 -5504079 -4380618 -2175238 -635171 -781075 -2114575 -3473665
12676c473665p42316j79999J46359K56242N774o10524j131816j006706k12542
$$ -3473665 -4215981 -4395980 -4249621 -3993379 -3987605 -4598129 -5729945 -6736651 -6949193
12667f949193P70315J555744K170317K756223L206089L251858K814481K110760
$$ -6949193 -6178878 -4623134 -2452817 303406 3509495 6761353 9575834 11686594
12659A1686594J413015P94007J36418o59518j531004k323252k971062l544350
$$ 11686594 13099609 13893616 14030034 13370516 11839512 9516260 6545198 3000848
12651C000848m068256m348315m086341l209167k019920r92782m72994n70208j190403
$$ 3000848 -1067408 -5415723 -9502064 -12711231 -14731151 -15723933 -16196927 -16767135 -17957538
12642a7957538k054798k782728l109324k998913k450963j300987N50708K696133
$$ -17957538 -20012336 -22795064 -25904388 -28903301 -31354264 -32655251 -32104543 -29408410
12634b9408410M268874M644535M030584L214805K750077K522644K137824J542591
$$ -29408410 -25139536 -20495001 -16464417 -13249612 -10499535 -7976891 -5839067 -4296476
12626d296476J065724Q89818P87827N85274O52905J509560K905258L754746L275760
$$ -4296476 -3230752 -2340934 -1553107 -967833 -314928 1194632 4099890 7854636 11130396
12617A1130396J917920Q20298N23654N89295L89667j48690o43530p54529m54828
$$ 11130396 13048316 13868614 14392268 14981563 15371230 15222540 14579010 13824481 13369653
12608A3369653j3703K22731J91654K27756O10532J079247J119062O94082L04622
$$ 13369653 13355950 13578681 13770335 13998091 14608623 15687870 16806932 17501014 17805636
12599A7805636K74761M06311M54061M78810M75511P2178j014255k478371l719868
$$ 17805636 18080397 18486708 18940769 19419579 19895090 19967268 18953013 16474642 12754774
12590A2754774m406394m416420l518079j665312M14929J485213R44355m76846
$$ 12754774 8348380 3931960 413881 -1251431 -836502 648711 1593066 1116220
12582A116220j375146r95997J81941J135382J431018J517118J880851K236235
$$ 1116220 -258926 -1254923 -1072982 62400 1493418 3010536 4891387 7127622
12574G127622J914022R02396o5981n85199j161040k353848l769364m410833l801362
$$ 7127622 9041644 9944040 9878059 9292860 8131820 5777972 2008608 -2402225 -6203587
12565f203587k287013m25136J374913K666469L030324K547557J869063J612221
$$ -6203587 -8490600 -8915736 -7540823 -4874354 -1844030 703527 2572590 4184811
12557D184811J850209K218861K263768J617612J28029j978369m129310n658690
$$ 4184811 6035020 8253881 10517649 12135261 12263290 10284921 6155611 496921
12549D96921n980023m657023j650394K351258O023657Q061063P884398N869452
$$ 496921 -5483102 -10140125 -11790519 -9439261 -3415604 4645459 12529857 18399309
12541A8399309L015920L24836j692604l026733l843081m353342m953205o018358
$$ 18399309 21415229 21740065 20047461 17020728 13177647 8824305 3871100 -2147258
12533b147258p238970p474046n760707k426588J132556L705378M991000N261535
$$ -2147258 -9386228 -16860274 -22620981 -25047569 -23915013 -20209635 -15218635 -9957100
12525i957100M829202L911201K617022R70982p67014j871599j729036p19522j7461
$$ -9957100 -5127898 -1216697 1400325 2371307 1604293 -267306 -1996342 -2715864 -2733325
12516b733325l00214j071529j471152j288140q57367m25208j19172k03435p19510
$$ -2733325 -3033539 -4105068 -5576220 -6864360 -7721727 -8146935 -8266107 -8469542 -9189052
12507i189052r78220q5400J824395L356368L192356J420215p41212k306297l183071
$$ -9189052 -10167272 -10252672 -8428277 -5071909 -1879553 -459338 -1200550 -3506847 -6689918
12498f689918l530325l058272j431757Q66464K679248L339224L270540L211980
$$ -6689918 -10220243 -13278515 -14710272 -13843808 -11164560 -7825336 -4554796 -1342816
12490a342816L286593L252148L256107L615840L940480L269653J374089o52672
$$ -1342816 1943777 5195925 8452032 12067872 16008352 19278005 20652094 19999422
12482A9999422j512686j071225k69382N178m23506j206452j817132j804953j161859
$$ 19999422 18486736 17415511 17146129 17151307 16727801 15521349 13704217 11899264 10737405
12473A0737405n03465n77710j508709k701878l457951l453705k721731j598185
$$ 10737405 10233940 9656230 8147521 5445643 1987692 -1466013 -4187744 -5785929
12465e785929q11231j148204k575285l845248l495450j409275R20022J907812
$$ -5785929 -6597160 -7745364 -10320649 -14165897 -17661347 -19070622 -18150600 -16242788
12457a6242788J443690O87309N56749R29479J318733J692210K241838K769600
$$ -16242788 -14799098 -14111789 -13555040 -12625561 -11306828 -9614618 -7372780 -4603180
12449d603180K827752K300973J434322M65870l09770l15552Q13092K483507L533135
$$ -4603180 -1775428 525545 1959867 2425737 2115967 1800415 2613507 5097014 8630149
12440H630149L537636L181270L118147L068585K450928J428614P84008R47129
$$ 8630149 12167785 15349055 18467202 21535787 23986715 25415329 26199337 27146466
12432B7146466J517807J587364L26637k389124n580206p685118p877577o642838
$$ 27146466 28664273 30251637 30578274 28189150 22608944 14923826 7046249 403411
12424D03411m802249k495562K75731K586185L097107J708191j27046j038465j112028
$$ 403411 -4398838 -6894400 -6618669 -4032484 -935377 772814 645768 -392697 -1504725
12415a504725j334825k207558l339331m069757m023801l184993j814239l63961
$$ -1504725 -2839550 -5047108 -8386439 -12456196 -16479997 -19664990 -21479229 -21843190
12407b1843190O80731R62641L84675p27392j681835j990519j933367k182416k730874
$$ -21843190 -21162459 -20199818 -19815143 -20542535 -22224370 -24214889 -26148256 -28330672 -31061546
12398c1061546k632952j157069J103993K726739K974187K462758K354796L222476
$$ -31061546 -33694498 -34851567 -33747574 -31020835 -28046648 -25583890 -23229094 -20006618
12390b0006618M720476O018340O389420N631529M188335K837089K095824J868322
$$ -20006618 -15286142 -9267802 -2878382 2753147 6941482 9778571 11874395 13742717
12382A3742717J657013J071379J07071r81363j955753k710301l188046l281243
$$ 13742717 15399730 16471109 16578180 15596817 13641064 10930763 7742717 4461474
12374D461474k863282j896410m68006J251551K996029M328311M720813L910025
$$ 4461474 1598192 -298218 -766224 485327 3481356 7809667 12530480 16440505
12366A6440505K231620M88422o42495j089646j264747j537305j917270k192255
$$ 16440505 18672125 19160547 18518052 17428406 16163659 14626354 12709084 10516829
12358A0516829k203298j930869j422822p02858L03157J691636L222293M061601
$$ 10516829 8313531 6382662 4959840 4256982 4560139 6251775 9474068 13535669
12350A3535669L310752J080540j260049k323168k032867j325808p45396K7415
$$ 13535669 16846421 17926961 16666912 14343744 12310877 10985069 10239673 10267088
12342A0267088J242590K403229K813761K265589Q73344j200191l396927m659971
$$ 10267088 11509678 13912907 16726668 18992257 19865601 18665410 15268483 10608512
12334A0608512m323108k837671j099503N83706K195366L062905K237710o0903
$$ 10608512 6285404 3447733 2348230 2931936 5127302 8190207 10427917 10367014
12326A0367014k226285k813884j759953Q4276J903232L072859L126811K239951
$$ 10367014 8140729 5326845 3566892 3651168 5554400 8627259 11754070 13994021
12318A3994021J352927J209425J491141J381143P34789J69698J61152N61308R12383
$$ 13994021 15346948 16556373 18047514 19428657 20163446 20333144 20494296 21055604 21967987
12309B1967987P48266l11678k177786l922353m334386l083244j022795P59023
$$ 21967987 22716253 22404575 20226789 16304436 11970050 8886806 7864011 8623034
12301H623034J810424K128976J651316L90833j169821k319506k783908k891141
$$ 8623034 10433458 12562434 14213750 14604583 13434762 11115256 8331348 5440207
12293E440207l074177l394979l501943k841769j003232J786252M409156N439060
$$ 5440207 2366030 -1028949 -4530892 -7372661 -8375893 -6589641 -2180485 3258575
12285C258575M291204J772857o12538j817027j677541n58345R69176K114632K071142
$$ 3258575 7549779 9322636 8710098 6893071 5215530 4657185 5626361 7740993 9812135
12276I812135O54783j325776k596670k378722q13321J353161L214083L885526
$$ 9812135 10466918 9141142 6544472 4165750 3352429 4705590 7919673 11805199
12268A1805199K722834j57026l495083n409243m787483k358178j59185L24181
$$ 11805199 14528033 14371007 10875924 5466681 679198 -1678980 -1838165 -1513984
12260a513984n49119j274113r57957P758Q61603J348856J430327P81968p60267
$$ -1513984 -2063103 -3337216 -4295173 -4287415 -3425812 -2076956 -646629 135339 -624928
12251f24928k526147l426401l051654j961571r66800n38233p99116j541600k192846
$$ -624928 -3151075 -6577476 -9629130 -11590701 -12557501 -13095734 -13894850 -15436450 -17629296
12242a7629296k218678j620910o64796P59254K878032N148587O414242O220177
$$ -17629296 -19847974 -21468884 -22133680 -21374426 -18496394 -13347807 -6933565 -713388
12234g13388N299155M414677L425105J985412M76989n08606j134268j946543k825760
$$ -713388 4585767 9000444 12425549 14410961 14887950 14379344 13245076 11298533 8472773
12225H472773l129124k753243k250192j867943j237761j93358P31772Q89605J69081
$$ 8472773 5343649 2590406 340214 -1527729 -2765490 -2958848 -2227076 -1337471 -1168390
12216a168390j073651k276078k744897k033089n53362N82456O46479m7275p19890
$$ -1168390 -2242041 -4518119 -7263016 -9296105 -9849467 -9267011 -8620532 -8667807 -9387697
12207i387697r62749p60526j40858P31609J359540J316125Q42598P06159J380818
$$ -9387697 -10350446 -11110972 -11251830 -10520221 -9160681 -7844556 -7001958 -6295799 -4914981
12198d914981K521215L275610L063369K111940J302511J421092K500204L897790
$$ -4914981 -2393766 881844 3945213 6057153 7359664 8780756 11280960 15178750
12190A5178750M896354N067660M258607K662074R04233m09550j350053k389861
$$ 15178750 20075104 25142764 29401371 32063445 32967678 32558128 31208075 28818214
12182B8818214l330962l182106j624363o4841l99526k804873n432055o357891
$$ 28818214 25487252 22305146 20680783 20615942 20216416 17411543 11979488 5621597
12174E621597n275525l180021j082883N18204J372024J396146R47573P42679J224399
$$ 5621597 346072 -2833949 -3916832 -3398628 -2026604 -630458 317115 1059794 2284193
12165B284193K074508K492303J962563O86537p18932j800472k462022k755263
$$ 2284193 4358701 6851004 8813567 9500104 8781172 6980700 4518678 1763415
12157A763415k757224k651011k619807k529544j977878q57315L45242J047709
$$ 1763415 -993809 -3644820 -6264627 -8794171 -10772049 -11629364 -11284122 -10236413
12149a0236413J203825J206537J353979J705860K288344L041022L627116L695565
$$ -10236413 -9032588 -7826051 -6472072 -4766212 -2477868 563154 4190270 7885835
12141G885835L335628K899697K372693J367372j28709j432887j830204j233671
$$ 7885835 11221463 14121160 16493853 17861225 17732516 16299629 14469425 13235754
12133A3235754J5604J609796L182799M094510L842888K647361J231087L1443j031362
$$ 13235754 13251358 14861154 18043953 22138463 25981351 28628712 29859799 29891242 28859880
12124B8859880k022442k671150k754659k460855k086047j576136p10337K89587
$$ 28859880 26837438 24166288 21411629 18950774 16864727 15288591 14578254 14867841
12116A4867841O64449j68135j885573l403880l797138l039095j837793q45594
$$ 14867841 15532290 15364155 13478582 10074702 6277564 3238469 1400676 555082
12108E55082j63063M01889Q18935Q13439L32591k19742l86745k02118j43893n56663
$$ 555082 392019 793908 1612843 2426282 2758873 2539131 2152386 1950268 1806375 1249712
12098A249712j313425k107328k827713l390078l354739k202355k08679J306195
$$ 1249712 -63713 -2171041 -4998754 -8388832 -11743571 -13945926 -14154605 -12848410
12090a2848410J071639p75033k727390l355060k451918p41106J096646K753286
$$ -12848410 -11776771 -12551804 -15279194 -18634254 -21086172 -21827278 -20730632 -17977346
12082a7977346L953243M352798L891999K894983J638788P8086j758535l277118
$$ -17977346 -14024103 -9671305 -5779306 -2884323 -1245535 -1167449 -2925984 -6203102
12074f203102l591828k399230m15366J173115J641230J105984J65246o35693j004177
$$ -6203102 -9794930 -12194160 -12609526 -11436411 -9795181 -8689197 -8523951 -9159644 -10163821
12065a0163821q19514p9349J055692K294203L387699M255117M873999N048909
$$ -10163821 -10983335 -11062684 -10006992 -7712789 -4325090 -69973 4804026 9852935
12057I852935M380003K587974o1098k698188m335494m508885l498679k001208
$$ 9852935 14232938 16820912 16759814 14061626 9726132 5217247 1718568 -282640
12049b82640o93926q3055m68513j710624l036350l445173k589701j145863q6025
$$ -282640 -976566 -1059621 -1528134 -3238758 -6275108 -9720281 -12309982 -13455845 -13541870
12040a3541870L39045O44065J198975J674864J576407R90715M44617J76540m6944
$$ -13541870 -13202825 -12558760 -11359785 -9684921 -8108514 -7117799 -6673182 -6496642 -6543586
12031f543586m29771r10249j535576k597524m031568m979044m451460k449351
$$ -6543586 -6973357 -7883606 -9419182 -12016706 -16048274 -21027318 -25478778 -27928129
12023b7928129j10980J287808J293203L60189o30971r13773k97621O98037J394828
$$ -27928129 -28039109 -26751301 -25458098 -25097909 -25728880 -26642653 -26940274 -26242237 -24847409
12014b4847409J751652K323361L283252L882519L277997J686395K48731k60485
$$ -24847409 -23095757 -20772396 -17489144 -13606625 -10328628 -8642233 -8393502 -8653987
12006h653987k17773n49344j642629l051844m123207m650296m829387m706151
$$ -8653987 -8871760 -9421104 -11063733 -14115577 -18238784 -22889080 -27718467 -32424618
11998c2424618l948054k376710n83056M01015K02634m20080m40516L29029J228320
$$ -32424618 -36372672 -38749382 -39332438 -38931423 -38728789 -39148869 -39589385 -39260356 -38032036
11989c8032036J587962J242109M38447k95110k86755P73231K384979L670800M298167
$$ -38032036 -36444074 -35201965 -34763518 -35058628 -35345383 -34572152 -32187173 -28516373 -24218206
11980b4218206M577986M593763L756437J549599j575170m349820n594485m858103
$$ -24218206 -19640220 -15046457 -11290020 -9740421 -11315591 -15665411 -21259896 -26117999
11972b6117999k487971O04314L389101N262757O234239O570990O421581N867418
$$ -26117999 -28605970 -28001656 -24612555 -19349798 -13115559 -6544569 -122988 5744430
11964E744430N106475M324046L428697K110667K57312j644319k539357j515475
$$ 5744430 10850905 15174951 18603648 20714315 20971627 19327308 16787951 15272476
11956A5272476J173069L879591M807210L617812J557055J2414o43055p98009q54602
$$ 15272476 16445545 20325136 25132346 28750158 30307213 30319627 29676572 28878563 28023961
11947B8023961j025650j335303j423430q02873K66445O40388l85790j965582k564074
$$ 28023961 26998311 25663008 24239578 23436705 23703150 24343538 23957748 21992166 19428092
11938A9428092j724697l50139O03598R93221J047152P61399k4126j347178l025004
$$ 19428092 17703395 17353256 17956854 18950075 19997227 20758626 20734500 19387322 16362318
11929A6362318m505878m912791l794661j911780p50049j085040k399926l712884
$$ 16362318 11856440 6943649 3148988 1237208 487159 -597881 -2997807 -6710691
11921f710691m417537m252256l196165j790459r78437j099718j399538r89571
$$ -6710691 -11128228 -15380484 -18576649 -20367108 -21345545 -22445263 -23844801 -24834372
11913b4834372J3683P60890Q03725M41563Q0254k41317o68173j272171k057308
$$ -24834372 -24820689 -24059799 -23256074 -22814511 -22734257 -22975574 -23643747 -24915918 -26973226
11904b6973226k924569l517406l308901k023512K465J895318K777102K445766
$$ -26973226 -29897795 -33415201 -36724102 -38747614 -38745149 -36849831 -34072729 -31626963
11896c1626963J628704J412439K271730L680695M668650M651162L790473K801864
$$ -31626963 -29998259 -28585820 -26314090 -22633395 -17964745 -13313583 -9523110 -6721246
11888f721246K428663K824491L352021L198817K227133J001976Q0183l02014J04689
$$ -6721246 -4292583 -1468092 1883929 5082746 7309879 8311855 8392038 8090024 8194713
11879H194713J525005L509760M904726M916555L841469K405880Q58368q52995
$$ 8194713 9719718 13229478 18134204 23050759 26892228 29298108 30156476 29303481
11871B9303481k520748l917741n173598o173630n921928l464868N24695L940228
$$ 29303481 26782733 22864992 17691394 11517764 5595836 2130968 2655663 6595891
11863F595891N275229M881311M047250L484287L038644K320950J114327n56062
$$ 6595891 11871120 16752431 20799681 24283968 27322612 29643562 30757889 30201827
11855C0201827k340439l662026m141771l867865l217485k635007k589413l344325
$$ 30201827 27861388 24199362 20057591 16189726 12972241 10337234 7747821 4403496
11847D403496m556985n398370n300138m383734l048295j492415J05744J281135
$$ 4403496 -153489 -5551859 -10851997 -15235731 -18284026 -19776441 -19670697 -18389562
11839a8389562J590186J132021M48082m5455k79776k77950j2124M11856O91514
$$ -18389562 -16799376 -15667355 -15219273 -15264728 -15544504 -15822454 -15834578 -15422722 -14731208
11830a4731208O58011N87504R52192J748142K230374J619153J28631j032241r31950
$$ -14731208 -14073197 -13485693 -12533501 -10785359 -8554985 -6935832 -6807201 -7839442 -8771392
11821h771392O2851Q88962J200345J665903K872374M470739N595856N712490M815825
$$ -8771392 -8708541 -7819579 -6619234 -4953331 -2080957 2389782 7985638 13698128 18513953
11812A8513953L172531J201746n90769j845127k442614k316124j454159k77904
$$ 18513953 21686484 22888230 22297461 20452334 18009720 15693596 14239437 13961533
11804A3961533K84071n36997k604588m897744o216070n931548m354681k468221
$$ 13961533 14245604 13708607 11104019 6206275 -9795 -5941343 -10296024 -12764245
11796a2764245j074356j77697N27329P28645k46007k085579l227072k525148o53111
$$ -12764245 -13838601 -14016298 -13488969 -12760324 -13006331 -15091910 -18318982 -20844130 -21497241
11787b1497241Q28809J393967J787090K614596L546846L925155L446006K162908
$$ -21497241 -20668432 -19274465 -17487375 -14872779 -11325933 -7400778 -3954772 -1791864
11779a791864M56929q59713j027909j85238P05849R28473N95583J15045l42054
$$ -1791864 -1334935 -2194648 -3222557 -3407795 -2701946 -1773473 -1177890 -1062845 -1404899
11770a404899o46346o01711m12569p75216k062884l759762n067163n696639n655065
$$ -1404899 -2051245 -2652956 -3065525 -3840741 -5903625 -9663387 -14730550 -20427189 -26082254
11761b6082254m669099k477150M38373K987876M397207M665832M205153L433792
$$ -26082254 -30751353 -33228503 -32790130 -29802254 -25405047 -20739215 -16534062 -13100270
11753a3100270K688381K107812J556990R94763Q81720J765988L347332M368680
$$ -13100270 -10411889 -8304077 -6747087 -5752324 -4870604 -3104616 242716 4611396
11745D611396L700990J361539j602960l945816m872603m358966l220189k624564
$$ 4611396 8312386 9673925 8070965 4125149 -747454 -5106420 -8326609 -10951173
11737a0951173l102323m036001m346411l584644k129083n09431J018379K245694
$$ -10951173 -14053496 -18089497 -22435908 -26020552 -28149635 -28659066 -27640687 -25394993
11729b5394993K878149K900298K774670K967483L413562L676567L482895K832290
$$ -25394993 -22516844 -19616546 -16841876 -13874393 -10460831 -6784264 -3301369 -469079
11721d69079J737429K58277j182650j909346j612193o54563L52419J045521J267757
$$ -469079 1268350 1526627 343977 -1565369 -3177562 -3832125 -3479706 -2434185 -1166428
11712a166428Q90390L6198p03433o93197Q7474J080525J792965K063746J709794
$$ -1166428 -276038 -239840 -943273 -1636470 -1548996 -468471 1324494 3388240 5098034
11703E098034M06059j788895m078345n457955n538433m661285l357987j963440
$$ 5098034 5504093 3715198 -363147 -5821102 -11359535 -16020820 -19378807 -21342247
11695b1342247o46842N48912J767551L132198M312536M549766L425599J563008
$$ -21342247 -21989089 -21440177 -19672626 -16540428 -12227892 -7678126 -4252527 -2689519
11687b689519K58437K61746J053410J477906R90185P4211m99415m85581j13031
$$ -2689519 -2431082 -2169336 -1115926 361980 1352165 1426376 926961 441380 328349
11678C28349M02967Q77633Q24066l63126k666348n161172o711130o822045n692452
$$ 328349 731316 1608949 2433015 2069889 -596459 -5757631 -12468761 -19290806 -24983258
11669b4983258l670676r99134J927131M370174N583005N419349M557151L928089
$$ -24983258 -28653934 -29653068 -27725937 -23355763 -17772758 -12353409 -7796258 -3868169
11661c868169L767205L371543K085148M04330m02459J09971R07366P72692k44179
$$ -3868169 -100964 3270579 5355727 5760057 5357598 5467569 6374935 7147627 6903448
11652F903448j238710j898639k692843l707476m237839l858069l132194k712040
$$ 6903448 5664738 3766099 1073256 -2634220 -6872059 -10730128 -13862322 -16574362
11644a6574362k272055j029295R50263K650342L266673K915187K167201J429461
$$ -16574362 -18846417 -19875712 -18925449 -16275107 -13008434 -10093247 -7926046 -6496585
11636f496585R19430P23077N57261j38551j450800k532580k334536p85670J086226
$$ -6496585 -5577155 -4854078 -4296817 -4435368 -5886168 -8418748 -10753284 -11538954 -10452728
11627a0452728K240614K501542K245048J600307L87416j212975k365329k228229
$$ -10452728 -8212114 -5710572 -3465524 -1865217 -1477801 -2690776 -5056105 -7284334
11619g284334q02378J023049K209146K263320J383727K28904m37027k09675N83614
$$ -7284334 -8086712 -7063663 -4854517 -2591197 -1207470 -978566 -1415593 -1625268 -1041654
11610a041654J090544P56013k8058k07544R59669L196263N341308O115654M959793
$$ -1041654 48890 804903 776845 569301 1528970 4725233 10066541 16182195 21141988
11601B1141988K429964j77572j783473k226301k020212j566752q55588R2661Q58125
$$ 21141988 23571952 23394380 21610907 19384606 17364394 15797642 14942054 15034715 15892840
11592A5892840R13139J03571j320878k950427m265642m661593l827334k129647
$$ 15892840 16805979 16909550 15588672 12638245 8372603 3711010 -116324 -2245971
11584b245971l42281J036297J949712K313475J830269N01309j028616k012487
$$ -2245971 -2588252 -1551955 397757 2711232 4541501 5042810 4014194 2001707
11576B001707k335453k387016k326533j854350o98619J034898L066537N164230
$$ 2001707 -333746 -2720762 -5047295 -6901645 -7600264 -6565366 -3498829 1665401
11568A665401P019730Q159377Q152418O805894M219310R79193j748551k957118
$$ 1665401 8685131 16844508 24996926 31802820 36022130 37001323 35252772 32295654
11560C2295654k973605l349451m987845o745658o635846m265687j280615O45044
$$ 32295654 29322049 25972598 20984753 14239095 7603249 3337562 2056947 2701991
11552B701991J382633J633627J564576R15626p5606q02823j274462k195555l875551
$$ 2701991 4084624 5718251 7282827 8198453 8122847 7320024 6045562 3850007 -25544
11543b5544n560390o093331m963061k607617r314J880429K651743K655448K612651
$$ -25544 -5585934 -11679265 -16642326 -19249943 -19259257 -17378828 -14727085 -12071637 -9458986
11534i458986K883067L216058L232715K912985K487403K064203J560667Q91450
$$ -9458986 -6575919 -3359861 -127146 2785839 5273242 7337445 8898112 9789562
11526I789562N9777q66783j733445k303808k432262k255036k130305k310694k621761
$$ 9789562 9849339 8982556 7249111 4945303 2513041 258005 -1872300 -4182994 -6804755
11517f804755k487698j423564L82743K084043K939743L022299L010310L352314
$$ -6804755 -9292453 -10716017 -10333274 -8249231 -5309488 -2287189 723121 4075435
11509D075435L836767L941273L380819K329498J314246Q42404Q79570P54773j06836
$$ 4075435 7912202 11853475 15234294 17563792 18878038 19720442 20600012 21354785 21247949
11500B1247949j435603k524209l322439m478495o075686o999130o101433l594506
$$ 21247949 19812346 17288137 13965698 9487203 3411517 -3587613 -9689046 -13283552
11492a3283552p22264J642398L427204M566718M579914L201663R68182j132234
$$ -13283552 -14005816 -12363418 -8936214 -4369496 210418 3412081 4380263 3248029
11484C248029k385359k605085j931852o10304J096592K873924M271301M826193
$$ 3248029 862670 -1742415 -3674267 -4284571 -3187979 -314055 3957246 8783439
11476H783439M482179L781928L341795L109616K397249P26704j522995l358271
$$ 8783439 13265618 17047546 20389341 23498957 25896206 26622910 25099915 21741644
11468B1741644l956413l270831k027155j085554o85379m23500n3733M8233m31884
$$ 21741644 17785231 14514400 12487245 11401691 10716312 10292812 10239079 10287312 9855428
11459I855428r58395p13361J10464L14662p60048k231074k554782j089764J408766
$$ 9855428 8897033 8183672 8294136 8608798 7848750 5617676 3062894 1973130 3381896
11450C381896L465689L843384K291344k24411k241011l036246l011775k808905
$$ 3381896 6847585 10690969 12982313 12757902 10516891 7480645 4468870 1659965
11442A659965k510438j966247j380307j068335r53727p72552m85097k8851R41104
$$ 1659965 -850473 -2816720 -4197027 -5265362 -6219089 -6991641 -7476738 -7505589 -6564485
11433f564485K388703L269671K466848M06349j065807o60994J151105L140794
$$ -6564485 -4175782 -906111 1560737 1967086 901279 240285 1391390 4532184
11425D532184M737024N917390O354007N590442L950418K479934J771731J350346
$$ 4532184 9269208 15186598 21540605 27131047 31081465 33561399 35333130 36683476
11417C6683476M94528p06537j509989j578522j468995j947647l052856m031139
$$ 36683476 37178004 36471467 34961478 33382956 31913961 29966314 26913458 22882319
11409B2882319m122046l252604k005761j073922p40896p33136n43125j0761M77157
$$ 22882319 18760273 15507669 13501908 12427986 11687090 10953954 10410829 10400068 10877225
11400A0877225N81810O96944J564218L076363M002197L317181J419853m85422
$$ 10877225 11459035 12155979 13720197 16796560 20798757 24115938 25535791 25050369
11392B5050369j889807l182014m503846n232961m825263l546797k054264p27445
$$ 25050369 23160562 19978548 15474702 10241741 5416478 1869681 -184583 -912028
11384i12028K89151Q77304J190651J696951K479891K809623J996837N48293j33312
$$ -912028 -622877 254427 1445078 3142029 5621920 8431543 10428380 10976673 10843361
11375A0843361O65827K073849K498173J201825j031910k622541k564488j292297
$$ 10843361 11509188 13583037 16081210 17283035 16251125 13628584 11064096 9771799
11367I771799k67425o20632k198876l950148m996648n095313m312124k787387
$$ 9771799 9504374 8883742 6684866 2734718 -2261930 -7357243 -11669367 -14456754
11359a4456754r05686P44411J837651K523191L015857L219908K955546K330019
$$ -14456754 -15362440 -14618029 -12780378 -10257187 -7241330 -4021422 -1065876 1264143
11351A264143J605244Q34397o0145q72227j072984l17674J116336K468950L051837
$$ 1264143 2869387 3703784 3643639 2771412 1698428 1380754 2497090 4966040 8017877
11342H017877K735923K022737J597371J642942J598259P85857o89155j910830
$$ 8017877 10753800 12776537 14373908 16016850 17615109 18400966 17711811 15800981
11334A5800981k159306j714516j396905j454692j265206j74664J666551L427972
$$ 15800981 13641675 11927159 10530254 9075562 7810356 7635692 9302243 12730215
11326A2730215M347225M252853L560531K886841K461496J775466O1125k640633
$$ 12730215 17077440 21330293 24890824 27777665 30239161 32014627 32075752 29435119
11318B9435119n126734o084184n361125l869972k415383j108754J31275J143116
$$ 29435119 24308385 18224201 12863076 8993104 6577721 5468967 5600242 6743358
11310F743358J816474K315283K661837K482443J572859M41775j59677j28896o2341
$$ 6743358 8559832 10875115 13536952 16019395 17592254 18034029 17874352 17745456 17683115
11301A7683115n05352j479260k643353l529668l631330k656640q41852J155022
$$ 17683115 17177763 15698503 13055150 9525482 5894152 3237512 2395660 3550682
11293C550682K653226L082301J958754p31412m040453o419453o861861n532337
$$ 3550682 6203908 9286209 11244963 10513551 6473098 53645 -6808216 -12340553
11285a2340553l269352q82827R38116J613465J122802K50358j26051M2017J34435
$$ -12340553 -15609905 -16492732 -15554616 -13941151 -12818349 -12567991 -12694042 -12652025 -12517590
11276a2517590j04961j36722O57974K170653L658313M399437M065635K669840
$$ -12517590 -12622551 -12759273 -12101299 -9930646 -6272333 -1872896 2192739 4862579
11268D862579N03247j816717l453058l730358k545176m72934J537559K683405
$$ 4862579 5365826 3549109 96051 -3634307 -6179483 -6652417 -5114858 -2431453
11260b431453K682378J782328M95328p04976j580070k162383k593591k883213
$$ -2431453 250925 2033253 2528581 1823605 243535 -1918848 -4512439 -7395652
11252g395652k881121k544844k130525j963429k034567j948935j274481J27160
$$ -7395652 -10276773 -12821617 -14952142 -16915571 -18950138 -20899073 -22173554 -22046394
11244b2046394J999951L697970M359256L486518J615458J76735K89875J600358
$$ -22046394 -20046443 -16348473 -11989217 -8502699 -6887241 -6710506 -6420631 -4820273
11236d820273K519713J762551m00287k448816l071585k249283j020030m24497
$$ -4820273 -2300560 -538009 -938296 -3387112 -6458697 -8707980 -9728010 -10152507
11228a0152507p84174j777282k820253l263787k576399p49580J503774L267272
$$ -10152507 -10936681 -12713963 -15534216 -18798003 -21374402 -22123982 -20620208 -17352936
11220a7352936M213101M691408N046317N126515M537257L099790R92160j219203
$$ -17352936 -13139835 -8448427 -3402110 1724405 6261662 9361452 10353612 9134409
11212I134409k560691k138698o4242K361948L787641L955467L393805K324943
$$ 9134409 6573718 4435020 4370778 6732726 10520367 14475834 17869639 20194582
11204B0194582N39150j740538l603263m310807l990616l324132k934034l140275
$$ 20194582 20733732 18993194 15389931 11079124 7088508 3764376 830342 -2309933
11196b309933l804442m254682l904331l164676l127471l963200m275850k692788
$$ -2309933 -6114375 -10369057 -14273388 -17438064 -20565535 -24528735 -28804585 -31497373
11188c1497373L29743K972092M016852L640096K508620J042760k70360o57139
$$ -31497373 -31167630 -28195538 -24178686 -20538590 -18029970 -16987210 -17257570 -17914709
11180a7914709L26180K243649M107080N072742M792982L453548J646229j2337
$$ -17914709 -17588529 -15344880 -11237800 -6165058 -1372076 2081472 3727701 3715364
11172C715364j245886k018812k262768k031545j722215j612829j288647j82064
$$ 3715364 2469478 450666 -1812102 -3843647 -5565862 -7178691 -8467338 -8649402
11164h649402J309720K032597J645048J201927J687464K611767K716049J629381
$$ -8649402 -7339682 -5307085 -3662037 -2460110 -772646 1839121 4555170 6184551
11156F184551J30541r57105j419764j313383o60642L78816J464010K292327K577677
$$ 6184551 6315092 5357987 3938223 2624840 1964198 2343014 3807024 6099351 8677028
11147H677028J890886j0264k572929m535538m878153l648633j870572p50480q56156
$$ 8677028 10567914 10557650 7984721 3449183 -1428970 -5077603 -6948175 -7698655 -8554811
11138h554811j795439k640791k782094k354584j819410j345852p66117R9735J331553
$$ -8554811 -10350250 -12991041 -15773135 -18127719 -19947129 -21292981 -22059098 -21959363 -20627810
11129b0627810K905437M469806N280870M767995L208411J632736J059436J848741
$$ -20627810 -17722373 -13252567 -7971697 -3203702 4709 1637445 2696881 4545622
11121D545622L508634M903124M978855L683669J976968O45477n26068j981612
$$ 4545622 8054256 12957380 17936235 21619904 23596872 24242349 23716281 21734669
11113B1734669l281958l549364k775026j793685r94237J3549J282346K014714
$$ 21734669 18452711 14903347 12128321 10334636 9340399 9353948 10636294 12651008
11105A2651008J610416N08552n16142j311146k068100k582704k418103j572864
$$ 12651008 14261424 14769976 14253834 12942688 10874588 8291884 5873781 4300917
11097D300917n36595J38563O2661q41669k079425k836411k855297k699250k800495
$$ 4300917 3764322 3902885 3965546 3123877 1044452 -1791959 -4647256 -7346506 -10147001
11088a0147001k732061j945351p88740j26328k36616p49176j399345k071651k253168
$$ -10147001 -12879062 -14824413 -15613153 -15739481 -15976097 -16725273 -18124618 -20196269 -22449437
11079b2449437j338204L89800J820490K285420K158936J997353J742144J153476
$$ -22449437 -23787641 -23397841 -21577351 -19291931 -17132995 -15135642 -13393498 -12240022
11071a2240022M79802J69690K13698K28328L8602j69607j64915J44570P55022
$$ -12240022 -11760220 -11590530 -11376832 -11148504 -11109902 -11279509 -11444424 -11299854 -10544832
11062a0544832J542319K205124K393623J934375R44333j90380r85613j166460
$$ -10544832 -9002513 -6797389 -4403766 -2469391 -1525058 -1715438 -2701051 -3867511
11054c867511p75688J59969J858496M256007O370795O877084N582426L800455
$$ -3867511 -4643199 -4483230 -2624734 1631273 8002068 14879152 20461578 24262033
11046B4262033K872178K771663K636433K197659J910283J828408J219721m19066
$$ 24262033 27134211 29905874 32542307 34739966 36650249 38478657 39698378 39279312
11038C9279312k517271l968589m209607l489565k357339j248956m67960k16133
$$ 39279312 36762041 32793452 28583845 25094280 22736941 21487985 21020025 20803892
11030B0803892n28573j262767k161698k917527l301097l347600l325794l374672
$$ 20803892 20275319 19012552 16850854 13933327 10632230 7284630 3958836 584164
11022E84164l214400k383016p99560J008385K299340K722406K539598K295518
$$ 584164 -2630236 -5013252 -5812812 -4804427 -2505087 217319 2756917 5052435
11014E052435K268490K219784J710219P02952k15989l54979L19750J063333J085601
$$ 5052435 7320925 9540709 11250928 11953880 11737891 11382912 11702662 12765995 13851596
11005A3851596L38779n00781p43479k49117O15081J299913J305588M18356r63913
$$ 13851596 14190375 13689594 12946115 12696998 13312079 14611992 15917580 16335936 15372023
10996A5372023j861824j478637j24380P99511m5390k748054o059619q328112q528421
$$ 15372023 13510199 12031562 11907182 12706693 12661303 9913249 3853630 -4474482 -13002903
10987a3002903o728058l928055j428560J004N76490J126715K225183L705223M966360
$$ -13002903 -19730961 -23659016 -25087576 -25086572 -24510082 -23383367 -21158184 -17452961 -12486601
10978a2486601N610841N766057N913565O408870P015239O924919N505124L116786
$$ -12486601 -6875760 -1109703 4803862 11212732 18227971 25152890 30658014 33774800
10970C3774800R13112l52070j019711j764736k499565k577503j909524j161751
$$ 33774800 34687912 34335842 33316131 31551395 29051830 26474327 24564803 23403052
10962B3403052p12574j18174R68906J906535J721303L88316j179931k336315l291525
$$ 23403052 22690478 22572304 23541210 25447745 27169048 27557364 26377433 24041118 20749593
10953B0749593m441729n636331o318007o040317m720790k759262j062498n19307
$$ 20749593 16307864 10671533 4353526 -1686791 -6407581 -9166843 -10229341 -10748648
10945a0748648j104446j744929j385359l5243J448816K375435K684536K576101
$$ -10748648 -11853094 -13598023 -14983382 -15018625 -13569809 -11194374 -8509838 -5933737
10937e933737K105223J230198L4471j193197k037234k173090j623171p38090J69594
$$ -5933737 -3828514 -2598316 -2563845 -3757042 -5794276 -7967366 -9590537 -10328627 -10159033
10928a0159033J074793K044791K994383L832722M674611N601362O258927N967298
$$ -10159033 -9084240 -7039449 -4045066 -212344 4462267 10063629 16322556 22289854
10920B2289854M286925J393997j962198m672566n654763m520828k024089L98196
$$ 22289854 26576779 27970776 26008578 21336012 15681249 11160421 9136332 9534528
10912I534528J688924J762808J213391P53802Q84208J627671K360512K231342
$$ 9534528 11223452 12986260 14199651 14953453 15837661 17465332 19825844 22057186
10904B2057186J077007k33619o66002j66423L20862o519q77221j254755m64647
$$ 22057186 23134193 22900574 22234572 22068149 22389011 22382492 21505271 20250516 19785869
10895A9785869J084286K260543K211797J019754n22182j631965k003695j727458
$$ 19785869 20870155 23130698 25342495 26362249 25840067 24208102 22204407 20476949
10887B0476949j029042k38584R7209o29206k536993m809414o038571n336054l163379
$$ 20476949 19447907 19209323 19306532 18677326 16140333 11330919 5292348 -43706 -3207085
10878c207085q90132M96021J041269J212579J069854L77094p16131j578172j742961
$$ -3207085 -4097217 -3601196 -2559927 -1347348 -277494 99600 -616531 -2194703 -3937664
10869c937664j396905j154935j484778k310232l016972k911883j874190n16297
$$ -3937664 -5334569 -6489504 -7974282 -10284514 -13301486 -16213369 -18087559 -18603856
10861a8603856M53263R16278J209595J507509J711325J865543K241848K926540
$$ -18603856 -18150593 -17234315 -16024720 -14517211 -12805886 -10940343 -8698495 -5771955
10853e771955L653886M117560M131642L436184J753874p29664l182966m627875
$$ -5771955 -2118069 1999491 6131133 9567317 11321191 10591527 7408561 2780686
10845B780686m534251k974736n12803K010608L938544N202301O017131O167782
$$ 2780686 -1753565 -4728301 -5241104 -3230496 708048 5910349 11927480 18095262
10837A8095262N054833K629348j85140k340778l603813m321456m572387l967831
$$ 18095262 23150095 25779443 25594303 23253525 19649712 15328256 10755869 6788038
10829F788038k155310P48467M015827O357352O484859M164224O57012k245923
$$ 6788038 4632728 5381195 9397022 15754374 22239233 26403457 27060469 24814546
10821B4814546l620819l712705l188856k539273k017457j615706j046932j19655
$$ 24814546 21193727 17481022 14292166 11752893 9735436 8119730 7072798 6953143
10813F953143Q68272J456855J711118K173237L077445L982609M268841L652234
$$ 6953143 7821415 9278270 10989388 13162625 16240070 20222679 24491520 28143754
10805B8143754K101184l78412l584223o878856r312285j0021352q626233n490546
$$ 28143754 30244938 29866526 26282303 19403447 10091162 69810 -8556423 -14046969
10797a4046969j678396J510307L150442L037785J728531L38818q0097N91869J389326
$$ -14046969 -15725365 -14215058 -11064616 -8026831 -6298300 -5959482 -6039579 -5447710 -4058384
10788d058384J282151K18292j147933k465014l812868m924363n005853l555396
$$ -4058384 -2776233 -2557941 -3705874 -6170888 -9983756 -14908119 -19913972 -23469368
10780b3469368q81437K306114N258427P003269O585456M090178J003902j032539
$$ -23469368 -24350805 -22044691 -16786264 -9782995 -3197539 892639 1896541 864002
10772H64002j633381j469077j059353l84032N18347J289752J705755J908855K076069
$$ 864002 -769379 -2238456 -3297809 -3681841 -3163494 -1873742 -167987 1740868 3816937
10763C816937K236036K473149K862680L033962K235888J89453k342220m143740
$$ 3816937 6052973 8526122 11388802 14422764 16658652 16848105 14505885 10362145
10755A0362145m601728l964296k737529j211067L81786J604295K025947J642694
$$ 10362145 5760417 1796121 -941408 -2152475 -1770689 -166394 1859553 3502247
10747C502247Q80212J33828n48611j233531j692362j481891n39553M50673N31610
$$ 3502247 4382459 4516287 3967676 2734145 1041783 -440108 -979661 -528988 2622
10738B622n73246k062724k771011k308807j343638o45644q1447J074623K878360
$$ 2622 -570624 -2633348 -5404359 -7713166 -9056804 -9702448 -9783895 -8709272 -5830912
10729e830912M316174M485726L738082L077058K666951J712277o9531j642056
$$ -5830912 -1514738 2970988 6709070 9786128 12453079 14165356 14095825 12453769
10721A2453769j834632q73329j19293m73231j590418k588269k930803k494006
$$ 12453769 10619137 9745808 9626515 9153284 7562866 4974597 2043794 -450212
10713d50212j326725K37502J476735J695234P70485q41606k527836l749230m006076
$$ -450212 -1776937 -1539435 -62700 1632534 2403019 1561413 -966423 -4715653 -8721729
10704h721729k999434j028598R94663K220334K553564K523077K502405K300526
$$ -8721729 -11721163 -12749761 -11755098 -9534764 -6981200 -4458123 -1955718 344808
10696C44808J594736N25522l60174o59767m09894J10901O58540J089961J338891
$$ 344808 1939544 2465066 2104892 1445125 1035231 1146132 1804672 2894633 4233524
10687D233524J385652J141832L72170j079044k889816m219408m229932k725524
$$ 4233524 5619176 6761008 7133178 6054134 3164318 -1055090 -5285022 -8010546
10679h010546l45832J820678K918994K820011J999757R04909m66141k246117m142335
$$ -8010546 -8356378 -6535700 -3616706 -796695 1203062 2107971 1641830 -604287 -4746622
10670d746622n507282n949787n574085m563230k863770m90018K081412M096443
$$ -4746622 -10253904 -16203691 -21777776 -26341006 -29204776 -29694794 -27613382 -23516939
10662b3516939N089277N164420M769427M257606L632412K695272J444045J79347
$$ -23516939 -18427662 -13263242 -8493815 -4236209 -603797 2091475 3535520 3714867
10654C714867r41376k267569m192512o329276p548433o991771m791994j733963
$$ 3714867 2773491 505922 -3686590 -10015866 -17564299 -24556070 -29348064 -31082027
10646c1082027J418722M105847N900468O605900O239748M763964K168737r25969
$$ -31082027 -29663305 -25557458 -19656990 -13051090 -6811342 -2047378 121359 -804610
10638h04610l173747l538363k335557r00898l35865q37500j968334l072605l542473
$$ -804610 -3978357 -7516720 -9852277 -10753175 -11089040 -11926540 -13894874 -16967479 -20509952
10629b0509952l230616k681224k545557k718436k473998j540708n72435l14273
$$ -20509952 -23740568 -26421792 -28967349 -31685785 -34159783 -35700491 -36272926 -36587199
10621c6587199o70467r03082m81454N95403K090938L685201M855102N070657M391613
$$ -36587199 -37257666 -38160748 -38642202 -38046799 -35955861 -32270660 -27415558 -22344901 -17953288
10612a7953288L659129L748588M576118N040554M057366J577237j398506l571613
$$ -17953288 -14294159 -10545571 -5969453 -928899 3128467 4705704 3307198 -264415
10604b64415m035102k625937r8342K132031K949546K456926J677368J290284J023795
$$ -264415 -4299517 -6925454 -7023796 -4891765 -1942219 514707 2192075 3482359 4506154
10595D506154L71893n99658j453221j926778j854136r12173R64697L034357M126902
$$ 4506154 4878047 4278389 2825168 898390 -955746 -1867919 -903222 2131135 6258037
10586F258037L640308J914844k47683k107213l205991l561551l669877l947413
$$ 6258037 9898345 11813189 11565506 9458293 6252302 2690751 -979126 -4926539
10578d926539m148331l671387k443848j129746m02719l44962o17736q50484p16089
$$ -4926539 -9074870 -12746257 -15190105 -16319851 -16722570 -17067532 -17685268 -18535752 -19251841
10569a9251841J7447J193233K147222K153216J084037l68225j152770o74672O85232
$$ -19251841 -19234394 -18041161 -15893939 -13740723 -12656686 -13024911 -14177681 -14852353 -14167121
10560a4167121J851860J934741Q71693o75473j856627k120853j540535p89783
$$ -14167121 -12315261 -10380520 -9508827 -10184300 -12040927 -14161780 -15702315 -16492098
10552a6492098n06906n62805l03701L99550Q80570P02263L50037M70057J001176
$$ -16492098 -16999004 -17561809 -17865510 -17465960 -16585390 -15883127 -15533090 -15063033 -14061857
10543a4061857J630825K505077L663690M222936L138331O90147j601678k469105
$$ -14061857 -12431032 -9925955 -6262265 -2039329 1099002 1789149 187471 -2281634
10535b281634j641232N43824L233466M915781M421325K379076P47724O09531J249947
$$ -2281634 -3922866 -3379042 -145576 4770205 9191530 11570606 12318330 12927861 14177808
10526A4177808J585186J466071J175975O78166M6450j33090M69526J269931J475578
$$ 14177808 15762994 17229065 18405040 19083206 19129656 18996566 19466092 20736023 22211601
10517B2211601J022042L31426m05899j211541j938692k349980k369298k083864
$$ 22211601 23233643 23565069 23159170 21947629 20008937 17658957 15289659 13205795
10509A3205795j781324j944092k683151l229945k659405j062043P56885K552284
$$ 13205795 11424471 9480379 6797228 3567283 907878 -154165 602720 3155004
10501C155004M572833O422580P402806Q024458R596078J2121881J4386272J6433093
$$ 3155004 7727837 14150417 21553223 29577681 39173759 51295640 65681912 82115005
10493H2115005J9934491K5743339L3561917M4172063N7520317O6301128N6799809
$$ 82115005 102049496 127792835 161354752 205526815 263047132 329348260 386148069
10486C86148069K2735372k3034308n6910033o5924529n6830114m4032356l4502869
$$ 386148069 408883441 385849133 328939100 263014571 206184457 162152101 127649232
10479A27649232k7060531k0535178j6378948j4812781j3588570j1185330q241491
$$ 127649232 100588701 80053523 63674575 48861794 35273224 24087894 15846403
10472A5846403n469230k587472K35200J917205K081593J699304J667606J897999
$$ 15846403 10377173 7789701 8024901 9942106 12023699 13723003 15390609 17288608
10464A7288608K059221K106553J838087R66500j09465n25593j85083L7713m83853
$$ 17288608 19347829 21454382 23292469 24258969 24149504 23623911 23438828 23476541 22992688
10455B2992688j451394k322700k927945l224011l085033k533986j737437q29812
$$ 22992688 21541294 19218594 16290649 13066638 9981605 7447619 5710182 4880370
10447D880370k41953q81532l078409n458125n925909l996988j283733N47540J409666
$$ 4880370 4638417 3756885 678476 -4779649 -10705558 -14702546 -15986279 -15438739 -14029073
10438a4029073K089983K872615L453121L518015K775412R28375j777484m352548
$$ -14029073 -11939090 -9066475 -5613354 -2095339 680073 1608448 -169036 -4521584
10430d521584n905336o344390n851144m179095j154873K421210N114503O097597
$$ -4521584 -10426920 -16771310 -22622454 -26801549 -27956422 -25535212 -20420709 -14323112
10422a4323112N570341M050512J880501m31400j973605k019178p59518P94882
$$ -14323112 -8752771 -4702259 -2821758 -3253158 -5226763 -7245941 -8005459 -7210577
10414g210577J662779J609776J156786J026142J532585K336230K688688K002039
$$ -7210577 -5547798 -3938022 -2781236 -1755094 -222509 2113721 4802409 6804448
10406F804448L40306j582286k939444l349572k886077j710845m1095J468983J783227
$$ 6804448 7144754 5562468 2623024 -726548 -3612625 -5323470 -5364565 -3895582 -2112355
10397b112355L81831k001923l922616m504729l922457k715712j122438P39618
$$ -2112355 -1730524 -3732447 -7655063 -12159792 -16082249 -18797961 -19920399 -19180781
10389a9180781K438971L390572L403221K834241K174838J604754R92964K64497
$$ -19180781 -16741810 -13351238 -9948017 -7113776 -4938938 -3334184 -2341220 -2076723
10381b076723l34876m17325J28390J034425K018986L076461M239452N184786N340911
$$ -2076723 -2411599 -2828924 -2700534 -1666109 352877 3429338 7668790 12853576 18194487
10372A8194487M435492K813236J190035J39073k80273n44789j303389k857162
$$ 18194487 22629979 25443215 26633250 26772323 26492050 25947261 24643872 21786710
10364B1786710m937680o931257q179998q121355o522660l841535j106324R14810
$$ 21786710 16849030 9917773 1737775 -6383580 -12906240 -16747775 -17854099 -16939289
10356a6939289K351141L801150N402387O617419O844634N934543M173353K093740
$$ -16939289 -14588148 -10786998 -5384611 1232808 8077442 14011985 18185338 20279078
10348B0279078L02354q23965j362862j604325j604729j163987k00816J017569
$$ 20279078 20581432 19757467 18394605 16790280 15185551 14021564 13820748 14838317
10340A4838317J925998J810951K08738k447837m755546n405392m346221k582094
$$ 14838317 16764315 18575266 18784004 16336167 11580621 6175229 1829008 -753086
10332g53086r64123L52500J398781K044839K332911K589270K925354L036338K727874
$$ -753086 -1717209 -1364709 34072 2078911 4411822 7001092 9926446 12962784 15690658
10323A5690658K261142J949159J775857J634369J568761J548009J396779J220738
$$ 15690658 17951800 19900959 21676816 23311185 24879946 26427955 27824734 29045472
10315B9045472J462914K134878K359249J199001j208440l740686n365035n766397
$$ 29045472 30508386 32643264 35002513 36201514 34993074 31252388 25887353 20120956
10307B0120956n115595l762862k247217j232073j207636k270159m079412n869093
$$ 20120956 15005361 11242499 8995282 7763209 6555573 4285414 206002 -5663091
10299e663091o654423n776703l376738k92251K474896M231688M849246M781636
$$ -5663091 -12317514 -18094217 -21470955 -21763206 -19288310 -15056622 -10207376 -5425740
10291e425740M659319M655032M414414L762782L135357K923954K682083J572641
$$ -5425740 -766421 3888611 8303025 12065807 15201164 18125118 20807201 22379842
10283B2379842m18790k284625l150078l124365k726587j926666l10503J904538
$$ 22379842 21961052 19676427 16526349 13401984 10675397 8748731 8438228 10342766
10275A0342766L558284L512474J741771p41601k944259m613517n888030o579507
$$ 10342766 13901050 17413524 19155295 18413694 15469435 10855918 4967888 -1611619
10267a611619o181120m580605k437780o77530K55614N49776O21224P19939Q11957
$$ -1611619 -7792739 -12373344 -14811124 -15488654 -15233040 -14683264 -14062040 -13342101 -12530144
10258a2530144O69709J01873q26607j832586k628564k920496k251234k83116K490523
$$ -12530144 -11860435 -11758562 -12585169 -14417755 -17046319 -19966815 -22218049 -22501165 -20010642
10249b0010642M625233M761888K797780j32006k650704l865163l411551j434512
$$ -20010642 -15385409 -10623521 -7825741 -7957747 -10608451 -14473614 -17885165 -19319677
10241a9319677J292594L616413M681482M346071L005590J277642j55496q19070
$$ -19319677 -18027083 -14410670 -9729188 -5383117 -2377527 -1099885 -1255381 -2074451
10233b074451q20744p38793r18972j049714o30507L28582J351727K117756K698984
$$ -2074451 -2895195 -3633988 -4552960 -5602674 -6233181 -5904599 -4552872 -2435116 263868
10224B63868L183272L407090L223004K775743K255347J509883K22092j481145
$$ 263868 3447140 6854230 10077234 12852977 15108324 16618207 16840299 15359154
10216A5359154k850746l125747k242744q31845M19692J293812J991635K677458
$$ 15359154 12508408 9382661 7139917 6308072 6727764 8021576 10013211 12690669
10208A2690669L094191K660174J075134j160210l054915m057794m392453m280652
$$ 12690669 15784860 18445034 19520168 18359958 15305043 11247249 6854796 2574144
10200B574144l285472j027258J634292K918368J882152o21113k941954m082842
$$ 2574144 -711328 -1738586 -104294 2814074 4696226 4075113 1133159 -2949683
10192b949683l909985k607097o20462J130481J715745J005895k59381j146492
$$ -2949683 -6859668 -9466765 -10087227 -8956746 -7241001 -6235106 -6494487 -7640979
10184g640979j060238O6535J574428K225040J216012q05633k233777k198104j380107
$$ -7640979 -8701217 -8634682 -7060254 -4835214 -3619202 -4424835 -6658612 -8856716 -10236823
10175a0236823r63860j197521j327583o70993O67045K074044L062058L484323
$$ -10236823 -11200683 -12398204 -13725787 -14396780 -13729735 -11655691 -8593633 -5109310
10167e109310L310384K468740J095663j41577l26158Q30434K529150L580232L511603
$$ -5109310 -1798926 669814 1765477 1623900 1297742 2128176 4657326 8237558 11749161
10158A1749161K774632J985838J316616N97428l62755j639132l042815m009840
$$ 11749161 14523793 16509631 17826247 18423675 18060920 16421788 13378973 9369133
10150I369133l947597k829333j206129M21834J898440K961709K942320J295758
$$ 9369133 5421536 2592203 1386074 1807908 3706348 6668057 9610377 10906135
10142A0906135j715923n109756p804318r023912q427765o290188l536774j280636
$$ 10906135 9190212 4080456 -3723862 -12747774 -21175539 -27465727 -31002501 -32283137
10134c2283137j73684j80226p79192j199671o54357J243458M099260O834029Q262560
$$ -32283137 -32456821 -32637047 -33416239 -34615910 -35270267 -34026809 -29927549 -23093520 -14830960
10125a4830960P735449N484027K490195j09059j656121k045457j315086M42201
$$ -14830960 -7095511 -1611484 878711 769652 -886469 -2931926 -4247012 -3804811
10117c804811K604168L894845L292235J103995j153773k018027j133990P28989
$$ -3804811 -1200643 2694202 5986437 7090432 5936659 3918632 2784642 3513631
10109C513631K329898K664349J504312m51951k085852k715456k488741j979828
$$ 3513631 5843529 8507878 10012190 9560239 7474387 4758931 2270190 290362
10101B90362j553668j179598p25377k87588j87933o16649j295017j647676j449278
$$ 290362 -1263306 -2442904 -3168281 -3455869 -3643802 -4260451 -5555468 -7203144 -8652422
10092h652422j181517j526943k538255l507808l637677k648843q25610J166391
$$ -8652422 -9833939 -11360882 -13899137 -17406945 -21044622 -23693465 -24519075 -23352684
10084b3352684K443941K334291R88396o24904j647686k146546k718039l405779
$$ -23352684 -20908743 -18574452 -17586056 -18210960 -19858646 -22005192 -24723231 -28129010
10076b8129010l448496k244846k51546J355891J821401J427046J065099J409116
$$ -28129010 -31577506 -33822352 -34073898 -32718007 -30896606 -29469560 -28404461 -26995345
10068b6995345K487690L812180M753880M908650M301581L290538K196350J012366
$$ -26995345 -24507655 -20695475 -15941595 -11032945 -6731364 -3440826 -1244476 -232110
10060b32110m64039k239490l988062n327131o076599o153002n380247l662000
$$ -232110 -696149 -2935639 -6923701 -12250832 -18327431 -24480433 -29860680 -33522680
10052c3522680j356139P36232J898832J991763J413857O83826J05105k79321n50802
$$ -33522680 -34878819 -34142587 -32243755 -30251992 -28838135 -28154309 -28049204 -28328525 -28879327
10043b8879327p59393q55823p48647l97675J75481R11300J664033K209610K494236
$$ -28879327 -29638720 -30494543 -31243190 -31640865 -31465384 -30554084 -28890051 -26680441 -24186205
10034b4186205K861713L758757N083576O075194O086435N288795M321715L387452
$$ -24186205 -21324492 -17565735 -12482159 -6406965 -320530 4968265 9289980 12677432
10026A2677432K104769K81271j590004k809027l172109k994753k668159k431342
$$ 12677432 14782201 15063472 13473468 10664441 7492332 4497579 1829420 -601922
10018f01922k378043k367621k009810j044643K44589J222849J531005J329951
$$ -601922 -2979965 -5347586 -7357396 -8402039 -8157450 -6934601 -5403596 -4073645
10010d073645R04823K59704p55388k011089k919633k756488j274862R04717K615625
$$ -4073645 -3168822 -2909118 -3664506 -5675595 -8595228 -11351716 -12626578 -11721861 -9106236
10001i106236L042322K336596J314603O61575N31373P13496Q93859Q16597M73405
$$ -9106236 -6063914 -3727318 -2412715 -1751140 -1219767 -506271 387588 1204185 1677590
9992A677590J30806l6705k55195q39494j714162k600642l503333m453534m856354
$$ 1677590 1808396 1771691 1516496 677002 -1037160 -3637802 -7141135 -11594669 -16451023
9983a6451023l877273j732082J15878M90692l25439j397665k443344l594270m396650
$$ -16451023 -20328296 -22060378 -21944500 -21453808 -21779247 -23176912 -25620256 -29214526 -33611176
9974c3611176m089623k777714j386545l57751P45483K082599K811721K042301
$$ -33611176 -37700799 -40478513 -41865058 -42222809 -41477326 -39394727 -36583006 -34540705
9966c4540705Q0k236011l774655m255486l544060j725782O13986K557461L492580
$$ -34540705 -34540625 -36776636 -40551291 -44806777 -48350837 -50076619 -49462633 -46905172 -43412592
9957d3412592L538797L400215L818503M958179O202815O726922O347694N584522
$$ -43412592 -39873795 -36473580 -32655077 -27696898 -21494083 -14767161 -8419467 -2834945
9949b834945M827858L838795K292418M44858j089996j972507k234880k058229
$$ -2834945 1992913 5831708 8124126 8568984 7478988 5506481 3271601 1213372
9941A213372j865032k310675l549130m616645m242105k410823n32848J97228R0756
$$ 1213372 -651660 -2962335 -6511465 -11128110 -15370215 -17781038 -18313886 -18116658 -18025902
9932a8025902K73840J186736K291998K948284K912540K068873M00900j511280
$$ -18025902 -17752062 -16565326 -14273328 -11325044 -8412504 -6343631 -5942731 -7454011
9924g454011k563263k214125j228756q28522j208882j400140o29299O91151J561095
$$ -7454011 -10017274 -12231399 -13460155 -14288677 -15497559 -16897699 -17526998 -16835847 -15274752
9915a5274752J573696J116156N88577j55545j503812l387332m973552n133550
$$ -15274752 -13701056 -12584900 -11996323 -12151868 -13655680 -17043012 -22016564 -27150114
9907b7150114l426283p07210J422036J864309O01154j827194m856227p787966
$$ -27150114 -30576397 -31283607 -29861571 -27997262 -27396108 -29223302 -34079529 -41867495
9899d1867495r848069j0788221j0768165r057351l788839N592580J5946533K2166013
$$ -41867495 -51715564 -62503785 -73271950 -82329301 -86118140 -80525560 -64579027 -42413014
9891d2413014K1845939J7205825J2031220Q003295M786375K306419J234312J591344
$$ -42413014 -20567075 -3361250 8669970 16673265 21459640 23766059 25000371 26591715
9883B6591715K372804K761821K761861K465527J562236p7111j871029k883347
$$ 26591715 28964519 31726340 34488201 36953728 38515964 38438853 36567824 33684477
9875C3684477k472718o88029J519155K588058J506170j180703l921976n677872
$$ 33684477 31211759 30523730 32042885 34630943 36137113 34956410 31034434 25356562
9867B5356562o401332o231433n131056l529552k434299k336381k529068k008893
$$ 25356562 18955230 12723797 7592741 4063189 1628890 -707491 -3236559 -5245452
9859e245452o46441R54772K300742L161535L264104K537802J589881J329289J975480
$$ -5245452 -5891893 -4937121 -2636379 525156 3789260 6327062 7916943 9246232 11221712
9850A1221712K775559K776680J629754l51101k557719m328062n028946m226215
$$ 11221712 13997271 16773951 18403705 18052604 15494885 11166823 6137877 1911662
9842A911662k002767P97704K791839K898855J238193q61957j912528j388607N9080
$$ 1911662 -91105 706599 3498438 6397293 7635486 6773529 4861001 3472394 3531474
9833C531474J255981J317210J47886j526503k651843k593325j543843k95537L16697
$$ 3531474 4787455 6104665 6252551 4726048 2074205 -519120 -2062963 -2358500 -2041803
9824b041803r7501j219830k178086k233439j434334m15758M09458J076455J446398
$$ -2041803 -2139304 -3359134 -5537220 -7770659 -9204993 -9620751 -9211293 -8134838 -6688440
9815f688440R42900o91945k761993m199542m524397l795278j963669R71747M180762
$$ -6688440 -5745540 -6437485 -9199478 -13399020 -17923417 -21718695 -23682364 -22710617 -18529855
9806a8529855O139769N951951M202323K255881R68083K44677m71550j582689l000749
$$ -18529855 -12390086 -6438135 -2235812 20069 988152 1232829 761279 -821410 -3822159
9797c822159m149605m410933l758635k824314k189871j834867j510714j386949
$$ -3822159 -7971764 -12382697 -16141332 -18965646 -21155517 -22990384 -24501098 -25888047
9789b5888047j872911k866612l655410l668518k936298j664489J80129K490767
$$ -25888047 -27760958 -30627570 -34282980 -37951498 -40887796 -42552285 -42372156 -39881389
9781c9881389M582369N689207N824898N664563N580068N315846M725298M218768
$$ -39881389 -35299020 -29609813 -23784915 -18120352 -12540284 -7224438 -2499140 1719628
9773A719628M092279L878149K921886J360437m1676r14649j559660k206037k612911
$$ 1719628 5811907 9690056 12611942 13972379 13930703 13016054 11456394 9250357 6637446
9764F637446k607900k482490k505170k437233j944185j229009q14790q02151p42518
$$ 6637446 4029546 1547056 -958114 -3395347 -5339532 -6568541 -7383331 -8185482 -8928000
9755h928000k67055M78695J133640J634587K231376K986468L388473K673974O93038
$$ -8928000 -9195055 -8716360 -7582720 -5948133 -3716757 -730289 2658184 5332158 6025196
9746F025196j657673l134885l290262k672610j950106j289216p43163o84682j306191
$$ 6025196 4367523 1232638 -2057624 -4730234 -6680340 -7969556 -8712719 -9397401 -10703592
9737a0703592j932638j434849N81293L331318N638287O880356P144270O788639
$$ -10703592 -12636230 -14071079 -13489786 -10158468 -4520181 2360175 9504445 16293084
9729A6293084O057638N001834L664515K357066J641739J818186K408684K380434
$$ 16293084 22350722 27352556 31017071 33374137 35015876 36834062 39242746 41623180
9721D1623180J045799j259650l395708m300761l778078k574605j704888j637488
$$ 41623180 42668979 41409329 38013621 33712860 29934782 27360177 25655289 24017801
9713B4017801k137064k804531l490107m065542m133192l353806j978205p10677
$$ 24017801 21880737 19076206 15586099 11520557 7387365 4033559 2055354 1344677
9705A344677j0517K53634M68891Q24018J204758J368159J213232R64609R68489
$$ 1344677 1334160 1587794 2056685 2880703 4085461 5453620 6666852 7631461 8599950
9696H599950J201741J253924J042768J161993J958358K521649J440960j274525
$$ 8599950 9801691 11055615 12098383 13260376 15218734 17740383 19181343 17906818
9688A7906818l779556m294592k881054r31838M85621J095069O97487r43181l308341
$$ 17906818 14127262 9832670 6951616 6019778 6505399 7600468 8297955 7354774 4046433
9679D046433m994361m897043l265288j276417J90202J035138J415060J260213
$$ 4046433 -947928 -5844971 -9110259 -10386676 -10196474 -9161336 -7746276 -6486063
9671f486063M97393n27137j155703r59910l4925J223192K446033L347036L676615
$$ -6486063 -5988670 -6515807 -7671510 -8631420 -8666345 -7443153 -4997120 -1650084 2026531
9662B026531L370667K720811K220136K188874K570659K964094K716458J182865
$$ 2026531 5397198 8118009 10338145 12527019 15097678 18061772 20778230 21961095
9654B1961095j718005n129351p707418q590518p826927n941828l445441q34300
$$ 21961095 20243090 15113739 7406321 -1184197 -9011124 -14952952 -18398393 -19232693
9646a9232693J362936K859033L689024L755863K574265j13409l572281o349203
$$ -19232693 -17869757 -15010724 -11321700 -7565837 -4991572 -5104981 -8677262 -15026465
9638a5026465p398575o732261n017918k881947o95151J269610K744724L539999
$$ -15026465 -22425040 -29157301 -34175219 -37057166 -37752317 -36482707 -33737983 -30197984
9630c0197984L680846L509081L533777L949088M279988L740117K066048j26686
$$ -30197984 -26517138 -23008057 -19474280 -15525192 -11245204 -7505087 -5439039 -5565725
9622e565725j895073k760234k905112k764877k576304k258643j613031o52758
$$ -5565725 -7460798 -10221032 -13126144 -15891021 -18467325 -20725968 -22338999 -22991757
9614b2991757K42127O16824M80056M23434J019563K136647L026039L083161K317834
$$ -22991757 -22749630 -22132806 -21652750 -21229316 -20209753 -18073106 -15047067 -11963906 -9646072
9605i646072J037166o21277k541408m175085m699099l802460k039793j90256J477893
$$ -9646072 -8608906 -9230183 -11771591 -15946676 -20645775 -24448235 -26488028 -26678284 -25200391
9596b5200391K999572M038924M013501K976923J856579J501329J802716K038823
$$ -25200391 -22200819 -18161895 -14148394 -11171471 -9314892 -7813563 -6010847 -3972024
9588c972024J777221J083466J50759p24623r28797O1903J891908L422676L864761
$$ -3972024 -2194803 -1111337 -960578 -1685201 -2613998 -2552095 -660187 2762489 6627250
9579F627250L473530K922151K392996J643738O41870l59619j242352k036672k516303
$$ 6627250 10100780 13022931 15415927 17059665 17701535 17341916 16099564 14062892 11546589
9570A1546589k226326j057549N21421J948032L008577L650689L661904K839575
$$ 11546589 9320263 8262714 8784135 10732167 13740744 17391433 21053337 23892912
9562B3892912J343026l99944k081879l589198m749271n279218n042680m171831
$$ 23892912 25235938 24835994 22754115 19164917 14415646 9136428 4093748 -78083
9554g8083k905466j519864m76021l28280j179978k304392k615970j674952j55650
$$ -78083 -2983549 -4503413 -4979434 -5307714 -6487692 -8792084 -11408054 -13083006 -13238656
9545a3238656P64589M82455n47922j332894j279413o21549J1205K94478L61393
$$ -13238656 -12474067 -11991612 -12539534 -13872428 -15151841 -15773390 -15762185 -15467707 -15106314
9536a5106314L69568K10630k31683p61029j026750q76245l39210N84007J777415
$$ -15106314 -14736746 -14526116 -14757799 -15518828 -16545578 -17421823 -17761033 -17177026 -15399611
9527a5399611K710699K732795J845978Q65536N50491P83401Q59462L96947l48769
$$ -15399611 -12688912 -9956117 -8110139 -7244603 -6694112 -5910711 -5051249 -4654302 -5003071
9518e003071r53979j248672j268760j112898r42457q75291p50325j86741R67552
$$ -5003071 -5957050 -7205722 -8474482 -9587380 -10529837 -11405128 -12155453 -12342194 -11374642
9509a1374642K351339L369651L692184L423397K901269K433799K144584J929833
$$ -11374642 -9023303 -5653652 -1961468 1461929 4363198 6796997 8941581 10871414
9501A0871414J527605O43482r62189l347487o101629q175208q337116o144209
$$ 10871414 12399019 13042501 12080312 8732825 2631196 -5544012 -13881128 -20025337
9493b0025337k501565Q46768K436201J857257j62345k140221k558545q21951K152445
$$ -20025337 -22526902 -21680134 -19243933 -17386676 -17549021 -19689242 -22247787 -23069738 -20917293
9484b0917293M445352M538942K420037n30746k602487k837026j466454M15685
$$ -20917293 -16471941 -11932999 -9512962 -10043708 -12646195 -15483221 -16949675 -16533990
9476a6533990J678366J910524J555528J396483J928089L072128M236421M610567
$$ -16533990 -14855624 -12945100 -11389572 -9993089 -8065000 -4992872 -756451 3854116
9468C854116L709408J895484K65345k27276M24892J398129J813070J259891k15769
$$ 3854116 7563524 9459008 9724353 9497077 9921969 11320098 13133168 14393059 14177290
9459A4177290k245506m213049n505271n842045n263178l875733j912094N754J144836
$$ 14177290 11931784 7718735 2213464 -3628581 -8891759 -12767492 -14679586 -14673832 -13528996
9450a3528996J420845J494750J830308K037549J557567O33637k2135l63192j083529
$$ -13528996 -12108151 -10613401 -8783093 -6745544 -5187977 -4554340 -4576475 -4939667 -6023196
9441f023196k453180l729904m013221l156647j497259P73182L390772N521852
$$ -6023196 -8476376 -12206280 -16219501 -19376148 -20873407 -20100225 -16709453 -11187601
9433a1187601O195425N237851L294155R71995j465271l517893m322574l623294
$$ -11187601 -4992176 245675 3539830 4511825 3046554 -471339 -4793913 -8417207
9425h417207k457097k219826l066101l705148k877281o61717J835821L725802
$$ -8417207 -10874304 -13094130 -16160231 -19865379 -22742660 -23404377 -21568556 -17842754
9417a7842754M897683N518035N478831M574358K971129J170712m83993k026559
$$ -17842754 -12945071 -7427036 -1948205 2626153 5597282 6767994 6284001 4257442
9409D257442l539483m828057n570646n656983n193953m252473k834368j122484
$$ 4257442 717959 -4110098 -9680744 -15337727 -20531680 -24784153 -27618521 -28741005
9401b8741005M36928J439001J827845J793059J435258P16555k15551q52312p17171
$$ -28741005 -28304077 -26865076 -25037231 -23244172 -21808914 -21092359 -21307910 -22160222 -22877393
9392b2877393M3244O77885N86720q2950p60187j174775j399321j267781l43072
$$ -22877393 -22834149 -22156264 -21569544 -21652494 -22412681 -23587456 -24986777 -26254558 -26597630
9383b6597630J257981K504541K473264J508417P76857P58641Q72993P22637Q95055
$$ -26597630 -25339649 -22835108 -20361844 -18853427 -18076570 -17317929 -16444936 -15722299 -14827244
9374a4827244J948048L161142L173996J766745J76419n58436q32084j576757k693318
$$ -14827244 -12879196 -9718054 -6544058 -4777313 -4600894 -5159330 -5991414 -7568171 -10261489
9365a0261489l123336k314686q56087M84787J668269K900939L746704L413045
$$ -10261489 -13384825 -15699511 -16555598 -16070811 -14402542 -11501603 -7754899 -4341854
9357d341854J866043R5664q78651q94592m25316R5694M32819L83025n3622m03510
$$ -4341854 -2475811 -2380147 -3258798 -4153390 -4578706 -4483012 -4050193 -3667168 -3720790 -4124300
9347d124300o7542R15639J733143J627958P30571j33710m34159n40569j219231
$$ -4124300 -4191842 -3276203 -1543060 84898 815469 681759 247600 -292969 -1512200
9338a512200k588504l786120l824984k659005j151013l4299P10688J320583J556994
$$ -1512200 -4100704 -7886824 -11711808 -14370813 -15521826 -15556125 -14845437 -13524854 -11967860
9329a1967860J019734n3776q65881j023505j002382j441056k235655k556975j657777
$$ -11967860 -10948126 -11001902 -11867783 -12891288 -13893670 -15334726 -17570381 -20127356 -21785133
9320b1785133M16857K754149M118570L774354J979734k95630k098718k899743
$$ -21785133 -21368276 -18614127 -14495557 -10721203 -8741469 -9037099 -11135817 -14035560
9312a4035560k539953j229528L41083J307825J323977P96738L72266M41410J158847
$$ -14035560 -16575513 -17805041 -17463958 -16156133 -14832156 -14035418 -13663152 -13221742 -12062895
9303a2062895K431117L583944L519483J789762o18649k039322j659174l1435J745242
$$ -12062895 -9631778 -6047834 -2528351 -738589 -1357238 -3396560 -5055734 -5087169 -3341927
9294c341927K904444L166248K596392J536279L82035p09066j700214k293889k042892
$$ -3341927 -437483 2728765 5325157 6861436 7243471 6534405 4834191 2540302 497410
9285D97410r53785L65506J355197K031735K658389L133632L015766K104886Q04152
$$ 497410 -456375 -90869 1264328 3296063 5954452 9088084 12103850 14208736 15012888
9276A5012888j18802j06203P52342J803403K438997K611194K584801K243378J015629
$$ 15012888 14894086 14787883 15540225 17343628 19782625 22393819 24978620 27221998 28237627
9267B8237627j307963l935256n533741n290962l441004r46953J141969K214755
$$ 28237627 26929664 22994408 17460667 12169705 8728701 7781748 8923717 11138472
9259A1138472K336663K036083J729321J361036O64688l74163j494559k479813
$$ 11138472 13475135 15511218 17240539 18601575 19266263 18892100 17397541 14917728
9251A4917728l242306l603920l252558k049974k98853J373878K415745K710014
$$ 14917728 11675422 8071502 4818944 2768970 2470117 3843995 6259740 8969754
9243H969754K612306K538018K410806J659511k2067k017479l241268l339654l117288
$$ 8969754 11582060 14120078 16530884 18190395 18168328 16150849 12909581 9569927 6452639
9234F452639l523170m437179m846060m194389l133719k695127k998300l162729
$$ 6452639 2929469 -1507710 -6353770 -10548159 -13681878 -16377005 -19375305 -22538034
9226b2538034k415247q64514R07152K571371M042377N049219N217088M538418
$$ -22538034 -24953281 -25817795 -24910643 -22339272 -18296895 -13247676 -8030588 -3492170
9218c492170L366097J932694K92705j167623j628118n90066J425002L130447L345394
$$ -3492170 -126073 1806621 2099326 931703 -696415 -1286481 138521 3268968 6614362
9209F614362J681580j179879l666553m212183k507755J69129K102318K499423
$$ 6614362 8295942 7116063 3449510 -762673 -3270428 -3101299 -998981 1500442
9201A500442J623441M4646j710375l012342l328836k742656j922677j491748j644835
$$ 1500442 3123883 3168529 1458154 -1554188 -4883024 -7625680 -9548357 -11040105 -12684940
9192a2684940k266062k998103l222600k450057q49564R40936K531263L888092
$$ -12684940 -14951002 -17949105 -21171705 -23621762 -24471326 -23530390 -20999127 -17111035
9184a7111035M767418M683242L675527K535260J879147J428853N98490n97309
$$ -17111035 -12343617 -7660375 -3984848 -1449588 429559 1858412 2456902 1859593
9176A859593j669225k354849k706134k736868k499766k318776k387740k243174
$$ 1859593 190368 -2164481 -4870615 -7607483 -10107249 -12426025 -14813765 -17056939
9168a7056939j220524N38487K056946K576052K148233J113401l61030j832699
$$ -17056939 -18277463 -17738976 -15682030 -13105978 -10957745 -9844344 -10205374 -12038073
9160a2038073k216149o07876K473043N153486N811295M529667K817653J921468
$$ -12038073 -14254222 -14862098 -12389055 -7235569 -1424274 3105393 5923046 7844514
9152G844514J568535M83952j970994m938141o864201o836271m960219j871515
$$ 7844514 9413049 9897001 7926007 2987866 -3876335 -10712606 -15672825 -17544340
9144a7544340J543173M094109M734394L446312J343648m26821j684000k918394
$$ -17544340 -16001167 -11907058 -7172664 -3726352 -2382704 -2809525 -4493525 -7411919
9136g411919m309179n419522n759562n284131m265166k882512j055886J337018
$$ -7411919 -11721098 -17140620 -22900182 -28184313 -32449479 -35331991 -36387877 -35050859
9128c5050859M065104O402948P546932P227844N757738L478372N26349k652103
$$ -35050859 -30985755 -24582807 -17035875 -9808031 -4050293 -571921 -45572 -2697675
9120b697675m957791n342259l815347j377483J008625K979517M341444M681903
$$ -2697675 -7655466 -12997725 -16813072 -18190555 -17181930 -14202413 -9860969 -5179066
9112e179066L776928K083065M27171p15554j389284j720025j633590j066451k48799
$$ -5179066 -1402138 680927 1108098 392544 -996740 -2716765 -4350355 -5416806 -5665605
9103e665605L54583L80309j19118o43708o16372P9989R55288J398015J277085
$$ -5665605 -5311022 -4930713 -5049831 -5693539 -6309911 -6229922 -5274634 -3876619 -2599534
9094b599534R81091R40328J243991J654770J812126J446065N87877m19748j299159
$$ -2599534 -1618443 -678115 565876 2220646 4032772 5478837 6066714 5646966 4347807
9085D347807k196901l405544m714039n412361n146766m437202l989276l702418
$$ 4347807 2150906 -1254638 -5968677 -11381038 -16527804 -20965006 -24954282 -28656700
9077b8656700k807697r62471J211872K803749L535921L902200M613212N977285
$$ -28656700 -31464397 -32426868 -31214996 -28411247 -24875326 -20973126 -16359914 -10382629
9069a0382629P538623Q188391O965952M078512R86908q09916j031468n01186J7799
$$ -10382629 -2844006 5344385 12310337 16388849 17375757 16565841 15534373 15033187 15050986
9060A5050986M85219J110098J691461J762027J234454N78024K74160K73505J44508
$$ 15050986 15536205 16646303 18337764 20099791 21334245 21912269 22186429 22459934 22604442
9051B2604442l13139q28262j111054j293974j602205j691017q19964J069199K841225
$$ 22604442 22291303 21463041 20351987 19058013 17455808 15764791 14944827 16014026 18855251
9042A8855251L202772K129744Q23245K36636P2752o14520k192469m078103n332616
$$ 18855251 22058023 24187767 25011012 25247648 25320400 24705880 22513411 18435308 13102692
9033A3102692n331281m046023k090628n05579p9892n97044r25238j86129J130299
$$ 13102692 7771411 3725388 1634760 1129181 1049289 452245 -472993 -659122 471177
9024D71177J476440j56787l075706n476065o100620n129815l584226k264704j382723
$$ 471177 1947617 1790830 -1284876 -6760941 -12861561 -17991376 -21575602 -23840306 -25223029
9015b5223029q13297l34322K36480Q19740J041485O78159R2796k3347O60147J890185
$$ -25223029 -26036326 -26370648 -26134168 -25314428 -24272943 -23594784 -23501988 -23525335 -22865188 -20975003
9005b0975003L257779M583483N835586O888273P446728P104575N533597K856528
$$ -20975003 -17717224 -13133741 -7298155 -409882 7036846 14141421 19675018 22531546
8997B2531546j48170k462890l571510l683869l256437k519194j518246l82365
$$ 22531546 22383376 19920486 16348976 12665107 9408670 6889476 5371230 4988865
8989D988865O07586J139339J049542N05815l5714k61404l86200r00405j930776
$$ 4988865 5596451 6735790 7785332 8291147 8255433 7994029 7607829 6707424 4776648
8980D776648l066643l798775l876352l264109k101007p85350K02841O74755P08739
$$ 4776648 1710005 -2088770 -5965122 -9229231 -11330238 -12115588 -11912747 -11237992 -10529253
8971a0529253K85778o60420j763213k234713j576047j522J896129L473111L966795
$$ -10529253 -10243475 -10903895 -12667108 -14901821 -16477868 -16479390 -14583261 -11110150 -7143355
8962g143355K780251K70028k214997l562242l844800l691742l209970k143172
$$ -7143355 -4363104 -4093076 -6308073 -9870315 -13715115 -17406857 -20616827 -22759999
8954b2759999p39396L04389O87807O77926M78136L0879n08836o70041j86636P83675
$$ -22759999 -23499395 -23195006 -22507199 -21829273 -21351137 -21320258 -21829094 -22499135 -22685771 -21902096
8944b1902096K021799L390333M527362M863590M176105K849795J453618K90948
$$ -21902096 -19880297 -16489964 -11962602 -7099012 -2922907 -73112 1380506 1671454
8936A671454n98448j302002j961095k531441k587206j739263l55167N17872J83610
$$ 1671454 1073006 -228996 -2190091 -4721532 -7308738 -9048001 -9403168 -8885296 -8701686
8927h701686r46972j756626j408507P9647J947146L252863L556296L184621K748876
$$ -8701686 -9648658 -11405284 -12813791 -12734144 -10786998 -7534135 -3977839 -793218 1955658
8918A955658K468577K168489J779780J427882J023783J90787j270655l106384
$$ 1955658 4424235 6592724 8372504 9800386 10824169 11014956 9744301 6637917
8910F637917m798699n733020n290061l333115p47109R83157J006230k85570j842149
$$ 6637917 1839218 -3893802 -9183863 -12516978 -13264087 -12280930 -11274700 -11560270 -13402419
8901a3402419k731821k378457p15437J571544L406899M236182M266850L731116
$$ -13402419 -16134240 -18512697 -19228134 -17656590 -14249691 -10013509 -5746659 -2015543
8893b015543K497624O92441q81334j407521p91644N30372K028682L047943L003926
$$ -2015543 482081 1174522 293188 -1114333 -1905977 -1375605 653077 3701020 6704946
8884F704946K127755J423948J284478P45000j089197l394811m418035l676504
$$ 6704946 8832701 10256649 11541127 12286127 11196930 7802119 3384084 -292420
8876b92420k370681j646892j446314j235658r45135p89841q47591j206097j961432
$$ -292420 -2663101 -4309993 -5756307 -6991965 -7937100 -8726941 -9574532 -10780629 -12742061
8867a2742061k686497k432463p69820J460457K844191K692175J450428J10203
$$ -12742061 -15428558 -17861021 -18630841 -17170384 -14326193 -11634018 -10183590 -10073387
8859a0073387n20999k34110N23971J065138J117048R85726R94265R84689N59340
$$ -10073387 -10594386 -10828496 -10304525 -9239387 -8122339 -7136613 -6142348 -5157659 -4598319
8850d598319l45671j322582j850265j684877r91259j76548M71361R89491J483563
$$ -4598319 -4943990 -6266572 -8116837 -9801714 -10792973 -10969521 -10498160 -9508669 -8025106
8841h025106J723110J219064k38827k266981m110075n046796m701163l274710
$$ -8025106 -6301996 -5082932 -5321759 -7588740 -11698815 -16745611 -21446774 -24721484
8833b4721484j481624N0241J368366K917515M652473N778361N511736L836317
$$ -24721484 -26203108 -26152867 -24784501 -21866986 -17214513 -11436152 -5924416 -2088099
8825b088099J407012r85740k696800l288611k641070j001438J099581K898696
$$ -2088099 -681087 -1666827 -4363627 -7652238 -10293308 -11294746 -10195165 -7296469
8817g296469L555775K719703J042981k66973o10083m16553l09570l08531j71713
$$ -7296469 -3740694 -1020991 21990 -244983 -855066 -1271619 -1581189 -1889720 -2061433
8808b061433j15685o74156j954245l426353m448354m767404m554701m133935l621424
$$ -2061433 -2177118 -2851274 -4805519 -8231872 -12680226 -17447630 -22002331 -26136266 -29757690
8799b9757690k729671j076678J190141L289457M494446M709078M203490L140386
$$ -29757690 -32487361 -33564039 -32373898 -29084441 -24589995 -19880917 -15677427 -12537041
8791a2537041J756577P50241Q98884K196317L734740M586217M595057M232085
$$ -12537041 -10780464 -10030223 -9131339 -6935022 -3200282 1385935 5980992 10213077
8783A0213077L884708L443708K531725J054613n23639j520122j625293j045453
$$ 10213077 14097785 17541493 20073218 21127831 20604192 19084070 17458777 16413324
8775A6413324j46066P24818J040830K53857j442341k798341k479677l74843K299159
$$ 16413324 16267258 16992076 18032906 18286763 16844422 14046081 11566404 11191561 13490720
8766A3490720M068682M150390K657001M55769j188562j412090m84162M64481N23093
$$ 13490720 17559402 21709792 24366793 24822562 23634000 22221910 21737748 22202229 22725322
8757B2725322l82849j838320l411268m656355n137501m818171m203941l786698
$$ 22725322 22342473 20504153 17092885 12436530 7299029 2480858 -1723083 -5509781
8749e509781l472258k802536j647195m41987K35089J73482l45622q03465q52946
$$ -5509781 -8982039 -11784575 -13431770 -13873757 -13638668 -13465186 -13810808 -14614273 -15467219
8740a5467219o05163n46938j134454k421076l984225n114114n158058l915240
$$ -15467219 -16072382 -16619320 -17753774 -20174850 -24159075 -29273189 -34431247 -38346487
8732c8346487j788325N52669K675502M452600N708989O113861N537804M273864
$$ -38346487 -40134812 -39582143 -36906641 -32454041 -26745052 -20631191 -15093387 -10819523
8724a0819523K733524J116747m41955j623419k114058j939630j331404l48682
$$ -10819523 -8085999 -6969252 -7411207 -9034626 -11148684 -13088314 -14419718 -14768400
8716a4768400J016989K359030K904212K299235J106859K10931j71694n85458j449357
$$ -14768400 -13751411 -11392381 -8488169 -6188934 -5082075 -4871144 -5042838 -5628296 -7077653
8707g077653k389369k622185j829723m49856Q27979J642010K003677J964728J450221
$$ -7077653 -9467022 -12089207 -13918930 -14368786 -13540807 -11898797 -9895120 -7930392 -6480171
8698f480171M87581m87336p50914R1710J614115K880738L317647L068446K387145
$$ -6480171 -5992590 -6479926 -7230840 -7139130 -5525015 -2644277 673370 3741816 6128961
8689F128961J051779j163447l596728m919732m475592k959337j480285l51273
$$ 6128961 7180740 6017293 2420565 -2499167 -6974759 -9934096 -11414381 -11765654
8681a1765654P68111J871173K433107K283590K067491K515948L541486M356899
$$ -11765654 -10997543 -9126370 -6693263 -4409673 -2342182 173766 3715252 8072151
8673H072151M356453L611655K535657J352552R8274r58502j244259n11889N69498
$$ 8072151 12428604 16040259 18575916 19928468 20026742 19068240 17823981 17312092 17881590
8664A7881590Q76442O0954r94278j228367o51561j68084l66518j039821j894397
$$ 17881590 18758032 18818986 17824708 16596341 15944780 15776696 15410178 14370357 12475960
8655A2475960l069482m577723n667439n334698l472646j142305M07198P94359
$$ 12475960 9406478 4828755 -838684 -6173382 -9646028 -10788333 -10381135 -9586776
8647i586776N34641K49553N0861l59366j212880k418690l659800m569619m855692
$$ -9586776 -9052135 -8802582 -8751721 -9111087 -10323967 -12742657 -16402457 -20972076 -25827768
8638b5827768m466567l677206k783413j619370L38972L140400N824620P059617
$$ -25827768 -30294335 -33971541 -36754954 -38374324 -38035352 -34894952 -29070332 -22010715
8630b2010715O305609M193638J919598N14730M53142J413172K355808K306536
$$ -22010715 -15705106 -11511468 -9591870 -9077140 -8623998 -7210826 -4855018 -2548482
8622b548482J278988J65132l58529m36846m16796j13679Q63292K280556L255553
$$ -2548482 -1269494 -1104362 -1462891 -1899737 -2316533 -2430212 -1566920 713636 3969189
8613C969189L123301K089127R74453M65403O41582J115480J500308J646933J451076
$$ 3969189 7092490 9181617 10156070 10621473 11263055 12378535 13878843 15525776 16976852
8604A6976852P06301n57741j723205k003740j317919m22723p0765l50571r48703
$$ 16976852 17683153 17125412 15402207 13398467 12080548 11657825 11587060 11236489 10287786
8595A0287786j611566k053663j794222n61877J220828K622890K783077J237304
$$ 10287786 8676220 6622557 4828335 4266458 5487286 8110176 10893253 12130557
8587A2130557j871361n452793p656478p132821m338076j286497J42056m25630
$$ 12130557 10259196 4806403 -2850075 -9982896 -14320972 -15607469 -15465413 -15891043
8579a5891043j966114l127500l168645k252993j114427m08293k81211m39461m14982
$$ -15891043 -17857157 -20984657 -24153302 -26406295 -27520722 -27929015 -28210226 -28649687 -29064669
8570b9064669K45187J648817L143825L608726K645318J282607R67575J948404
$$ -29064669 -28819482 -27170665 -24026840 -20418114 -17772796 -16490189 -15522614 -13574210
8562a3574210L195035L872209M223590M789763N331130M967210L158737K88682
$$ -13574210 -10379175 -6506966 -2283376 2506387 7837517 12804727 15963464 16252146
8554A6252146k570774m349368m677500m046089l121006j941392j41369K056515
$$ 16252146 13681372 9332004 4654504 608415 -2512591 -4453983 -4595352 -2538837
8546b538837L612210L662998K344158M37576j293341k145145j506825M57534K455370
$$ -2538837 1073373 4736371 7080529 7518105 6224764 4079619 2572794 3030328 5485698
8537E485698L093423K245359R54528J19878j84661j97476O277K73951K20968l12599
$$ 5485698 8579121 10824480 11779008 11898886 11714225 11516749 11523026 11796977 12017945 11705346
8527A1705346r47634j207117j088537r83974j190544j680282k209930k479701
$$ 11705346 10757712 9550595 8462058 7478084 6287540 4607258 2397328 -82373
8519h2373k287703j696458j019431n72700m75720o61110r16908r25280n21357
$$ -82373 -2370076 -4066534 -5085965 -5658665 -6134385 -6795495 -7712403 -8637683 -9159040
8510i159040k6899o7673q30135j679109j809172j206136o46563o88665r57489
$$ -9159040 -9185939 -9253612 -10083747 -11762856 -13572028 -14778164 -15424727 -16113392 -17070881
8501a7070881o41806M56739J653666K180078J990977J584724J164141L09961j395180
$$ -17070881 -17712687 -17255948 -15602282 -13422204 -11431227 -9846503 -8682362 -8372401 -9767581
8492i767581l631969n439449n979280n096699l284215j348120m7665K85782l7834
$$ -9767581 -13399550 -18838999 -24818279 -29914978 -33199193 -34547313 -34594978 -34309196 -34347030
8483c4347030l42899j77823M12109J134177J731779J963671J591289O39490m51513
$$ -34347030 -34689929 -34867752 -34455643 -33321466 -31589687 -29626016 -28034727 -27395237 -27846750
8474b7846750j171830j393344j275475p81312L89368K222129L947059M472276
$$ -27846750 -29018580 -30411924 -31687399 -32468711 -32079343 -29857214 -25910155 -21437879
8466b1437879L330031J085972j206702k811307l515478l315863k302989r20595
$$ -21437879 -18107848 -17021876 -18228578 -21039885 -24555363 -27871226 -30174215 -31094810
8458c1094810M3853N7622o84374j625196k544220l562286m531866m867882m121679
$$ -31094810 -31050957 -30993335 -31677709 -33302905 -35847125 -39409411 -43941277 -48809159 -52930838
8449e2930838k394082l6217K698662N452847P550377Q394041P951717O559385
$$ -52930838 -55324920 -55361137 -52662475 -47209628 -39659251 -31265210 -23313493 -16754108
8441a6754108M443348J849258m98958j650619j312573j16082J147152K188699
$$ -16754108 -12310760 -10461502 -10960460 -12611079 -13923652 -14039734 -12892582 -10703883
8433a0703883K924379K952153J860487N16j501215j717731p81131L51210R37456
$$ -10703883 -7779504 -4827351 -2966864 -2966348 -4467563 -6185294 -6966425 -6615215 -5677759
8424e677759J156928J712509K758885L450568K844680J202986n3200N3767Q49870
$$ -5677759 -4520831 -2808322 -49437 3401131 6245811 7448797 7395597 7449364 8299234
8415H299234Q61486k97219j462236j402908j69467J352399K686679L921026M848209
$$ 8299234 9160720 8863501 7401265 5998357 5828890 7181289 9867968 13788994 18637203
8406A8637203M770931L449699J716540O67661M39049J64178r51893k860642m901296
$$ 18637203 23408134 26857833 28574373 29242034 29681083 29845261 28893368 26032726 21131430
8397B1131430o388636o876374o225917m726319l012613j603788n12329N65897
$$ 21131430 14742794 7866420 1640503 -3085816 -6098429 -7702217 -8214546 -7648649
8389g648649J685633K370226J933259J41442k328080m126481m179356k562657
$$ -7648649 -5963016 -3592790 -1659531 -1518089 -3846169 -7972650 -12152006 -14714663
8381a4714663l43829J513784K909907M187291N281755N681151N153992M132512
$$ -14714663 -15058492 -13544708 -10634801 -6447510 -1165755 4515396 9669388 13801900
8373A3801900L254427K739649K314854J588304M08193j017532k241718k849826
$$ 13801900 17056327 19795976 22110830 23699134 24107327 23089795 20848077 17998251
8365A7998251k666330j759263m05654Q71066J461374J135827K50067p51563j875832
$$ 17998251 15331921 13572658 13167004 14038070 15499444 16635271 16885338 16133775 14257943
8356A4257943l262256m458418m568729l263182j187720Q23552K504168L843451
$$ 14257943 10995687 6537269 1968540 -1294642 -2482362 -1658810 845358 4688809
8348D688809M475645L910478K226530J15666j715391k896491l278222k882297
$$ 4688809 9164454 13074932 15301462 15417128 13701737 10805246 7527024 4644727
8340D644727k048199j370646j348527k075243l107859l537044k504673p1203K502065
$$ 4644727 2596528 1225882 -122645 -2197888 -5305747 -8842791 -11347464 -11418667 -8916602
8331h916602L729342L253964K048163J332855J569747K438301L367124L910257
$$ -8916602 -5187260 -1933296 114867 1447722 3017469 5455770 8822894 12733151
8323A2733151L865489L249765K135328N57346j242165k565720k624767j306973
$$ 12733151 16598640 19848405 21983733 22541079 21298914 18733194 16108427 14801454
8315A4801454O23528K201252K961649K926811K196552Q24034r74469k689374l699458
$$ 14801454 15424982 17626234 20587883 23514694 25711246 26535280 25560811 22871437 19171979
8306A9171979l679301k933291k245005k185975k561194k693627k199248j244649
$$ 19171979 15492678 12559387 10314382 8128407 5567213 2873586 674338 -570311
8298e70311j00693J189165K604053L930844M893411N230457M568507K636874j07395
$$ -570311 -671004 518161 3122214 7053058 11946469 17176926 21745433 24382307 24274912
8289B4274912k412806l224660k642892j615670q49986l68625J3277K77712L65278
$$ 24274912 21862106 18637446 15994554 14378884 13528898 13160273 13173550 13451262 13816540
8280A3816540L58654L05727J13292j78760k21399K72233J056466J528278J412341
$$ 13816540 14175194 14480921 14594213 14415453 14194054 14466287 15522753 17051031 18463372
8271A8463372J025811P15145K50540q89012k659139m265777n027068n121946n181930
$$ 18463372 19489183 20204328 20454868 19565856 16906717 12640940 7613872 2491926 -2690004
8262b690004n380453n367397m992931m526426m004920k875490o87192K082013
$$ -2690004 -8070457 -13437854 -18430785 -22957211 -26962131 -29837621 -30524813 -28442800
8254b8442800M241768M895615M098365K678928J601413J339386J613862J756428
$$ -28442800 -24201032 -19305417 -15207052 -12528124 -10926711 -9587325 -7973463 -6217035
8246f217035J441539R82320Q32653R74489R50809L60490q21687k245899l337591
$$ -6217035 -4775496 -3793176 -2960523 -1986034 -1035225 -674735 -1496422 -3742321 -7079912
8237g079912l630647l172541k467414j839162j048537K09469J640497K561566
$$ -7079912 -10710559 -13883100 -16350514 -18189676 -19238213 -19028744 -17388247 -14826681
8229a4826681K704504K456102K306490K391621K621564K919865L170102L146327
$$ -14826681 -12122177 -9666075 -7359585 -4967964 -2346400 573465 3743567 6889894
8221F889894K694107J907052J025880K27965m10062p98230p97164l78842J82961
$$ 6889894 9584001 11491053 12516933 12744898 12334836 11536606 10739442 10360600 10543561
8212A0543561M35276K19205r0326r3895n3690o35168j844247k712168k396204
$$ 10543561 10978837 11198042 11107716 11013821 10960131 10324963 8480716 5768548 3372344
8203C372344j227812k10370K59074O18866J204713J665258J460749N97289k82053
$$ 3372344 2144532 1934162 2193236 2812102 4016815 5682073 7142822 7740111 7458058
8194G458058l95893N11510J783991K275177J471236O6818q96015j231172j466080
$$ 7458058 7062165 7573675 9357666 11632843 13104079 13170897 12274882 11043710 9577630
8185I577630j736145j590066r53139m82399o02252q02635l74743N85459J387447
$$ 9577630 7841485 6251419 5298280 4815881 4213629 3410994 3036251 3621710 5009157
8176E009157J627175J362055O59526m39525j515766j833694j023781N05896J980663
$$ 5009157 6636332 7998387 8657913 8218388 6702622 4868928 3845147 4351043 6331706
8167F331706K972273L584085L952902L729914K306557l26466l165347m916759
$$ 6331706 9303979 12888064 16840966 20570880 22877437 22550971 19385624 14468865
8159A4468865n042186l866958j931276K30981J805513J993791R34323j92366l57776
$$ 14468865 9426679 5559721 3628445 3859426 5664939 7658730 8593053 8400687 8042911
8150H042911L67819J293789K010748K390698K174804J194769k19742j600375k931029
$$ 8042911 8410730 9704519 11715267 14105965 16280769 17475538 17255796 15655421 12724392
8141A2724392m358808n501529n696855m961928m114279l778836l720087l314574
$$ 12724392 8365584 2864055 -2832800 -7794728 -11909007 -15687843 -19407930 -22722504
8133b2722504k285890p99076P88642K024808K531343K403191K261544K592273
$$ -22722504 -25008394 -25807470 -25018828 -22994020 -20462677 -18059486 -15797942 -13205669
8125a3205669L079364K861114J515734l55072j621693j656441p96287J77633Q43743
$$ -13205669 -10126305 -7265191 -5749457 -6104529 -7726222 -9382663 -10178950 -10001317 -9157574
8116i157574J308582J755801K168676K545786L051806L728983M253576M206859
$$ -9157574 -7848992 -6093191 -3924515 -1378729 1673077 5402060 9655636 13862495
8108A3862495L490727K352714J169646L32058Q7601K64930L74894K48751L32802
$$ 13862495 17353222 19705936 20875582 21207640 21295241 21560171 21935065 22183816 22516618
8099B2516618R86757J687062J407368k12157k459499m349334n497966o141849
$$ 22516618 23503375 25190437 26597805 26385648 23926149 19576815 14078849 7937000
8091G937000o571884o674159n935174l968182j167252J364282K815563L386092
$$ 7937000 1365116 -5309043 -11244217 -15212399 -16379651 -15015369 -12199806 -8813714
8083h813714L627253L346640J865748o09915k632448k917086j678348k14147N04128
$$ -8813714 -5186461 -1839821 25927 -583988 -3216436 -6133522 -7811870 -8026017 -7521889
8074g521889M76476K06528N2220K3466l8601j30498Q6899R94005K499013L992001
$$ -7521889 -7045413 -6838885 -6786665 -6763199 -6801800 -6932298 -6845399 -5851394 -3352381 639620
8064F39620M829761M643866L246194P42019k072591l948248m271004l641506k984822
$$ 639620 5469381 10113247 13359441 14101460 12028869 8080621 3809617 168111 -2816711
8055b816711k374377j236821M72876J917045K259033J437328m6836j689351l139218
$$ -2816711 -5191088 -6427909 -5955033 -4037988 -1778955 -341627 -388463 -2077814 -5217032
8046e217032m158027m751140n212768n798431o345031o287354n048127k514125
$$ -5217032 -9375059 -14126199 -19338967 -25137398 -31482429 -37769783 -42817910 -45332035
8038d5332035O43747L119495L796682K732631J235345P14077J426695K492473
$$ -45332035 -44688288 -41568793 -37772111 -35039480 -33804135 -33090058 -31663363 -29170890
8030b9170890L089056L368286M030184N167068N888390N286214L624590K253743
$$ -29170890 -26081834 -22713548 -18683364 -13516296 -7627906 -2341692 1282898 3536641
8022C536641K211787L083241L437648K321189J10250k054671l360632l727008
$$ 3536641 5748428 8831669 12269317 14590506 14700756 12646085 9285453 5558445
8014E558445l440595k768459j912048j031595j80944O37020J288826J571197J560153
$$ 5558445 2117850 -650609 -2562657 -3594252 -3775196 -3138176 -1849350 -278153 1282000
8005A282000J686133K233102K885755L037535K502717J664116R31347L50678j94201
$$ 1282000 2968133 5201235 8086990 11124525 13627242 15291358 16222705 16573383 16379182
7996A6379182p07069j134897j392931j146239Q3392K200335M107703M450629K834181
$$ 16379182 15672113 14537216 13144285 11998046 12081438 14281773 18389476 22840105 25674286
$$ [...]
##END NTUPLES=NMR SPECTRUM
##END=
