##TITLE=31Pdec_MeTGLU 2808-1
 D2O 24 sc
 30.8.2023
##JCAMPDX= 6.0         $$ Bruker NMR JCAMP-DX V2.0
##DATA TYPE= NMR SPECTRUM
##DATA CLASS= NTUPLES
##ORIGIN= UXNMR, Bruker Analytische Messtechnik GmbH
##OWNER= root
$$ XWIN-NMR		Version 3.5
$$ Wed Aug 30 13:45:12 2023 Russian Standard Time (UT+4h)  she@DPX200
##.OBSERVE FREQUENCY= 81.013821
##.OBSERVE NUCLEUS= ^31P
##.ACQUISITION MODE= SIMULTANEOUS
##.ACQUISITION SCHEME= undefined
##.AVERAGES= 40
##.DIGITISER RES= 16
##SPECTROMETER/DATA SYSTEM= spect
##.PULSE SEQUENCE= zgpg30
##.SOLVENT NAME= CDCl3
##.SHIFT REFERENCE= (INTERNAL, CDCl3, 0, 248.564)
##AUDIT TRAIL= $$ (NUMBER, WHEN, WHO, WHERE, WHAT)
$$ ##TITLE= Audit trail, XWIN-NMR		Version 3.5
$$ ##JCAMPDX= 5.01
$$ ##ORIGIN= Bruker BioSpin GmbH
$$ ##OWNER= she
$$ F:/spectra/data/she/nmr/P31/1/pdata/1/auditp.txt
$$ ##AUDIT TRAIL=  $$ (NUMBER, WHEN, WHO, WHERE, WHAT)
(   1,<2023-08-30 13:44:07.54 +0400>,<she>,<DPX200>,
      <created by zg, POWCHK disabled, PULCHK disabled
       configuration hash MD5:
       00 E9 B6 7A A2 85 ED C7 34 08 36 98 17 FE 4E 26
       data hash MD5: 32K
       59 07 D9 11 9B 23 C5 1D 86 99 32 92 27 0A 0C 7E>)
(   2,<2023-08-30 13:44:10.06 +0400>,<she>,<DPX200>,
      <Start of raw data processing
       efp BC_mod = 2 LB = 5 FT_mod = 6 PKNL = 1 PHC0 = -10720.78 PHC1 = 11.08485 SI = 64K 
       data hash MD5: 64K
       12 30 70 AF EF 4E BA 7A 92 8C 42 09 66 04 74 73>)
(   3,<2023-08-30 13:44:35.21 +0400>,<she>,<DPX200>,
      <pk PHC0 = -435.5886 PHC1 = 371.2001 
       data hash MD5: 64K
       91 8D 77 5E B3 4B E4 60 10 E6 15 59 27 41 06 AE>)
(   4,<2023-08-30 13:44:38.25 +0400>,<she>,<DPX200>,
      <abs ABSG = 5 
       data hash MD5: 64K
       ED 71 78 6F EF 22 59 B7 60 B5 57 41 1F CA BD 3E>)
$$ ##END=
$$ 
$$ hash MD5
$$ F9 3D 67 56 FE A0 EB FD AE CD D8 32 BD 0F A7 80
##$RELAX= 
##$RELAX= 
##$RELAX= 
##$RELAX= 
##$RELAX= 
##$RELAX= 
##$RELAX= 
##$RELAX= 
##$RELAX= 
$$ Bruker specific parameters
$$ --------------------------
##$DU= <F:/spectra>
##$EXPNO= 1
##$NAME= <P31>
##$PROCNO= 1
##$TYPE= <nmr>
##$USER= <she>
##$AMP= (0..31)
100 100 100 100 100 100 100 100 100 100 100 100 100 100 100 100 100 100 
100 100 100 100 100 100 100 100 100 100 100 100 100 100 
##$AQSEQ= 0
##$AQ_mod= 1
##$AUNM= <au_zg>
##$AUTOPOS= <>
##$BF1= 81.014009
##$BF2= 200.13
##$BF3= 200.13
##$BF4= 200.13
##$BF5= 200.13
##$BF6= 200.13
##$BF7= 200.13
##$BF8= 200.13
##$BYTORDA= 1
##$CFDGTYP= 0
##$CFRGTYP= 5
##$CHEMSTR= <none>
##$CNST= (0..31)
1 1 145 1 1 1 1 1 1 1 1 1 1 1 1 1 1 1 1 1 1 1 1 1 1 1 1 1 1 1 1 1 
##$CPDPRG= <waltz16>
##$CPDPRG1= <>
##$CPDPRG2= <waltz16>
##$CPDPRG3= <>
##$CPDPRG4= <mlev>
##$CPDPRG5= <mlev>
##$CPDPRG6= <mlev>
##$CPDPRG7= <mlev>
##$CPDPRG8= <mlev>
##$CPDPRGB= <>
##$CPDPRGT= <>
##$D= (0..31)
0 1 0 0 0 0 0 0 0 0 0 0.03 2e-05 3e-06 0 0 0 0 0 0 0 0 0 0 0 0 0 0 0 0 
0 0 
##$DATE= 1693388646
##$DBL= (0..7)
120 120 120 11 120 120 24 19 
##$DBP= (0..7)
150 150 150 150 150 150 150 150 
##$DBP07= 0
##$DBPNAM0= <>
##$DBPNAM1= <>
$$ [...]
##$SUBNAM3= <"">
##$SUBNAM4= <"">
##$SUBNAM5= <"">
##$SUBNAM6= <"">
##$SUBNAM7= <"">
##$SUBNAM8= <"">
##$SUBNAM9= <"">
##$SW= 501.771253377433
##$SWIBOX= (0..15)
0 1 3 0 0 0 0 0 0 0 0 0 0 0 0 0 
##$SW_h= 40650.406504065
##$TD= 32768
##$TD0= 1
##$TE= 0
##$TE2= 300
##$TE3= 300
##$TEG= 300
##$TL= (0..7)
0 120 53 12 22 120 120 120 
##$TP= (0..7)
150 150 150 150 150 150 150 150 
##$TP07= 0
##$TPNAME0= <>
##$TPNAME1= <>
##$TPNAME2= <>
##$TPNAME3= <>
##$TPNAME4= <>
##$TPNAME5= <>
##$TPNAME6= <>
##$TPNAME7= <>
##$TPOAL= (0..7)
0.5 0.5 0.5 0.5 0.5 0.5 0.5 0.5 
##$TPOFFS= (0..7)
0 0 0 0 0 0 0 0 
##$TUNHIN= 0
##$TUNHOUT= 0
##$TUNXOUT= 0
##$USERA1= <user>
##$USERA2= <user>
##$USERA3= <user>
##$USERA4= <user>
##$USERA5= <user>
##$V9= 5
##$VALIST= <valist>
##$VCLIST= <CCCCCCCCCCCCCCC>
##$VD= 0
##$VDLIST= <DDDDDDDDDDDDDDD>
##$VPLIST= <PPPPPPPPPPPPPPP>
##$VTLIST= <TTTTTTTTTTTTTTT>
##$WBST= 1024
##$WBSW= 4
##$XGAIN= (0..3)
0 0 0 0 
##$XL= 0
##$YL= 0
##$YMAX_a= 2077
##$YMIN_a= -3055
##$ZGOPTNS= <>
##$ZL1= 120
##$ZL2= 120
##$ZL3= 120
##$ZL4= 120
##$ABSF1= 248.5645
##$ABSF2= -253.2056
##$ABSG= 5
##$ABSL= 3
##$ALPHA= 0
##$AQORDER= 0
##$ASSFAC= 0
##$ASSFACI= 0
##$ASSFACX= 0
##$ASSWID= 0
##$AUNMP= <proc_1d>
##$AZFE= 0.1
##$AZFW= 0.5
##$BCFW= 0
##$BC_mod= 2
##$BYTORDP= 0
##$COROFFS= 0
##$CY= -3
##$DATMOD= 1
##$DC= 0
##$DFILT= <>
##$DTYPP= 0
##$F1P= 0
##$F2P= 0
##$FCOR= 1
##$FTSIZE= 65536
##$FT_mod= 6
##$GAMMA= 0
##$GB= 0
##$INTBC= 1
##$INTSCL= 6.047779e-11
##$ISEN= 30
##$LB= 5
##$LEV0= 0
##$LPBIN= 0
##$MAXI= 10000
##$MC2= 0
##$MEAN= 0
##$ME_mod= 0
##$MI= 50
##$NCOEF= 0
##$NC_proc= -11
##$NLEV= 6
##$NOISF1= 182.463
##$NOISF2= 159.3651
##$NSP= 0
##$NTH_PI= 0
##$NZP= 0
##$OFFSET= 248.5645
##$PC= 4
##$PHC0= -11156.37
##$PHC1= 382.2849
##$PH_mod= 1
##$PKNL= yes
##$PPARMOD= 0
##$PSCAL= 0
##$PSIGN= 0
##$REVERSE= no
##$SF= 81.0140089999694
##$SI= 65536
##$SIGF1= 159.3651
##$SIGF2= -187.1042
##$SINO= 113.3802
##$SIOLD= 16384
##$SREGLST= <1H.CDCl3>
##$SSB= 0
##$STSI= 65536
##$STSR= 0
##$SW_p= 40650.406504065
##$SYMM= 0
##$S_DEV= 0
##$TDeff= 32768
##$TDoff= 0
##$TI= <>
##$TILT= no
##$TM1= 0
##$TM2= 0
##$TOPLEV= 0
##$USERP1= <user>
##$USERP2= <user>
##$USERP3= <user>
##$USERP4= <user>
##$USERP5= <user>
##$WDW= 1
##$XDIM= 65536
##$YMAX_p= 402084213
##$YMIN_p= -96973073
$$ End of Bruker specific parameters
$$ ---------------------------------
##NTUPLES= NMR SPECTRUM
##VAR_NAME=  FREQUENCY,     SPECTRUM/REAL,   SPECTRUM/IMAG
##SYMBOL=    X,             R,               I
##VAR_TYPE=  INDEPENDENT,   DEPENDENT,       DEPENDENT
##VAR_FORM=  AFFN,          ASDF,            ASDF
##VAR_DIM=   65536,         65536,           65536
##UNITS=     HZ,            ARBITRARY UNITS, ARBITRARY UNITS
##FACTOR=    0.620285442955139, 1,           1
##FIRST=     20137.2065510682, 0,            0
##LAST=      -20513.1999529968, 0,           0
##MIN=       -20513.1999529968, -96973073,   0
##MAX=       20137.2065510682, 402084213,    0
$$ Real data points
##PAGE= N=1
##DATA TABLE= (X++(R..R)), XYDATA
$$ [...]
12301D1132905j699696j633999k319117l247535l470790k648296j476277j038850
12293B3598345j695717k670628k902557k282210j803255k435659m086833n725228
12285c742o218506m937837j963520J856063N133418O653720O173184M632300L530071
12276A4855151L801337N007950N701327M850562K864216R69407k21847j082591
12268C6745512k062590l062009l788400m084257l680962k288789l31918R88813
12260A8435400R36857J89166K4806Q21296J808173K048264J177024o03852k705865
12251B2131269m369944n132889n098997m545715l458853j724264N10633L015214
12243A326454N659112P950128Q802026P506370M773981K101092J90118j315226
$$ plain form
12301 41132905 39433209 37799210 35480093 32232558 28761768 26113472 24637195 23598345
12293 23598345 21902628 19232000 16329443 14047233 12243978 9808319 5721486 -3742
12285 -3742 -6222248 -11160085 -13123605 -11267542 -6134124 519596 6692780 11325080 14855151
12276 14855151 18656488 23664438 29365765 34216327 37080543 38049950 37828103 36745512
12268 36745512 34682922 31620913 27832513 23748256 20067294 17778505 17446587 18435400
12260 18435400 19372257 19561423 19586229 20407525 22215698 24263962 25440986 24837134 22131269
12251 22131269 17761325 12628436 7529439 2983724 -475129 -2199393 -1688760 1326454
12243 1326454 6985566 14935694 23737720 31244090 36018071 38119163 38309281 36994055
12235C6994055k696600l717305m380811n086430n637463n031981k841738k5148
12227G576579K300721M139477N808800O585238N454022K990654J157646R77003
12219C6990140J511334J598205J560726K393536L942493M872163M231979K311460
12211E9412036O1156j653102k272252j774183r38697r00076k140384m134132o005543
12202C9654823p183143p437045o863954o073718n866979o341911o687853o204963
12194a3004743n125481m010883k783695j001901J167163K958556L917461M142993
12186a3740530L674636K385780O16133q47093j748643k687651m064697n325175
12178b1737240n803435n764944n802747n449463l291231J302542P047889J1555373
$$ plain form
12235 36994055 34297455 30580150 26199339 21112909 15475446 10443465 7601727 7576579
12227 7576579 9877300 14016777 19825577 26410815 31864837 34855491 36013137 36990140
12219 36990140 38501474 40099679 41660405 44053941 47996434 52868597 57100576 59412036
12211 59412036 59473192 57820090 55547838 53773655 52834958 51934882 49794498 45660366 39654823
12202 39654823 32471680 25034635 18170681 12096963 6229984 -111927 -6799780 -13004743
12194 -13004743 -18130224 -22141107 -24924802 -25926703 -24759540 -21800984 -17883523 -13740530
12186 -13740530 -10065894 -7680114 -7063981 -7911074 -9659717 -12347368 -16412065 -21737240
12178 -21737240 -27540675 -33305619 -39108366 -44557829 -47849060 -46546518 -39498629 -27943256
12170b7943256J3063299J1496313Q342832N644247M643618N006344N363400M688699
12162C0305496L117971J597972J056169J822248L344971M296430L427465P34990
12154D9703712k414601m622388n718931o416978p048945p252158o804293o004742
12146C420676m945454l091000k11968K686225M200872M227822L957796L962028
12138A4206997L200178O42280k764689m819637m659358l621417l274243l502399
12130d592288l142368j841749m24081L42779N30958O07129R28431J868005L777492
12121a945692O349455Q370910Q650890P210217N309153M315706M657495N671175
12113D8589309O128995M970076J990759j848463m921734o059760n351273l877583
$$ plain form
12170 -27943256 -14879957 -3383644 4959188 10603435 15247053 20253397 25616797 30305496
12162 30305496 33423467 35021439 36077608 37899856 41244827 45541257 48968722 49703712
12154 49703712 47289111 42666723 36947792 30530814 23481869 16229711 9425418 3420676
12146 3420676 -1524778 -4615778 -4827746 -2141521 2059351 6287173 10244969 14206997
12138 14206997 17407175 18049455 15284766 10465129 5805771 2184354 -1089889 -4592288
12130 -4592288 -7734656 -9576405 -10000486 -9657707 -9126749 -8519620 -7591189 -5723184 -1945692
12121 -1945692 4403763 12774673 21425563 28635780 33944933 38260639 42918134 48589309
12113 48589309 54718304 59688380 61679139 59830676 54908942 48849182 43497909 39620326
12105C9620326k712251k188777j986621j725428j449248j636484k714239m416797
12097B0790481n670955n434755l842781k311454k220617l534434m926694n198377
12089a2349586m340773l277092k888745l325772l904779l513664j468306J654596
12081c3414121M153633M544132K890853P03979m75757k77608N94530J323037J683879
12072a8273443K007815K751997M167986O171081Q317199R921137J0366241R394608
12064C4824621P103096L774598q2625l586583n770473o279799n583087m273865
12056B0125883k446417j64515J694685J790068k23227l013139m695852m440615
12048H626871k767129o08041J440393L016023L681820L081220J354398p75610
$$ plain form
12105 39620326 36908075 34719298 32732677 31007249 29558001 27921517 25207278 20790481
12097 20790481 15119526 9684771 5841990 3530536 1309919 -2224515 -7151209 -12349586
12089 -12349586 -16690359 -19967451 -22856196 -26181968 -30086747 -33600411 -35068717 -33414121
12081 -33414121 -29260488 -24716356 -21825503 -21121524 -21597281 -21874889 -21280359 -19957322 -18273443
12072 -18273443 -16265628 -13513631 -9345645 -3174564 5142635 15063772 25430013 34824621
12064 34824621 41927717 45702315 45619690 42033107 36262634 29982835 24399748 20125883
12056 20125883 17679466 17514951 19209636 20999704 20776477 17763338 13067486 8626871
12048 8626871 5859742 5251701 6692094 9708117 13389937 16471157 17825555 17049945
12040A7049945k409714l001591k583028j609238o34555L406L92205R40116J877530
12031A0025076K877678L439813L621762L892659M060578K982820j6601l795389
12023B7088396o246423o477492n494346m708465m475453m300326l815964l109273
12015a1539346k383098j586710k76400K042884N056029P321484P534629O121329
12007A2290801M776920M268737L571492J517241j583495m474234o269085o611569
11999G486808n346364k907151m69280J123999K162413L138448L686472L368145
11991A2243490K858668L094956L576555K859702P61752j135792j401666j72961
11983B2684704J538527K942524L499306K750792P31495j846047m061957n131848
$$ plain form
12040 17049945 14640231 11638640 9055612 7446374 6811819 6815225 7207430 8147546 10025076
12031 10025076 12902754 16342567 19964329 23856988 27917566 30900386 30883785 27088396
12023 27088396 20841973 14364481 8870135 4161670 -313783 -4614109 -8430073 -11539346
12015 -11539346 -13922444 -15509154 -15785554 -13742670 -8686641 -1365157 6169472 12290801
12007 12290801 17067721 21336458 24907950 26425191 24841696 20367462 14098377 7486808
11999 7486808 2140444 -766707 -1235987 -111988 2050425 5188873 8875345 12243490
11991 12243490 15102158 18197114 21773669 24633371 25395123 24259331 22857665 22684704
11983 22684704 24223231 27165755 30665061 33415853 34147348 32301301 28239344 23107496
11975B3107496m493407k358715j68749M48014o02930k015023l058173m369665
11967F488848o387750q104194q171313o520541m111150j630410Q05865L065096
11959b4565549M817678N766762N695166M658129L452222L328094M715193O667661
11951A4535356Q016352Q549694Q574243P953392O337756L929986J294019j286144
11943E7904654l641801n312416o009513o143866o166278n732517m363966k694060
11935A7840237k122158l208227n128256o677573p115720o140800l945509j502819
11927a8000825q1187j57332j150820k166974k487398j540651P02668L147863M225521
11918a7509135L522343K219446J614089J720109J622380P33503o35124j605963
$$ plain form
11975 23107496 18614089 16255374 16086625 16534639 15931709 13916686 10858513 6488848
11967 6488848 101098 -8003096 -16174409 -22694950 -26806100 -28436510 -27630645 -24565549
11959 -24565549 -19747871 -13981109 -8285943 -3627814 -175592 3152502 7867695 14535356
11951 14535356 22551708 31101402 39675645 47629037 53966793 57896779 59190798 57904654
11943 57904654 54262853 48950437 42940924 36797058 30630780 24898263 20534297 17840237
11935 17840237 15718079 12509852 7381596 704023 -6411697 -12552497 -16498006 -18000825
11927 -18000825 -18082012 -18239344 -19390164 -21557138 -24044536 -25585187 -24882519 -21734656 -17509135
11918 -17509135 -13986792 -11767346 -10153257 -8433148 -6810768 -6077265 -6712389 -8318352
11910h318352j420891j41459J179902J366136K17330j601327l604208n691673
11902a8014542p304136p340560n398113k426071L11431K333057L625430M012898
11894c0200606L511892K691643J927398Q29016p51461j675372o58256J642864
11886b2682882K848118J500034j303947l271536l246702j802843j42556R61406
11878b7140908J405077J545273J835468K399945K923632L107609L207727L897638
11870f818539N413129O888834O890422M947880K394702J101818J263370J136203
11862B3217819n82835k851351l641583k734798j904019k256266k714840j797134
11854D734993J10737J279713R38282K9690j89784N84655J898946L135696L525345
$$ plain form
11910 -8318352 -9739243 -9880702 -8700800 -7334664 -7117334 -8718661 -12322869 -18014542
11902 -18014542 -25318678 -32659238 -38057351 -40483422 -40171991 -37838934 -34213504 -30200606
11894 -30200606 -26688714 -23997071 -22069673 -21240657 -21992118 -23667490 -24325746 -22682882
11886 -22682882 -19834764 -18334730 -19638677 -22910213 -26156915 -27959758 -28102314 -27140908
11878 -27140908 -25735831 -24190558 -22355090 -19955145 -17031513 -13923904 -10716177 -6818539
11870 -6818539 -1405410 5483424 12373846 17321726 19716428 20818246 22081616 23217819
11862 23217819 22634984 19783633 16142050 13407252 11503233 9246967 6532127 4734993
11854 4734993 4845730 6125443 7063725 7093415 6903631 7488286 9387232 12522928 16048273
11845A6048273K171689j251788n814849r662239j1214873j0138658p277090l757530
11837c0897065k25123L062093N640693O802130O303430M738342K870279Q66311
11829h38910j431952l756432n482941o322865o317539n110917j933880L286197
11821b7909239R150426J3462593J4584912J2216703P400453K047643k007208m023300
11813B4922983m464076m094423l298415k319176j525353j008366l93480M45138
11805H264832R18268N81984O3787L07555J066265J048271l18259k065917k938461
11796F928325k843718k680033l154222m137257m908589m802436l898859l240168
11788b2736957l998618o198535q566083r808619r670368q553939o620737l720601
$$ plain form
11845 16048273 18219962 16968174 11153325 1491086 -9723787 -19862445 -27139535 -30897065
11837 -30897065 -31122188 -28060095 -22419402 -15617272 -9313842 -4575500 -1705221 -838910
11829 -838910 -2270862 -6027294 -11510235 -17833100 -24150639 -29261556 -31195436 -27909239
11821 -27909239 -18758813 -5296220 9288692 21505395 28905848 30953491 28946283 24922983
11813 24922983 20458907 16364484 13066069 10746893 9221540 8213174 7819694 8264832
11805 8264832 9183100 9765084 9828871 10136426 11202691 12250962 11932703 9866786 6928325
11796 6928325 4084607 1404574 -1749648 -5886905 -10795494 -15597930 -19496789 -22736957
11788 -22736957 -26735575 -32934110 -41500193 -51308812 -60979180 -69533119 -76153856 -79874457
11780g9874457M3074M028537P178499Q371908P228270M959328L859472N217162
11772c8988207P895959R515128Q820562O347521L100223m39341l865201o347439
11764a3960795p183841o474319m828674k683089k81873J897587L201275L395564
11756b6918165L004126K921861L687706N122061O647002P874970Q705468Q837887
11748A9882916P604201M734290J154891j514445k430753k169395j799986j729016
11740B3732703j703827j565750j494347j584770j646380j594615j784486k672941
11732I685587m130712n262726n088874l444689j112990R68990K468195L518517
11724b398702M097191L945432L092612K031591J180859M65268l56073j227631
$$ plain form
11780 -79874457 -79831383 -75802846 -68624347 -60252439 -53024169 -48064841 -44205369 -38988207
11772 -38988207 -31092248 -21577120 -12756558 -6409037 -3308814 -3748155 -7613356 -13960795
11764 -13960795 -21144636 -27618955 -32447629 -35130718 -35412591 -33515004 -30313729 -26918165
11756 -26918165 -23914039 -20992178 -17304472 -12182411 -5535409 2339561 11045029 19882916
11748 19882916 27487117 32221407 33376298 31861853 29431100 27261705 25461719 23732703
11740 23732703 22028876 20463126 18968779 17384009 15737629 14143014 12358528 9685587
11732 9685587 5554875 292149 -4796725 -8241414 -9354404 -8385414 -5917219 -2398702
11724 -2398702 1698489 5643921 8736533 10768124 11948983 12414251 12058178 10830547
11716A0830547j974581k716211l654127m477912m437651l182896j215206O99076
11708a0128961K281627L632152M656643N097972N056841M923498M670253L795326
11700B3985351K311399J198867J167725J280134k80738l933477p920986j0079201
11692G729074r758499p702284m815865j781328O22662J780326J830149J391028
11684a0704737P47915j01320o70731m8596J995341M523996O373997P185715P252187
11675A6553767O790713N763920M144805J953736q31583m051860p088818r110605
11667A4124075r712166r228319q319134p184843n244494j847339K550773O248746
11659a8612701P754696P197155N795740M110572J598167j959918n441079p360476
$$ plain form
11716 10830547 8855966 6139755 2485628 -1992284 -6429935 -9612831 -10828037 -10128961
11708 -10128961 -7847334 -4215182 441461 5539433 10596274 15519772 20190025 23985351
11700 23985351 26296750 27495617 28663342 29943476 29662738 25729261 17808275 7729074
11692 7729074 -2029425 -9731709 -14547574 -16328902 -15706240 -13925914 -12095765 -10704737
11684 -10704737 -9956822 -10058142 -10728873 -10777469 -8782128 -4258132 2115865 9301580 16553767
11675 16553767 23344480 29108400 33253205 35206941 34375358 30323498 23234680 14124075
11667 14124075 4411909 -4816410 -13135544 -20320387 -25564881 -27412220 -24861447 -18612701
11659 -18612701 -10858005 -3660850 2134890 6245462 7843629 5883711 442632 -6917844
11651f917844p366810o202208m552273k557289k53451K123441M266627N813319
11643a5646488O332831N759031M746459M053666L524911K202737l95123l573662
11635G004362o238940p897924q496906p683913m974309p83776L257410N512322
11627b0301674N786755N249430M931148M697126L836359K168964P2997k266782
11619D174323m872846p200373q142446p221047n240578l305824j639523J24047
11611c3324267J910160L150408L527708L141213K132435Q37274J24318O84578
11603a7816173J887561K197094J004115o94963j744753k140535k413900k544501
11595b2266055k263746j775933j165597M68746L993074Q254011J0330604Q405759
$$ plain form
11651 -6917844 -14284654 -20486862 -25039135 -27596424 -27849875 -25726434 -21459807 -15646488
11643 -15646488 -9313657 -3554626 1191833 5245499 8770410 10973147 10578024 7004362
11635 7004362 765422 -7132502 -15629408 -23313321 -28287630 -29071406 -25813996 -20301674
11627 -20301674 -14514919 -9265489 -4334341 362785 4199144 6368108 6441105 4174323
11619 4174323 -698523 -7898896 -16041342 -23262389 -28502967 -31808791 -33448314 -33324267
11611 -33324267 -31414107 -28263699 -24735991 -21594778 -19462343 -18625069 -18500751 -17816173
11603 -17816173 -15928612 -13731518 -12727403 -13422366 -15167119 -17307654 -19721554 -22266055
11595 -22266055 -24529801 -26305734 -27471331 -27002585 -23009511 -14755500 -4424896 3980863
11587C980863L739873p05688k991324k986771j187169J995047N594894P761941
11579A5201666O913058L204658j442677m765859n533836l882576r28766J716356
11571A0482024K544198J026205j792289l886829l870137k091231k2122J307566
11563C697385J994373K501225K724820K087523K89898k302854m830914o223606
11555f2150n568684k764451J043497M048668N129821M597764L577607K843448
11547A2845520K400742K036528J956420K691091M340538N973840N983283L317287
11539D1545249j500150o617607j0147456j1237484j0138354p677856m847461k583638
11531a3204757j521940j794281l027970m464059n166324m495184k669411p39386
$$ plain form
11587 3980863 7720736 7015048 4023724 1036953 -150216 1844831 7439725 15201666
11579 15201666 22114724 25319382 23876705 19110846 13577010 9694434 8765668 10482024
11571 10482024 13026222 14052427 12260138 8373309 4503172 2411941 2389819 3697385
11563 3697385 5691758 8192983 10917803 13005326 13295224 10992370 6161456 -62150
11555 -62150 -5630834 -8395285 -7351788 -3303120 1826701 6424465 10002072 12845520
11547 12845520 15246262 17282790 19239210 21930301 26270839 32244679 38227962 41545249
11539 41545249 40045099 33427492 23280036 12042552 1904198 -5773658 -10621119 -13204757
11531 -13204757 -14726697 -16520978 -19548948 -24013007 -29179331 -33674515 -36343926 -37083312
11523c7083312K59548J69179k97455k64657O95177K387909M103765M972230M549449
11514b0508167L195096J792599J066364J132710J510156J435300L87239j409881
11506a1398584l036795l593700k837038j121351R74500K803426L863204M295448
11498a0050890M905241O181976P453599P492722N827339K993978k34574l163502
11490B1405889m919163m896679l718737k902983l157359l663465l402535k435857
11482g690889j367213l25482P36913J333088R55306l1114q52691j400844j937637
11473a0580563j969212n74189J937487L707419L196948P81866j870762l403493
11465h774499l341467j756715Q07751L210901M169704L106636M94055k538911
$$ plain form
11523 -37083312 -36823764 -36654585 -36952040 -37216697 -36521520 -34133611 -30029846 -25057616 -20508167
11514 -20508167 -17313071 -15520472 -14454108 -13321398 -11811242 -10375942 -9988703 -11398584
11506 -11398584 -14435379 -18029079 -20866117 -21987468 -21012968 -18209542 -14346338 -10050890
11498 -10050890 -5145649 1036327 8489926 15982648 21809987 24803965 24569391 21405889
11490 21405889 16486726 11590047 7871310 4968327 1810968 -1852497 -5255032 -7690889
11482 -7690889 -9058102 -9383584 -8646671 -7313583 -6358277 -6389391 -7242082 -8642926 -10580563
11473 -10580563 -12549775 -13123964 -11186477 -7479058 -4282110 -3500244 -5371006 -8774499
11465 -8774499 -12115966 -13872681 -13064930 -9854029 -5684325 -2577689 -2083634 -4622545
11457d622545m871406n925753n790469m748492k692937O50495M793051Q235883
11449a4972173R598992Q838607P041633N220471L640979K063230Q5309k685692
11441A8831356o201689r542862j1386425j1159666r393876o771474l362124O88928
11433c8297832M130979N179127L387511M39377j308408q65165R39328K604213
11425b3790870L162317K581983J626740J355568K221967L428091L502364J769504
11417d142336r15972k991714l505459k570718r53096M60281J061144Q46783L62927
11408a2348160J08945M5011j74666o35186j040324j039836m93193M43912J311596
11399a3821901J629434J419343J190408J085615L65567j678729m399851o023327
$$ plain form
11457 -4622545 -9493951 -15419704 -21210173 -25958665 -28651602 -28001107 -23208056 -14972173
11449 -14972173 -5373181 3465426 10507059 15727530 19368509 21431739 21517048 18831356
11441 18831356 12629667 3086805 -8299620 -19459286 -28853162 -35624636 -38986760 -38297832
11433 -38297832 -34166853 -28987726 -25600215 -25160838 -26469246 -27334411 -26395083 -23790870
11425 -23790870 -20628553 -18046570 -16419830 -15064262 -12842295 -9414204 -5911840 -4142336
11417 -4142336 -5058308 -8050022 -11555481 -14126199 -15079295 -14619014 -13557870 -12711087 -12348160
11408 -12348160 -12239215 -12194204 -12368870 -13004056 -14044380 -15084216 -15577409 -15133497 -13821901
11399 -13821901 -12192467 -10773124 -9582716 -8497101 -8131534 -9810263 -14210114 -20233441
11391b0233441n387844l048115n16772J172386J978470K410665K983663L900415
11383a6740573M885946N335982M852302L686476K572020K059898J972835J532742
11375A0157628J89783j613825k774726k813448k459568k511216k459521j048571
11367e333464J775469M321121M952568L833228K378368J427640N97652p08250
11359A3244332k219768k858742j681175J193563M408622O192531N568934K891768
11351B6740065n72769l311494m076579k545620J56733K117274K302994J306931
11343B2117535J67566j023539k770726m848599o120275n668233l599101q25151
11335b570523J433215K078991Q10718j436311l182088l710223l420298k973031
$$ plain form
11391 -20233441 -25621285 -28669400 -29186172 -28013786 -26035316 -23624651 -20640988 -16740573
11383 -16740573 -11854627 -6518645 -1666343 2020133 4592153 6652051 8624886 10157628
11375 10157628 10347411 8733586 5958860 3145412 685844 -1825372 -4284893 -5333464
11367 -5333464 -3557995 763126 5715694 9548922 11927290 13354930 13952582 13244332
11359 13244332 11024564 8165822 6484647 7678210 12086832 18279363 23848297 26740065
11351 26740065 26167296 22855802 18779223 16233603 16390336 18507610 20810604 22117535
11343 22117535 22285101 21261562 18490836 13642237 7521962 1853729 -1745372 -2570523
11335 -2570523 -1137308 941683 1752401 316090 -2865998 -6576221 -9996519 -12969550
11327a2969550k567271k040405j118757N23783K901675N259901O536951O522864
11319C049191O051126N791729N409268M292345K583895R44243l31822j351142
11311B6438833j989311j873594j071766l57633n92221j939086l656981m609897
11303A0348344m220376l129921k676900l419359m353435l904576j559696J711416
11295a1204503M370971N273903M053164J259111j775533l682243l908941k781269
11287h395340r83426O53477J214993M24010n53014K26190L528504P975637J1237779
11278A5328810J1832502R667168N540935P00737l526710o362809p839609q160393
11270A7180631p084206m396692p51347K542188M553350N143129M484936K799298
$$ plain form
11327 -12969550 -15536821 -17577226 -18695983 -18172200 -15270525 -10010624 -3473673 3049191
11319 3049191 9100317 14892046 20301314 24593659 27177554 28121797 27789975 26438833
11311 26438833 24449522 22575928 21504162 21146529 20554308 18615222 14958241 10348344
11303 10348344 6127968 2998047 321147 -3098212 -7451647 -11356223 -12915919 -11204503
11295 -11204503 -6833532 -1559629 2493535 3752646 1977113 -1705130 -5614071 -8395340
11287 -8395340 -9378766 -8725289 -7510296 -7086286 -7639300 -7413110 -3884606 4091031 15328810
11278 15328810 27161312 36828480 42369415 43070152 39543442 33180633 25341024 17180631
11270 17180631 10096425 5699733 4948386 7490574 12043924 17187053 21671989 24471287
11262B4471287P03812p01144n01594J297028L688127N193188M716821K361766
11254D1229291n59206k671095l701060m189321m265112l446843j758797j99979
11246B0437878M22319N32803J006218J749020J836837R32861k03121p61249q16872
11237B5136694r31591j288673j645334j902659k265842k811351l210877l048004
11229H032363k272024j185101o9149R55338J711183J934222J659504J340156J214595
11220A3321087Q01305l93842j733030j770458l1860K153756L107075K642178J898656
11211A9994867J683469J673627J171699K5639j292786k119879k092820j552313
11203A7491503j386990k119352l261393l951181m001226l787824l362056k459239
$$ plain form
11262 24471287 25175099 24473955 23972361 25269389 28957516 34150704 38867525 41229291
11254 41229291 40670085 37998990 34297930 30108609 25843497 22396654 20637857 20437878
11246 20437878 20860197 21393000 22399218 24148238 25985075 26917936 26714815 25953566 25136694
11237 25136694 24205103 22916430 21271096 19368437 17102595 14291244 11080367 8032363
11229 8032363 5760339 4575238 4506089 5461427 7172610 9106832 10766336 12106492 13321087
11220 13321087 14122392 13728550 11995520 10225062 10193202 12346958 15454033 18096211 19994867
11211 19994867 21678336 23351963 24523662 24549301 23256515 21136636 19043816 17491503
11203 17491503 16104513 13985161 10723768 6772587 2771361 -1016463 -4378519 -6837758
11195f837758j327665o55379n07641j97701M94429Q55738M51657q7228k19066
11186h030614o76576k496311n238774p149614p004603n056514k318913K36112
11178c7735807J784581J882033R43477l6491m69146m88949l23513q501J66327
11169c4285989k67718j016039q37571J017300L529823M738596L797627J802808
11161b1521163O24448J220977K977515M323787L995496J996933n29752k378596
11153i290355l130759l012665k361013j522971r09270o25501j96970Q27438K032558
11144a8189508K408612J542434O7493j210847k140448k871408l111130k257251
11136b5762053k03442K347421M414057N411564N357763M624461L528999K109369
$$ plain form
11195 -6837758 -8165423 -8820802 -9328443 -9526144 -9031715 -8175977 -7724320 -7811548 -8030614
11186 -8030614 -8707190 -11203501 -16442275 -23591889 -30596492 -35653006 -37971919 -37735807
11178 -37735807 -35951226 -34069193 -33125716 -33162207 -33631353 -34120302 -34443815 -34452316 -34285989
11169 -34285989 -34553707 -35569746 -36407317 -35390017 -31860194 -27121598 -23323971 -21521163
11161 -21521163 -20896715 -19675738 -16698223 -12374436 -8378940 -6382007 -6911759 -9290355
11153 -9290355 -12421114 -15433779 -17794792 -19317763 -20227033 -20852534 -21049504 -20222066 -18189508
11144 -18189508 -15780896 -14238462 -14170969 -15381816 -17522264 -20393672 -23504802 -25762053
11136 -25762053 -25965495 -23618074 -19204017 -13792453 -8434690 -3810229 -281230 1828139
11128A828139L37988j455647k586004k559117j445238M00540K700380N061645
11120B282686O666560O606726M605225J271248k223632m563867m780167k935387
11112F929392l20999J509534K000373J635493R56657J39171n72866q50549r01134
11103A0525072j318077j975709j882222o55522O65896J066823J116920K056139
11095I599320L747440M703907M066150K479086R38489j64279n78591J80345K114558
11086B7086425M247426N339932M736484K406955j064113m174780n098366l423794
11078C0056169q95768K87330l07113j295948j275746q1976J447257K304099K004550
11069C2242854R78690K45884L68432Q65419R11875K66339q68175k422797m251177
$$ plain form
11128 1828139 2166127 710480 -1875524 -4434641 -5879879 -5479339 -2778959 2282686
11120 2282686 8949246 15555972 20161197 21432445 19208813 14644946 9864779 6929392
11112 6929392 6608393 8117927 10118300 11753793 12710450 12849621 12276755 11426206 10525072
11103 10525072 9206995 7231286 5349064 4693542 5359438 6426261 7543181 9599320
11095 9599320 13346760 18050667 22116817 24595903 25534392 25370113 24791522 24971867 27086425
11086 27086425 31333851 36673783 41410267 43817222 42753109 38578329 33479963 30056169
11078 30056169 29160401 29447731 29140618 27844670 26568924 26486948 27934205 30238304 32242854
11069 32242854 33221544 33467428 33835860 34701279 35613154 35879493 35011318 32588521 28337344
11060B8337344n682429o057384n563925m835884l901560k396671p94046l99988
11052a294543j733625l642485m494497l727266j842143N40245K988299M949469
11044h256546N830733N515108M525298L598323L143212L004555K679234J867723
11036B1907640Q05655j23752j018458k308781l892892m848291m345273k700266
11028C475582j262434j231460k605828m239152m989923m891852m985244n812863
11020b6543174o482233n762648l829019k094818j281254m90411J534915M950779
11012c9997863Q883857J2130224J3344596J1544778P459500L819037L092947M889420
11004B5166496O371584N229559J554848l026312o975704r319339r569487q053541
$$ plain form
11060 28337344 22654915 16597531 11033606 6197722 2296162 -100509 -894555 -1294543
11052 -1294543 -3028168 -6670653 -11165150 -14892416 -16734559 -16194314 -13206015 -8256546
11044 -8256546 -2425813 3089295 7614593 11212916 14356128 17360683 20039917 21907640
11036 21907640 22713295 22589543 21571085 19262304 15369412 10521121 6175848 3475582
11028 3475582 2213148 981688 -1624140 -5863292 -10853215 -15745067 -20730311 -26543174
11020 -26543174 -33025407 -38788055 -42617074 -44711892 -45993146 -46483557 -44948642 -39997863
11012 -39997863 -31114006 -18983782 -5639186 5905592 13365092 17184129 20277076 25166496
11004 25166496 31538080 36767639 38322487 35296175 28320471 19001132 9431645 1378104
10996A378104n964350m367526l169675j484158R85911L297462M161871L337905
10988a824456J926739J191676J194993Q54210o16530k687397m198143m730076
10980h888984m825682n028826n298071n402790n341012n188079m989594m988131
10972d9951169n461051o016948n500871l083979P55488M699317P806305R849492
10964d6903416J0669468R868526P399471M105418J304262k29307q32912j502841
10956a6121331k812914m240684m649153l493396j451469J85401O13596Q969p70640
10947c2731621p86909L96130K392102M311706N540977O025161N720436M305319
10939d826699J933452j70677p08139J62471J091163J413826J860466L016331L990491
$$ plain form
10996 1378104 -4586246 -8953772 -12123447 -13607605 -12621694 -9324232 -5162361 -1824456
10988 -1824456 102283 1293959 2488952 3343162 2726632 39235 -4158908 -8888984
10980 -8888984 -13714666 -18743492 -24041563 -29444353 -34785365 -39973444 -44963038 -49951169
10972 -49951169 -55412220 -61429168 -66930039 -70014018 -69258530 -64559213 -56752908 -46903416
10964 -46903416 -36233948 -26365422 -18965951 -14860533 -13556271 -13785578 -14618490 -16121331
10956 -16121331 -18934245 -23174929 -27824082 -31317478 -32768947 -32583546 -31969950 -31960981 -32731621
10947 -32731621 -33518530 -33122400 -30730298 -26418592 -20877615 -14852454 -9132018 -4826699
10939 -4826699 -2893247 -3063924 -3772063 -3609592 -2518429 -1104603 755863 3772194 7762685
10930G762685L463993J590412m9025k65113O99125J908663K782995L237823L368243
10921B4499801L262513K787281J500801o98935k698590k661573k7366L285161
10913B9249093M331100J870964k653878o761574r054787r627010q958578p103799
10905h708469m078850n36961K506444M624885O154974P166661O745446L938103
10897A7812233o96634n117390p514758p558243n957791l536577j059687P73984
10889a2854863J893134L033892M696494O210165O536908N759602M883538M171795
10881B4330665K687741r7678l060832m479850l895623k275898o38365P33153J747352
10872A5050665K001510J287712K53137J5312R93649K312739K516319Q88720j927863
$$ plain form
10930 7762685 11226678 12817090 12768065 12502952 13202077 15110740 17893735 21131558 24499801
10921 24499801 27762314 30549595 32050396 31351461 28652871 25991298 25963932 29249093
10913 29249093 33580193 35451157 32797279 26035705 16980918 7353908 -1604670 -8708469
10905 -8708469 -12787319 -13324280 -10817836 -6192951 -37977 7128684 13874130 17812233
10897 17812233 17115599 11998209 4483451 -3074792 -9032583 -12569160 -13628847 -12854863
10889 -12854863 -10961729 -7927837 -3231343 2978822 9515730 15275332 20158870 24330665
10881 24330665 27018406 26920728 23859896 19380046 15484423 13208525 12570160 13303313 15050665
10872 15050665 17052175 18339887 18593024 18608336 19601985 21914724 24431043 25319763 23391900
10863B3391900m517470n715178n072158k719170O87437L817144N046152L623914
10855A8542571N15556k317651l703133m148565m799648n774202n982882m653621
10847a2321575k556942j308362j641409k812878l655421l683981l039063j964070
10839c2983701q29852k47194m27281m96441Q54486L792604O856997Q338151P890353
10830g251878O582100N606881N170298M457729K490099q31572m332789o342427
10822E548441o065290m158644j956534l91247K26054j50876j285575k375978k449210
10813a3058859j423200n01811j060925l064610m846436m657155k369785M72968
10805c0509813K223463K513689K071388J526186P81172m84435k070489l207357
$$ plain form
10863 23391900 18874430 13159252 8087094 5367924 6055361 9872505 14918657 18542571
10855 18542571 19058127 16740476 13037343 8888778 4089130 -1685072 -7667954 -12321575
10847 -12321575 -14878517 -16186879 -17828288 -20641166 -24296587 -27980568 -31019631 -32983701
10839 -32983701 -33813553 -34060747 -34488028 -34984469 -34129983 -30337379 -23480382 -15142231 -7251878
10830 -7251878 -669778 4937103 10107401 14565130 17055229 16223657 11890868 5548441
10822 5548441 -516849 -4675493 -6632027 -7023274 -6797220 -6948096 -8233671 -10609649 -13058859
10813 -13058859 -14482059 -14983870 -16044795 -19109405 -23955841 -28612996 -30982781 -30509813
10805 -30509813 -28286350 -25772661 -23701273 -22175087 -21393915 -21878350 -23948839 -27156196
10797b7156196l119053j555692J047390L759636N599558O046336N291944M030719
10789f055358K914934K040512Q85252j095409l652589n650379o016770m721411
10781b1351218k600009l89387J607209K947893K880391J257305p44629j483279
10773a7875724m73593J280983K624744L409940M052335M421962L873352K390442
10765C704441J037771Q43616J566865K053408J625475N57841p33217k187198l480115
10756D988887l631066j949251Q81133L266966M152827L545050J826649p22775
10748A2358420l613876n951222o892942o160575m137135j746532o5121M89893
10740a5719090N96146J146132J942900J891789N63456j171080k342963k998955
$$ plain form
10797 -27156196 -30275249 -31830941 -30783551 -27023915 -21424357 -15378021 -10086077 -6055358
10789 -6055358 -3140424 -1099912 -214660 -1310069 -4962658 -10613037 -16629807 -21351218
10781 -21351218 -23951227 -24340614 -22733405 -19785512 -16905121 -15647816 -16392445 -17875724
10773 -17875724 -18349317 -17068334 -14443590 -11033650 -6981315 -2559353 1313999 3704441
10765 3704441 4742212 5585828 7152693 9206101 10831576 11389417 10656200 8469002 4988887
10756 4988887 1357821 -591430 289703 3556669 7709496 11254546 13081195 12358420
10748 12358420 8744544 2793322 -4099620 -10260195 -14397330 -16143862 -16208983 -15719090
10740 -15719090 -15122944 -13976812 -12033912 -10142123 -9578667 -10749747 -13092710 -16091665
10732a6091665l636047m149413m026999l248642k333316j626964j053954m79877
10724c6646877J20265P89026J490568J925136J790516J252144Q91864J110236
10716b7277122J640359J618433K28731k381557m767077n230464l514018j124673
10708d0807388L03153N86502N95544P76509P75879L65580l3962l0784n5231j093702
10698c8617900l553721o421879p734689o267456k867188K74033J899768K886375
10690f0402657M907494Q344409J1957051J4252669J4612332J3297027J0979493
10683A7947818Q287280N373178J936668k007816n513833p296620o965917n370205
10675F390553l728030k615003j680171j59577K137302M183035M437016K499814
$$ plain form
10732 -16091665 -19727712 -23877125 -27904124 -31152766 -33486082 -35113046 -36167000 -36646877
10724 -36646877 -36526612 -35737586 -34247018 -32321882 -30531366 -29279222 -28387358 -27277122
10716 -27277122 -25636763 -24018330 -23789599 -26171156 -30938233 -36168697 -39682715 -40807388
10708 -40807388 -40504235 -39917733 -39322189 -38545680 -37769801 -37404221 -37438183 -37468967 -37524198 -38617900
10698 -38617900 -42171621 -48593500 -56328189 -62595645 -65462833 -65188800 -63289032 -60402657
10690 -60402657 -55495163 -47150754 -35193703 -20941034 -6328702 6968325 17947818
10683 17947818 26235098 31608276 33544944 31537128 26023295 18726675 11760758 6390553
10675 6390553 2662523 47520 -1632651 -1792228 345074 4528109 8965125 11464939
10667A1464939l24770k463216l546665l956208l593730k134309k26983O88715
10659d092227j9062j467965k257072j579815N36144L234900N004226M755280L050751
10650G165160J570270J151894J131014Q03291M71389M08530k28657k311213m955133
10641E206545n967210m245461j048453J346635J799794R69947K92888O72943J963612
10632I91240L254073L497906K167336k99224k676243l930133m180657m425307
10624e601009n183928n781286n202556l257607n61194K212693M572923O083354
10616a2718610O589213O360999N566944L988536J824917K55353K82946J299021
10608A3449319J756486J114660J64831m03068o27408m86789K84338J363500J959781
$$ plain form
10667 11464939 11140169 8676953 5130288 1174080 -2419650 -4553959 -4780942 -4092227
10659 -4092227 -4111289 -5579254 -7836326 -9416141 -8879997 -5645097 -640871 4114409 7165160
10650 7165160 8735430 9887324 11018338 11821629 12293018 12701548 12472891 10161678 5206545
10641 5206545 -760665 -5006126 -6054579 -4707944 -2908150 -1938203 -1645315 -972372 991240
10632 991240 4245313 7743219 9910555 9611331 6935088 3004955 -1175702 -5601009
10624 -5601009 -10784937 -16566223 -21768779 -25026386 -25587580 -23374887 -18801964 -12718610
10616 -12718610 -6129397 231602 5798546 9787082 11611999 11867352 12150298 13449319
10608 13449319 15205805 16320465 16485296 16082228 15454820 14968031 15252369 16615869 18575650
10599A8575650K047774K319047K545976J321514j824183n170258o606836n891989
10591G316695m309862k913473k048215j897424k371230k783936k569260k141959
10583a3718664k369948l385399m415169m491986k982004L6291L448506N791939
10575b2086434O794470P498612Q280758P779525M872437Q53720j825581k609369
10567I558138l192313m875147o859344p391451n613380k079404J708529M107081
10559a4637291M476001L778126L518387M100756M801489N099135N066120M506973
10551B0709696K908751O83872m91525O85195L587158O249483P286830O930909
10543D8550369O373146O309882O097758M419346R35767k953121n328427n526509
$$ plain form
10599 18575650 20623424 22942471 25488447 26809961 24985778 19815520 13208684 7316695
10591 7316695 3006833 93360 -1954855 -3852279 -6223509 -9007445 -11576705 -13718664
10583 -13718664 -16088612 -19474011 -23889180 -28381166 -31363170 -31326879 -27878373 -22086434
10575 -22086434 -15291964 -7793352 487406 8266931 13139368 13993088 12167507 9558138
10567 9558138 6365825 1490678 -5368666 -12760117 -18373497 -20452901 -18744372 -14637291
10559 -14637291 -10161290 -6383164 -2864777 1235979 6037468 11136603 16202723 20709696
10551 20709696 23618447 24302319 23810794 24495989 28083147 34332630 41619460 48550369
10543 48550369 54923515 61233397 67331155 71750501 72686268 69733147 64404720 58878211
10535E8878211m357769k915917j768175j083440q04889o43564m48580o01148j576104
10526D4678625l184712m746193n909302o775130p310744p220937o376446m875409
10518a720248k761775j81344K287426L974367M738375M888424M717093M501717
10510B0444035M587278M930496M917092M164910L107604K312650J844067J862214
10502D8170346K980238N160010P147209Q048233Q568341R629858J1022710J2847812
10494A13574757J6706243K3315244L0473866L5946055M0192991M1913092L2757206
10487C34879454M017766l8861904p4662767q4635323o9896211m7127992l0299665
10480f586642k1490529j6834051j3873874j1476321p974355k824502K182501N370340
$$ plain form
10535 58878211 54520442 51604525 49836350 48752910 47948021 47304457 46855877 46254729 44678625
10526 44678625 41493913 36747720 30838418 24063288 16752544 9531607 3155161 -1720248
10518 -1720248 -4482023 -4663367 -2375941 1598426 6336801 11225225 15942318 20444035
10510 20444035 25031313 29961809 34878901 39043811 42151415 44464065 46308132 48170346
10502 48170346 51150584 56310594 63457803 71506036 80074377 89704235 100726945 113574757
10494 113574757 130281000 153596244 184070110 220016165 260209156 302122248 334879454
10487 334879454 338897220 300035316 225372549 140737226 70841015 23713023 -6586642
10480 -6586642 -28077171 -44911222 -58785096 -70261417 -78235772 -81060274 -78877773 -73507433
10472g3507433P099757Q032258P501334N134466K480454J455516K233579L793191
10464c5776878N444589O766467P131885O416956N303202L975142J537383k243147
10456a444401n622314o604018n367427l809552l118381k860550k133621o12397
10448c1572661J373084K952030L024669J200776j564340l716129m378908l685155
10440c6366634k328475j225587j071192j580923j570177l91794J117573J768228
10432d1648981J629748J687572K233631K575871K276332J727901J313387P55228
10424b7449311l71613j964860l458457m189733l640752j826682L49309J575959
10416d0976140J303738K52082l82126J92J143857K338995K852431K357406J377351
$$ plain form
10472 -73507433 -66407676 -58375418 -50874084 -45739618 -43259164 -41803648 -39570069 -35776878
10464 -35776878 -30332289 -23565822 -16433937 -10016981 -4713779 -738637 798746 -1444401
10456 -1444401 -7066715 -13670733 -19038160 -22847712 -25966093 -28826643 -30960264 -31572661
10448 -31572661 -30199577 -27247547 -24222878 -23022102 -24586442 -28302571 -32681479 -36366634
10440 -36366634 -38695109 -39920696 -40991888 -42572811 -44142988 -44534782 -43417209 -41648981
10432 -41648981 -40019233 -38331661 -36098030 -33522159 -31245827 -29517926 -28204539 -27449311
10424 -27449311 -27820924 -29785784 -33244241 -37433974 -41074726 -42901408 -42552099 -40976140
10416 -40976140 -39672402 -39420320 -39802446 -39802254 -38658397 -36319402 -33466971 -31109565 -29732214
10407b9732214J125499K382812M425372N484409M593738K755176J842665K387047
10399d735496K964691K024339j48568j796468j746338m61808Q94225J694956J881761
10390E71294J430298L94570p52752j320206r14432M57321K573232M906239O475880
10381A3821444O294634M235592J399567m98707l03814J679243L792319M275451
10373C4695729K693746Q4131k368169m528416o956136r603152j1313016j0716784
10365h012067p472543k649661J918499M676965N049456L457201Q80127j602286
10357c754309l182151l690177l666146l762416l952777l554821k116476k8732
10349b7708005J834693K830093K822260K073572J011490j26153j440561k822882
$$ plain form
10407 -29732214 -28606715 -26223903 -21798531 -16314122 -11720384 -8965208 -7122543 -4735496
10399 -4735496 -1770805 253534 104966 -1691502 -3437840 -3899648 -3005423 -1310467 571294
10390 571294 2001592 2396162 1643410 323204 -591228 -133907 2439325 7345564 13821444
10381 13821444 20116078 24351670 25751237 25252530 24948716 26627959 30420278 34695729
10373 34695729 37389475 37473606 35105437 30577021 23620885 14017733 2704717 -8012067
10365 -8012067 -15484610 -18134271 -16215772 -11538807 -6489351 -3032150 -2152023 -3754309
10357 -3754309 -6936460 -10626637 -14292783 -18055199 -22007976 -25562797 -27679273 -27708005
10349 -27708005 -25873312 -23043219 -20220959 -18147387 -17135897 -17262050 -18702611 -21525493
10341b1525493l328523j825547J400913M332282N064556L582504J263827q13351
10333a1848832k362162l178491k992628k076882j221715r34630j183381j929136
10325b7727857l271210m955467o346053p060448p114376o334427m280155j060696
10317f8150689K284579M579547N373092M899815L725473K666465K426472K816971
10309c9378275K774070J639846N7634q93272j070626j176614j585302j955312
10301d1587851j887205j283803p7020J689249L357093L936741L288395K560836
10293c0003565L018446M691714O490715P330198O770219M919974K398890L88832
10285F005423M7568J461894L401446M363653L776081K161155M94438l44401J17248
$$ plain form
10341 -21525493 -24854016 -26679563 -25278650 -20946368 -15881812 -12299308 -11035481 -11848832
10333 -11848832 -14210994 -17389485 -20382113 -22458995 -23680710 -24615340 -25798721 -27727857
10325 -27727857 -30999067 -35954534 -42300587 -49361035 -56475411 -62809838 -67089993 -68150689
10317 -68150689 -65866110 -61286563 -55913471 -51013656 -47288183 -44621718 -42195246 -39378275
10309 -39378275 -36604205 -34964359 -34906725 -35799997 -36870623 -38047237 -39632539 -41587851
10301 -41587851 -43475056 -44758859 -44835879 -43146630 -39789537 -35852796 -32564401 -30003565
10293 -30003565 -26985119 -22293405 -15802690 -8472492 -1702273 3217701 5616591 6005423
10285 6005423 6052991 7514885 10916331 15279984 19056065 21217220 21711658 21367257 21484505
10276B1484505J548735K676386K044203p51227m672666q121537r998753r944353
10268e734707q074586m923734j438733J430286L214708L879077L492078K283188
10260e872423Q76310n6410n06406j095010k117517k965954k830773j746285n15054
10251a6829522L66934J266619K689545M310878N156922M770438L804163L192779
10243H728756K993239K471774J240856k71591j663982l261692n434656p573888
10235b771184q460655p642037n844573l924268j969199L32133K953372N551451
10227b1774960P849764R515271R853527Q210221M864314J223410j176058j929365
10219A6636124j961684k424244l478317m342706m454032m093797l610623k598665
$$ plain form
10276 21484505 23033240 25709626 27753829 27002602 22329936 14208399 4209646 -5734707
10268 -5734707 -13809293 -18733027 -20171760 -18741474 -15526766 -11647689 -8155611 -5872423
10260 -5872423 -4996113 -5052523 -5558929 -6653939 -8771456 -11737410 -14568183 -16314468 -16829522
10251 -16829522 -16462588 -15195969 -12506424 -8195546 -3038624 1731814 5535977 8728756
10243 8728756 11721995 14193769 15434625 15163034 13499052 10237360 4802704 -2771184
10235 -2771184 -11231839 -18873876 -24718449 -28642717 -30611916 -30279783 -27326411 -21774960
10227 -21774960 -13925196 -4409925 5443602 13653823 18518137 19741547 18565489 16636124
10219 16636124 14674440 12250196 8771879 4429173 -24859 -4118656 -7729279 -10327944
10211a0327944o15933J513116K119340P05644j238067j907754j097642m975K34597
10202a0619618p95702k942475n300398o194016m481098j071372J693137K476055
10194b7235487K127425K200672L047723L890941M162186M011322L738882L423277
10186f33059L068113K517220J181842j489424m938958p405237p477299n601409
10178b0778211l549583k439279j816514p58142Q47070K579941M395740O336142
10170a5182836P577094O849013M089961Q30955j494625k861403l745338l790681
10162g727860k420665k89564J122422J386091J493906K057228K121803M42371
10154a814268k641591n320654o131633n202869l809423l078758l145293l313308
$$ plain form
10211 -10327944 -10943877 -9430761 -7311421 -6605777 -7843844 -9751598 -10849240 -10854215 -10619618
10202 -10619618 -11415320 -14357795 -19658193 -25852209 -30333307 -31404679 -29711542 -27235487
10194 -27235487 -25108062 -22907390 -19859667 -15968726 -11806540 -7795218 -4056336 -633059
10186 -633059 2435054 4952274 6134116 4644692 -294266 -7699503 -15176802 -20778211
10178 -20778211 -24327794 -26767073 -28583587 -29341729 -28494659 -25914718 -21518978 -15182836
10170 -15182836 -7605742 -756729 3333232 4164187 2669562 -191841 -3937179 -7727860
10162 -7727860 -10148525 -10438089 -9315667 -7929576 -6435670 -4378442 -2256639 -1814268
10154 -1814268 -4455859 -9776513 -15908146 -21111015 -24920438 -27999196 -31144489 -34457797
10146c4457797k884260j776141m11584O86848J000623J46790j510795k608992
10138d1815308j936205P9088J775654K360810K792006M107230N671538N908844
10130b1056343M320538J860522n22462k740063m749902n729548m722733j844999
10122c5184990J691874M745528O992447Q359737Q212232N843728J907617j358088
10114A210085k013449l04598J893876L267238L906337M126651L647871K469500
10106A8203511J608417K062284L491596M697673N066009M773210L843064J938370
10098D5684134p70660l203483m137112l155838r10471J234387K011862J300122
10090C8052941L98744P63097K348477L604685L219628J513436m5174m70705l01111
$$ plain form
10146 -34457797 -37342057 -39118198 -39529782 -38842934 -37842311 -37695521 -39206316 -41815308
10138 -41815308 -43751513 -43672425 -41896771 -39535961 -36743955 -32636725 -26965187 -21056343
10130 -21056343 -16735805 -14875283 -15397745 -18137808 -22887710 -28617258 -33339991 -35184990
10122 -35184990 -33493116 -28747588 -21755141 -13395404 -5183172 660556 2568173 1210085
10114 1210085 -803364 -1107962 785914 4053152 7959489 12086140 15734011 18203511
10106 18203511 19811928 21874212 25365808 30063481 35129490 39902700 43745764 45684134
10098 45684134 44913474 41709991 37572879 34417041 33506570 34740957 36752819 38052941
10090 38052941 38451685 39214782 41563259 45167944 48387572 49901008 49855834 49385129 49084018
10081D9084018j106735l867247p669507j0194336r750232o691329k724979O77942
10073G757595K763418L045295J448530j081050k988120l439701k790317j721884
10065B993766n95409K36095K77903m88611j354150j682816j603738j557754j511011
10056e285725j014798J65653J781823L288058M089873L814571K569995Q55950
10048A0265400q25584k115670k640220k100269o32670J191057K770310L640528
10040I552882L386329J910835j83173j994140l174154l896236m013075k996873
10032a407605r19073J244625K647299L298965L473357L154147K561284K444653
10024A6497652L076201L492750K584141O06718j151657j933984j961239j558988
$$ plain form
10081 49084018 47977283 44110036 36440529 26246193 16495961 9804632 7079653 7757595
10073 7757595 10521013 13566308 15014838 13933788 10945668 7505967 4715650 2993766
10065 2993766 2398357 2634452 2912355 2423744 1069594 -613222 -2216960 -3774714 -5285725
10056 -5285725 -6300523 -6134870 -4353047 -1064989 3024884 6839455 9409450 10265400
10048 10265400 9439816 7324146 4683926 2583657 1950987 3142044 5912354 9552882
10040 9552882 12939211 14850046 14666873 12672733 9498579 5602343 1589268 -1407605
10032 -1407605 -2326678 -1082053 1565246 4864211 8337568 11491715 14052999 16497652
10024 16497652 19573853 23066603 25650744 26257462 25105805 23171821 21210582 19651594
10016A9651594p56932K07233Q27217J042919J425662K337819L270388L244121
10008C1250021J667592j195634m265980o129302n908149l890965j171733J309560
10000A1665410L153296M103983L852719K501269Q64633j18438k87605l55502j041141
9991B4338624k264298l349117l918430m261094m732865n231010n612304o164915
9983a1195409o952274o988104n124337j907094N20908Q57970M1385m46664p05433
9974c1899052j784561l599426m816411m684424l799013k885894j785416M0015
9966e5214182K679513N724509Q501992J0195603J0303653R209984P872048O810015
9958F083135N812839M641888L412270K114472L95770j782421l666770m291075
$$ plain form
10016 19651594 18894662 19101895 19929112 20972031 22397693 24735512 28005900 31250021
10008 31250021 32917613 31721979 27455999 21326697 15418548 11527583 10355850 11665410
10000 11665410 14818706 18922689 22775408 25276677 26141310 26022872 25735267 25379765 24338624
9991 24338624 22074326 18725209 14806779 10545685 5812820 581810 -5030494 -11195409
9983 -11195409 -18147683 -25135787 -30260124 -32167218 -31646310 -30788340 -30746955 -31193619 -31899052
9974 -31899052 -33683613 -37283039 -42099450 -46783874 -50582887 -53468781 -55254197 -55214182
9966 -55214182 -52534669 -46810160 -38308168 -28112565 -17808912 -8598928 -726880 6083135
9958 6083135 11895974 16537862 19950132 22064604 22460374 20677953 17011183 12720108
9950A2720108l360229j367020R25508K883656M057055M119331K906740O62742
9942B3547891j708589k948815k410930p18185P72327J138336M25825p34697j755075
9933A5608088k478156l170049l996529m476946l890524k364401r23578j12921
9925e805016O97453K051502L199958K993923J396394p86585l076844n149734o025592
9916a0504541m752855j710056J878794N412894Q704199J0753218J0373118Q023041
9908B8177812N525500L930096L108085L302596N171225Q079793J0345806J1777463
9900G9418376J4363071K0188943L0356420M5204399O1724021P0025233N7782368
9893C79062831K3021382j9533596m9430632n7825492n1577193m2123447l5036059
$$ plain form
9950 12720108 9359879 7992859 8918367 11802023 15859078 19978409 22885149 23547891
9942 23547891 21839302 18890487 16479557 15761372 16533699 17672035 18097860 17363163 15608088
9933 15608088 13129932 9959883 5963354 1486408 -2404116 -4768517 -5692095 -5805016
9925 -5805016 -5107563 -3056061 143897 3137820 4534214 3747629 670785 -4478949 -10504541
9916 -10504541 -15257396 -16967452 -15088658 -9675764 -971565 9781653 20154771 28177812
9908 28177812 33703312 37633408 40741493 44044089 49215314 57295107 67640913 79418376
9900 79418376 93781447 113970390 144326810 189531209 251255230 321280463 379062831
9893 379062831 402084213 382550617 333119985 275294493 223717300 181593853 146557794
9886A46557794l0298728k7063540k4723373k1962886j7956875j3696499j0396243
9879D59650p595130m363460j368337m6280l10622o08863j0548R57069J378140
9870a1508381Q66757m04593j682768j751003M8810K802592M672099M726266L751340
9861A521119L191381L620970M351899M316646L159134J393821m21685k277769
9853A8855516m168213n360725m936255l037594r61611K2171n85148k724625n762348
9844h658832q176317q389818o484556m307496l330564l087518k256511n61617
9836d5253229J104547J897730J670832Q68073M21122J288846L366566N184366
9828b9451147N399254M346196L477116L544727M066412M395576M491406M500677
$$ plain form
9886 146557794 116259066 89195526 64472153 42509267 24552392 10855893 459650
9879 459650 -7135480 -11498940 -12867277 -12913557 -13224179 -13833042 -13843590 -12886521 -11508381
9870 -11508381 -10641624 -11046217 -12728985 -14479988 -14431178 -11628586 -6956487 -2230221 1521119
9861 1521119 4712500 8333470 12685369 17002015 20161149 21554970 21133285 18855516
9853 18855516 14687303 9326578 4390323 1352729 391118 413289 -171859 -2896484 -8658832
9844 -8658832 -16835149 -25224967 -31709523 -36017019 -39347583 -42435101 -44691612 -45253229
9836 -45253229 -44148682 -42250952 -40580120 -39712047 -39290925 -38002079 -34635513 -29451147
9828 -29451147 -24051893 -19705697 -16228581 -12683854 -8617442 -4221866 269540 4770217
9820D770217M197868L141985J179931j280644l421944m593573m834198m526423
9812e366781l476641r66211K873316O337638P494570N966969K875797n34220l506651
9803A1697786n431260n882493n054156l521006j629448K91801J353844O26542
9795g548390j673559m198223n738094n906769m744764k597778m96813L48973j22887
9786c2678304p36605o59698k95905j63189K52589J740915M020121N945829O734450
9777a5839797O324245M908693K918727J245595O07244O45945L49003n72695j395981
9768h09021j580165j541564j957107k915905m133986n429379o440958o323618
9760c1131703m443909j267264K016277M683545O728303P950166P548552N038830
$$ plain form
9820 4770217 8968085 12110070 13290001 12009357 8587413 3993840 -840358 -5366781
9812 -5366781 -8843422 -9809633 -6936317 -598679 6895891 12862860 15738657 15204437 11697786
9803 11697786 6266526 384033 -4670123 -8191129 -9820577 -9528776 -8174932 -7548390
9795 -7548390 -9221949 -13420172 -19158266 -25065035 -29809799 -32407577 -32904390 -32555417 -32678304
9786 -32678304 -33414909 -34074607 -34370512 -34533701 -34281112 -32540197 -28520076 -22574247 -15839797
9777 -15839797 -9515552 -4606859 -1688132 -442537 164707 810652 1159655 586960 -809021
9768 -809021 -2389186 -3930750 -5887857 -8803762 -12937748 -18367127 -24808085 -31131703
9760 -31131703 -35575612 -36842876 -34826599 -30143054 -23414751 -15464585 -7916033 -2877203
9752b877203J165563k515923m786128n298615m375273k708457j022694M52785
9744b1965945K066232L922205N250088N240808M385650M121857M937649N666186
9736A3624730N129949L707104K500901J568793Q5736j891653l015435k399376
9728A9310749r45105l18818j097563k497306l576592m063782m128257l955474
9720a272148l639570l056506j766881M89661L028079M455448M110408K928350
9712E276841K292184K177227J182790j395950m251784n415538m529565l064952
9704g728747k379220k280523j704986k42850J368412J952303Q41627j555838l851482
9695a5581304m631424l704011k308779j876110k689888l839236m152362k986504
$$ plain form
9752 -2877203 -1711640 -4227563 -9013691 -14312306 -18687579 -21396036 -22418730 -21965945
9744 -21965945 -19899713 -15977508 -10727420 -5486612 -1100962 3020895 7958544 13624730
9736 13624730 18754679 22461783 24962684 26531477 26617213 24725560 21710125 19310749
9728 19310749 18365644 18046826 16949263 14451957 10875365 6811583 2683326 -1272148
9720 -1272148 -4911718 -7968224 -9735105 -9245444 -6217365 -1761917 2348491 5276841
9712 5276841 7569025 9746252 10929042 9533092 5281308 -134230 -4663795 -7728747
9704 -7728747 -10107967 -12388490 -14093476 -14336326 -12967914 -11015611 -10173984 -11729822 -15581304
9695 -15581304 -20212728 -23916739 -26225518 -28101628 -30791516 -34630752 -38783114 -41769618
9687d1769618n45737K112275L634938L448595K245390J156147O88451Q02922J590738
9678b6635899L142630M900966N951447O101225O027559O177583O141315N397156
9670A7203982M114511K834928J813910J091671Q22052J051042J434736J630914
9662C1997746J756305J994560J938238Q99744j079886l010075l909513l688560
9654B6898559k970586k372394k186244k494638l188349l852991l965356l407124
9646B460877k619113j984899j157203N55682K922086M328569L172437k78624l852077
9637C547735n389754m384491j778174J162143L362659L933484K522723j82154
9629B794171k766479m137537m182564l501314k785711k419671k291292j812844
$$ plain form
9687 -41769618 -42315355 -40203080 -36568142 -33119547 -30874157 -29718010 -29029559 -28226637 -26635899
9678 -26635899 -23493269 -18592303 -12640856 -6539631 -512072 5665511 11806826 17203982
9670 17203982 21318493 24153421 25967331 27059002 27881054 28932096 30366832 31997746
9662 31997746 33754051 35748611 37686849 38586593 37506707 34496632 30587119 26898559
9654 26898559 23927973 21555579 19369335 16874697 13686348 9833357 5868001 2460877
9646 2460877 -158236 -2143135 -3300338 -2744656 177430 4505999 7678436 7399812 3547735
9637 3547735 -1842019 -6226510 -8004684 -6842541 -3479882 453602 2976325 2794171
9629 2794171 27692 -4109845 -8292409 -11793723 -14579434 -16999105 -19290397 -21103241
9621b1103241l40800K211858N178626P541632Q492287P794994N939942L948489
9613A9663787K679138K162800J823811J388140J176662J295406J030800l46868
9605C0873676k350016l552287l301417k610095k954657m544807o234075o899168
9597a572846o359163n018921l271689j523956l42158j25476p41439j677659k359917
9588b2993224k174007n73008K346261N487109P427087P529322O191830M152082
9580G393452J924497j86794k061406l881138n854554p658649q515012p964612
9572b6804216o190008l471266O7046L759145O030051N548563K724403n12600k506552
9563b1355434l083499l054338l099027l341012l562272l452101k780461j541128
$$ plain form
9621 -21103241 -21444041 -19232183 -14053557 -6511925 1980362 9775356 15715298 19663787
9613 19663787 22342925 24505725 26329536 27717676 28894338 30189744 31220544 30873676
9605 30873676 28523660 24971373 21669956 19059861 16105204 11560397 5326322 -1572846
9597 -1572846 -7932009 -12950930 -16222619 -17746575 -18088733 -18214209 -18955648 -20633307 -22993224
9588 -22993224 -25167231 -25740239 -23393978 -17906869 -10479782 -2950460 3241370 7393452
9580 7393452 9317949 9131155 7069749 3188611 -2665943 -10324592 -18839604 -26804216
9572 -26804216 -32994224 -36465490 -36398444 -32639299 -26609248 -21060685 -18336282 -18848882 -21355434
9563 -21355434 -24438933 -27493271 -30592298 -33933310 -37495582 -40947683 -43728144 -45269272
9555d5269272J21208K090363M111180N444299N210465L464462J597668J123314
9547b2106313K086338L078446K787395J060452j556739m570882p319554q572524
9539c5113381p323187m100407q06350J079479J723169K186326L061418M293505
9531c4999428N734592P014930P126155N145371J586728j714894l353797l386843
9523a6847186k486787j019286M66724P84230p00935k796648l549203k572271j326916
9514c0048278j010710j267659j388549j684334k718557l755352l051997K29977
9506d4695459M967988Q957344J0528924R556951P463108O167552O411372O945170
9498A6302950N821577K670857o78311k027713r29818J190819K649635K887581
$$ plain form
9555 -45269272 -45148064 -43057701 -38946521 -33502222 -28291757 -24827295 -23229627 -22106313
9547 -22106313 -20019975 -16941529 -14154134 -13093682 -14650421 -19221303 -26540857 -35113381
9539 -35113381 -42436568 -46536975 -47343325 -46263846 -44540677 -42354351 -39292933 -34999428
9531 -34999428 -29264836 -22249906 -15123751 -9978380 -8391652 -10106546 -13460343 -16847186
9523 -16847186 -19333973 -20353259 -19886535 -19102305 -19803240 -22599888 -26149091 -28721362 -30048278
9514 -30048278 -31058988 -32326647 -33715196 -35399530 -38118087 -41873439 -44925436 -44695459
9506 -44695459 -39727471 -30770127 -20241203 -10684252 -3221144 2946408 9357780 16302950
9498 16302950 22124527 24795384 24117073 22089360 21159542 22350361 24999996 27887577
9490B7887577K478544K181475K057938J411864l49935k769407m493970m590595
9482B3813491l522185k580176k542316l200957l983178m477128m341366l325357
9474d159172j713570l48909J76597J48515L15225J175576K956864N738529Q829733
9465A3119388J0313961Q329598L222536k267411n462318n948585n029507l743592
9457A2534070k252878p49811J64531K29894p0835j62658L6916L66838P58992J086288
9447A1941347J137971J038461J275075J979212K554849K384291J557233M90739
9439B4359178q42117k751914n021490o734834o952883n360100k455383N85010
9431e174533K535162L146717L431699M429775N804270O188833M827346K275674
$$ plain form
9490 27887577 30366121 32547596 34605534 36017398 35667463 32898056 28404086 23813491
9482 23813491 20291306 17711130 15168814 11967857 7984679 3507551 -833815 -4159172
9474 -4159172 -5872742 -6221651 -6045054 -5896539 -5581314 -4405738 -1448874 4289655 13119388
9465 13119388 23433349 31762947 34985483 32718072 27255754 21307169 16277662 12534070
9457 12534070 10281192 9531381 9695912 9925806 9854971 9692313 9729229 10096067 10855059 11941347
9447 11941347 13079318 14117779 15392854 17372066 19926915 22311206 23868439 24359178
9439 24359178 23517061 20765147 15743657 9008823 2055940 -3304160 -5759543 -5174533
9431 -5174533 -2639371 507346 3939045 8368820 14173090 20361923 25189269 27464943
9423B7464943m19799k447462l075270j783296Q41911K977427L054117J175816
9415B7788387j297790l173096l998624l754301k766514j796878j501336j673793
9407G826055j423627j29867K045233M391610N976011N961691M253274J873862
9399C0774242K07489k01008K61758J207164K608065M202966N250171N170715L984151
9390E3465713J968293n57021k930580m301501m467561m049940l522742k706438
9382C2898223j651712j237187k050973l218748l372061k547684k051261k372629
9374A4395968k276683l79564L098119O583558Q569916Q362299O036548K400001
9366D6790162j210283l733288n070301n677800n603272m372788j873082J093175
$$ plain form
9423 27464943 27045144 24597682 21522412 19739116 20581027 23558454 26612571 27788387
9415 27788387 26490597 23317501 19318877 15564576 12798062 11001184 9499848 7826055
9407 7826055 6402428 6272561 8317794 12709404 18685415 24647106 28900380 30774242
9399 30774242 30981731 30780723 31042481 32249645 34857710 39060676 44310847 49481562 53465713
9390 53465713 55434006 54876985 51946405 47644904 43177343 39127403 35604661 32898223
9382 32898223 31246511 30009324 27958351 24739603 21367542 18819858 16768597 14395968
9374 14395968 12119285 11739721 14837840 21421398 29991314 38353613 44390161 46790162
9366 46790162 45579879 41846591 36776290 31098490 25495218 21122430 19249348 20342523
9358B0342523L384866M434915M343842L247180J059787j919133m473391n146623
9350B5273966l702733j593661o17964j233351k453886l174698l093997k405373
9342F998303j268645P3612J098299J378622R67879O7576j450528l667063n758110
9333a560055o088897l619450Q43070N085603P303169P404259O504645N377392
9325B1249736L773383J321413j364045k959806k762159j377539r0597J37049q77804
9316A7049631k509957l533618k893708p82078J257191J752216Q18760l8189L76988
9307A1497236J676910K311934J119138j491093l768441m146095k700365j058965
9299C440259q23196k216654m224106n603487n565159m001972j613873M68315J775701
$$ plain form
9358 20342523 23727389 28162304 32506146 35753326 36813113 34893980 30420589 25273966
9350 25273966 21571233 19977572 19359608 18126257 15672371 12497673 9403676 6998303
9342 6998303 5729658 5803270 6901569 8280191 9248070 9315646 7865118 4198055 -1560055
9333 -1560055 -7648952 -11268402 -10425332 -5339729 1963440 9367699 15872344 21249736
9325 21249736 25023119 26344532 24980487 22020681 19258522 17880983 17790386 17927435 17049631
9316 17049631 14539674 11006056 8112348 7330270 8587461 10339677 11158437 11120248 11497236
9307 11497236 13174146 15486080 16605218 15114125 11345684 7199589 4499224 3440259
9299 3440259 2617063 400409 -3823697 -9427184 -14992343 -18994315 -20608188 -20139873 -18364172
9290a8364172L106911N500610Q658181J0910402J0739821P895928L227531j775297
9282B9899915n261688n915648m228488k327538j947656k889816l803700l877412
9274c52031l145208j714836L27482K392773L679615M106489M256772M270559L502628
9265A7324243J573724q39432k669584l494978l543797l054890k109271r12647
9257B273368J65086Q20214R45937P22591P08560J489393K925781M068564M242223
9248A8361717L953235M192865M988192N265153M188112K042985l68223k612006
9240D0012030m551788n904753o446823o459862o461632o539442o380709n952622
9232h685601n672183n721167n568762m493037k400775J51332K622439M813170
$$ plain form
9290 -18364172 -15257261 -9756651 -1098470 9811932 20551753 28447681 31675212 29899915
9282 29899915 24638227 18722579 14494091 12166553 10218897 7329081 3525381 -352031
9274 -352031 -3497239 -5212075 -4884593 -2491820 1187795 5294284 9551056 13821615 17324243
9265 17324243 18897967 18058535 15388951 11893973 8350176 5295286 3186015 2273368
9257 2273368 2438454 3258668 4204605 4927196 5635756 7125149 10050930 14119494 18361717
9248 18361717 22314952 26507817 31496009 36761162 40949274 42992259 42624036 40012030
9240 40012030 35460242 29555489 23108666 16648804 10187172 3647730 -2732979 -8685601
9232 -8685601 -14357784 -20078951 -25647713 -30140750 -32541525 -32390193 -29767754 -24954584
9224b4954584O495433P122476O273949M318179K301843J063240O50947P37269
9216D008752J350699K851317N190758P489654Q485355P342820M176112J52965
9208D1048432k872130l385919j452124J093396K049482O24769k157823m578831
9200C0369252n496318m788057l166155j772924j533621k471978l703160m311997
9192C125042m200253l938894l899260l767153k925897j110423J434323M314025
9184a0968490P266780R957408J1610731J1206902Q385540M148402K92615k174504
9176C9725384l968106o540317j0044847j2571783j1784534p353529j494498L000607
9168a1031623M972015M993750L835837J645553j313325l985712n237250m944631
$$ plain form
9224 -24954584 -18459151 -11336675 -5062726 -744547 1557296 2620536 3271483 4008752
9216 4008752 5359451 8210768 13401526 20891180 29376535 36719355 40895467 41048432
9208 41048432 38176302 34790383 33338259 34431655 36481137 37105906 34948083 30369252
9200 30369252 24872934 20084877 16918722 15145798 13612177 11140199 7437039 3125042
9192 3125042 -1075211 -5014105 -8913365 -12680518 -15606415 -16716838 -15282515 -10968490
9184 -10968490 -3701710 6255698 17866429 29073331 37458871 41607273 41899888 39725384
9176 39725384 35757278 29216961 19172114 6600331 -5184203 -12537732 -14032230 -11031623
9168 -11031623 -6059608 -1065858 2769979 4415532 3102207 -883505 -6120755 -11065386
9160a1065386l901541k861449k087394j548102r53987K51868K272023M313795
9152a5580173N199389M705891L705305K903942K181165J403689J041614J394265
9144F955087J843885J582531O49820m07934j461056k560118l120343k389616p78936
9135C13320K30068j63459j123786j339650n52776M92981J129141J256036J051327
9126A293202P20307M87964M97821P08401J032080J457881J904630K154558K136779
9117A2393623K084028K163642K137699J703373J035646N94769M06182j3234p96238
9108B1709490j170364k57539J558610K487936Q78643l140751p676038j0572751
9100C817236j0765531q501454m908870j487516O19331J401309J816314K472281
$$ plain form
9160 -11065386 -14966927 -17828376 -19915770 -21463872 -22417859 -22165991 -19893968 -15580173
9152 -15580173 -10380784 -5674893 -1969588 934354 3115519 4519208 5560822 6955087
9144 6955087 8798972 10381503 11031323 10623389 9162333 6602215 3481872 1092256 313320
9135 313320 543388 379929 -743857 -2083507 -2636283 -2143302 -1014161 241875 1293202
9126 1293202 2013509 2501473 2999294 3707695 4739775 6197656 8102286 10256844 12393623
9117 12393623 14477651 16641293 18778992 20482365 21518011 22112780 22518962 22505728 21709490
9108 21709490 20539126 20281587 21840197 24328133 25206776 22066025 14389987 3817236
9100 3817236 -6948295 -15449749 -20358619 -21846135 -21226804 -19825495 -18009181 -15536900
9092a5536900K745377J687242m45012k232126k634001j834946m78114J189822
9084a7538658L013107M348679M433825L195610J292071n80305k137196l341925
9076g314792m086770m171768l616252k942158k844456l256782l010419j065976
9068c2309373J924874M036759M287017L689313L662186M143657M032824K952764
9060c579979J640596Q30547O58284J107980K137455L177280L260524J963674k80753
9051A0915608k927420n718850q109354r038186p881756n260229k390000J08430
9043c0301757K329685M297309N638809O054106N718876N137745M765838M700118
9035H340729M532161L601606J669233o55481k334380k734584j956032n16859J006746
$$ plain form
9092 -15536900 -12791523 -11104281 -11549293 -13781419 -16415420 -18250366 -18728480 -17538658
9084 -17538658 -14525551 -10176872 -5743047 -2547437 -1255366 -1835671 -3972867 -7314792
9076 -7314792 -11401562 -15573330 -19189582 -22131740 -24976196 -28232978 -31243397 -32309373
9068 -32309373 -30384499 -26347740 -22060723 -18371410 -14709224 -10565567 -6532743 -3579979
9060 -3579979 -1939383 -1108836 -450552 657428 2794883 5972163 9232687 11196361 10915608
9051 10915608 7988188 2269338 -5840016 -14878202 -22759958 -28020187 -30410187 -30301757
9043 -30301757 -27972072 -23674763 -18035954 -11981848 -6262972 -1125227 3640611 8340729
9035 8340729 12872890 16474496 18143729 17488248 15153868 12419284 10463252 9946393 10953139
9026A0953139K132181K672351K956789L637389N046965O726426P621933O779335
9018D8526508L999643N1284l683824n934540o160967m687548k419103m56176K74355
9009B9509632o00798k691531n053543o694598o988112n850321l785848j708596
9001c863715l59628L08609J007143K183605L350866L572682K563756J071299J57082
8992I991699L08525J246460K282966K690826J977087J40324k286112m538105n965240
8983E848430o151385n010583k953449p08914J276588L033285M395355M547037
8975D276364K927559N00136o60542O45212L584439O218958P057257N648469K580317
8966C2778169n08454j659278l10823J908326K796884J813096J19221j199220k025338
$$ plain form
9026 10953139 13085320 15757671 18714460 22351849 27398814 34125240 41747173 48526508
9018 48526508 52526151 52577435 48893611 42959071 36798104 32110556 29691453 29235277 29509632
9009 29509632 28908834 26217303 21163760 14469162 7481050 1630729 -2155119 -3863715
9001 -3863715 -4223343 -3914734 -2907591 -723986 2626880 6199562 8763318 9834617 9991699
8992 9991699 10300224 11546684 13829650 16520476 18497563 18637887 16351775 11813670 5848430
8983 5848430 -302955 -5313538 -8266987 -8975901 -7699313 -4666028 -270673 4276364
8975 4276364 7203923 7704059 7043517 7688729 11273168 17492126 24549383 30197852 32778169
8966 32778169 32269715 30610437 30299614 32207940 35004824 36817920 36937141 35737921 33712583
8957C3712583k506316k605590k627710l208154m265888m719450l860537k460410
8949G458528j874918k440191l368157l913216l936563l410623k075192J32713
8941a3427619K609651M305514M461437L215725J517227L03341k53058m91530l85732
8932A854956N28079K183788L598509L967270L673473L533645L344954K059551
8924B4744225n02631k886858l396663j918706j0342O71668j94982j572965k165379
8915A2767367j468497R4129J811607L254107M270931M735169M482015L405111
8907C3351939J557769o86526k589008l523353l690294m054359n301832p051285
8899H013051q252213q072032o240364l021094P06048L693103N189953N404864
$$ plain form
8957 33712583 31206267 28600677 25972967 22764813 18498925 13779475 9918938 7458528
8949 7458528 5583610 3143419 -224738 -4137954 -8074517 -11485140 -13560332 -13427619
8941 -13427619 -10817968 -6512454 -2051017 1164708 2681935 2985276 2732218 2240688 1854956
8932 1854956 2383035 4566823 8165332 12132602 15806075 19339720 22684674 24744225
8924 24744225 24241594 21354736 17958073 16039367 16029025 16700693 16505711 14932746 12767367
8915 12767367 11298870 11392999 13204606 16458713 20729644 25464813 29946828 33351939
8907 33351939 34909708 34223182 31634174 28110821 24420527 20366168 15064336 8013051
8899 8013051 -239162 -8311194 -14551558 -17572652 -16866604 -13173501 -7983548 -2578684
8891b578684M785262L272789Q58285j522389k521342j776753p8739J816263L766853
8882F021545N567542O512975O036056M349800K272026P78610O16903J627488K367982
8873C6150927J257999j553466m144730m960907m288282l289640k523222k105738
8865A4542941k467583l837867n352461n689804m503412k490820l05526J649811
8857h454721K459882R34803k845936o923268q998120q324151n824493k800310
8849d0776314l4135K060586L060162K679427J285597P7404M47925K835785O093114
8840b2270449Q162248P660040N056086K428144J894257L881327O713409Q039479
8832B1564541O801537L770110L59026k565341m633365n470418m877336l257558
$$ plain form
8891 -2578684 2206578 5479367 6337652 4815263 2293921 517168 438429 2254692 6021545
8882 6021545 11589087 18102062 24138118 28487918 30759944 31538554 32155457 33782945 36150927
8873 36150927 37408926 35855460 31710730 26749823 22461541 19171901 16648679 14542941
8865 14542941 12075358 8237491 2885030 -2804774 -7308186 -9799006 -10104532 -8454721
8857 -8454721 -5994839 -5060036 -7905972 -14829240 -23827360 -32151511 -37976004 -40776314
8849 -40776314 -40810449 -38749863 -35689701 -33010274 -31724677 -31647273 -31199348 -28363563 -22270449
8840 -22270449 -14108201 -6448161 -1392075 1036069 2930326 6811653 13525062 21564541
8832 21564541 28366078 32136188 32495214 29929873 25296508 19826090 14948754 11691196
8824A1691196j344250M06019J832760K734083K941682K566593J792375O37779
8816B3258237o88844j517670j352354n38685K63766R69769J696896J826031N19762
8807B4436908j753059l299601l191816k268806j699414j449754q59424N8041Q32578
8798A0805653J563513K714474M047164M679919M280358L458283K816999K257069
8790C6623432J477934O43725J86432K41018N28623N44634l13147k408444n238463
8781C2285744p372282p568957o026930m103198k678612j303068O83331K681557
8773F597585L267313K027096J44117j116807j776269k498537l248819l394175
8765A504k785314j876498q92289L04202J504261K097376J831495R48803m44870
$$ plain form
8824 11691196 10346946 10752965 12585725 15319808 18261490 20828083 22620458 23258237
8816 23258237 22569393 21051723 19699369 19160684 19424450 20394219 22091115 23917146 24436908
8807 24436908 22683849 19384248 16192432 13923626 12224212 10774458 9915034 9973075 10805653
8798 10805653 12369166 15083640 19130804 23810723 28091081 31549364 34366363 36623432
8790 36623432 38101366 38745091 38931523 39172541 39701164 40245798 39932651 37524207 32285744
8781 32285744 24913462 17344505 11317575 7214377 4535765 3232697 3916028 6597585
8773 6597585 9864898 11891994 12036111 10919304 9143035 6644498 3395679 1504
8765 1504 -2783810 -4660308 -5552597 -5248395 -3744134 -1646758 184737 1133540 688670
8756F88670k280462l688858l370585j361119M75844M90571q13324j544430n35459
8747a1939152J987685N133230P699675Q245584O068880K281632r21281k265682
8739A6290571k155531j544622q35972j4567Q65054J647137K087273J740118L10716
8730A8390177j692619l096085l120337k073693r01965l04368k95172k98814L65349
8721F972473J785223L218801L819426L522006K896628K292626J601289P60787
8713B6869259o0210p93094j485980k005532k252995k668129l922526o013703q130305
8704d63215r352946q942963o246449j435979L506641N801015M602685J982978
8696a0548233N71028R45314J982926K871645L610742L962639L209126J164529
$$ plain form
8756 688670 -1591792 -5280650 -8651235 -10012354 -9536510 -9045939 -9859263 -11403693 -11939152
8747 -11939152 -9951467 -4818237 2881438 11127022 17195902 19477534 18556253 16290571
8739 16290571 14135040 12590418 11754446 11739879 12604933 14252070 16339343 18079461 18390177
8730 18390177 16697558 13601473 10481136 8407443 7505478 7201110 6905938 6607124 6972473
8721 6972473 8757696 11976497 15795923 19317929 22214557 24507183 26108472 26869259
8713 26869259 26809049 26015955 24529975 22524443 20271448 17603319 13680793 7667090 -463215
8704 -463215 -9816161 -18759124 -25005573 -26441552 -22934911 -17133896 -12531211 -10548233
8696 -10548233 -9977205 -9031891 -7048965 -4177320 -566578 3396061 6605187 7769716
8688G769716j349967l305600m328558m721098m998799n406012n607440m970652
8680b6918410l402917j653808m70984K06568Q22430J425895J934924K762306M323614
8671b0970382O069486O855881O306427N073404L743257K307065Q32122k50971
8663I966289r07371j748324k959805l570979k450106K70361L259569N208480N555439
8654A2623553M367363K231774L13591r4246J461250M040024N842105N490766L088769
8645C9364949J57595j609066j704953r96428p27010j559597l411588n656006p272198
8636A6585698p269214n420948k492937M29255K616668L588344K848078L45898
8628A1230842k898857n215429n553040m166096k087304k82638O16510K61293j191517
$$ plain form
8688 7769716 6419749 3114149 -1214409 -5935507 -10934306 -16340318 -21947758 -26918410
8680 -26918410 -30321327 -31975135 -32446119 -32239551 -31417121 -29991226 -28056302 -25293996 -20970382
8671 -20970382 -14900896 -8045015 -1738588 3334816 7078073 9385138 10217260 9966289
8663 9966289 9058918 7310594 4350789 779810 -1670296 -1399935 1859634 7068114 12623553
8654 12623553 16990916 19222690 19536281 19442035 20903285 24943309 30785414 36276180 39364949
8645 39364949 39522544 37913478 36208525 35212097 34485087 32925490 29513902 23857896 16585698
8636 16585698 9316484 3895536 1402599 1831854 4448522 8036866 10884944 11230842
8628 11230842 8331985 3116556 -2436484 -6602580 -8689884 -8972522 -8356012 -8094719 -9286236
8619i286236k838234l517901k929306k126511k461214l872793m581737k851311
8611c4465243J075843N101033P155339O571044L857597L2272l479340n074895
8603a9226350m013283j168569J786917L940595N486550O655251O972105N885952
8595F319168L739758J677978O20617N57603Q63875J110513J403390J949142K503272
8586B0745316K462452J456482l70103k615950m801414o232265o225700m921315
8578e02497l558748l378562m299772n152911n181080m761601m540771m452337
8570c5828279l980848l019664j983024j181465m67716M86292J798614L256283
8562d0919807M390428M702420M052253K892912J963749J662220J793053J952304
$$ plain form
8619 -9286236 -12124470 -15642371 -18571677 -20698188 -23159402 -27032195 -31613932 -34465243
8611 -34465243 -33389400 -28288367 -21133028 -14561984 -10704387 -10672115 -14151455 -19226350
8603 -19226350 -23239633 -24408202 -22621285 -18680690 -13194140 -6538889 433216 6319168
8595 6319168 10058926 11736904 12357521 12915124 13778999 14889512 16292902 18242044 20745316
8586 20745316 23207768 24664250 24294147 21678197 16876783 10644518 4418818 -502497
8578 -502497 -4061245 -7439807 -11739579 -16892490 -22073570 -26835171 -31375942 -35828279
8570 -35828279 -39809127 -42828791 -44811815 -45993280 -46460996 -45974704 -44176090 -40919807
8562 -40919807 -36529379 -31826959 -27774706 -24881794 -22918045 -21255825 -19462772 -17510468
8554a7510468J998327K007541J870847J216160q5743j441259j838688p91724J124056
8545a3450951K840620L861197M564847N406777O033800N469223L250214K05191
8537A8180918k148045l035522l053900l214529l626457l570407k797278k086794
8529e352014k193100k804995l152123l254871l763170m670258n096589m574296
8521c4861416l738589l335188l295624l427162m335082o635890r454508j0723708
8513g9807167r237768n796027k132111P04424K684837M160074N373507O306443
8505g7743788O647271O149449N266981N082575O206976P981613R173260R298034
8497b1937629Q877123Q523134Q195411P329979N386089K355289r21442l085389
$$ plain form
8554 -17510468 -15512141 -13504600 -11633753 -10417593 -10503336 -11944595 -13783283 -14575007 -13450951
8545 -13450951 -10610331 -6749134 -2184287 3222490 9256290 14725513 17975727 18180918
8537 18180918 16032873 12997351 9943451 6728922 3102465 -467942 -3265220 -5352014
8529 -5352014 -7545114 -10350109 -13502232 -16757103 -20520273 -25190531 -30287120 -34861416
8521 -34861416 -38600005 -41935193 -45230817 -48657979 -52993061 -59628951 -69083459 -79807167
8513 -79807167 -89044935 -94840962 -96973073 -96268649 -93583812 -89423738 -84050231 -77743788
8505 -77743788 -71096517 -64947068 -59680087 -54597512 -48390536 -40408923 -31235663 -21937629
8497 -21937629 -13060506 -4537372 3658039 10988018 16374107 18729396 17807954 14722565
8489A4722565l419223k684787k296729k576317k377023o85033J907819L693345
8481F284617L442458J183303k159287n310105p070815o952516n640304m516549
8473b0739198m513715n442301o262477n788537l393688M20529M077827O003646
8465c5637914N915999M917539M304425M505151N081913N276371M401715K165775
8457I30974r93573m019552n883035o066889m523762j622352J686813M128386M977727
8448a1385263M542984L556750K345877Q69073p31222k042315k742832k782279
8440h369227k342584j778250j253406k07864K248006N828116Q474902Q208112
8432A0807805N446642K592465J270738Q94291J41380j168003k246264k614205
$$ plain form
8489 14722565 11303342 8618555 6321826 3745509 1368486 683453 2591272 6284617
8481 6284617 9727075 10910378 8751091 3440986 -3629829 -10582345 -16222649 -20739198
8473 -20739198 -25252913 -30695214 -36957691 -42746228 -46139916 -45719387 -41641560 -35637914
8465 -35637914 -29721915 -24804376 -20499951 -15994800 -10912887 -5636516 -1234801 930974
8457 930974 -62599 -4082151 -9965186 -16032075 -20555837 -22178189 -20491376 -16362990 -11385263
8448 -11385263 -6842279 -3285529 -939652 -70579 -801801 -2844116 -5586948 -8369227
8440 -8369227 -10711811 -12490061 -13743467 -13951331 -11703325 -5875209 2599693 10807805
8432 10807805 16254447 18846912 20117650 21011941 21153321 19985318 17739054 15124849
8424A5124849k452691k119332j984064k458596l585684m754453n270994n031112
8416a2532077m281490l061939j391068K94706J499246K308983L126072L905293
8408a0132274M216948L928604L206036J941689r6315k494237m270567m891286
8400h591402m606500l658032j898654M62156K435598L151933K770763K013665
8392g920473J162756L8103j322169k518971l210297l254575k586080j371198j72876
8383b1155780M64356N44278M08451J65506j95296k23336Q12084K905027M878667
8374a1396043N283491L587545M18503k989901n301315n408708l003310Q58981
8366a7950757M097148N064215L889647K207348J429635J475537J342720N93571
$$ plain form
8424 15124849 12672158 10552826 8568762 6110166 2524482 -2229971 -7500965 -12532077
8416 -12532077 -16813567 -19875506 -21266574 -20971868 -19472622 -17163639 -14037567 -10132274
8408 -10132274 -5915326 -1986722 1219314 3161003 3064688 570451 -3700116 -8591402
8400 -8591402 -13197902 -16855934 -18754588 -18292432 -15856834 -12704901 -9934138 -7920473
8392 -7920473 -6757717 -6719614 -8041783 -10560754 -13771051 -17025626 -19611706 -20982904 -21155780
8383 -21155780 -20691424 -20147146 -19738695 -19573189 -19768485 -19991821 -19179737 -16274710 -11396043
8374 -11396043 -6112552 -2525007 -2106504 -5096405 -10397720 -15806428 -18809738 -17950757
8366 -17950757 -13853609 -8789394 -4899747 -2692399 -1262764 212773 1555493 2149064
8358B149064j95903l19682L27763J489768K915130M204764M800893M521728L733138
8349B3626663K676973J125355q65859k451331k948753k809410k738443k227279
8341A3387916j68469L049278N307085N035973K715510l83992l821754p404751
8333A7716796r869432r550439o293812j709111K531785N814893P949304Q395654
8325A4985638O718951L387127l72299l414051n226415n888433n728395m996909
8317e34786l854106k706749k279225k913535l860833l805733k278224j40922J509169
8308b0864944K454551L022121L080021K049575n6191k110526k673701j232728
8300a6331822J375207L628764M429138L800623K686850K054383K158362K637494
$$ plain form
8358 2149064 1953161 1633479 1961242 3451010 6366140 10570904 15371797 19893525 23626663
8349 23626663 26303636 27428991 26563132 24111801 21163048 18353638 15615195 13387916
8341 13387916 13219447 16268725 21575810 26611783 29327293 28943301 25121547 17716796
8333 17716796 7847364 -1703075 -7996887 -9705998 -7174213 -1359320 6589984 14985638
8325 14985638 21704589 25091716 24719417 21305366 16078951 10190518 4462123 -534786
8317 -534786 -4388892 -7095641 -9374866 -12288401 -16149234 -19954967 -22233191 -22374113 -20864944
8308 -20864944 -18410393 -15388272 -12308251 -10258676 -10314867 -12425393 -15099094 -16331822
8300 -16331822 -14956615 -11327851 -6898713 -3098090 -411240 1643143 3801505 6438999
8292F438999L122423L489880L549960K853193J102415j333809l574183m934288
8284A0714590n350283n128598m530633l703878k731168j436906O79978L826229
8276g660669P101322Q738108P544848L997780l07852m065289o787855q225276
8268C35117q005423o166919l595054j425223n3998J012287K400548M173967N791689
8259e533009O503275N824559L925437J666648Q1004l54115P106L29878j27019
8250A2323764j549713l313494m190276l244618q37185J413863J954992O32224
8242C189557j300510k340414j840964l00856J066627J185234J1070j283988j329930
8233b944174L9349J529819J605719j57296k840045m909877n129469l302628n75085
$$ plain form
8292 6438999 9561422 13051302 16601262 19454455 20556870 19223061 15648878 10714590
8284 10714590 5364307 235709 -4294924 -7998802 -10729970 -12166876 -11486898 -7660669
8276 -7660669 -559347 8178761 15723609 19721389 19413537 15348248 8560393 335117
8268 335117 -7670306 -13837225 -17432279 -18857502 -18911500 -17899213 -15498665 -11324698 -5533009
8259 -5533009 970266 6794825 10720262 12386910 12467914 12113799 12120905 12450783 12323764
8250 12323764 10774051 7460557 3270281 25663 -811522 602341 2557333 3189557
8242 3189557 1889047 -451367 -2292331 -2593187 -1526560 -341326 -330256 -1614244 -2944174
8233 -2944174 -2904825 -1375006 230713 73417 -2766628 -7676505 -12805974 -16108602 -16683687
8224a6683687J291016J457272P78153O97070J530967K313905K233415J566244
8216d815645R90500N43308k79423j641590k988930l504183k779012j205448J22511
8207a5557912J40658j196220k671619k781056j026603J709931L875162M264105
8199a3243554K683931j9205k587004m137853m365168l214958r57163J280678J821416
8190b2738880K1708k744346m353512l988886k283414K36587L674611P513335J0031833
8181a4630964R831845P368204M219648J325805j200880k895053k787288p57584
8173D73733J775392L082511K716145J563937O57647K87132N8407n42803j562080
8164H510021k325979j936919k77231J631453K567203K275944J377557K92845j144006
$$ plain form
8224 -16683687 -15392671 -13935399 -13157246 -12460176 -10929209 -8615304 -6381889 -4815645
8216 -4815645 -3825145 -3281837 -3561260 -5202850 -8191780 -11695963 -14474975 -15680423 -15557912
8207 -15557912 -15417254 -16613474 -19285093 -22066149 -23092752 -21382821 -17507659 -13243554
8199 -13243554 -10559623 -10578828 -13165832 -17303685 -21668853 -24883811 -25840974 -24560296 -22738880
8190 -22738880 -22717172 -25461518 -29815030 -33803916 -36087330 -35850743 -32176132 -24662797 -14630964
8181 -14630964 -4799119 2569085 6788733 8114538 6913658 4018605 1231317 473733
8173 473733 2249125 5331636 8047781 9611718 10269365 10556497 10614904 10072101 8510021
8164 8510021 6184042 4247123 3969892 5601345 8168548 10444492 11822049 12114894 10970888
8155A0970888k895533m161752m089316k774536j135796N1728N95635N39082l0567
8146b930167p15367q73033k79744N58059J048245J256385J703455K561414L357060
8137E686307L447506K603737J224764J88733L39804J745275L431164M185992L753160
8128B6606442K962828K515819J924334Q6400l042861n777458o193433m386494
8120A4695577k812449l898701p375336j0447613j0720212q473032n813454m171408
8112c9016628l263216k178795o03970J161239K663252L398984K995230J828477
8104c3015427J229214K513252N679047R238175J1327993J0913307Q148060M027486
8096B0061107j52776l318486n052656n687325n839387n727979n031011l515686
$$ plain form
8155 10970888 8075355 3913603 -175713 -2950249 -4086045 -4034317 -3438682 -2899600 -2930167
8146 -2930167 -3645534 -4518567 -4798311 -4240252 -3192007 -1935622 -232167 2329247 5686307
8137 5686307 9133813 11737550 12962314 13151047 13490851 15236126 18667290 22853282 26606442
8128 26606442 29569270 32085089 34009423 34095823 31052962 25275504 19082071 14695577
8120 14695577 11883128 7984427 609091 -9838522 -20558734 -29031766 -34845220 -39016628
8112 -39016628 -42279844 -44458639 -45062609 -43901370 -41238118 -37839134 -34843904 -33015427
8104 -33015427 -31786213 -29272961 -23593914 -14355739 -3027746 7885561 16033621 20061107
8096 20061107 19908331 16589845 11537189 5849864 10477 -5717502 -10748513 -14264199
8088a4264199j602509M6696J419723L103831N156848O553538O207481M213642
8080A0835051J607698p97197k749897m017073m336249m003095l799858m079009
8072a1339629m392973m160901l170257j337148J257484L710004M427794K697489
8064a2308137j60108j857378j345010L87448J567963J352067L96969O8258J098043
8055a0799885K929107M422459N032156M878017L857091J596208j405431l531226
8047F978496l744735k984917l055107m501388o383423p762287q398242q088644
8039c7940247o408932l448241j15354K596511M235411M782604M545515M261350
8031b7491383M656129N646558O437392O512013N992715M965889L189987P83471
$$ plain form
8088 -14264199 -15866708 -15820012 -14400289 -11296458 -6139610 413928 6621409 10835051
8080 10835051 12442749 11645552 8895655 4878582 542333 -3460762 -7260620 -11339629
8072 -11339629 -15732602 -19893503 -23063760 -24400908 -23143424 -19433420 -15005626 -12308137
8064 -12308137 -12468245 -14325623 -15670633 -15283185 -13715222 -12363155 -11966186 -11897928 -10799885
8055 -10799885 -7870778 -3448319 1583837 6461854 10318945 11915153 10509722 6978496
8047 6978496 3233761 248844 -2806263 -7307651 -13691074 -21453361 -29851603 -37940247
8039 -37940247 -44349179 -47797420 -47912774 -45316263 -41080852 -36298248 -31752733 -27491383
8031 -27491383 -22835254 -17188696 -10751304 -4239291 1753424 6719313 9909300 10692771
8023A0692771j433584k707284l008462k614861j549471J77403K232759M288770
8015F078041O266651P830527Q095866O458181L520926P16251q90430j155093n90528
8006C6330392o7225n38205k409287n048736p220759q070836p620481o548172n717174
7997f910483n610729n843543n427351l862126j729577J40104J721878L451447
7989b4070380N128282N945296N604240M673156L685065K542857J101060k22352
7981D387224q16742n20562M01402J600079K694505L325239L489428L563372L698011
7972B1821956L490270K634381J647284J471051K438746M017466N467673O316012
7964D9304839O245479N094675L163594J096088p99339k784978m983854o751548
$$ plain form
8023 10692771 9259187 6551903 3543441 928580 -620891 -443488 1789271 6078041
8015 6078041 12344692 20175219 28271085 34729266 38250192 38966443 38076013 36920920 36330392
8006 36330392 36263167 35724962 33315675 28266939 21046180 12975344 5354863 -1193309 -6910483
7997 -6910483 -12521212 -18364755 -23792106 -27654232 -29383809 -29243705 -27521827 -24070380
7989 -24070380 -18942098 -12996802 -7392562 -2719406 965659 3508516 4609576 4387224
7981 4387224 3570482 3049920 3451322 5051401 7745906 11071145 14560573 18123945 21821956
7972 21821956 25312226 27946607 29593891 31064942 33503688 37521154 42988827 49304839
7964 49304839 55550318 60644993 63808587 64904675 64105336 61320358 56336504 49584956
7956D9584956p161720o010643m055703k391495j861557k822957m899477o900607
7948A3480797p521567o431564m424441k368279l79193J757791L820757N298850
7940C233151O058122O306284N940067M454940J687098j631910m216698n079102
7932A6751952m231134k845088k541585l993358o123148p048262n929283l626959
7924a9586865j612774p02567q26460j312491j074704Q02950M005883O791175P436758
7915f079095N859547L523675J973503J759858K419750K901647K184366J66220
7907A4709471j956486k711335j911134q28190p35674j688411k855983l552421
7899a530163l579455k885935j395824P54678L007842M519457M613614L327841
$$ plain form
7956 49584956 42423236 36412593 32356890 29965395 28103838 25280881 20381404 13480797
7948 13480797 5959230 -472334 -4896775 -7265054 -7644247 -5886456 -2065699 3233151
7940 3233151 9291273 15597557 21537624 25992564 27679662 26047752 21831054 16751952
7932 16751952 12520818 9675730 7134145 3140787 -2982361 -10030623 -15959906 -19586865
7924 -19586865 -21199639 -21902206 -22728666 -24041157 -25115861 -24312911 -20307028 -13515853 -6079095
7915 -6079095 -219548 3304127 5277630 7037488 9457238 12358885 14543251 14709471
7907 14709471 12752985 10041650 8130516 7302326 6566652 4878241 2022258 -1530163
7899 -1530163 -5109618 -7995553 -9391377 -8636699 -5628857 -1109400 3504214 6832055
7891F832055J567054M64325L70103N61406Q1631j255473k861093m225011n443646
7882c908649o787254p972283q153534o696932l826356m56732K464450M365280
7874c0972010N042629M587781L329302J617779l29466k144636k978708j954663
7866b3801992Q24568M019771O002815N877168L677924K70523k642602l233941
7858i005766j215869J386835J933538k28349l263977m844224m137337j987901
7850b1363050J25567J141451J020167O15009O99336J137696J359189J419020J872224
7841a1973391K614829K709998J650205Q3921j033722j325410o89238J049654L502186
7832c410968N341537N389074L816934J719959j13772j388620j758685j089341
$$ plain form
7891 6832055 8399109 8863434 9233537 9794943 9876574 8621101 5760008 1534997 -3908649
7882 -3908649 -10695903 -18668186 -26821720 -33518652 -37345008 -37801740 -35337290 -30972010
7874 -30972010 -25929381 -21341600 -18012298 -16394519 -16723985 -18868621 -21847329 -23801992
7866 -23801992 -22977424 -18957653 -12954838 -7077670 -3399746 -3129223 -5771825 -9005766
7858 -9005766 -10221635 -8834800 -6901262 -7129611 -10393588 -15237812 -19375149 -21363050
7850 -21363050 -21237483 -20096032 -19075865 -18460856 -17761520 -16623824 -15264635 -13845615 -11973391
7841 -11973391 -9358562 -6648564 -4998359 -4914438 -5948160 -7273570 -7962808 -6913154 -3410968
7832 -3410968 1930569 7319643 11136577 12856536 12742764 11354144 9595459 8506118
7824H506118j76854k60067j505688k533099j786414P80223L401927L803751J197831
7815A1427728k548505m060129j472738L675746P963932R253443P854361N099304
7807C7193142J964348q48430k700450l517387l812154l776072l040043j773762
7799A9689192j194746k196049l999035m998027m630718l648746k792681k077363
7791e848173j405205j080476j411471k256788l187904l814606l916800l642802
7783b6564225l622042m392945n503578n601445l769575n41971K703045N119620
7775d2173116O749714P650190P348629N614277L459613K682572M129501O731763
7767B193143Q541209Q463410O708861M020364J224957o13389o59979N90323J399248
$$ plain form
7824 8506118 8329264 8069197 6563509 4030410 2243996 3024219 6426146 10229897 11427728
7815 11427728 8879223 4819094 3346356 7022102 14986034 24239477 32093838 37193142
7807 37193142 39157490 38309060 35608610 32091223 28279069 24502997 21462954 19689192
7799 19689192 18494446 16298397 12299362 7301335 2670617 -978129 -3770810 -5848173
7791 -5848173 -7253378 -8333854 -9745325 -12002113 -15190017 -19004623 -22921423 -26564225
7783 -26564225 -30186267 -34579212 -40082790 -45684235 -49453810 -49995781 -47292736 -42173116
7775 -42173116 -35423402 -27773212 -20424583 -14810306 -11350693 -8668121 -4538620 2193143
7767 2193143 10734352 19197762 25906623 29926987 31151944 30538555 29878576 30468899 31868147
7758C1868147O13684j063620k253733k872401m042723o236794q473664r557345
7750b018449r353452q499669p436036o167327m631771k874429r85596Q68185K409837
7741c8688707L352747L484355K748872J493859N30656N24623J252257J817360
7733b3483978J658535R63267P0474r60430j927167k164674j162325O68572K193565
7724b4144161K490485J528111J60585m40941L54002K150677M038902N500648O427712
7715a933980O411960M878577K235080R8843k44634Q42384K032358K482936K089928
7706A8893452R76302m18169j192062q74372k41957m05999j303087j979167k170917
7697A1284024k575479l568400m670762n352012n314653l885518m31657M052272
$$ plain form
7758 31868147 32481831 31418211 29164478 26292077 22249354 16012560 7538896 -2018449
7750 -2018449 -11371901 -19871570 -27307606 -33474933 -38106704 -40981133 -41966729 -41098544 -38688707
7741 -38688707 -35335960 -31851605 -29102733 -27608874 -27078218 -26553595 -25301338 -23483978
7733 -23483978 -21825443 -20862176 -20791702 -21752132 -23679299 -25843973 -27006298 -26337726 -24144161
7724 -24144161 -21653676 -20125565 -19964980 -20405921 -20051919 -17901242 -13862340 -8361692 -1933980
7715 -1933980 4477980 9356557 11591637 11690480 11445846 12288230 14320588 16803524 18893452
7706 18893452 19869754 19451585 18259523 17385151 17143194 16737195 15434108 13454941 11284024
7697 11284024 8708545 5140145 469383 -4882629 -10197282 -14082800 -14514457 -10462185
7689a0462185O881025O085134K322463k089545n303958o649923o278352n102666
7681b0598007m385654m310567l433284o08743K906934M434788K877386k37162
7673b3354309k650028l293280k294890k44381K035877L751273M700137N165123
7665a6184478N060670L832610J521772p36379j803777j715201j317495j122106
7657a2464384j002794p33472k80004L48436J119104J872393K504651L232565M415431
7648i88074O060706P597351Q127306O961315M194092R03136j474451k247479j917196
7639B7216706j441507j225006r53515j97154J041079K208206K419998R92878j907251
7630B8154434n165588p504987q417785q260135p592217o664805n474015m019966
$$ plain form
7689 -10462185 -3581160 2503974 4826437 2736892 -2567066 -9216989 -15495341 -20598007
7681 -20598007 -24983661 -29294228 -32727512 -33336255 -30429321 -25994533 -23117147 -23354309
7673 -23354309 -26004337 -29297617 -31592507 -31836888 -29801011 -26049738 -21349601 -16184478
7665 -16184478 -11123808 -7291198 -5769426 -6505805 -8309582 -10024783 -11342278 -12464384
7657 -12464384 -13467178 -14200650 -14480654 -14132218 -13013114 -11140721 -8636070 -5403505 -988074
7648 -988074 5072632 12669983 20797289 27758604 31952696 32855832 31381381 29133902 27216706
7639 27216706 25775199 24550193 23596678 23399524 24440603 26648809 29068807 30061685 28154434
7630 28154434 22988846 15483859 7066074 -1194061 -8786278 -15451083 -20925098 -24945064
7622b4945064k421446r14792K48764J069687J980688L528913N697520P637818
7614h117912Q291708P349877N488021L598306J951904L28528j163660j883035
7606A5843737j518888p81908p02279j295429j438446k37725J865943L626886M401798
7597A9763689M744482N635077P237126Q413471P580387M315856J50170k567161
7589E5273097k766969j459072m22590m63289j092917j433622r85052K38588J812197
7580D8700371L143837L929018M321150M424123L820053K035265n94098l019578
7572F6760141m569199n548952o570091p621592q125154p716405o585672n002338
7564A5020738k820923K39808L826748O734537P726018O578802M179504J660236
$$ plain form
7622 -24945064 -27366510 -28281302 -28032538 -26962851 -24982163 -21453250 -15755730 -8117912
7614 -8117912 173796 7523673 13011694 16610000 18561904 18890432 17726772 15843737
7606 15843737 14324849 13542941 12840662 11545233 10106787 9869062 11735005 15361891 19763689
7597 19763689 24508171 30143248 37380374 45793845 53374232 57690088 57840258 55273097
7589 55273097 52506128 51047056 50624466 50161177 49068260 47634638 46649586 46888174 48700371
7580 48700371 51844208 55773226 60094376 64518499 68338552 70373817 69779719 66760141
7572 66760141 62190942 56641990 50071899 42450307 34325153 26608748 20023076 15020738
7564 15020738 12199815 12439623 16266371 23000908 30726926 37305728 41485232 43145468
7556D3145468l08945j486798j898444k006876k627698m180245o146092p583940
7548A6906430p991469p368044n814438l690269j932341j371002j604828j302610
7540a4168571R6513J692856K575266L247746M770694O788071P375727N127647
7532A7505949Q74857k958139m409121l229315n29218K256075M020149M142272
7524A7673509K594935R1763k143262l116485k659101j240965N81700K214302K756447
7515A6752843J458608j175747l262102l172306j266235M22617K43314j596982
7507H404010l498377m001458k842780r13743N94599J188786J393261K046467L317691
7498E688456M565863N084914M701325L619817K017984N89k201361m183810n556365
$$ plain form
7556 43145468 42836523 41349725 39451281 37444405 34816707 30636462 24490370 16906430
7548 16906430 8914961 1546917 -4267521 -7957790 -9890131 -11261133 -12865961 -14168571
7540 -14168571 -14072058 -12379202 -9803936 -6556190 -1785496 5002575 12378302 17505949
7532 17505949 18380806 15422667 11013546 7784231 7255013 9511088 13531237 17673509
7524 17673509 20268444 20360207 18216945 15100460 12441359 11200394 11782094 13996396 16752843
7515 16752843 18211451 17035704 13773602 10601296 9335061 9757678 10000992 8404010
7507 8404010 4905633 904175 -1938605 -2852348 -2257749 -1068963 324298 2370765 5688456
7498 5688456 10254319 15339233 20040558 23660375 25678359 25678948 23477587 19293777 13737412
7489A3737412o205424o369203o229112n292869k637414J612096N287238N684687
7481d12589K519885j301825k470387m31447K681760M636001M725083L213749M79343
7472A3639573k842062n667917p088166o931495n495789l166406o17023J131206
7464a7038079J491002J040223J017136K065496L704921M931205N076625M188719
7456F477248K887067J900554J591014J862939K415100K804278K325358M46576
7448B2710134k259149m107106l838234j954408l871J210510K066785L001925L882972
7439B0709558M637864N594542O669009O843534N126879J787515j837310m558139
$$ plain form
7489 13737412 7531988 1162785 -5066327 -10359196 -12996610 -11384514 -6097276 -412589
7481 -412589 2107296 805471 -1664916 -2096363 585397 5221398 9946481 13160230 13639573
7472 13639573 10797511 5129594 -1958572 -8890067 -14385856 -17552262 -18169285 -17038079
7464 -17038079 -15547077 -14506854 -13489718 -11424222 -7719301 -2788096 2288529 6477248
7456 6477248 9364315 11264869 12855883 14718822 17133922 19938200 22263558 22710134
7448 22710134 20450985 16343879 12505645 10551237 10547366 11757876 13824661 16826586 20709558
7439 20709558 25347422 30941964 37610973 44454507 49581386 51368901 49531591 44973452
$$ [...]
##END NTUPLES=NMR SPECTRUM
##END=
