##TITLE=31Pdec_MeAc
 , 48 sc
 10.2.2021
##JCAMPDX= 6.0         $$ Bruker NMR JCAMP-DX V2.0
##DATA TYPE= NMR SPECTRUM
##DATA CLASS= NTUPLES
##ORIGIN= UXNMR, Bruker Analytische Messtechnik GmbH
##OWNER= root
$$ XWIN-NMR		Version 3.5
$$ Wed Feb 10 13:29:52 2021 Russian Standard Time (UT+4h)  she@DPX200
##.OBSERVE FREQUENCY= 81.013821
##.OBSERVE NUCLEUS= ^31P
##.ACQUISITION MODE= SIMULTANEOUS
##.ACQUISITION SCHEME= undefined
##.AVERAGES= 48
##.DIGITISER RES= 16
##SPECTROMETER/DATA SYSTEM= spect
##.PULSE SEQUENCE= zgpg30
##.SOLVENT NAME= CDCl3
##.SHIFT REFERENCE= (INTERNAL, CDCl3, 0, 298.009)
##AUDIT TRAIL= $$ (NUMBER, WHEN, WHO, WHERE, WHAT)
$$ ##TITLE= Audit trail, XWIN-NMR		Version 3.5
$$ ##JCAMPDX= 5.01
$$ ##ORIGIN= Bruker BioSpin GmbH
$$ ##OWNER= she
$$ F:/spectra/data/she/nmr/P31/1/pdata/1/auditp.txt
$$ ##AUDIT TRAIL=  $$ (NUMBER, WHEN, WHO, WHERE, WHAT)
(   1,<2021-02-10 13:28:25.07 +0400>,<she>,<DPX200>,
      <continue with go, POWCHK disabled, PULCHK disabled
       configuration hash MD5:
       00 E9 B6 7A A2 85 ED C7 34 08 36 98 17 FE 4E 26
       data hash MD5: 32K
       99 BB 5D C6 8C 25 3E 1D 6A F8 2A 74 F4 BC 11 CA>)
(   2,<2021-02-10 13:28:29.31 +0400>,<she>,<DPX200>,
      <Start of raw data processing
       efp BC_mod = 2 LB = 1 FT_mod = 6 PKNL = 1 PHC0 = -1920.423 PHC1 = 104.0022 SI = 64K 
       data hash MD5: 64K
       92 B0 A3 1C F8 2C 6F 30 AF 04 E2 1C DB 08 20 CE>)
(   3,<2021-02-10 13:29:26.17 +0400>,<she>,<DPX200>,
      <pk PHC0 = 4.09551 PHC1 = 0 
       data hash MD5: 64K
       C1 38 BC 1F 28 41 15 A3 7B 89 2F 7A 70 34 1D AB>)
$$ ##END=
$$ 
$$ hash MD5
$$ 56 2F 54 BD 7A 69 37 62 FD 8E 1F 8B A8 B2 9B BA
##$RELAX= 
##$RELAX= 
##$RELAX= 
##$RELAX= 
##$RELAX= 
##$RELAX= 
##$RELAX= 
##$RELAX= 
$$ Bruker specific parameters
$$ --------------------------
##$DU= <F:/spectra>
##$EXPNO= 1
##$NAME= <P31>
##$PROCNO= 1
##$TYPE= <nmr>
##$USER= <she>
##$AMP= (0..31)
100 100 100 100 100 100 100 100 100 100 100 100 100 100 100 100 100 100 
100 100 100 100 100 100 100 100 100 100 100 100 100 100 
##$AQSEQ= 0
##$AQ_mod= 1
##$AUNM= <au_zg>
##$AUTOPOS= <>
##$BF1= 81.014009
##$BF2= 200.13
##$BF3= 200.13
##$BF4= 200.13
##$BF5= 200.13
##$BF6= 200.13
##$BF7= 200.13
##$BF8= 200.13
##$BYTORDA= 1
##$CFDGTYP= 0
##$CFRGTYP= 5
##$CHEMSTR= <none>
##$CNST= (0..31)
1 1 145 1 1 1 1 1 1 1 1 1 1 1 1 1 1 1 1 1 1 1 1 1 1 1 1 1 1 1 1 1 
##$CPDPRG= <waltz16>
##$CPDPRG1= <>
##$CPDPRG2= <waltz16>
##$CPDPRG3= <>
##$CPDPRG4= <mlev>
##$CPDPRG5= <mlev>
##$CPDPRG6= <mlev>
##$CPDPRG7= <mlev>
##$CPDPRG8= <mlev>
##$CPDPRGB= <>
##$CPDPRGT= <>
##$D= (0..31)
0 1 0 0 0 0 0 0 0 0 0 0.03 2e-05 3e-06 0 0 0 0 0 0 0 0 0 0 0 0 0 0 0 0 
0 0 
##$DATE= 1612949183
##$DBL= (0..7)
120 120 120 11 120 120 24 19 
##$DBP= (0..7)
150 150 150 150 150 150 150 150 
##$DBP07= 0
##$DBPNAM0= <>
##$DBPNAM1= <>
##$DBPNAM2= <>
##$DBPNAM3= <>
##$DBPNAM4= <>
##$DBPNAM5= <>
##$DBPNAM6= <>
##$DBPNAM7= <>
##$DBPOAL= (0..7)
0.5 0.5 0.5 0.5 0.5 0.5 0.5 0.5 
##$DBPOFFS= (0..7)
0 0 0 0 0 0 0 0 
##$DE= 6
$$ [...]
##$SUBNAM2= <"">
##$SUBNAM3= <"">
##$SUBNAM4= <"">
##$SUBNAM5= <"">
##$SUBNAM6= <"">
##$SUBNAM7= <"">
##$SUBNAM8= <"">
##$SUBNAM9= <"">
##$SW= 600.660478495614
##$SWIBOX= (0..15)
0 1 3 0 0 0 0 0 0 0 0 0 0 0 0 0 
##$SW_h= 48661.800486618
##$TD= 32768
##$TD0= 1
##$TE= 0
##$TE2= 300
##$TE3= 300
##$TEG= 300
##$TL= (0..7)
0 120 53 12 22 120 120 120 
##$TP= (0..7)
150 150 150 150 150 150 150 150 
##$TP07= 0
##$TPNAME0= <>
##$TPNAME1= <>
##$TPNAME2= <>
##$TPNAME3= <>
##$TPNAME4= <>
##$TPNAME5= <>
##$TPNAME6= <>
##$TPNAME7= <>
##$TPOAL= (0..7)
0.5 0.5 0.5 0.5 0.5 0.5 0.5 0.5 
##$TPOFFS= (0..7)
0 0 0 0 0 0 0 0 
##$TUNHIN= 0
##$TUNHOUT= 0
##$TUNXOUT= 0
##$USERA1= <user>
##$USERA2= <user>
##$USERA3= <user>
##$USERA4= <user>
##$USERA5= <user>
##$V9= 5
##$VALIST= <valist>
##$VCLIST= <CCCCCCCCCCCCCCC>
##$VD= 0
##$VDLIST= <DDDDDDDDDDDDDDD>
##$VPLIST= <PPPPPPPPPPPPPPP>
##$VTLIST= <TTTTTTTTTTTTTTT>
##$WBST= 1024
##$WBSW= 4
##$XGAIN= (0..3)
0 0 0 0 
##$XL= 0
##$YL= 0
##$YMAX_a= 10590
##$YMIN_a= -10615
##$ZGOPTNS= <>
##$ZL1= 120
##$ZL2= 120
##$ZL3= 120
##$ZL4= 120
##$ABSF1= 0
##$ABSF2= 0
##$ABSG= 0
##$ABSL= 0
##$ALPHA= 0
##$AQORDER= 0
##$ASSFAC= 0
##$ASSFACI= 0
##$ASSFACX= 0
##$ASSWID= 0
##$AUNMP= <proc_1d>
##$AZFE= 0.1
##$AZFW= 0.5
##$BCFW= 0
##$BC_mod= 2
##$BYTORDP= 0
##$COROFFS= 0
##$CY= -3
##$DATMOD= 1
##$DC= 0
##$DFILT= <>
##$DTYPP= 0
##$F1P= 0
##$F2P= 0
##$FCOR= 1
##$FTSIZE= 65536
##$FT_mod= 6
##$GAMMA= 0
##$GB= 0
##$INTBC= 1
##$INTSCL= 5.30512e-09
##$ISEN= 30
##$LB= 1
##$LEV0= 0
##$LPBIN= 0
##$MAXI= 10000
##$MC2= 0
##$MEAN= 0
##$ME_mod= 0
##$MI= 50
##$NCOEF= 0
##$NC_proc= -5
##$NLEV= 6
##$NOISF1= 182.463
##$NOISF2= 159.3651
##$NSP= 0
##$NTH_PI= 0
##$NZP= 0
##$OFFSET= 298.0089
##$PC= 4
##$PHC0= -1916.328
##$PHC1= 104.0022
##$PH_mod= 1
##$PKNL= yes
##$PPARMOD= 0
##$PSCAL= 0
##$PSIGN= 0
##$REVERSE= no
##$SF= 81.014009
##$SI= 65536
##$SIGF1= 159.3651
##$SIGF2= -187.1042
##$SINO= 113.3802
##$SIOLD= 16384
##$SREGLST= <1H.CDCl3>
##$SSB= 0
##$STSI= 65536
##$STSR= 0
##$SW_p= 48661.800486618
##$SYMM= 0
##$S_DEV= 0
##$TDeff= 32768
##$TDoff= 0
##$TI= <>
##$TILT= no
##$TM1= 0
##$TM2= 0
##$TOPLEV= 0
##$USERP1= <user>
##$USERP2= <user>
##$USERP3= <user>
##$USERP4= <user>
##$USERP5= <user>
##$WDW= 1
##$XDIM= 65536
##$YMAX_p= 363890865
##$YMIN_p= -16082345
$$ End of Bruker specific parameters
$$ ---------------------------------
##NTUPLES= NMR SPECTRUM
##VAR_NAME=  FREQUENCY,     SPECTRUM/REAL,   SPECTRUM/IMAG
##SYMBOL=    X,             R,               I
##VAR_TYPE=  INDEPENDENT,   DEPENDENT,       DEPENDENT
##VAR_FORM=  AFFN,          ASDF,            ASDF
##VAR_DIM=   65536,         65536,           65536
##UNITS=     HZ,            ARBITRARY UNITS, ARBITRARY UNITS
##FACTOR=    0.742531479157977, 1,           1
##FIRST=     24142.8966085939, 0,            0
##LAST=      -24518.9038780241, 0,           0
##MIN=       -24518.9038780241, -16082345,   0
##MAX=       24142.8966085939, 363890865,    0
$$ Real data points
##PAGE= N=1
##DATA TABLE= (X++(R..R)), XYDATA
$$ [...]
$$ plain form
36859 626172 -98500 -1061535 -1770854 -1932760 -2339238 -3063970 -2511169 -287747 968678
36850 968678 -622594 -2449151 -1029298 2022269 2042496 -1128363 -2603301 -330244 1496277
36841 1496277 -713532 -4055014 -3738367 -430933 1304177 65595 -1341848 -1276253 -1343841
36832 -1343841 -2563204 -3211148 -2005522 -626686 -1174139 -3008149 -3925217 -3131093 -1451860
36823 -1451860 269765 1433488 1370065 431400 502100 2563049 4440128 3173804 -627313
36814 -627313 -3207627 -2705636 -1232627 -988573 -888363 1024388 3808311 4865446 3874103
36805 3874103 2801353 2378601 1251341 -1016171 -2520928 -1642203 585613 1795441
36797 1795441 894099 -1349463 -3263377 -3279230 -1124399 1406134 1951517 348818 -1234655
$$ packed form
36859F26172p24672r63035p09319j61906m06478p24732N52801K223422J256425
36850I68678j591272j826557J419853L051567K0227l170859j474938K273057J826521
36841A496277k209809l341482L16647L307434J735110j238582j407443O5595o7588
36832a343841j219363o47944J205626J378836n47453j834010r17068P94124J679233
36823a451860J721625J163723o3423r38665P0700K060949J877079j266324l801117
36814f27313k580314N01991J473009K44054J00210J912751K783923J057135r91343
36805C874103j072750m22752j127260k267512j504757Q78725K227816J209828
36797A795441r01342k243562j913914j5853K154831K530533N45383j602699j583473
$$ plain form
36788 -1234655 -1256177 -389026 329372 1083136 1982086 1991734 669355 -504891 -206312 550094
36778 550094 24594 -1570985 -2843415 -3582578 -4246134 -3987119 -1692317 1364020 2415693
36769 2415693 894126 -1022850 -1804737 -2216395 -2998334 -3213913 -2079752 -594989 51474
36760 51474 309032 1121333 2090648 2226264 1686732 1318847 1022873 88150 -1008835 -628489
36750 -628489 1770426 4374552 4736034 2438450 -422471 -1370867 80603 2161657 2664744
36741 2664744 889949 -1944647 -3794841 -3355226 -1088075 1129785 1781512 1134568 334494
36732 334494 -649631 -2793930 -5427739 -5715675 -2133079 2857981 5395998 4601247 2505082
36723 2505082 508401 -1528276 -2939602 -2053833 755740 2423553 1172865 -852454
$$ packed form
36788a234655k1522Q67151P18398P53764Q98950R648j322379j174246K98579P56406
36778E50094n25500j595579j272430p39163o63556K59015K294802L056337J051673
36769B415693j521567j916976p81887m11658p81939k15579J134161J484763O46463
36760E1474K57558Q12301R69315J35616n39532l67885k95974r34723j096985L80346
36750f28489K398915K604126L61482k297584k860921r48396J451470K081054N03087
36741B664744j774795k834596j850194M39615K267151K217860O51727o46944q00074
36732C34494r84125k144299k633809k87936L582596M991060K538017p94751k096165
36723B505082j996681k036677j411326Q85769K809573J667813j250688k025319
$$ plain form
36715 -852454 -775823 811300 1093296 -484297 -1480344 -225595 1819520 2205598 573778
36706 573778 -1330357 -1909091 -1097376 141994 945922 1113767 969030 882071 856000 524169
36696 524169 -332679 -1181316 -928924 765028 2409509 1768763 -1418425 -4498178 -4587839
36687 -4587839 -1810834 1129723 2272872 2005641 1374278 372672 -1330553 -3081753
36679 -3081753 -3747373 -3100983 -1950318 -1111927 -724085 -335153 614935 2101732 3192250
36670 3192250 2934792 1695678 870065 960956 813601 -608654 -2451141 -2936805 -1775043
36661 -1775043 -615381 -958536 -2312577 -2879927 -1866091 -578303 -829141 -2450755 -3236654
36652 -3236654 -1765006 607778 1532663 733439 -131858 -269166 -534115 -1173017 -755376
$$ packed form
36715h52454P6631J587123K81996j577593r96047J254749K045115L86078j631820
36706E73778j904135n78734Q11715J239370Q03928J67845j44737q6959k6071l31831
36696E24169q56848q48637K52392J693952J644481o40746l187188l079753q9661
36687d587839K777005K940557J143149k67231o31363j001606j703225j751200
36679c081753o65620O46390J150665Q38391L87842L88932R50088J486797J090518
36670C192250k57458j239114q25613R0891j47355j422255j842487m85664J161762
36661a775043J159662l43155j354041n67350J013836J287788k50838j621614p85899
36652c236654J471648K372784R24885p99224q65297j37308k64949o38902M17641
$$ plain form
36643 -755376 1586817 4312978 5208459 4069986 2465335 1517484 1093373 688672 -23944
36634 -23944 -1315961 -3182738 -5049798 -6146707 -5964451 -4309384 -1719036 44262 -716249
36625 -716249 -3165103 -4169118 -2050756 1248094 3007110 3209703 3421357 3691887 3084326
36616 3084326 2323333 2943524 4035474 2957073 -224373 -2056022 -665632 1343557
36608 1343557 760931 -1745841 -3242972 -2905257 -2254591 -2093226 -1786646 -1180727 -832098
36599 -832098 -340701 1309812 3414087 3636736 1180630 -1862545 -3201961 -2891538 -2278596
36590 -2278596 -1954977 -2024807 -2999811 -4672986 -5065869 -2564683 1242876 2942831 1683433
36581 1683433 235897 1074650 3225763 4091710 2892922 871482 -795711 -1649268 -1248108
$$ packed form
36643g55376K342193K726161Q95481j138473j604651r47851m24111m04701p12616
36634b3944j292017j866777j867060j096909J82256J655067K590348J763298p60511
36625g16249k448854j004015K118362L298850J759016K02593K11654K70530o07561
36616C084326p60993O20191J091950j078401l181446j831649J390390K009189
36608A343557n82626k506772j497131L37715O50666J61365L06580O05919L48629
36599h32098M91397J650513K104275K22649k456106l043175j339416L10423O12942
36590b278596L23619o9830r75004j673175l92883K501186L807559J699955j259398
36581A683433j447536Q38753K151113Q65947j198788k021440j667193q53557M01160
$$ plain form
36572 -1248108 430966 2143728 2476290 1699555 1108056 708722 -650033 -2708219 -3407715
36563 -3407715 -1912801 -221057 -450535 -1889948 -2291410 -1151377 -47842 -156749 -912747
36554 -912747 -1048955 95741 2130809 3617257 2985462 484883 -1354697 -545045 1568574
36545 1568574 1998536 348091 -681539 637281 2601468 2808896 1605698 1069528 1531793
36536 1531793 1081732 -1451732 -4514776 -5420681 -3305696 -82964 1411968 222871
36528 222871 -1723932 -1732108 443724 2159497 1138104 -1605525 -3071683 -2005948 -14267
36519 -14267 959375 742600 30238 -1079736 -2377162 -2471922 -324407 2412054 2590781
36510 2590781 -325519 -3146222 -3072861 -1380804 -1216437 -2867646 -3709662 -2613292 -1614199
$$ packed form
36572a248108J679074J712762L32562p76735n91499l99334j358755k058186o99496
36563c407715J494914J691744k29478j439413m01462J140033J103535j08907p55998
36554i12747j36208J144696K035068J486448o31795k500579j839580Q09652K113619
36545A568574M29962j650445j029630J318820J964187K07428j203198n36170M62265
36536A531793m50061k533464l063044r05905K114985L222732J494932j189097
36528B22871j946803q176K175832J715773j021393k743629j466158J065735J991681
36519a4267R73642k16775p12362j109974j297426r4760K147515K736461J78727
36510B590781k916300k820703P3361J692057J64367j651209q42016J096370R99093
$$ plain form
36501 -1614199 -2319066 -3172713 -2121174 -166710 79469 -1616640 -3009592 -2872992 -2199760
36492 -2199760 -1797004 -1072102 73622 315291 -873279 -1796559 -913068 632697 620606
36483 620606 -901519 -1764568 -927095 208200 27251 -1176718 -1927480 -1404416 103858
36474 103858 1839401 2944989 2700000 1209072 -250014 -228134 1393718 3276988 4098436
36465 4098436 3781864 3091967 2458256 1727219 875921 256675 -17855 -267114 -490986
36456 -490986 -135189 793737 1100233 -99903 -1736523 -1987247 -1033522 -1082465 -3206857
36447 -3206857 -5642361 -6143820 -4800450 -3255300 -2098220 -682372 892344 1422308
36439 1422308 533202 -468900 -360292 375063 445570 -394936 -1185766 -1081334 -125178
$$ packed form
36501a614199p04867q53647J051539J954464K46179j696109j392952J36600O73232
36492b199760M02756P24902J145724K41669j188570r23280Q83491J545765j2091
36483F20606j522125q63049Q37473J135295j80949j203969p50762N23064J508274
36474A03858J735543J105588k44989j490928j459086K1880J621852J883270Q21448
36465D098436l16572o89897o33711p31037q51298o19246k74530k49259k23872
36456d90986L55797R28926L06496j200136j636620k50724R53725m8943k124392
36447c206857k435504n01459J343370J545150J157080J415848J574716N29964
36439A422308q89106j002102J08608P35355P0507q40506p90830J04432R56156
$$ plain form
36430 -125178 1136048 2205422 2802826 2945682 2938700 2951775 2604959 1442748 4972
36421 4972 -165566 1722213 4188276 4719559 2846106 979073 1358608 3085157 3630599
36412 3630599 2719259 2553134 3870253 4233083 1762442 -1427743 -1939158 -53456 880202
36403 880202 -284840 -938733 826945 3076919 3026738 1001868 -705679 -1372183 -1875936
36394 -1875936 -2204505 -1482479 -181696 121757 -588150 -515912 1009548 2327250 1988227
36385 1988227 762833 87205 46891 119752 585925 1740205 2639516 2084562 282476
36376 282476 -1577649 -2727142 -2783434 -1312997 1165227 2653731 1879091 377613 573908
36367 573908 2333473 3455498 3168066 2741927 2689282 2024343 799254 649058 1775127
$$ packed form
36430a25178J261226J069374N97404J42856o982J3075l46816j162211j437776
36421D972j70538J887779K466063N31283j873453j867033L79535J726549N45442
36412C630599r11340j66125J317119L62830k470641l190185n11415J885702R33658
36403H80202j165042o53893J765678K249974n0181k024870j707547o66504n03753
36394a875936l28569P22026J300783L03453p09907P2238J525460J317702l39023
36385A988227j225394o75628m0314P2861M66173J154280Q99311n54954j802086
36376B82476j860125j149493n6292J470437K478224J488504p74640j501478J96295
36367E73908J759565J122025k87432m26139n2645o64939j225089j50196J126069
$$ plain form
36358 1775127 1987994 231802 -1370773 -838966 579655 868244 645073 1341281 1769562
36349 1769562 -127222 -3156592 -4080423 -2623829 -1772500 -2811536 -3519846 -2246370 -653292
36340 -653292 -870348 -2400773 -3517751 -3763700 -3499916 -2677749 -1530917 -978674 -1035304
36331 -1035304 -337941 1505641 2735458 1962154 245885 -776444 -1176298 -1599401 -1594526
36322 -1594526 -861994 -438950 -643870 352923 3479877 5982494 4643708 592236 -2188019
36313 -2188019 -2271630 -1502384 -973339 86815 1445882 1532456 558493 653288 2085838
36304 2085838 2597579 1474596 872755 1603983 1041284 -2520848 -6355782 -6855498 -4343729
36295 -4343729 -1700821 -163701 768346 999774 372885 198148 1338629 1938393 79712
$$ packed form
36358A775127K12867j756192j602575N31807J418621K88589k23171O96208M28281
36349A769562j896784l029370r23831J456594Q51329j039036p08310J273476J593078
36340f53292k17056j530425j116978k45949K63784Q22167J146832N52243n6630
36331a035304O97363J843582J229817p73304j716269j022329l99854m23103M875
36322a594526P32532M23044k04920R96793L126954K502617j338786m051472k780255
36313b188019q3611P69246N29045J060154J359067Q6574r73963R4795J432550
36304B085838N11741j122983o01841P31228n62699l562132l834934m99716K511769
36295d343729K642908J537120R32047K31428o26889j74737J140481N99764j858681
$$ plain form
36286 79712 -2378489 -2072527 367604 888433 -1748211 -4095010 -3360951 -1100486 121669
36277 121669 667150 2018338 3287825 2344653 -672746 -3418990 -4463309 -4382111 -3930887
36268 -3930887 -2880381 -943136 1336752 3046170 3736860 3743423 3971714 5079324 6489291
36259 6489291 6619240 4553900 1182501 -1606463 -2461788 -1277663 779916 1787805
36251 1787805 783860 -597925 362514 3560925 5409001 3542529 451595 118697
36243 118697 2361555 3563389 2449656 1502520 2071076 1864881 -761926 -3260230 -2546895
36234 -2546895 98463 1232606 812700 1642170 3827698 4067101 1243521 -1211211 -367993
36225 -367993 2006909 2634703 1384728 11375 -1408903 -3404196 -4200715 -1815923 1748245
$$ packed form
36286G9712k458201L05962K440131N20829k636644k346799P34059K260465J222155
36277A21669N45481J351188J269487r43172l017399k746244j044319Q1198M51224
36268c930887J050506J937245K279888J709418O90690O563K28291J107610J409967
36259F489291J29949k065340l371399k788964q55325J184125K057579J007889
36251A787805j003945j381785R60439L198411J848076j866472l090934l32898
36243A18697K242858J201834j113733r47136N68556k06195k626807k498304P13335
36234b546895K645358J134143m19906Q29470K185528K39403k823580k454732Q43218
36225c67993K374902O27794j249975j373353j420278j995293p96519K384792L564168
$$ plain form
36216 1748245 2478520 463970 -157214 1963093 3067671 691159 -1913719 -971274 1599717
36207 1599717 1283942 -1988043 -4427072 -4752202 -5133405 -5916520 -4401103 -200675 2605042
36198 2605042 1120932 -1970015 -2551341 -922900 -202254 -856558 -633690 907233 1602038
36189 1602038 607573 -273207 -67742 -401486 -2242578 -3446022 -1816890 1067562 1678809
36180 1678809 -584158 -2846524 -3052717 -2427898 -2875105 -3859912 -3415621 -1259829 721403
36171 721403 962065 -62115 -873357 -859107 -554791 -541194 -716296 -665622 -283970 255490
36161 255490 927471 1804014 2520527 2321938 1078132 -123671 -80994 975692 1697380
36152 1697380 1452108 931997 775696 683967 397257 426733 978310 1152810 255598 -1007431
$$ packed form
36216A748245P30275k014550o21184K120307J104578k376512k604878R42445K570991
36207A599717l15775l271985k439029l25130l81203p83115J515417M200428K805717
36198B605042j484110l090947n81326J628441P20646o54304K22868J540923O94805
36189A602038r94465q80780K05465l33744j841092j203444J629132K884452O11247
36180A678809k262967k262366k06193O24819m47207r84807M44291K155792J981232
36171G21403K40662j024180q11242J4250L04316J3597j75102N0674L81652N39460
36161B55490O71981Q76543P16513j98589j243806j201803M2677J056686P21688
36152A697380k45272n20111j56301r1729k86710K9476N51577J74500q97212j263029
$$ plain form
36142 -1007431 -1806311 -2672736 -4195366 -5163214 -4006128 -1528543 6724 254415 814398
36133 814398 1871497 1618188 -263682 -1323458 121656 2559525 3899135 4243301 4333140
36124 4333140 3506136 1394758 -304420 -187822 390945 -295782 -1096838 109096 2612369
36115 2612369 3986504 3919283 3767800 3178203 669520 -2755554 -4149619 -2972058 -1669501
36106 -1669501 -1638032 -1801359 -1567535 -1862607 -2549767 -2087044 -589372 -18684 -507941
36097 -507941 25693 1602825 1421109 -1031597 -2185244 -100163 1946016 740183 -1482055
36088 -1482055 -754952 2278463 3932004 3436691 3111367 3765078 3929375 3094249 2180061
36079 2180061 1156277 -637366 -2163234 -1731165 -97904 379353 -535149 -849766 281298
$$ packed form
36142a007431p98880q66425j522630r67848J157086K477585J535267K47691N59983
36133H14398J057099k53309j881870j059776J445114K437869J339610L44166Q9839
36124D333140q27004k111378j699178J16598N78767o86727q01056J205934K503273
36115B612369J374135o7221j51483n89597k508683l425074j394065J177561J302557
36106a669501L1469j63327K33824k95072o87160M62723J497672N70688m89257
36097e07941N33634J577132j81716k452706j153647K085081K046179j205833k222238
36088a482055P27103L033415J653541m95313l25324O53711J64297q35126r14188
36079B180061j023784j793643j525868M32069J633261M77257r14502l14617J131064
$$ plain form
36070 281298 1802494 3114362 4444574 5111953 4221681 2905683 3017498 3734578 2443019
36061 2443019 -962239 -3679998 -4095665 -3309494 -2367867 -1064927 81625 -228822 -1540000
36052 -1540000 -1969065 -1556477 -2179180 -3664386 -3530062 -1464753 -338999 -1389385 -2098218
36043 -2098218 -681695 894995 616211 -213821 148978 662875 -119636 -1198403 -1431066
36034 -1431066 -2022273 -3763150 -4433707 -2299704 206005 -30215 -1720886 -1532517 226691
36025 226691 594155 -554884 -583094 724062 542081 -2025644 -4395574 -4750205 -4289494
36016 -4289494 -4239739 -3879537 -2806037 -2298564 -3039483 -3882236 -4041767 -4151589 -4090454 -2376356
36006 -2376356 792403 2407227 543704 -2613984 -3760121 -2866577 -2341661 -2988882 -3282825
$$ packed form
36070B81298J521196J311868J330212O67379q90272j315998J11815P17080j291559
36061B443019l405258k717759m15667P86171R41627J302940J146552l10447j311178
36052a540000m29065M12588o22703j485206J34324K065309J125754j050386p08833
36043b098218J416523J576690k78784q30032L62799N13897p82511j078767k32663
36034a431066n91207j740877o70557K134003K505709k36220j690671J88369J759208
36025B26691L67464j149039k8210J307156j81981k567725k369930l54631M60711
36016d289494M9755L60202J073500N07473p40919q42753j59531j09822O1135J714098
36006b376356L168759J614824j863523l157688j146137Q93544N24916o47221k93943
$$ plain form
35997 -3282825 -2287340 -1078898 -932936 -1603858 -1957311 -1453586 -536492 73361 228492
35988 228492 548584 1652184 3182332 3958622 3271009 1723829 634977 802374 1888059
35979 1888059 2803539 2709131 1687268 239843 -1633786 -3971167 -5502229 -4400740 -1184945
35970 -1184945 865990 -273862 -2505731 -2755689 -1451754 -1076626 -1470294 -273352 2209753
35961 2209753 2761028 792777 34018 2598511 5021209 3337415 -634386 -1877473
35953 -1877473 546933 2765673 2175888 488488 67394 415022 -153176 -1453070 -1905706
35944 -1905706 -1056886 -50199 135777 -227509 -461670 -620727 -1152722 -1654790 -959880
35935 -959880 915179 1812353 -143314 -3513884 -4769117 -2753540 16333 1121035
$$ packed form
35997c282825R95485J208442J45962o70922l53453N03725R17094O09853J55131
35988B28492L20092J103600J530148P76290o87613j547180j088852J67397J085685
35979A888059R15480r4408j021863j447425j873629k337381j531062J101489L215795
35970a184945K050935j139852k231869k49958J303935L75128l93668J196942K483105
35961B209753N51275j968251p58759K564493K422698j683794l971801j243087
35953a877473K424406K218740n89785j687400m21094L47628n68198j299894m52636
35944a905706Q48820J006687J85976l63286k34161j59057n31995n02068O94910
35935i59880J875059Q97174j955667l370570j255233K015577K769873J104702
$$ plain form
35927 1121035 1095470 1275105 1049442 -620068 -2637878 -3212302 -2720634 -2644759 -2573136 -1008115
35917 -1008115 1381598 2222771 1081490 -167101 -742773 -1792821 -3369795 -3728674 -2728271
35908 -2728271 -2877025 -5262525 -7122575 -5646420 -2025064 607975 1440680 1725153 1818599
35899 1818599 1211014 502207 704533 1195884 765318 86181 697624 2052193 2169881
35890 2169881 886586 -215739 -821143 -1851605 -2551677 -1089046 1430668 1322930 -1979247
35881 -1979247 -4323999 -3026963 -1064832 -2103692 -4472465 -3947214 -337064 2901499
35873 2901499 4233189 4931700 5168632 3682767 1390309 991785 2338616 2296591 139301
35864 139301 -1186281 -571974 -934424 -3533922 -4726895 -2000672 887184 -382700 -3065537
$$ packed form
35927A121035k5565J79635k25663j669510k017810n74424M91668P5875P1623J565021
35917a008115K389713Q41173j141281j248591n75672j050048j576974l58879J000403
35908b728271j48754k385500j860050J476155L621356K633039Q32705K84473R3446
35899A818599o07585p08807K02326M91351m30566o79137O11443J354569J17688
35890B169881j283295j102325o05404j030462p00072J462631K519714j07738l302177
35881a979247k344752J297036J962131j038860k368773N25251L610150L238563
35873B901499J331690O98511K36932j485865k292458l98524J346831m2025k157290
35864A39301j325582O14307l62450k599498j192973K726223K887856j269884k682837
$$ plain form
35855 -3065537 -1304016 4102291 6353655 2987638 -844691 -914532 252792 -932183
35847 -932183 -2718871 -1689808 742219 612626 -1673480 -1816360 1279651 3538431 1876498
35838 1876498 -1385825 -2155886 -21741 2112689 2284361 1219213 508259 825486 1846984
35829 1846984 2621133 1928040 -655924 -3735163 -4952429 -3408696 -807887 302995
35821 302995 -801533 -2585530 -3280197 -2658582 -1643442 -920642 -608719 -866324 -1875956
35812 -1875956 -3109185 -3363706 -1955250 433374 2294721 2483302 977771 -1013802
35804 -1013802 -1738715 -423975 1658493 2349488 1148272 -149836 134416 1299237 1253815
35795 1253815 -764540 -3477044 -5313453 -5810962 -5251364 -4004618 -2632289 -1732588 -1063530
$$ packed form
35855c065537J761521N406307K251364l366017l832329o9841J167324j184975
35847i32183j786688J029063K432027j29593k286106j42880L096011K258780j661933
35838A876498l262323p70061K134145K134430J71672j065148p10954L17227J021498
35829A846984P74149o93093k583964l079239j217266J543733K600809J110882
35821C02995j104528j783997o94667O21615J015140P22800L11923k57605j009632
35812a875956j233229k54521J408456K388624J861347J88581j505531j991573
35804a013802p24913J314740K082468O90995j201216j298108K84252J164821m5422
35795A253815k018355k712504j836409m97509N59598J246746J372329Q99701O69058
$$ plain form
35786 -1063530 413622 2754346 3931115 1872732 -2402740 -5175434 -4239371 -1471290
35778 -1471290 -8922 -13890 723614 2431651 2390168 -717777 -3995566 -4011825 -1669151
35769 -1669151 -733163 -2271249 -3511479 -2427493 -578685 -277878 -1310900 -2143153 -2579676
35760 -2579676 -3199400 -3339649 -1877123 429739 1433042 538274 -526905 -254083 773229
35751 773229 1187054 864473 735404 1255295 2054554 2847030 3729861 4420814 4045862 2326944
35741 2326944 500558 127808 1053799 1616046 1177110 1168632 2700402 4351465 3943052
35732 3943052 1761044 74233 -247463 -447467 -1050490 -709718 1215985 3083662 3366370
35723 3366370 2907945 3203221 3856888 3469957 1959173 354657 -735369 -921450 529469
$$ packed form
35786a063530J477152K340724J176769k058383m275472k772694R36063K768081
35778a471290J462368m968P37504J708037m1483l107945l277789j6259K342674
35769a669151R35988j538086j240230J083986J848808L00807j033022q32253m36523
35760b579676o19724j40249J462526K306862J003303q94768j065179K72822J027312
35751G73229M13825l22581j29069N19891P99259P92476Q82831O90953l74952j718918
35741B326944j826386l72750R25991N62247m38936q478J531770J651063m08413
35732C943052k182008j686811l21696k00004o03023L40772J925703J867677K82708
35723C366370m58425K95276O53667l86931j510784j604516j090026j86081J450919
$$ plain form
35714 529469 3183341 4449233 2353736 -1370814 -3268276 -2737345 -2150396 -2648877 -2693946
35705 -2693946 -1345924 -234318 -915047 -2311080 -2376338 -963490 389643 604287 -170568
35696 -170568 -1217020 -1761064 -1423931 -802445 -983959 -2111912 -3272868 -4059056 -5002861
35687 -5002861 -5951778 -5497887 -3096394 -546633 7437 -1192767 -2093407 -1650321 -835652
35678 -835652 -982385 -2102740 -2902209 -1973933 797747 3673477 4419719 2697235 459996
35669 459996 -528374 -675716 -1222213 -1922072 -1531180 -129233 730557 359047 -82309
35660 -82309 419831 936010 -70284 -2152981 -2959199 -1225761 1286553 1821021 190677
35651 190677 -1047217 -324832 604326 -555378 -2764813 -2908686 -663414 669984 -929679
$$ packed form
35714E29469K653872J265892k095497l724550j897462N30931N86949m98481m5069
35705b693946J348022J111606o80729j396033o5258J412848J353133K14644p74855
35696a70568j046452n44044L37133O21486j81514j127953j160956p86188r43805
35687e002861r48917M53891K401493K549761N54070j200204r00640M43086Q14669
35678h35652j46733j120355p99469R28276K771680K875730P46242j722484k237239
35669D59996r88370j47342n46497o99859L90892J401947Q59790l71510m41356
35660h2309N02140N16179j006294k082697q06218J733438K512314N34468j630344
35651A90677j237894P22385R29158j159704k209435j43873K245272J333398j599663
$$ plain form
35642 -929679 -3099448 -2742232 -633438 269309 -250628 353178 2754075 4325165 3181789
35633 3181789 974523 182175 667172 715753 -12256 -626554 -1162808 -2379244 -3584931
35624 -3584931 -2750313 611495 4064403 4575396 1556559 -2828734 -5767256 -5915576 -4130177
35615 -4130177 -2531301 -2424258 -3007642 -2663520 -1361407 -641496 -1057558 -1229144 -308778
35606 -308778 218014 -1161831 -3095333 -2977785 -882483 560846 197541 -342480 65022
35597 65022 170653 -862702 -1361151 20716 1420513 470412 -1522829 -1259333 1258994
35588 1258994 2408843 301894 -2513654 -2819495 -814611 1066611 1665580 1716255 1942497
35579 1942497 2061020 1408297 -189336 -1890284 -2046242 250679 3607008 5272344 3982321
$$ packed form
35642i29679k169769L57216K108794R02747n19937O03806K400897J571090j143376
35633C181789k207266p92348M84997M8581p28009o14298n36254j216436j205687
35624c584931Q34618L361808L452908N10993l018837m385293k938522j48320J785399
35615d130177J598876J07043n83384L44122J302113P19911m16062j71586R20366
35606c08778N26792j379845j933502J17548K095302J443329l63305n40021M07502
35597F5022J05631j033355m98449J381867J399797r50101j993241K63496K518327
35588A258994J149849k106949k815548l05841K004884J881222N98969N0675K26242
35579A942497J18523o52723j597633j700948j55958K296921L356329J665336j290023
$$ plain form
35570 3982321 1060968 -1317241 -1892866 -518865 1813772 2992174 1516414 -1448213
35562 -1448213 -3395737 -3937663 -4759976 -5928037 -5196879 -2088984 435847 281397 -708244
35553 -708244 -428926 -458118 -2991804 -6099714 -6070738 -3214434 -1208241 -1266717 -1130964
35544 -1130964 119022 515238 -666501 -1211407 -16517 616339 -1129274 -3220809 -2767633
35535 -2767633 -313847 1300415 907202 -397437 -1529066 -2168553 -1935365 -672714 746469
35526 746469 1218124 682055 -245719 -1151655 -1470312 -359704 1817754 2925528 1501454
35517 1501454 -1001889 -2060984 -1577555 -1701202 -3348140 -4837113 -4503824 -3112289 -2614618
35508 -2614618 -3336023 -3593978 -2148673 -150049 79608 -1957382 -4080233 -4086169 -2433156
$$ packed form
35570C982321k921353k378209n75625J374001K332637J178402j475760k964627
35562a448213j947524n41926q22313j168061P31158L107895K524831j54450r89641
35553g08244K79318k9192k533686l107910K8976K856304K006193n8476J35753
35544a130964J249986L96216j181739n44906J194890O32856j745613k091535M53176
35535b767633K453786J614262l93213j304639j131629o39487K33188J262651J419183
35526G46469M71655n36069r27774r05936l18657J110608K177458J107774j424074
35517A501454k503343j059095M83429j23647j646938j488973L33289J391535M97671
35508b614618p21405k57955J445305J998624K29657k036990k122851n936J653013
$$ plain form
35499 -2433156 -1253369 -1339615 -1600408 -1223721 -587690 149120 1503618 3193504 4013255
35490 4013255 3876555 4105289 4805023 4077779 1266999 -1074135 -434084 2044379 3297453
35481 3297453 2353603 528026 -1064718 -1886952 -1129119 891384 1541667 -1000974 -4242070
35472 -4242070 -4226472 -1440399 -228928 -2142451 -3715938 -1966739 1461430 3402017
35464 3402017 3346724 2395418 646572 -1869897 -3616948 -3435156 -2642306 -3042111 -4031290
35455 -4031290 -3774910 -2192980 -747357 -170333 -289155 -1181947 -2635321 -3368065 -2663872
35446 -2663872 -1847347 -2298859 -3138666 -2940650 -2432312 -2959786 -3519134 -2376011 -686016
35437 -686016 -984070 -2594710 -2466116 -574331 -149722 -1741634 -1736881 1272925 3194860
$$ packed form
35499b433156J179787q6246k60793L76687O36031P36810J354498J689886Q19751
35490D013255j36700K28734O99734p27244k810780k341134O40051K478463J253074
35481C297453r43850j825577j592744q22234P57833K020503O50283k542641l241096
35472d242070J5598K786073J211471j913523j573487J749199L428169J940587
35464C402017n5293r51306j748846k516469j747051J81792P92850l99805r89179
35455d031290K56380J581930J445623N77024j18822q92792j453374p32744P04193
35446b663872Q16525m51512q39807J98016N08338n27474n59348J143123J689995
35437f86016k98054j610640J28594J891785M24609j591912M753L009806J921935
$$ plain form
35428 3194860 680057 -3129640 -3137717 207402 2383043 1879784 1119501 1225633 689735
35419 689735 -558229 -209890 2198925 3863599 2976863 1236905 484401 -200279 -2015863
35410 -2015863 -3601939 -3098891 -1221193 84896 686072 1704725 2952659 3123067 1930978
35401 1930978 225029 -1416175 -2516542 -1991383 323243 2056754 626573 -2894617
35393 -2894617 -4642989 -3124361 -1171408 -1716202 -3698435 -3974648 -2010944 -475869
35385 -475869 -1299882 -3068970 -3189869 -1517141 -431876 -1411920 -2928874 -2652319 -838352
35376 -838352 27675 -1203984 -2941218 -3551378 -3650412 -4416376 -5149475 -4414390 -2708929
35367 -2708929 -1907433 -2396239 -2756897 -2242395 -1614809 -1337088 -885246 -331631 -734411
$$ packed form
35428C194860k514803l809697q077L345119K175641n03259p60283J06132n35898
35419F89735j247964L48339K408815J664674q86736j739958p52504o84680j815584
35410b015863j586076N03048J877698J306089O01176J018653J247934J70408j192089
35401A930978j705949j641204j100367N25159K314626J733511j430181l521190
35393b894617j748372J518628J952953n44794j982233k76213J963704J535075
35385d75869q24013j769088j20899J672728J085265r80044j516954K76555J813967
35376h38352Q66027j231659j737234o10160r9034p65964p33099P35085J705461
35367b708929Q01496m88806l60658N14502O27586K77721M51842N53615m02780
$$ plain form
35358 -734411 -2209074 -3321722 -3264808 -2982007 -3132697 -2683168 -929411 703652 763749
35349 763749 426626 1796852 4218765 4757934 2516546 192204 434713 2360027 3055059
35340 3055059 1577626 -82547 80795 1493022 1957770 643633 -854827 -734688 516343
35331 516343 832931 -425523 -1534166 -1010720 102221 -182861 -1709671 -2348080 -1208038
35322 -1208038 18486 -386894 -1632277 -1669774 -221294 946095 680022 -98371 -123952
35313 -123952 306121 265362 137301 987598 2246874 1944189 -151229 -1415069 267095
35304 267095 3332844 4480389 2958607 991981 323713 448390 414140 259421 -31206
35295 -31206 -1122053 -2784367 -3252750 -1440319 1198719 2225216 945856 -1328386 -2999199
$$ packed form
35358g34411j474663j112648N6914K82801j50690M49529J753757J633063O0097
35349G63749l37123J370226K421913N39169k241388k324342K42509J925314O95032
35340C055059j477433j660173J63342J412227M64748j314137j498460J20139J251031
35331E16343L16588j258454j108643N23446J112941k85082j526810o38409J140042
35322a208038J226524m05380j245383l7497J448480J167389k66073p78393k5581
35313a23952M30073m0759j28061Q50297J259276l02685k095418j263840J682164
35304B67095L065749J147545j521782j966626o68268J24677l4250j54719k90627
35295c1206j090847j662314m68383J812431K639038J026497j279360k274242j670813
$$ plain form
35286 -2999199 -3225305 -1956498 67063 1743295 2682883 3375368 3952971 3748768 2636886
35277 2636886 1663868 1511445 1465080 901969 610295 1339124 2126950 1668919 579429
35268 579429 580714 1805641 2496875 1363771 -972462 -2884206 -3199419 -1898237 -22778
35259 -22778 1371478 2452117 3960355 5133308 4013095 764897 -1360280 -191754
35251 -191754 2020977 1788154 -555931 -1748873 -569489 1099121 1687652 1419118 514754
35242 514754 -1121404 -2314997 -1594292 50100 300149 -426067 564191 3134957 3547736
35233 3547736 351039 -2671922 -1884739 1074720 2619801 3038035 5158469 8618979
35225 8618979 9493135 5805842 413882 -2400186 -1326890 1546282 3296328 2611664
$$ packed form
35286b999199k26106J268807K023561J676232R39588O92485N77603k04203j111882
35277B636886r73018j52423m6365n63111k91674P28829P87826m58031j089490
35268E79429J285J224927O91234j133104k336233j911744l15213J301182J875459
35259b2778J394256J080639J508238J172953j120213l248198k125177J168526
35251a91754K212731k32823k344085j192942J179384J668610N88531k68534r04364
35242E14754j636158j193593P20705J644392K50049p26216R90258K570766M12779
35233C547736l196697l022961P87183K959459J545081M18234K120434L460510
35225H618979Q74156l687293n391960k814068J073296K873172J750046o84664
$$ plain form
35217 2611664 563018 -700750 -298300 671932 1018698 1064771 1533235 1869367 1086527
35208 1086527 -252630 -425409 1019895 2399392 1901781 -119663 -1362788 -164028
35200 -164028 2333545 3180999 1092595 -1916870 -3144621 -2416021 -1331984 -478258 419011
35191 419011 456083 -1381463 -3394961 -2727307 -4393 1132068 -207850 -891082 388834
35182 388834 498107 -2323689 -4415043 -2259224 1551213 2427607 922443 725643 1828018
35173 1828018 1353203 -92435 1033165 4358537 5226363 2266647 -86403 1388053
35165 1388053 3955418 3837859 1811649 706860 439609 -955095 -3281365 -4409185
35157 -4409185 -3588321 -2123903 -1384660 -1821953 -3166199 -4201420 -3300474 -529030 1728090
$$ packed form
35217B611664k048646j263768M02450R70232L46766M6073M68464L36132p82840
35208A086527j339157j72779J445304J379497m97611k021444j243125J198760
35200a64028K497573Q47454k088404l009465j227751P28600J084037Q53726Q97269
35191D19011L7072j837546k013498O67654K722914J136461j339918o83232J279916
35182C88834J09273k821796k091354K155819L810437Q76394j505164j96800J102375
35173A828018m74815j445638J125600L325372Q67826k959716k353050J474456
35165A388053K567365j17559k026210j104789k67251j394704k326270j127820
35157d409185Q20864J464418P39243m37293j344246j035221R00946K771444K257120
$$ plain form
35148 1728090 1506733 -284945 -1309936 -699420 728691 2157826 3193833 3231301 1945936
35139 1945936 365890 284283 2260149 4709818 5304281 3287414 276561 -1579138 -2100747
35130 -2100747 -2752389 -3632451 -2603064 1269577 5195002 5835252 3733881 1925900 1157236
35121 1157236 -259406 -2326818 -2894709 -1754768 -1485686 -3004590 -3637337 -1306654 2271501
35112 2271501 4429657 4974826 4853938 3917914 2266688 1660256 3137498 4860277 4591402
35103 4591402 2918904 1912696 1904748 1745132 1164093 768051 418328 -555751 -1981417
35094 -1981417 -2982954 -3022593 -2075612 -625491 130090 -556069 -1360142 -366102 1603885
35085 1603885 1816388 381039 813614 4421880 7670507 7356558 5008377 3385851 1965000
$$ packed form
35148A728090k21357j791678j024991O10516J428111J429135J036007L7468j285365
35139A945936j580046q1607J975866K449669N94463k016867l010853j855699n21609
35130b100747o51642q80062J029387L872641L925425O40250k101371j807981p68664
35121A157236j416642k067412n67891J139941K69082j518904o32747K330683L578155
35112B271501K158156N45169j20888r36024j651226o06432J477242J722779k68875
35103D591402j672498j006208p948j59616n81039l96042l49723r74079j425666
35094a981417j001537l9639R46981J450121P55581o86159q04073R94040J969987
35085A603885K12503j435349M32575L608266L248627l13949k348181j622526j420851
$$ plain form
35076 1965000 -611773 -2576113 -1640190 644954 1242582 521593 715979 1198616 -301259
35067 -301259 -2980168 -3896808 -2826227 -1963327 -1590200 -416903 472922 -1206128 -4036093
35058 -4036093 -4024456 -931823 1254136 713860 -120970 213052 -180881 -2113584 -3048083
35049 -3048083 -1436074 618426 1173912 1296998 2017217 2074939 1034278 1155584 3547210
35040 3547210 5623220 5151884 3924890 4497431 5923543 5822442 4448374 3560722 3055370
35031 3055370 1814621 531561 737510 1898807 2016065 577934 -975121 -1206048 129144
35022 129144 1999371 2539288 1051440 -122982 1760848 4816060 3761276 -2179629
35014 -2179629 -6704551 -4768820 253434 1840295 -306468 -1210450 885704 2449536
$$ packed form
35076A965000k576773j964340R35923K285144N97628p20989J94386M82637j499875
35067c01259k678909r16640J070581Q62900L73127J173297Q89825j679050k829965
35058d036093J1637L092633K185959n40276q34830L34022l93933j932703r34499
35049c048083J612009K054500N55486J23086P20219N7722j040661J21306K391626
35040C547210K076010m71336j226994N72541J426112j01101j374068q87652n05352
35031C055370j240749j283060K05949J161297J17258j438131j553055k30927J335192
35022A29144J870227N39917j487848j174422J883830L055212j054784n940905
35014b179629m524922J935731N022254J586861k146763r03982K096154J563832
$$ plain form
35006 2449536 880533 -2031779 -3704684 -4038907 -3950352 -3483639 -2522323 -1433832 -447151
34997 -447151 122413 -652443 -2762891 -3878983 -1915089 1541408 3000221 1895696 791818
34988 791818 916970 665644 -948470 -2361059 -2083205 -902603 -324553 -672825 -1653558
34979 -1653558 -3126344 -4470998 -4619022 -3419629 -1877734 -795720 -270313 -313226 -615070
34970 -615070 -226173 807483 322193 -2991552 -6148496 -4627141 1261141 6074650 6119045
34961 6119045 3424656 1582230 827844 -540807 -2378794 -3057184 -2261138 -1111645 -236970
34952 -236970 533241 1125158 1232470 934863 457846 -84836 -250814 416220 1227478 852865
34942 852865 -534156 -1248244 -850899 -918846 -2011504 -2122507 20846 2091868 1101603
$$ packed form
35006B449536j569003k912312j672905l34223Q8555M66713R61316J088491R86681
34997d47151N69564p74856k110448j116092J963894L456497J458813j104525j103878
34988G91818J25152k51326j614114j412589K77854J180602N78050l48272r80733
34979a653558j472786j344654j48024J199393J541895J082014N25407m2913l01844
34970f15070L88897J033656m85290l313745l156944J521355N888282M813509M4395
34961F119045k694389j842426p54386j368651j837987o78390P96046J149493Q74675
34952b36970P70211N91917J07312k97607m77017n42682j65978O67034Q11258l74613
34942H52865j387021p14088L97345o7947j092658j11003K143353K071022r90265
$$ plain form
34933 1101603 -2020826 -3453822 -1593959 1351501 2861715 2834271 2287274 1389342 -33630
34924 -33630 -1270613 -1299682 -150098 1180277 1931942 1989112 1218553 -641532 -2927218
34915 -2927218 -3659343 -1434579 2321668 4355633 3378964 1523145 1108541 1532795 1042533
34906 1042533 140270 630461 1998734 1812299 -89953 -884894 817058 2681595 2340352
34897 2340352 937994 953153 2328085 3044072 2371384 1373682 825882 494794 186680
34888 186680 73265 151102 316801 616214 817504 488686 45308 596066 2037699 2653315
34878 2653315 1544218 31029 -446131 -250215 -93501 569311 1983927 2649796 1543102
34869 1543102 297126 838280 2211898 2358276 1779391 2368634 3509352 2888845 981851
$$ packed form
34933A101603l122429j432996J859863K945460J510214k7444n46997q97932j422972
34924c3630j236983k9069J149584J330375P51665N7170p70559j860085k285686
34915b927218p32125K224764L756247K033965r76669j855819m14604M24254m90262
34906A042533r02263M90191J368273j86435j902252p94941J701952J864537l41243
34897B340352j402358J5159J374932P15987o72688r97702n47800l31088l08114
34888A86680j13415P7837J65699K99413K01290l28818m43378N50758J441633O15616
34878B653315j109097j513189m77160J95916J56714O62812J414616O65869j106694
34869A543102j245976N41154J373618J46378n78885N89243J140718o20507j906994
$$ plain form
34860 981851 1005806 3809196 6279282 6001498 4323106 3195484 1959097 -499979 -2832627
34851 -2832627 -3160241 -2301627 -2363366 -3129990 -2529528 -247269 1684372 2052148 1983497
34842 1983497 2702774 3605619 3565990 2896843 2857471 3822038 4828842 4643025 2694668
34833 2694668 -660376 -4177137 -6273380 -6230112 -4844787 -3451539 -2470610 -1540201 -850994
34824 -850994 -1232519 -2579172 -3316850 -2291384 -364041 902382 1421158 2143053 3044347
34815 3044347 3265599 3042824 3521030 4358989 3603909 812249 -1631630 -1614593 -69612
34806 -69612 906050 1256751 2347999 4128820 5047790 4458203 3277896 2346985 1679450
34797 1679450 1303441 1427713 1720833 1614689 1298940 1353690 1581589 1310578 602218 -17008
$$ packed form
34860I81851K3955K803390K470086k77784j678392j127622j236387k459076k332648
34851b832627l27614Q58614o1739p66624O00462K282259J931641L67776o8651
34842A983497P19277R02845l9629o69147l9372R64567J006804j85817j948357
34833B694668l355044l516761k096243M3268J385325J393248R80929R30409O89207
34824h50994l81525j346653p37678J025466J927343J266423N18776P21895R01294
34815C044347K21252k22775M78206Q37959p55080k791660k443879J7037J544981
34806f9612R75662L50701J091248J780821R18970n89587j180307r30911o67535
34797A679450l76009J24272K93120j06144l15749N4750K27899k71011p08360o19226
$$ plain form
34787 -17008 -735820 -2053726 -3366205 -3293760 -1464340 1072299 3048480 3648945 2523279
34778 2523279 443507 -556147 771080 3043386 3939128 3203824 2258105 1476637 164314
34769 164314 -1053673 -478423 1710376 3275737 3300584 3282836 4042544 4113558 2585764
34760 2585764 1226875 1936124 3811194 4589600 3711013 2301444 1254927 881971 1443707
34751 1443707 2544821 2859929 1772422 412471 -100073 -379224 -1432999 -2682959 -2828416
34742 -2828416 -1828488 -600358 402586 920370 241443 -1434413 -1917779 541892 4166129
34733 4166129 5194665 2655376 -401981 -961303 409891 1037687 -58852 -1178374
34725 -1178374 -429554 1900750 3912457 4484558 4203096 3763536 2666191 600317 -941015
$$ packed form
34787a7008p18812j317906j312479P2445J829420K536639J976181O00465j125666
34778B523279k079772r99654J327227K272306Q95742p35304r45719p81468j312323
34769A64314j217987N75250K188799J565361K4847j7748P59708P1014j527794
34760B585764j358889P09249J875070P78406q78587j409569j046517l72956N61736
34751A443707J101114L15108j087507j359951n12544k79151j053775j249960j45457
34742b828416R99928J228130J002944N17784o78927j675856m83366K459671L624237
34733D166129J028536k539289l057357n59322J371194O27796j096539j119522
34725a178374P48820K330304K011707N72101k81462m39560j097345k065874j541332
$$ plain form
34716 -941015 -431207 820648 206802 -1586923 -706751 3861722 7625676 6395723 2160366
34707 2160366 -19540 947957 1935465 1237604 436086 710363 1038636 749335 695212
34698 695212 1030187 678965 -113588 385278 1956427 1921734 -322052 -1389213 1070810
34689 1070810 4158069 3634159 35667 -2647708 -3122410 -3687613 -5235630 -5408293 -2835028
34680 -2835028 190648 1217966 1274973 2639057 4823507 5537956 4627886 4113895 4449220
34671 4449220 3642452 823914 -1937469 -2800878 -2897089 -3876804 -4542880 -2698065 627429
34662 627429 1957860 414858 -1079015 -419430 760313 334587 -674499 10316 2071958
34653 2071958 3104918 2068453 81563 -1621722 -2600271 -2561672 -1591889 -595008 22427
$$ packed form
34716i41015N09808J251855o13846j793725Q80172M568473L763954j229953m235357
34707B160366k179906R67497R87508o97861q01518K74277L28273k89301n4123
34698F95212L34975l51222p92553M98866J571149l4693k243786j067161K460023
34689A070810L087259n23910l598492k683375m74702n65203j548017j72663K573265
34680b835028L025676J027318N7007J364084K184450P14449r10070n13991L35325
34671D449220q06768k818538k761383q63409r6211r79715o66076J844815L325494
34662F27429J330431j543002j493873O59585J179743m25726j009086O84815K061642
34653B071958J032960j036465j986890j703285r78549L8599R69783R96881O17435
$$ plain form
34644 22427 1279038 3451676 4174885 1370416 -2684188 -3493361 -593035 1780459 1062106
34635 1062106 -122348 1388603 4224509 4829496 2793017 756547 60545 -527603 -1906947
34626 -1906947 -3027088 -2699220 -1261079 146953 739285 157477 -1431454 -2835910 -2509668
34617 -2509668 -459924 1212405 495393 -2125482 -4187973 -4128625 -2889047 -2362609 -2984994
34608 -2984994 -3724282 -4060921 -4620468 -5526863 -5538951 -3833914 -1604821 -594321 -791864
34599 -791864 -972618 -849222 -1042112 -1364498 -963964 -12080 535237 744862 1375857 1869175
34589 1869175 916609 -839635 -1230164 -209662 -338561 -2579628 -4411253 -3730895 -1959220
34580 -1959220 -1141707 -459617 1633807 3801174 3543107 1347566 33693 630230 1736515
$$ packed form
34644B2427J256611K172638P23209k804469m054604q09173K900326K373494p18353
34635A062106j184454J510951K835906O04987k036479k036470o96002n88148j379344
34626a906947j120141L27868J438141J408032N92332n81808j588931j404456L26242
34617b509668K049744J672329p17012k620875k062491N9348J239578N26438o22385
34608b984994p39288l36639n59547r06395j2088J705037K229093J010500j97543
34599g91864j80754J23396j92890l22386M00534R51884N47317K09625O30995M93318
34589A869175r52566j756244l90529J020502j28899k241067j831625O80358J771675
34580a959220Q17513O82090K093424K167367k58067k195541j313873N96537J106285
$$ plain form
34571 1736515 2451471 3079681 3199773 1900810 -1427 -668988 -262306 -518215 -1145127
34562 -1145127 228187 3723508 6001169 4901604 2550210 1878306 2425187 2034596 932013
34553 932013 1253735 3279805 4731184 3842860 1255092 -1296218 -2689303 -2666862 -1676604
34544 -1676604 -804288 -997947 -2107518 -3195634 -3641840 -3336224 -2151231 -169256 1692567
34535 1692567 2267846 1498404 481687 83278 205975 509348 1043050 1834376 2472133
34526 2472133 2533040 2056769 1307702 426698 -388454 -714711 -321891 425491 947965 1138627
34516 1138627 1341936 1680172 1752876 1132396 -90419 -1454716 -2666506 -3720803 -4524656
34507 -4524656 -4738000 -4224858 -3507455 -3403694 -4035074 -4373685 -3098418 -29189 3455765
$$ packed form
34571A736515P14956O28210J20092j298963j902237o67561M06682k55909o26912
34562a145127J373314L495321K277661j099565k351394o71904N46881l90591j102583
34553I32013L21722K026070J451379q88324k587768k551310j393085K2441R90258
34544a676604Q72316j93659j109571j088116m46206L05616J184993J981975J861823
34535A692567N75279p69442j016717l98409J22697L03373N33702P91326O37757
34526B472133O0907m76271p49067q81004q15152l26257L92820P47382N22474J90662
34516A138627K03309L38236P2704o20480j222815j364297j211790j054297q03853
34507d524656k13344N13142P17403J03761o31380l38611J275267L069229L484954
$$ plain form
34498 3455765 5618182 5898678 5101660 4238698 3616662 3040103 2291193 1110927 -717273
34489 -717273 -2741597 -3778351 -3164194 -1728319 -748238 -243080 731136 2244910 3115982
34480 3115982 2548981 1090578 -349064 -1361679 -1524842 -221096 2201170 3995846
34472 3995846 3743666 2046372 803167 1197351 2787864 3954272 2963480 -361106 -3545293
34463 -3545293 -3382250 148640 3288979 3115539 1280565 1270577 3220863 4101277 2596018
34454 2596018 889816 1061736 2234179 2481544 1624116 680981 -25191 -670089 -792840
34445 -792840 119672 1426890 2039894 2059392 2501558 3465274 3799302 2957499 2144543 2730179
34435 2730179 4031011 3887045 1710846 -239870 286857 2240624 2612349 954524 283243
$$ packed form
34498C455765K162417K80496p97018q62962o22036n76559p48910j180266j828200
34489g17273k024324j036754O14157J435875R80081N05158R74216J513774Q71072
34480C115982n67001j458403j439642j012615j63163J303746K422266J794676
34472C995846k52180j697294j243205L94184J590513J166408r90792l324586l184187
34463c545293J63043L530890L140339j73440j834974r988J950286Q80414j505259
34454B596018j706202J71920J172443K47365q57428r43135p06172o44898j22751
34445g92840R12512J307218O13004J9498M42166R63716L34028q41803q12956N85636
34435B730179J300832j43966k176199j950716N26727J953767L71725j657825o71281
$$ plain form
34426 283243 2535859 5350788 5348452 3015447 1732402 2753747 3953469 3474014 1856468
34417 1856468 37042 -2112494 -4099572 -3981963 -981259 2550036 3490827 1455286
34409 1455286 -1294160 -2614587 -2061296 -535074 476322 -70518 -1475133 -1630253 361722
34400 361722 2555428 2317987 -248216 -2221929 -1257883 1763139 3716627 2505475 -785798
34391 -785798 -2998548 -2229337 246336 1791220 1613397 1124735 1402477 1791827 1350488
34382 1350488 337096 -356419 -266182 592393 1763466 2160343 980894 -890052 -1624295
34373 -1624295 -821340 292665 1157832 2423281 3746957 3379967 1055249 -882627 -642682
34364 -642682 777285 2026079 3730964 6284408 7585875 5867560 3108548 2501916
$$ packed form
34426B83243K252616K814929k336k333005j283045J021345J199722m79455j617546
34417A856468j819426k149536j987078J17609L000704L531295R40791k035541
34409A455286k749446j320427N53291J526222J011396n46840j404615j55120J991975
34400C61722K193706k37441k566203j973713R64046L021022J953488j211152l291273
34391g85798k212750P69211K475673J544884j77823m88662K77742L89350m41339
34382A350488j013392o93515R0237Q58575J171073L96877j179449j870946p34243
34373a624295Q02955J114005Q65167J265449J323676l66990k324718j937876K39945
34364f42682J419967J248794J704885K553444J301467j718315k759012o06632
$$ plain form
34356 2501916 3688849 3762889 2195427 1230594 1584986 1367279 -162331 -1048273 27836
34347 27836 1587812 1815224 907646 -279914 -1846053 -3654482 -4267296 -2626632 291929
34338 291929 2573713 3136039 1867973 -559904 -2357538 -1702852 889636 2711622 2204719
34329 2204719 645469 -275252 -645309 -915131 -309056 1536155 2968125 2425416 956230
34320 956230 612905 1423277 2137324 2979393 5013434 7228790 7117308 4477812 2101947
34311 2101947 1928108 2742516 2671927 1840708 1166860 373788 -969538 -1772735 -831723
34302 -831723 892246 1433912 802831 694839 1375894 1245375 41768 10055 2370980
34293 2370980 4615673 3568247 10554 -2257586 -1622759 -377188 -838741 -2139743
$$ packed form
34356B501916J186933P4040j567462r64833L54392k17707j529610q85942J076109
34347B7836J559976K27412r07578j187560j566139j808429o12814J640664K918561
34338B91929K281784N62326j268066k427877j797634O54686K592488J821986n06903
34329B204719j559250r20721l70057k69822O06075J845211J431970n42709j469186
34320I56230l43325Q10372P14047Q42069K034041K215356j11482k639496k375865
34311B101947j73839Q14408p0589q31219o73848p93072j343326q03197R41012
34302h31723J723969N41666o31081j07992O81055j30519j203607l1713K360925
34293B370980K244693j047426l557693k268140O34827J245571m61553j301002
$$ plain form
34285 -2139743 -2070490 -347036 1489968 2328834 2220676 1628195 1193312 1633060 2753412
34276 2753412 3185117 2151166 756657 348525 450155 -142450 -941069 -384910 1346528
34267 1346528 2146248 947836 -770921 -1023655 370609 1964836 2183559 475845 -1947356
34258 -1947356 -2524608 138459 4034093 5560391 3871998 1813244 2034802 3954809
34250 3954809 5441595 5748501 5411994 4632707 3406911 2438469 2434501 3011010 3457374
34241 3457374 3951733 4810255 5197233 4054000 1976364 707496 817304 1247994 1319084
34232 1319084 1842025 3653628 6013804 7314009 6995750 6065166 5740361 6128951 6524518
34223 6524518 6684453 7157981 8161244 8877083 8652583 8409503 9691921 12357508 14512881
$$ packed form
34285b139743O9253J723454J837004Q38866j08158n92481m34883M39748J120352
34276B753412M31705j033951j394509m08132J01630n92605p98619N56159J731438
34267A346528P99720j198412j718757k52734J394264J594227K18723j707714k423201
34258a947356n77252K663067L895634J526298j688393k058754K21558J920007
34250C954809J486786L06906l36507p79287j225796r68442l968N76509M46364
34241C457374M94359Q58522L86978j143233k077636j268868J09808M30690P1090
34232A319084N22941J811603K360176J300205l18259r30584l24805L88590L95567
34223F524518J59935M73528J003263P15839k24500k43080J282418K665587K155373
$$ plain form
34214 14512881 15111462 15353664 16766801 18995980 20595927 21316263 22398115 24816153
34206 24816153 28184056 31475545 34327052 37653530 43129833 51621440 61909863 71730627
34198 71730627 80639392 91151504 106331412 126903893 151523312 179062165 209285265
34191 209285265 241588727 274440529 306038024 334120503 354898848 363890865 359224992
34184 359224992 343529296 321346346 294938878 263937212 229190921 195120201 166609393
34177 166609393 144215529 124350650 104459215 86193866 72540102 63519874 56547926
34170 56547926 50022513 44385054 39891933 35555233 30816727 26590493 23898608 22627598
34162 22627598 22103789 21746013 20769489 18519537 15629384 13682446 13208549 13079447 12218561
$$ packed form
34214A4512881N98581K42202J413137K229179J599947P20336J081852K418038
34206B4816153L367903L291489K851507L326478N476303Q491607J0288423R820764
34198G1730627Q908765J0512112J5179908K0572481K4619419K7538853L0223100
34191B09285265L2303462L2851802L1597495K8082479K0778345Q992017m665873
34184C59224992j5695696k2182950k6407468l1001666l4746291l4070720k8510808
34177A66609393k2393864j9864879j9891435j8265349j3653764r020228o971948
34170E6547926o525413n637459m493121m336700m738506m226234k691885j271010
34162B2627598n23809l57776r76524k249952k890153j946938m73897j29102q60886
$$ plain form
34153 12218561 10706387 8973241 7372703 6808741 7986112 9579509 9229229 7153272
34145 7153272 6460044 8546291 10526186 9229998 5804852 3921817 4785908 6412902
34137 6412902 6953429 6327032 5059309 3650816 2860383 2912407 2815675 1918582 1347560
34128 1347560 2252847 3573348 3485758 2216038 1365349 1320777 1529576 2339451 3941482
34119 3941482 4392301 1845388 -1702806 -2338756 55752 1636188 697126 63152 1892994
34110 1892994 3802219 2745589 -35993 -1044816 221852 1117476 138689 -1370504
34102 -1370504 -1746976 -1082146 -361601 31533 418984 1172221 2281498 3285197 3604575
34093 3604575 3048634 1857041 398156 -813243 -1167963 -701280 -317015 -388996 161336
$$ packed form
34153A2218561j512174j733146j600538n63962J177371J593397l50280k075957
34145G153272o93228K086247J979895j296188l425146j883035Q64091J626994
34137F412902N40527o26397j267723j408493p90433N2024r6732q97093n71022
34128A347560R05287J320501q7590j269720q50689m4572K08799Q09875J602031
34119C941482M50819k546913l548194o35950K394508J580436r39062o33974J829842
34110A892994J909225j056630k781582j008823J266668Q95624r78787j509193
34102a370504l76472O64830P20545L93134L87451P53237J109277J003699L19378
34093C604575n55941j191593j458885j211399l54720M66683L84265p1981N50332
$$ plain form
34084 161336 2037158 3604919 2780982 418114 -643712 179406 753525 354549 918891
34075 918891 2878972 3156715 -221491 -4219629 -4621805 -1922722 -54632 -378451 -523985
34066 -523985 957246 2250888 1517242 -156686 -493228 932120 2779157 4081699 5016645
34057 5016645 5911640 6458811 6076638 4721113 3179203 2518541 3223020 4845816 6308712
34048 6308712 6461022 4940229 3035391 2943048 5054000 6704495 5311763 2200653 1000829
34039 1000829 2399949 3443828 2603815 2053084 3198162 3491244 789155 -1938540 -415564
34030 -415564 3968082 5507930 2318112 -1157488 -666267 2490454 4311248 3476616 1708433
34021 1708433 562826 42970 -387067 -1015018 -1837646 -2453805 -2321233 -1518135 -705890
$$ packed form
34084A61336J875822J567761q23937k362868j061826Q23118N74119l98976N64342
34075I18891J960081K77743l378206l998138m02176K699083J868090l23819j45534
34066e23985J481231J293642p33646j673928l36542J425348J847037J302542R34946
34057E016645Q94995N47171l82173j355525j541910o60662P04479J622796J462896
34048F308712J52310j520793j904838r2343K110952J650495j392732l111110j199824
34039A000829J399120J043879q40013n50731J145078K93082k702089k727695J522976
34030d15564M383646J539848l189818l475600M91221L156721J820794q34632j768183
34021A708433j145607n19856m30037o27951q22628o16159J32572Q03098Q12245
$$ plain form
34012 -705890 -130268 557815 1286219 1349974 642138 206372 981928 2592830 3830875
34003 3830875 3909556 3012763 2035371 1895772 2723672 3764398 4364170 4631710 4670119 3916543
33993 3916543 2190254 699898 730783 1808096 2526784 2761470 3439818 4360652 4069515
33984 4069515 2143463 37990 -686630 294785 2570300 5330176 7058028 6515261 4455956
33975 4455956 2954415 2726328 2571768 1682741 782184 541057 616699 855675 1711119
33966 1711119 2749436 2476923 521628 -1615012 -2778721 -3425213 -3851530 -3165183 -1266123
33957 -1266123 43500 -499475 -1665709 -1774236 -1133629 -818629 -596190 48222 265333
33948 265333 -704666 -1675490 -1228196 -99933 376839 984265 3066955 5221140 4711024
$$ packed form
34012g05890N75622O88083P28404O3755p07836m35766P75556J610902J238045
34003C830875P8681q96793r77392j39599Q27900J040726N99772K67540L8409p53576
33993C916543j726289j490356L0885J077313P18688K34686O78348R20834k91137
33984D069515j926052k105473p24620R81415K275515K759876J727852n42767k059305
33975D455956j501541k28087j54560q89027r00557k41127P5642K38976Q55444
33966A711119J038317k72513j955295k136640j163709o46492m26317O86347J899060
33957a266123J309623n42975j166234j08527O40607L15000K22439O44412K17111
33948B65333r69999r70824M47294J128263M76772O07426K082690K154185n10116
$$ plain form
33939 4711024 1955942 398224 1488329 2819442 2174270 633476 153368 337333 -437802
33930 -437802 -2151761 -3276660 -2982013 -1743659 -299754 860055 1420524 1569744 1969511
33921 1969511 2695343 2817188 1845330 952449 1659966 3617281 4855424 4359395 3330038
33912 3330038 3340920 4036623 3722590 2100151 1121077 2381052 4685375 5618197 4964805
33903 4964805 4633860 5172273 4815529 2981954 2157832 4195696 6744781 6212856 3034192
33894 3034192 813915 837045 893913 -253714 -786894 687635 2674860 3456486 3603820
33885 3603820 3916781 3192889 446857 -2375259 -2543440 -471354 899737 184876 -1096737
33876 -1096737 -1166523 -184429 480004 13115 -1089517 -1558281 -829794 -92104 -907023
$$ packed form
33939D711024k755082j557718J090105J331113o45172j540794m80108J83965p75135
33930d37802j713959j124899K94647J238354J443905J159809N60469J49220L99767
33921A969511P25832J21845r71858q92881P07517J957315J238143m96029j029357
33912C330038J0882O95703l14033j622439r79074J259975K304323R32822o53392
33903D964805l30945N38413l56744j833575q24122K037864K549085n31925l178664
33894C034192k220277K3130N6868j147627n33180J474529J987225P81626J47334
33885C603820L12961p23892k746032k822116j68181K072086J371091p14861j281613
33876a096737o9786R82094O64433m66889j102632m68764P28487P37690q14919
$$ plain form
33867 -907023 -2562983 -2446491 112132 2298058 1673347 -253157 -477937 1016567 1907877
33858 1907877 1590754 1522994 1899456 1151586 -841434 -1884456 -679322 1426050 2802879
33849 2802879 3513415 3961796 3717000 2966855 3214359 4912271 5920643 4102962 480270
33840 480270 -1868300 -1502355 160628 1008614 487905 -273995 59187 1487085 2606814
33831 2606814 2473974 2152861 3320791 5541537 6517323 5258514 3265284 2069387 1485524
33822 1485524 1118335 1583213 2884843 3394975 2127919 573626 579205 1780872 2855807
33813 2855807 3780094 4705023 4098442 815578 -2874910 -3417851 -965117 695478 -451598
33804 -451598 -2061366 -1081869 2340934 5691756 6933574 5501636 2203166 -676453
$$ packed form
33867i07023j655960J16492K558623K185926o24711j926504k24780J494504Q91310
33858A907877l17123o7760L76462p47870j993020j043022J205134K105372J376829
33849B802879P10536M48381k44796p50145K47504J697912J008372j817681l622692
33840D80270k348570L65945J662983Q47986n20709p61900L33182J427898J119729
33831B606814j32840l21113J167930K220746R75786j258809j993230j195897n83863
33822A485524l67189M64878J301630N10132j267056j554293N579J201667J074935
33813B855807R24287R24929o06581l282864l690488n42941K452734J660595j147076
33804d51598j609768R79497L422803L350822J241818j431938l298470k879619
$$ plain form
33796 -676453 -585118 2709681 6587461 8303482 7300312 4590835 1530340 -143419 996247
33787 996247 3961019 5449478 3558237 180300 -1700862 -1732660 -1412076 -878279 1005499
33778 1005499 3764078 5011955 3530581 825936 -983101 -1344295 -731479 596603
33770 596603 2228073 2967684 1854443 -398004 -1832684 -1245518 552724 1465808 82381
33761 82381 -2805847 -4622444 -3403868 1405 2570464 2302718 434715 -9210 2324752
33752 2324752 5685327 7296834 6335293 4495301 3928485 5104768 6661184 6934189 5534224
33743 5534224 3666521 2888458 3290484 3207450 1461186 -373283 629884 4605073 7770002
33734 7770002 6802180 3102817 791599 1253413 2083196 1350208 242509 611951 2176793
$$ packed form
33796f76453R1335L294799L877780J716021j003170k709477l060495j673759J139666
33787I96247K964772J488459j891241l377937j881162l1798L20584N33797J883778
33778A005499K758579J247877j481374k704645j809037l61194O12816J328082
33770E96603J631470P39611j113241k252447j434680N87166J798242R13084j383427
33761H2381k888228j816597J218576L405273K569059k67746j868003m43925K333962
33752B324752L360575J611507r61541j839992n66816J176283J556416K73005j399965
33743E534224j867703p78063M02026q3034j746264j834469J003167L975189L164929
33734G770002r67822l699363k311218M61814Q29783p32988j107699L69442J564842
$$ plain form
33725 2176793 3580151 4475409 4982503 4484515 2675137 772901 87558 251368 332891
33716 332891 644666 1703841 2434807 1553081 37373 -102081 890504 964358 -84152
33707 -84152 -143961 1492869 2623737 1505274 -545381 -1392182 -1031885 -683452 -527512
33698 -527512 -111775 267639 344827 931968 2410605 3260069 2151035 635841 1328936
33689 1328936 3760167 4634428 2556019 59833 -27846 1745915 2807654 2135333 913225
33680 913225 379140 495224 645599 682331 1081092 2288965 3814614 4194091 2650952
33671 2650952 727474 984575 3631317 5808114 5121564 2634875 1076118 1157367 1333469
33662 1333469 523231 -809154 -2066999 -3153623 -3530082 -2387767 -244636 1149388
$$ packed form
33725B176793J403358Q95258N07094m97988j809378j902236o85343J63810Q1523
33716C32891L11775J059175P30966q81726j515708j39454R92585P3854j048510
33707h4152n9809J636830J130868j118463k050655q46801L60297L48433J55940
33698e27512M15737L79414P7188N87141J478637Q49464j109034j515194O93095
33689A328936K431231Q74261k078409k496186q7679J773761J061739o72321j222108
33680I13225n34085J16084J50375L6732L98761J207873J525649L79477j543139
33671B650952j923478K57101K646742K176797o86550k486689j558757Q1249J76102
33662A333469q10238j332385j257845j086624l76459J142315K143131J394024
$$ plain form
33654 1149388 1104441 808861 1236809 1730166 1590240 1604277 2579489 3447006 2516317 138917
33644 138917 -1429891 -814288 951713 1755121 554521 -1701922 -2830418 -1481481 1135446
33635 1135446 2388716 1628471 1180258 2848821 4960370 4877073 3258264 3057670 4682186
33626 4682186 5277965 3443919 1685629 2646269 5197048 6250197 4918458 2912250
33618 2912250 1824999 1838105 2459808 2952772 2466716 1056420 116029 658691 1772468
33609 1772468 2015023 1669615 2111153 3346974 3803257 2573576 554071 -819315 -972543
33600 -972543 -305213 221391 -341049 -1999228 -3617350 -4227006 -4006821 -3275593 -1498523
33591 -1498523 1430210 3862674 4140984 3081250 2774108 3303384 2858491 1024438 -466889
$$ packed form
33654A149388m4947k95580M27948M93357j39926J4037R75212Q67517r30689k377400
33644A38917j568808O15603J766001Q03408j200600k256443j128496J348937K616927
33635A135446J253270p60245m48213J668563K111549q3297j618809k00594J624516
33626D682186N95779j834046j758290R60640K550779J053149j331739k006208
33618B912250j087251J3106O21703M92964m86056j410296r40391N42662J113777
33609A772468K42555l45408M41538J235821M56283j229681k019505j373386j53228
33600i72543O67330N26604n62440j658179j618122o09656K20185P31228J777070
33591a498523K928733K432464K78310j059734l07142N29276m44893j834053j491327
$$ plain form
33582 -466889 -642941 -534853 -812061 -611992 163769 -197098 -2360025 -4201118 -3861310
33573 -3861310 -2616192 -2483418 -2778776 -1778263 -322878 -454515 -1279039 77329 3263962
33564 3263962 4269025 1368789 -1881174 -1613397 1108324 2515292 1580996 404271
33556 404271 357893 721153 742694 577450 176469 -701199 -1367343 -970434 -265564 -642388
33546 -642388 -1561499 -1298265 -264234 -803004 -3104278 -4326701 -3013041 -1335171 -1088644
33537 -1088644 -550632 1923205 4023508 2959116 682335 1162912 3629503 3548019 309321
33528 309321 -1331707 1151594 3975103 3125987 322210 -568247 204401 -359165 -2517518
33519 -2517518 -3864318 -3793900 -3931324 -4429098 -3463614 -777464 1330912 1272290 37329
$$ packed form
33582d66889j76052J08088k77208K00069P75761l60867k162927j841093L39808
33573c861310J245118J32774k95358J000513J455385j31637q24524J356368L186633
33564C263962J005063k900236l249963K67777K721721J406968r34296j176725
33556D04271m6378L63260K1541j65244m00981q77668o66144L96909P04870l76824
33546f42388r19111K63234J034031n38770k301274j222423J313660J677870K46527
33537a088644N38012K473837K100303j064392k276781M80577K466591q1484l238698
33528C09321j641028K483301K823509q49116k803777q90457P72648n63566k158353
33519b517518j346800P0418j37424m97774R65484K686150K108376n8622j234961
$$ plain form
33510 37329 -822206 -1028234 -876455 -593799 -848234 -2145208 -3434493 -3183193 -2078354
33501 -2078354 -2522054 -4899126 -6576359 -5582976 -3261845 -2019846 -2196006 -2560313 -2436361
33492 -2436361 -1840937 -730177 403931 212411 -1711047 -3507571 -3046102 -683733 1359403
33483 1359403 1876522 1440249 638762 -729444 -2437706 -3297926 -2589141 -1095460 12269
33474 12269 617656 1134473 1124927 -230673 -2160874 -2227677 742875 4551071 5905996
33465 5905996 4418389 2600610 1920380 1059868 -1081471 -2936634 -2633432 -1105083 -591567
33456 -591567 -1197503 -1373152 -1011652 -1377848 -2290642 -2180631 -1105559 -944485 -2048193
33447 -2048193 -2414706 -1145230 -93865 -649817 -1216180 237242 2870489 4163426 3188828
$$ packed form
33510C7329q59535k06028J51779K82656k54435j296974j289285K51300J104839
33501b078354m43700k377072j677233R93383K321131J241999j76160l64307J23952
33492b436361N95424J110760J134108j91520j923458j796524M61469K362369K043136
33483A359403N17119m36273q01487j368206j708262q60220P08785J493681J107729
33474A2269O05387N16817r546j355600j930201o6803K970552L808196J354925
33465E905996j487607j817779o80230q60512k141339j855163L03202J528349N13516
33456e91567o05936j75649L61500l66196r12794J10011J075072J61074j103708
33447b048193l66513J269476J051365n55952n66363J453422K633247J292937r74598
$$ plain form
33438 3188828 1021085 -1065863 -2232685 -1830098 -106117 1380356 1240676 -321298
33430 -321298 -2242448 -3794008 -4317877 -3109297 -720775 810363 335966 -806878 -761536
33421 -761536 378439 1310790 1564731 1385205 695415 -331466 -775088 -581091 -1366419
33412 -1366419 -3718031 -5080140 -2961363 610710 947314 -2894059 -6528262 -6002926
33404 -6002926 -2698667 -930271 -2265417 -4035910 -3006735 759599 3890870 3229258
33396 3229258 -704122 -4069866 -3872861 -1175086 678040 394214 -205066 610111 1951989
33387 1951989 1824654 23355 -1657063 -1780638 -865575 -369839 -583466 -161903 1968987
33378 1968987 4681831 5463699 3355351 333628 -744065 871057 3300277 4129223
$$ packed form
33438C188828k167743k086948j166822M02587J723981J486473j39680j561974
33430c21298j921150j551560n23869J208580K388522J531138m74397j142844M5342
33421g61536J139975R32351K53941j79526o89790j026881m43622J93997p85328
33412a366419k351612j362109K118777L572073L36604l841373l634203N25336
33404f002926L304259J768396j335146j770493J029175L766334L131271o61612
33396C229258l933380l365744J97005K697775J853126k83826n99280Q15177J341878
33387A951989j27335j801299j680418j23575R15063M95736k13627M21563K130890
33378A968987K712844P81868k108348l021723j077693J615122K429220Q28946
$$ plain form
33370 4129223 2672344 427068 -585911 -122473 45803 -1223525 -2452115 -1764148 -381554
33361 -381554 -1311542 -4378334 -5610441 -2835504 1016253 2251642 1444936 1347775 1917341
33352 1917341 986496 -1230723 -2045003 -638881 782032 670642 121172 341362 623617
33343 623617 81418 -403258 678611 3350032 6021024 6887745 5298357 2501593 951989
33334 951989 1979993 4354150 5943844 6132740 5499099 4133648 1989531 52737 -839422
33325 -839422 -1652598 -3487588 -5009954 -4110981 -1586468 -212211 -354110 247790 2092519
33316 2092519 2877777 1777560 1212268 2663560 3918052 2716763 441957 -398899 -94827
33307 -94827 -277631 -368846 1238559 3415678 3086642 -140621 -3001020 -2984905 -1475375
$$ packed form
33370D129223j456879k245276j012979M63438J68276j269328j228590O87967J382594
33361c81554r29988l066792j232107K774937L851757J235389q06706r7161N69566
33352A917341r30845k217219q14280J406122J420913j11390n49470K20190K82255
33343F23617n42199m84676J081869K671421K670992Q66721j589388k796764j549604
33334I51989J028004K374157J589694J88896o33641j365451k144117j936794q92159
33325h39422q13176j834990j522366Q98973K524513J374257j41899O01900J844729
33316B092519P85258j100217n65292J451292J254492j201289k274806q40856L04072
33307i4827j82804r1215J607405K177119l29036l227263k860399J6115J509530
$$ plain form
33298 -1475375 -1248304 -2446830 -2794732 -1276445 248665 -160355 -1389232 -652586 2205336
33289 2205336 3983965 2630810 289917 -116560 565735 -411321 -2528357 -2510194 101211
33280 101211 1882038 950959 -311829 392279 1694632 1574522 906442 1260788 1693721
33271 1693721 749707 -346963 358199 1961919 2168899 1061002 283711 -347681 -1962793
33262 -1962793 -3167637 -1346972 2526245 4221078 2249537 77935 874647 3094306
33254 3094306 3426213 1816925 921919 1784855 2649488 1922183 340960 -319381 419448
33245 419448 1371669 1309446 497157 370309 1622081 3023784 2790829 1005886 -207092
33236 -207092 744420 2937921 4141995 3471912 2003277 965239 412946 81909 492159
$$ packed form
33298a475375K27071j198526l47902J518287J525110m09020j228877P36646K857922
33289B205336J778629j353155k340893m06477O82295r77056k117036J8163K611405
33280A01211J780827r31079j262788P04108J302353j20110o68080L54346M32933
33271A693721r44014j096670P05162J603720K06980j107897p77291o31392j615112
33262a962793j204844J820665L873217J694833j971541k171602P96712K219659
33254C094306L31907j609288q95006Q62936Q64633p27305j581223o60341P38829
33245D19448R52221o2223q12289j26848J251772J401703k32955j784943j212978
33236b07092R51512K193501J204074o70083j468635j038038n52293l31037M10250
$$ plain form
33227 492159 2006645 3258910 2171775 -1069560 -3623032 -3503746 -2073448 -1673008 -2176506
33218 -2176506 -1884943 -687815 328779 1811625 5454186 10105311 11923110 9639760
33210 9639760 6663891 6163708 6795543 5659030 3152606 1952172 2670672 3518838 3466861
33201 3466861 3027030 2351306 1047677 -295089 -611863 -283715 -563693 -1271943 -1110172
33192 -1110172 -157575 114182 -521138 -526797 779833 2000218 1795844 727904 163626
33183 163626 505805 1150889 1254860 117041 -2238970 -4498671 -5011314 -3697371 -2196437
33174 -2196437 -1845158 -2327388 -2591172 -2262469 -1723847 -1353874 -1031907 -131615 1929921
33165 1929921 4730749 6632741 6132637 3433331 342671 -1250293 -692455 1070363
$$ packed form
33227D92159J514486J252265j087135l241335k553472J19286J430298M00440n03498
33218b176506K91563J197128J016594J482846L642561M651125J817799k283350
33210I639760k975869n00183O31835j136513k506424j200434P18500Q48166n1977
33201C466861m39831o75724j303629j342766l16774L28148k79978p08250J61771
33192a110172R52597K71757o35320n659J306630J220385k04374j067940n64278
33183A63626L42179O45084J03971j137819k356011k259701n12643J313943J500934
33174b196437L51279m82230k63784L28703N38622L69973L21967R00292K061536
33165A929921K800828J901992n00104k699306l090660j592964N57838J762818
$$ plain form
33157 1070363 2151581 1398533 -291578 -1087620 -734934 -626081 -1108006 -694013 1046216
33148 1046216 1958768 480044 -1483045 -1168770 901166 1940401 1095774 -336 -237502
33139 -237502 63515 864771 2370396 3427569 2629503 1063248 1289641 3331698 4371133
33130 4371133 2957741 876116 48729 138558 262602 666773 1396703 1476992 870768
33121 870768 1298241 3454479 5055956 3493559 -633875 -4232761 -5231249 -4104842 -2479224
33112 -2479224 -1338246 -448395 900456 2390368 2287410 -388627 -3664505 -4298543 -1800875
33103 -1800875 1012363 1831143 1347678 1364931 2298447 3403279 3808142 2549433 -685858
33094 -685858 -4067796 -4770857 -2567390 -339652 -6247 -202757 552782 920575 -632302
$$ packed form
33157A070363J081218p53048j690111p96042L52686J08853m81925M13993J740229
33148A046216R12552j478724j963089L14275K069936J039235q44627j096110k37166
33139b37502L01017Q01256J505625J057173p98066j566255K26393K042057J039435
33130D371133j413392k081625q27387Q9829J24044M04171P29930Q0289o06224
33121H70768M27473K156238J601477j562397m127434l598886r98488J126407J625618
33112b479224J140978Q89851J348851J489912j02958k676037l275878o34038K497668
33103a800875K813238Q18780m83465J7253R33516J104832M04863j258709l235291
33094f85858l381938p03061K203467K227738L33405j96510P55539L67793j552877
$$ plain form
33085 -632302 -2257142 -897600 2772500 4516852 1763084 -3487876 -7260046 -7438631
33077 -7438631 -4728582 -1276989 1006716 1545528 1069814 476212 -29850 -528746 -829668
33068 -829668 -828759 -845563 -1120654 -1513379 -1991672 -2702678 -3315439 -3187233 -2422177 -1753740
33058 -1753740 -1241210 -371311 427776 53760 -1180907 -1712226 -1546407 -2606086 -5209260
33049 -5209260 -6690987 -5243271 -2828029 -2083333 -2383800 -1620959 -231077 -350545 -1903690
33040 -1903690 -2681457 -2079286 -1864031 -2909678 -3624497 -2344887 436865 2857298 3514530
33031 3514530 2293923 373039 -635948 -382989 -189531 -968492 -1761616 -1642075 -1828809
33022 -1828809 -3920179 -6887029 -8048719 -6576812 -3930721 -1306958 1018520 2135051
$$ packed form
33085f32302j624840J359542L670100J744352k753768n250960l772170j78585
33077g438631K710049L451593K283705N38812m75714n93602n06062m98896l00922
33068h29668R09j6804k75091l92725m78293p11006o12761J28206P65056O68437
33058a753740N12530Q69899P99087l74016j234667n31319J65819j059679k603174
33049e209260j481727J447716K415242P44696l00467P62841J389882j19468j553145
33040a903690p77767O02171K15255j045647p14819J279610K781752K420433O57232
33031C514530j220607j920884j008987K52959J93458p78961p93124J19541j86734
33022a828809k091370k966850j161690J471907K646091K623763K325478J116531
$$ plain form
33014 2135051 923978 -1665497 -3093732 -2526787 -1730870 -2266167 -3635971 -4610168 -4615484
33005 -4615484 -3497360 -1642196 -503722 -1144363 -2198659 -1442563 497262 538617 -2246963
32996 -2246963 -5055294 -5289433 -3555644 -1619108 67217 1335572 1293556 196283 171031
32987 171031 2116135 3880640 3572194 2600320 2977076 3555838 2000761 -918752 -2346226
32978 -2346226 -1851963 -1523534 -1822484 -878941 1594926 3030793 1888401 86177 -7153
32969 -7153 1200115 1975591 2054813 2088550 1763482 530857 -700814 -562814 575072 1130850
32959 1130850 727076 465023 934271 1520865 1765003 1948011 2130706 1994963 1913132 2720654
32949 2720654 3962711 3920036 2204917 802123 1255166 2170419 1285551 -932524 -1955314
$$ packed form
33014B135051j211073k589475j428235N66945P95917n35297j369804r74197n316
33005d615484J118124J855164J138474o40641j054296P56096J939825M1355k785580
32996b246963k808331k34139J733789J936536J686325J268355m2016j097273k5252
32987A71031J945104J764505l08446r71874L76756N78762j555077k919513j427474
32978b346226M94263L28429k98950R43543K473867J435867j142392j802224r3330
32969g153J207268P75476P9222L3737l25068j232625j231671J38000J137886N55778
32959A130850m03774k62053M69248N86594K44138J83008J82695j35743q1831Q07522
32949B720654J242057m2675j715119j402794M53043R15253q84868k218075j022790
$$ plain form
32940 -1955314 -1168299 -790165 -2251855 -3801237 -3029585 -273774 2109273 2906436 2745218
32931 2745218 2094191 482530 -1919680 -3475571 -2777135 -384197 1969614 3400231
32923 3400231 4272546 4975755 5437084 5942866 7183357 8724543 8496791 5225993 908357
32914 908357 -857052 834329 3259398 3904107 3289234 2892628 2345067 714900 -1041811
32905 -1041811 -1508887 -1623431 -3171504 -5092256 -4521452 -1512408 653750 384097 -449713
32896 -449713 -591644 -1522605 -3739370 -4608762 -2604167 -432784 -680021 -1222165 1059186
32887 1059186 4281592 3966477 269662 -2021284 -675696 1276646 824084 -949948
32879 -949948 -1430405 -2867 2388887 4684705 5501021 3786378 807782 -563944 575303
$$ packed form
32940a955314P87015L78134j461690j549382P71652K755811K383047P97163j61218
32931B745218o51027j611661k402210j555891O98436K392938K353811J430617
32923C400231Q72315P03209M61329N05782J240491J541186k27752l270798m317636
32914I08357j765409J691381K425069O44709o14873l96606n47561j630167j756711
32905a041811m67076j14544j548073j920752N70804L009044K166158k69653q33810
32896d49713j41931r30961k216765q69392K004595K171383k47237n42144K281351
32887A059186L222406l15115l696815k290946J345588J952342m52562j774032
32879i49948m80457J427538K391754K295818Q16316j714643k978596j371726J139247
$$ plain form
32870 575303 2274408 2870885 2635305 1824002 3396 -1790461 -1360116 792644 1129882
32861 1129882 -1484073 -3273737 -1167984 2058970 1790526 -1469329 -3132643 -1374407
32853 -1374407 1031481 1499813 651646 51586 -84758 -41984 264169 479771 -54292
32844 -54292 -769659 -171701 1790493 3272878 2978629 1514653 -125595 -1718165 -2791175
32835 -2791175 -2260109 -251544 1117408 151523 -2175409 -3632201 -3594721 -3182290 -3097144
32826 -3097144 -2802310 -1847328 -830094 -723314 -1909677 -3949086 -5623221 -5277911 -2202338
32817 -2202338 1870057 3621197 1500587 -2226810 -3803186 -2171802 242506 966601
32809 966601 283784 -81162 224123 104302 -832236 -1578406 -1258038 -234475 470686
$$ packed form
32870E75303J699105N96477k35580q11303j820606j793857M30345K152760L37238
32861A129882k613955j789664K105753L226954k68444l259855j663314J758236
32853a374407K405888M68332q48167o00060j36344M2774L06153K15602n34063
32844e4292p15367N97958J962194J482385k94249j463976j640248j592570j073010
32835b791175N31066K008565J368952r65885k326932j456792L7480M12431Q5146
32826c097144K94834R54982J017234J06780j186363k039409j674135L45310L075573
32817b202338M072395J751140k120610l727397j576376J631384K414308P24095
32809I66601o82817l64946L05285j19821r36538p46170L20368J023563P05161
$$ plain form
32800 470686 41402 -1747343 -3999419 -4696869 -2565945 892947 2622617 1637162 46081
32791 46081 -60356 822489 1103822 637729 331899 328856 229646 429660 1522944 2706556
32781 2706556 2455034 813409 -489296 -459902 11306 -99246 -307944 415994 1859005
32772 1859005 2692583 2122156 725988 -286087 -229685 588948 1263942 1178407 700613
32763 700613 893858 2277429 3941054 4255234 2609275 164549 -1345925 -1299021 -361489
32754 -361489 594651 1038362 493364 -1138781 -2670354 -2239579 333886 2692269 2466059
32745 2466059 57154 -2068015 -2273560 -920607 728291 1564138 1102191 105229 188191
32736 188191 1611099 2358211 1012960 -563161 206396 2212269 1915451 -1100934 -3240630
$$ packed form
32800D70686m29284j788745k252076o97450K130924L458892J729670r85455j591081
32791D6081j06437Q82845K81333m66093l05830l043r9210K00014J093284J183612
32781B706556k51522j641625j302705K9394M71208j10552k08698P23938J443011
32772A859005Q33578n70427j396168j012075N6402Q18633O74994q5535m77794
32763G00613J93245J383571J663625L14180j645959k444726j510474M6904R37532
32754c61489R56140M43711n44998j632145j531573M30775K573465K358383k26210
32745B466059k408905k125169k05545J352953J648898Q35847m61947r96962Q2962
32736A88191J422908P47112j345251j576121P69557K005873k96818l016385k139696
$$ plain form
32727 -3240630 -2258468 -167184 539022 320322 316887 -308558 -2119314 -3029119 -1322656
32718 -1322656 749453 -287073 -3883713 -6183040 -5426463 -3604869 -2810892 -2794348 -2580468
32709 -2580468 -2165161 -1870210 -1683664 -1805440 -2606656 -3780318 -4548454 -4658701 -4265580
32700 -4265580 -3277192 -1891236 -1096728 -1355222 -1568722 -809162 -130152 -888190 -2214461
32691 -2214461 -2279377 -1290837 -886274 -1146116 -761339 212516 477481 221860 909114 2241839
32681 2241839 2274171 961043 581994 1874139 2800474 2329270 2361287 4130622 5506013
32672 5506013 4266491 1917980 1595597 3543345 5220213 5137377 4310614 4101219 4390034
32663 4390034 4114851 2704607 899752 283480 1407111 2533811 1616407 -468306 -684478
$$ packed form
32727c240630R82162K091284P06206k18700l435o25445j810756r09805J706463
32718a322656K072109j036526l596640k299327P56577J821594P93977J6544K13880
32709b580468M15307K94951J86546j21776q01216j173662p68136j10247L93121
32700d265580R88388J385956P94508k58494k13500P59560O79010p58038j326271
32691b214461o4916R88540M04563k59842L84777R73855K64965k55621O87254J332725
32681B241839L2332j313128l79049J292145R26335m71204L2017J769335J375391
32672E506013j239522k348511l22383J947748J676868q2836q26763k09395K88815
32663D390034k75183j410244j804855o16272J123631J126700r17404k084713k16172
$$ plain form
32654 -684478 1678545 3716300 3230421 1728859 1218019 553930 -2147989 -5352929 -5856134
32645 -5856134 -3854523 -2773817 -4003078 -5031838 -3580032 -822748 794686 880860
32637 880860 732850 1048214 1480503 1718938 1845175 1960475 2145359 2476031 2690994 2270087
32627 2270087 1187437 168400 -117519 212873 554420 549483 347210 310003 554781 796412
32617 796412 836417 1107317 2073910 2958231 2124186 -536494 -2627933 -1905285 772713
32608 772713 2577742 2329184 1303331 614087 -195610 -1432344 -2042392 -1327380 -510668
32599 -510668 -1137261 -2741412 -3552767 -3013469 -2105697 -1375926 -237368 1428813 2451206
32590 2451206 2012096 1062679 980555 1503210 1296205 196210 -686651 -1182893 -2518602
$$ packed form
32654f84478K363023K037755m85879j501562n10840o64089k701919l204940n03205
32645e856134K001611J080706j229261j028760J451806K757284J617434Q6174
32637H80860j48010L15364M32289K38435J26237J15300J84884L30672K14963m20907
32627B270087j082650j019037k85919L30392L41547m937k02273l7207K44778K41631
32617G96412M0005K70900R66593Q84321q34045k660680k091439P22648K677998
32608G72713J805029k48558j025853o89244q09697j236734o10048P15012Q16712
32599e10668o26593j604151q11355N39298R07772P29771J138558J666181J022393
32590B451206m39110r49417q2124N22655k07005j099995q82861m96242j335709
$$ plain form
32581 -2518602 -4678097 -5150749 -2241750 1492692 1714166 -1882370 -4936980 -4436028 -2644475
32572 -2644475 -3067256 -4729260 -3705649 484823 3671548 3017771 1076713 1855681 5004249
32563 5004249 6664474 5133658 2786685 2231098 3160188 3972053 4329530 4525391 3916413
32554 3916413 1993837 62456 -241728 381321 -161404 -1937546 -2824057 -1986166 -1061354
32545 -1061354 -1133669 -1042179 21078 738718 349718 659979 2796088 4107711 1684975
32536 1684975 -2506900 -3899837 -2059045 -972540 -2441967 -3555388 -2039580 -79915
32528 -79915 -532561 -2573468 -3787423 -4024276 -4363116 -4324791 -3094608 -1961494 -2548962
32519 -2548962 -3740420 -3304537 -1765788 -1641816 -3190444 -3925251 -2598958 -967217 -883357
$$ packed form
32581b518602k159495m72652K908999L734442K21474l596536l054610N00952J791553
32572b644475m22781j662004J023611M190472L186725o53777j941058P78968L148568
32563E004249J660225j530816k346973n55587R29090Q11865L57477J95861o08978
32554C916413j922576j931381l04184O23049n42725j776142q86511Q37891R24812
32545a061354p2315R1490J063257P17640l89000L10261K136109J311623k422736
32536A684975m191875j392937J840792J086505j469427j113421J515808J959665
32528g9915m52646k040907j213955k36853l38840L8325J230183J133114n87468
32519b548962j191458M35883J538749J23972j548628p34807J326293J631741Q3860
$$ plain form
32510 -883357 -1825221 -2231361 -1664103 -747769 -81437 144772 218766 768795 1792224 2047158
32500 2047158 494274 -1901441 -3088075 -2503716 -1412601 -767105 -186582 772559 1644158
32491 1644158 1715851 833018 -477735 -1025858 358878 3140098 4820328 3770691 1543513
32482 1543513 677704 1097448 952459 297484 979947 2910056 3650010 2462472 1728838
32473 1728838 3003379 4357866 3410308 807213 -1117257 -1327115 -145565 1746283
32465 1746283 2756858 1002167 -2501161 -3488562 116280 4460391 4639593 1647759
32457 1647759 602584 2942120 4735384 3035204 -308776 -2429417 -3231739 -3425494
32449 -3425494 -2133468 746519 2347877 315849 -3043261 -3382481 -251912 2810386
$$ packed form
32510h83357r41864m06140N67258R16334O66332K26209P3994N50029J023429K54934
32500B047158j552884k395715j186634N84359J091115O45496N80523R59141Q71599
32491A644158P1693q82833j310753n48123J384736K781220J680230j049637k227178
32482A543513q65809M19744j44989o54975O82463J930109P39954j187538p33634
32473A728838J274541J354487r47558k603095j924470k09858J181550J891848
32465A746283J010575j754691l503328r87401L604842M344111J79202k991834
32457A647759j045175K339536J793264j700180l343980k120641q02322j93755
32449c425494J292026K879987J601358k032028l359110l39220L130569L062298
$$ plain form
32441 2810386 3767285 4193263 5368113 5711337 3838509 1512499 1163870 2173825 2113921
32432 2113921 620728 -528507 -704379 -1156310 -2284827 -2654170 -1513156 -230099 -102141
32423 -102141 -451411 -198530 143248 -435913 -1503151 -1958830 -1910431 -2164549 -2504417 -2113218
32413 -2113218 -1255685 -932180 -1222114 -1580085 -2396055 -4401696 -6687574 -7347302 -6274947
32404 -6274947 -5290929 -5088990 -4197252 -1747200 868305 2326951 3405264 5056766 6151992
32395 6151992 5169844 2965904 1633163 1232916 -103374 -2894380 -5214219 -5337491 -3839159
32386 -3839159 -2326624 -1280263 -48971 1653740 3026133 2835313 608517 -2614253
32378 -2614253 -4791366 -4608124 -2730430 -946131 -142576 340600 1379615 2744199 3382797
$$ packed form
32441B810386R56899M25978J174850L43224j872828k326010l48629J009955n9904
32432B113921j493193j149235j75872m51931j128517l69343J141014J283057J27958
32423a02141l49270K52881L41778n79161j067238m55679M8399k54118l39868L91199
32413b113218Q57533L23505k89934l57971q15970k005641k285878o59728J072355
32404f274947R84018K01939Q91738K450052K615505J458646J078313J651502J095226
32395F151992r82148k203940j332741m00247j336290k791006k319839j23272J498332
32386c839159J512535J046361J231292J702711J372393j90820k226796l222770
32378b614253k177113J83242J877694J784299Q03555M83176J039015J364584O38598
$$ plain form
32369 3382797 2651928 967449 -656426 -1583229 -2052463 -2657036 -3422898 -3712345 -3039484
32360 -3039484 -1571911 183881 1614602 1911844 703961 -878578 -888390 902448 2208197
32351 2208197 1123620 -1114036 -1792477 -485569 779969 925783 1164492 2354828 3114668
32342 3114668 1955257 -159201 -1082719 -533040 -212311 -1188218 -2669627 -3481151 -3483888
32333 -3483888 -3160798 -2716095 -2032864 -964682 536027 2059499 2552038 1324632 -643649
32324 -643649 -1410606 -431507 813656 1051286 831744 984792 794620 -617423 -2032253
32315 -2032253 -1487168 378290 822973 -711287 -1420805 498958 2792400 2588908 929991
32306 929991 970519 2850118 3722099 2677693 2110132 3295595 3870805 1587216 -1939864
$$ packed form
32369C382797p30869j684479j623875r26803m69234o04573p65862k89447O72861
32360c039484J467573J755792J430721K97242j207883j582539r812J790838J305749
32351B208197j084577k237656o78441J306908J265538J45814K38709J190336P59840
32342C114668j159411k114458r23518N49679L20729r75907j481409q11524k737
32333c483888L23090M44703O83231J068182J500709J523472M92539j227406j968281
32324f43649p66957R79099J245163K37630k19542J53048j90172j412043j414830
32315b032253N45085J865458M44683j534260p09518J919763K293442k03492j658917
32306I29991M0528J879599Q71981j044406n67561J185463N75210k283589l527080
$$ plain form
32297 -1939864 -3626507 -3272120 -2828235 -2436997 -241568 3840234 6885379 6487435 3727553
32288 3727553 1502831 1044953 1237112 758046 -207843 -481819 412192 1419295 1066581
32279 1066581 -615540 -1895947 -1508937 -356809 -213010 -1287503 -2280684 -2562342 -2812564
32270 -2812564 -3324668 -3182532 -1812620 -180466 431345 -845 -673085 -1162326 -1344998
32261 -1344998 -850962 381272 1543175 1956358 2130023 2708097 2857379 1191603 -1758205
32252 -1758205 -3554637 -2775656 -677367 608151 383083 -776401 -2292926 -3589776
32244 -3589776 -3641711 -1848275 853559 2687180 2753944 1524673 72544 -564670 72128
32235 72128 1092387 751426 -1218802 -2625690 -1629881 312408 381935 -1253085 -1634123
$$ packed form
32297a939864j686643L54387M43885L91238K195429M081802L045145l97944k759882
32288C727553k224722m57878J92159m79066r65889k73976Q94011J007103l52714
32279A066581j682121j280407L87010J152128J43799j074493r93181k81658k50222
32270b812564n12104J42136J369912J632154O11811m32190o72240m89241j82672
32261a344998M94036J232234J161903M13183J73665N78074J49282j665776k949808
32252a758205j796432P78981K098289J285518k25068j159484j516525j296850
32244c589776n1935J793436K701834J833621O6764j229271j452129o37214O36798
32235G2128J020259l40961j970228j406888R95809J942289O9527j635020l81038
$$ plain form
32226 -1634123 275182 1929694 1243866 -421267 -994099 -1054536 -2211801 -3896464 -4272754
32217 -4272754 -3196001 -1904683 -710904 644891 1173025 -254606 -2432391 -3003272
32209 -3003272 -1910394 -1213348 -1584771 -1565034 -416589 908843 1993118 3451801 4582900
32200 4582900 3268331 -607305 -3984783 -4182511 -1702137 1456567 4075958 5228373
32192 5228373 3978670 1271886 37581 1586779 3654266 3672013 2122784 870866
32184 870866 164761 -494305 -297393 1476571 3269859 2961551 899345 -951921 -1927336
32175 -1927336 -2587594 -2795992 -2205192 -1722135 -2094930 -1971464 45151 2275543 1857440
32166 1857440 -684197 -1817718 7721 2613675 3587561 2802849 1044335 -1174094
$$ packed form
32226a634123J909305J654512o85828j665133n72832o0437j157265j684663l76290
32217d272754J076753J291318J193779J355795N28134j427631k177785n70881
32209c003272J092878O97046l71423J9737J148445J325432J084275J458683J131099
32200D582900j314569l875636l377478j97728K480374L158704K619391J152415
32192E228373j249703k706784j234305J549198K067487J7747j549229j251918
32184H70866p06105o59066J96912J773964J793288l08308k062206j851266r75415
32175a927336o60258k08398N90800M83057l72795J23466K016615K230392m18103
32166A857440k541637j133521J825439K605954R73886p84712j758514k218429
$$ plain form
32158 -1174094 -2695330 -2111695 -22873 1189800 658964 102692 878197 2059035 2356957
32149 2356957 1959300 1397732 412244 -928627 -1580420 -1081041 -348158 -26057 525981
32140 525981 1745241 2821365 3012088 2649032 2103300 1175586 181387 86863 841048
32131 841048 1136479 478456 -206913 -600633 -1575080 -2959581 -3000026 -1198489 576398
32122 576398 1101852 1445570 2028833 898298 -2679016 -5654591 -5491078 -4736568 -7269793
32113 -7269793 -11429590 -11578054 -6431503 -1210299 -258872 -1549825 -823799 1874800 2911651
32104 2911651 743369 -2200623 -3152604 -2182671 -1130888 -870582 -671423 272446 1654495
32095 1654495 2566050 2610644 2053553 1220080 444111 459044 1869993 3983053 5053364
$$ packed form
32158a174094j521236N83635K088822J212673n30836n56272P75505J180838K97922
32149B356957l97657n61568r85488j340871o51793M99379P32883L22101N52038
32140E25981J219260J076124J90723l63056n45732r27714r94199r4524P54185
32131H41048K95431o58023o85369l93720r74447j384501m0445J801537J774887
32122E76398N25454L43718N83263j130535l577314k975575J63513P54510k533225
32113g269793m159797j48464N146551N221204R51427j290953P26026K698599J036851
32104B911651k168282k943992r51981R69933J051783K60306J99159R43869J382049
32095A654495R11555M4594n57091q33473p75969J4933J410949K113060J070311
$$ plain form
32086 5053364 4145210 2035223 -3564 -1389646 -1933608 -1618497 -1264687 -2059886 -3604312
32077 -3604312 -3857435 -2086484 -299124 -295327 -885701 14629 1937286 2935616 3089213
32068 3089213 4106164 5776824 5722447 3060072 -179390 -1977347 -2556150 -2951722 -3305915
32059 -3305915 -3455352 -3555491 -3300260 -2056898 -495338 -466324 -2408890 -4425470 -4840162
32050 -4840162 -4152738 -3483415 -2697669 -1378703 -222393 123873 584048 2411551 5038015
32041 5038015 6527548 5803943 3458510 870710 -612699 -314563 976614 1424192 186040
32032 186040 -1616609 -2637142 -2944348 -2955126 -1996971 481545 3142835 4001038 3026129
32023 3026129 1890393 1409465 861783 -237553 -1266250 -1571109 -1179719 -392577 243889
$$ packed form
32086E053364r08154k109987k038787j386082n43962L15111L53810p95199j544426
32077c604312k53123J770951J787360L797n90374R00330J922657R98330J53597
32068C089213J016951J670660n4377k662375l239462j797957n78803l95572l54193
32059c305915j49437j00139K55231J243362J561560K9014j942566k016580m14692
32050d840162O87424O69323P85746J318966J156310L46266M60175J827503K626464
32041E038015J489533p23605k345433k587800j483409K98136J291177M47578j238152
32032A86040j802649j020533l07206j0778R58155K478516K661290Q58203r74909
32023C026129j135736m80928n47682j099336j028697l04859L91390P87142O36466
$$ plain form
32014 243889 -174518 -1678717 -2385478 -434575 3025192 4666312 3145198 603347 -523129
32005 -523129 -282130 87591 342014 732889 770811 52606 -625632 -328589 648201 1586632
31995 1586632 2549441 3559433 3656612 2294428 771841 621745 1334663 1418619 976115
31986 976115 1202237 1867186 1628067 707748 795536 1952355 2072067 235107 -1666474
31977 -1666474 -1826952 -1042077 -868466 -976255 -67381 1762660 3231398 3602173 2893882
31968 2893882 1280401 -450732 -885581 155306 812649 -177575 -1215896 -241010 1592515
31959 1592515 1254487 -1434929 -3200204 -1965955 363950 924275 -292409 -1170341 -676555
31950 -676555 369633 1097052 1589805 2075925 2217491 1625561 588858 -153191 -340300
$$ packed form
32014B43889m18407j504199p06761J950903L459767J641120j521114k541851j126476
32005e23129K40999L69721K54423L90875L7922p18205o78238K97043R76790R38431
31995A586632R62809J009992R7179j362184j522587j50096P12918Q3956m42504
31986I76115K26122O64949k39119r20319Q7788J156819J19712j836960j901581
31977a666474j60478P84875J73611j07789R08874J830041J468738L70775p08291
31968B893882j613481j731133m34849J040887O57343r90224j038321R74886J833525
31959A592515l38028k689416j765275J234249K329905N60325j216684q77932M93786
31950f76555J046188P27419M92753M86120J41566n91930j036703p42049j87109
$$ plain form
31941 -340300 -574624 -1482464 -2694299 -3256159 -3039604 -2885792 -3123464 -3016792 -2220339
31932 -2220339 -1577839 -1600246 -1400607 -351886 444999 -81800 -907132 -514628 401548
31923 401548 66584 -1250146 -1700702 -1052597 -801096 -1157354 -635575 1040800 2258123
31914 2258123 2300678 2297817 2711021 2400393 1032236 -83933 -473089 -1210135 -2141594 -1287835
31904 -1287835 1467747 3005881 1359085 -1140802 -1488271 -410249 -408019 -1385445 -1325273
31895 -1325273 -60680 609761 -69493 -1135460 -1718087 -1509318 -95269 2295635 4074424
31886 4074424 3990813 2739524 1508374 232628 -1237049 -1962001 -1724948 -2069638 -3413614
31877 -3413614 -3341285 -453811 2377736 1951291 -164648 -337439 1195142 1603706 1214910
$$ packed form
31941c40300k34324r07840j211835n61860K16555J53812k37672J06672P96453
31932b220339O42500k2407J99639J048721P96885n26799q25332L92504R16176
31923D01548l34964j316730m50556O48105K51501l56258N21779J676375J217323
31914B258123M2555k861M13204l10628j368157j116169l89156p37046r31459Q53759
31904a287835K755582J538134j646796k499887l47469J078022K230r77426O0172
31895a325273J264593O70441o79254j065967n82627K08769J414049K390904J778789
31886D074424q3611j251289j231150j275746j469677p24952K37053l44690j343976
31877c413614P2329K887474K831547m26445k115939j72791J532581M08564l88796
$$ plain form
31868 1214910 2707430 5085805 4124142 -435844 -3480204 -1971525 921395 1284273
31860 1284273 -166046 -751212 -308329 -140617 -232187 -142158 -485771 -1363678 -1428643 -357821
31850 -357821 53408 -895341 -1010418 1223262 3648744 3469379 1314069 -128685 127183
31841 127183 1174104 2207451 2633332 1656738 -377643 -1735396 -1888289 -2351763 -3353712
31832 -3353712 -2350158 1720232 5339136 4762272 1429608 -392485 257548 868155 199612
31823 199612 -589188 -954078 -1476468 -1558876 -54849 1680282 677438 -3151873 -6293802
31814 -6293802 -6135255 -3740058 -1483144 -210455 488353 1138389 2212625 3558152 3790801
31805 3790801 1959839 -244928 -46693 2508212 4376742 3578927 1240384 -845245
$$ packed form
31868A214910J492520K378375r61663m559986l044360J508679K892920L62878
31860A284273j450319n85166M42883J67712r1570R0029l43613q77907o4965J070822
31850c57821M11229r48749j15077K233680K425482j79365k155310j442754K55868
31841A27183J046921J033347M25881r76594k034381j357753j52893m63474j001949
31832c353712J003554M070390L618904n76864l332664j822093O50033O10607o68543
31823A99612p88800l64890n22390q2408J504027J735131j002844l829311l141929
31814f293802J58547K395197K256914J272689O98808O50036J074236J345527K32649
31805C790801j830962k204767J98235K554905J868530p97815k338543k085629
$$ plain form
31797 -845245 -2352271 -3310210 -3057628 -1513613 144850 1078815 1629748 1902265 1234856
31788 1234856 -71514 -342580 936171 1836935 740674 -978585 -762162 1469514 3217580
31779 3217580 2737993 1001949 82147 606064 1434584 1505805 1220247 1510555 2030503
31770 2030503 1510594 118153 -144367 1599340 3339023 3058035 1929964 2295441 3531703
31761 3531703 2923381 303240 -1396415 -635661 769053 1045418 835501 823009 -98756
31752 -98756 -2282838 -3412043 -1618018 1229508 1921585 434035 -462406 508226 1579896
31743 1579896 697233 -1899967 -4029270 -3503938 36864 4361352 6203754 4486288
31735 4486288 1420869 -350865 -761664 -1407202 -2671978 -3305404 -2378394 -347669 1576167
$$ packed form
31797h45245j507026r57939K52582J544015J658463R33965N50933K72517o67409
31788A234856j306370k71066J278751R00764j096261j719259K16423K231676J748066
31779C217580m79587j736044r19802N23917Q28520P1221k85558K90308N19948
31770B030503n19909j392441k62520J743707J739683k80988j128071L65477J236262
31761C531703o08322k620141j699655P60754J404714K76365k09917j2492r21765
31752i8756k184082j129205J794025K847526O92077j487550q96441R70632J071670
31743A579896q82663k597200k129303N25332L540802M324488J842402j717466
31735D486288l065419j771734m10799o45538j264776o33426R27010K030725J923836
$$ plain form
31726 1576167 2267386 1422960 175227 123473 1062194 968344 -771532 -1823698 -243756
31717 -243756 2302536 2917051 1736782 1121400 1506011 1191977 6117 -140843 1113757
31708 1113757 1472559 -338714 -2393254 -2577706 -1612441 -1333532 -1695510 -1367925 -119514
31699 -119514 1162493 2012235 2396208 1848279 83080 -1909417 -2682963 -2107641 -1392407
31690 -1392407 -1542561 -2556952 -3860820 -4748818 -4564166 -3103622 -883078 1195063 2271511
31681 2271511 1814571 222380 -904755 -174982 1699131 2590790 1820306 861357 689192
31672 689192 281685 -1069077 -1799014 -355587 1845095 2017049 -29224 -1682808 -1151436
31663 -1151436 658590 2005975 2326284 2017051 1593519 1464316 1561732 1090047 -421603
$$ packed form
31726A576167O91219q44426j247733n1754R38721r3850j739876j052166J579942
31717b43756K546292O14515j180269o15382L84611l14034j185860j46960J254600
31708A113757L58802j811273k054540j84452R65265K78909l61978L27585J248411
31699a19514J282007Q49742L83973n47929j765199j992497p73546N75322P15234
31690a392407j50154j014391j303868q87998J84652J460544K220544K078141J076448
31681B271511m56940j592191j127135P29773J874113Q91659p70484r58949j72165
31672F89192m07507j350762p29937J443427K200682J71954k046273j653584N31372
31663a151436J810026J347385L20309l09233m23532j29203R7416m71685j511650
$$ plain form
31654 -421603 -1965752 -2056041 -707760 727908 1461532 1754154 1825980 1680984 1732029 2127131
31644 2127131 1814105 -105969 -2565126 -3921239 -4522532 -5538449 -5924562 -3753802 -467573
31635 -467573 -44238 -3142168 -5839804 -5570982 -4415649 -4440503 -3844311 -930022 1702492
31626 1702492 1054249 -928430 -446884 1722088 1775331 -370074 -1047388 656154 1421057
31617 1421057 -535674 -2775799 -3086669 -2609455 -2778891 -2627259 -1210263 104569 -127195
31608 -127195 -1077415 -1256816 -576912 485352 1759424 2315989 788836 -2072527 -3531910
31599 -3531910 -2726965 -1843301 -2205879 -2216577 -931035 -419535 -1980613 -2990671 -769871
31590 -769871 2811416 4081321 2942787 1806306 853734 -1391301 -3729287 -3141486 -198268
$$ packed form
31654d21603j544149r0289J348281J435668P33624K92622P1826j44996N1045L95102
31644B127131l13026j920074k459157j356113o01293j015917l86113K170760L286229
31635d67573M23335l097930k697636K68822J155333k4854N96192K914289K632514
31626A702492o48243j982679M81546K168972N3243k145405o77314J703542P64903
31617A421057j956731k240125l10870M77214j69436J51632J416996J314832k31764
31608a27195r50220j79401O79904J062264J274072N56565j527153k861363j459383
31599c531910Q04945Q83664l62578j0698J285542N11500j561078j010058K220800
31590g69871L581287J269905j138534j136481r52572k245035k337986N87801K943218
$$ plain form
31581 -198268 685507 -2425454 -6001375 -6095232 -3474080 -1606552 -1679069 -2036388 -1461329
31572 -1461329 -690892 -717779 -1217731 -1232012 -616276 -68883 152728 727857 1934372 2521670
31562 2521670 1156724 -1281558 -2446632 -1674573 -621956 -467597 -638071 -969535 -2523563
31553 -2523563 -4872874 -5281343 -2710996 -181168 -535758 -2143456 -1919099 -568066 -1040122
31544 -1040122 -3160157 -3941963 -2678609 -1671028 -1848476 -1451374 454465 2520514 3704337
31535 3704337 4220773 3553845 808452 -2400752 -2797439 -114134 2204124 1923385 589581
31526 589581 201092 482885 723389 1289213 1924556 1355856 -202149 -1012965 -1193328
31517 -1193328 -2678877 -4795602 -4113689 -573140 895804 -2127295 -4939584 -2708622
$$ packed form
31581a98268Q83775l110961l575921r3857K621152J867528p2517l57319N75059
31572a461329P70437k6887m99952j4281O15736N47393K21611N75129J206515N87298
31562B521670j364946k438282j165074P72059J052617J54359j70474l31464j554028
31553b523563k349311m08469K570347K529828l54590j607698K24357J351033m72056
31544a040122k120035p81806J263354J007581j77448L97102J905839K066049J183823
31535C704337N16436o66928k745393l209204l96687K683305K318258k80739j333804
31526E89581l88489K81793K40504N65824O35343n68700j558005q10816j80363
31517a193328j485549k116725O81913L540549J468944l023099k812289K230962
$$ plain form
31509 -2708622 1899822 3204064 1506589 1614446 4127264 4648363 1659338 -837055
$$ packed form
31509b708622M608444J304242j697475J07857K512818N21099k989025k496393
$$ [...]
##END NTUPLES=NMR SPECTRUM
##END=
