##TITLE=31Pdec_MTPMA2509
 CDCl3, 24 sc
 28.9.2020
##JCAMPDX= 6.0         $$ Bruker NMR JCAMP-DX V2.0
##DATA TYPE= NMR SPECTRUM
##DATA CLASS= NTUPLES
##ORIGIN= UXNMR, Bruker Analytische Messtechnik GmbH
##OWNER= root
$$ XWIN-NMR		Version 3.5
$$ Mon Sep 28 10:37:22 2020 Russian Standard Time (UT+4h)  she@DPX200
##.OBSERVE FREQUENCY= 81.013821
##.OBSERVE NUCLEUS= ^31P
##.ACQUISITION MODE= SIMULTANEOUS
##.ACQUISITION SCHEME= undefined
##.AVERAGES= 24
##.DIGITISER RES= 17
##SPECTROMETER/DATA SYSTEM= spect
##.PULSE SEQUENCE= zgpg30
##.SOLVENT NAME= CDCl3
##.SHIFT REFERENCE= (INTERNAL, CDCl3, 0, 182.463)
##AUDIT TRAIL= $$ (NUMBER, WHEN, WHO, WHERE, WHAT)
$$ ##TITLE= Audit trail, XWIN-NMR		Version 3.5
$$ ##JCAMPDX= 5.01
$$ ##ORIGIN= Bruker BioSpin GmbH
$$ ##OWNER= she
$$ F:/spectra/data/she/nmr/P31/1/pdata/1/auditp.txt
$$ ##AUDIT TRAIL=  $$ (NUMBER, WHEN, WHO, WHERE, WHAT)
(   1,<2020-09-28 10:36:11.50 +0400>,<she>,<DPX200>,
      <created by zg, POWCHK disabled, PULCHK disabled
       configuration hash MD5:
       00 E9 B6 7A A2 85 ED C7 34 08 36 98 17 FE 4E 26
       data hash MD5: 32K
       E0 70 5E 53 8A 2E 56 5A F9 54 A4 E8 A1 87 47 CF>)
(   2,<2020-09-28 10:36:13.53 +0400>,<she>,<DPX200>,
      <Start of raw data processing
       efp BC_mod = 2 LB = 1 FT_mod = 6 PKNL = 1 PHC0 = -2742.745 PHC1 = 71.00175 SI = 64K 
       data hash MD5: 64K
       2A 23 63 EA C4 EB 05 AF 1F 2D 00 52 8B 30 EE 9E>)
(   3,<2020-09-28 10:36:26.48 +0400>,<she>,<DPX200>,
      <pk PHC0 = -7.722756 PHC1 = 0 
       data hash MD5: 64K
       0B 2D AF 6D DF 1E 7C 55 9B 65 D4 4C 57 9F 01 E0>)
(   4,<2020-09-28 10:36:53.53 +0400>,<she>,<DPX200>,
      <pk PHC0 = 8.199998 PHC1 = 0 
       data hash MD5: 64K
       91 69 91 2C CA BA 54 E2 B7 B1 BD 4F 97 D8 64 59>)
$$ ##END=
$$ 
$$ hash MD5
$$ DE 30 5E 4D CB 0E 40 9F F9 CF 35 C7 44 0F 77 F9
##$RELAX= 
##$RELAX= 
##$RELAX= 
##$RELAX= 
##$RELAX= 
##$RELAX= 
##$RELAX= 
##$RELAX= 
$$ Bruker specific parameters
$$ --------------------------
##$DU= <F:/spectra>
##$EXPNO= 1
##$NAME= <P31>
##$PROCNO= 1
##$TYPE= <nmr>
##$USER= <she>
##$AMP= (0..31)
100 100 100 100 100 100 100 100 100 100 100 100 100 100 100 100 100 100 
100 100 100 100 100 100 100 100 100 100 100 100 100 100 
##$AQSEQ= 0
##$AQ_mod= 1
##$AUNM= <au_zg>
##$AUTOPOS= <>
##$BF1= 81.014009
##$BF2= 200.13
##$BF3= 200.13
##$BF4= 200.13
##$BF5= 200.13
##$BF6= 200.13
##$BF7= 200.13
##$BF8= 200.13
##$BYTORDA= 1
##$CFDGTYP= 0
##$CFRGTYP= 5
##$CHEMSTR= <none>
##$CNST= (0..31)
1 1 145 1 1 1 1 1 1 1 1 1 1 1 1 1 1 1 1 1 1 1 1 1 1 1 1 1 1 1 1 1 
##$CPDPRG= <waltz16>
##$CPDPRG1= <>
##$CPDPRG2= <waltz16>
##$CPDPRG3= <>
##$CPDPRG4= <mlev>
##$CPDPRG5= <mlev>
##$CPDPRG6= <mlev>
##$CPDPRG7= <mlev>
##$CPDPRG8= <mlev>
##$CPDPRGB= <>
##$CPDPRGT= <>
##$D= (0..31)
0 1 0 0 0 0 0 0 0 0 0 0.03 2e-05 3e-06 0 0 0 0 0 0 0 0 0 0 0 0 0 0 0 0 
0 0 
##$DATE= 1601274970
##$DBL= (0..7)
120 120 120 11 120 120 24 19 
##$DBP= (0..7)
150 150 150 150 150 150 150 150 
##$DBP07= 0
##$DBPNAM0= <>
##$DBPNAM1= <>
$$ [...]
##$SUBNAM2= <"">
##$SUBNAM3= <"">
##$SUBNAM4= <"">
##$SUBNAM5= <"">
##$SUBNAM6= <"">
##$SUBNAM7= <"">
##$SUBNAM8= <"">
##$SUBNAM9= <"">
##$SW= 369.568048894756
##$SWIBOX= (0..15)
0 1 3 0 0 0 0 0 0 0 0 0 0 0 0 0 
##$SW_h= 29940.119760479
##$TD= 32768
##$TD0= 1
##$TE= 0
##$TE2= 300
##$TE3= 300
##$TEG= 300
##$TL= (0..7)
0 120 53 12 22 120 120 120 
##$TP= (0..7)
150 150 150 150 150 150 150 150 
##$TP07= 0
##$TPNAME0= <>
##$TPNAME1= <>
##$TPNAME2= <>
##$TPNAME3= <>
##$TPNAME4= <>
##$TPNAME5= <>
##$TPNAME6= <>
##$TPNAME7= <>
##$TPOAL= (0..7)
0.5 0.5 0.5 0.5 0.5 0.5 0.5 0.5 
##$TPOFFS= (0..7)
0 0 0 0 0 0 0 0 
##$TUNHIN= 0
##$TUNHOUT= 0
##$TUNXOUT= 0
##$USERA1= <user>
##$USERA2= <user>
##$USERA3= <user>
##$USERA4= <user>
##$USERA5= <user>
##$V9= 5
##$VALIST= <valist>
##$VCLIST= <CCCCCCCCCCCCCCC>
##$VD= 0
##$VDLIST= <DDDDDDDDDDDDDDD>
##$VPLIST= <PPPPPPPPPPPPPPP>
##$VTLIST= <TTTTTTTTTTTTTTT>
##$WBST= 1024
##$WBSW= 4
##$XGAIN= (0..3)
0 0 0 0 
##$XL= 0
##$YL= 0
##$YMAX_a= 9965
##$YMIN_a= -5554
##$ZGOPTNS= <>
##$ZL1= 120
##$ZL2= 120
##$ZL3= 120
##$ZL4= 120
##$ABSF1= 0
##$ABSF2= 0
##$ABSG= 0
##$ABSL= 0
##$ALPHA= 0
##$AQORDER= 0
##$ASSFAC= 0
##$ASSFACI= 0
##$ASSFACX= 0
##$ASSWID= 0
##$AUNMP= <proc_1d>
##$AZFE= 0.1
##$AZFW= 0.5
##$BCFW= 0
##$BC_mod= 2
##$BYTORDP= 0
##$COROFFS= 0
##$CY= -3
##$DATMOD= 1
##$DC= 0
##$DFILT= <>
##$DTYPP= 0
##$F1P= 0
##$F2P= 0
##$FCOR= 1
##$FTSIZE= 65536
##$FT_mod= 6
##$GAMMA= 0
##$GB= 0
##$INTBC= 1
##$INTSCL= 5.30512e-09
##$ISEN= 30
##$LB= 1
##$LEV0= 0
##$LPBIN= 0
##$MAXI= 10000
##$MC2= 0
##$MEAN= 0
##$ME_mod= 0
##$MI= 50
##$NCOEF= 0
##$NC_proc= -9
##$NLEV= 6
##$NOISF1= 182.463
##$NOISF2= 159.3651
##$NSP= 0
##$NTH_PI= 0
##$NZP= 0
##$OFFSET= 182.463
##$PC= 4
##$PHC0= -2742.268
##$PHC1= 71.00175
##$PH_mod= 1
##$PKNL= yes
##$PPARMOD= 0
##$PSCAL= 0
##$PSIGN= 0
##$REVERSE= no
##$SF= 81.0140089999434
##$SI= 65536
##$SIGF1= 159.3651
##$SIGF2= -187.1042
##$SINO= 113.3802
##$SIOLD= 16384
##$SREGLST= <1H.CDCl3>
##$SSB= 0
##$STSI= 65536
##$STSR= 0
##$SW_p= 29940.119760479
##$SYMM= 0
##$S_DEV= 0
##$TDeff= 32768
##$TDoff= 0
##$TI= <>
##$TILT= no
##$TM1= 0
##$TM2= 0
##$TOPLEV= 0
##$USERP1= <user>
##$USERP2= <user>
##$USERP3= <user>
##$USERP4= <user>
##$USERP5= <user>
##$WDW= 1
##$XDIM= 65536
##$YMAX_p= 306004895
##$YMIN_p= -114821170
$$ End of Bruker specific parameters
$$ ---------------------------------
##NTUPLES= NMR SPECTRUM
##VAR_NAME=  FREQUENCY,     SPECTRUM/REAL,   SPECTRUM/IMAG
##SYMBOL=    X,             R,               I
##VAR_TYPE=  INDEPENDENT,   DEPENDENT,       DEPENDENT
##VAR_FORM=  AFFN,          ASDF,            ASDF
##VAR_DIM=   65536,         65536,           65536
##UNITS=     HZ,            ARBITRARY UNITS, ARBITRARY UNITS
##FACTOR=    0.456856943014862, 1,           1
##FIRST=     14782.0589164792, 0,            0
##LAST=      -15158.0608439998, 0,           0
##MIN=       -15158.0608439998, -114821170,  0
##MAX=       14782.0589164792, 306004895,    0
$$ Real data points
##PAGE= N=1
##DATA TABLE= (X++(R..R)), XYDATA
$$ [...]
45221g305610R663456R082831n42400n256249p00444N603841Q221876P051638
45213B5818939J496487o520014q837834j915800M569388J512897m858007n033386
45205F232670l951246j0328921j6775535j0388478K651017M822820l331008m291442
45197c5360123N921257J1610311N339607n50284K861800P075188M349551J293374
45189B540681L750261M397393l138516j1504961j1995323p769539m841989j537805
45181c0099798L473571M302311j119926m480788j359750m2622n272607o066807
45173d0666416O338495J9613997J5846769j658174j3363203j0285373n68491O785595
45165a7956801R501522N724005m636786j2450596p311299O086106J2481479Q065627
$$ y = [-7305610, 2357846, 11440677, 10898277, 5642028, 4941584, 10545425, 18767301, 25818939, 27315426, 20795412, 11957578, 10041778, 14611166, 16124063, 11266056, 6232670, 2281424, -8047497, -24823032, -35211510, -32560493, -27737673, -31068681, -35360123, -29438866, -17828555, -12488948, -13039232, -10177432, -3102244, 1247307, 2540681, 6290942, 10688335, 7549819, -3955142, -15950465, -23720004, -28561993, -30099798, -26626227, -22323916, -23443842, -27924630, -29284380, -29327002, -34599609, -40666416, -34327921, -14713924, 1132845, -525329, -13888532, -24173905, -24742396, -17956801, -8455279, -2731274, -7368060, -19818656, -27129955, -21043849, -8562370, -496743]
45157d96743M294297P129891P471468q94944p578307j229242J0625521J1229022
45149C0550963l79403q217128l492514L718644J825448n081805o722296m606265
45141G595644p427250j2734290q807715L983829R872450K136688m486729L016537
45133f850836J4006886J1282112l60738k363439O625438R799209J331488n673132
45125B7796988l910093l029048q576420r974353o59641P498246L458405m319569
45117H284515l218129K511745K018781j906916j79099L485446j030120j0121317
45109a55094j0523765r24778O683490O101196K601248J94403k567949l972360
45101b563609J1332N363022L329399m691036p964328l491118J95254j703878l701349
$$ y = [-496743, 3797554, 10927445, 18398913, 17503969, 9925662, 8696420, 19321941, 30550963, 30171560, 21954432, 18461918, 22180562, 24006010, 18924205, 12201909, 7595644, 168394, -12565896, -21373611, -17389782, -7517332, -5380644, -9867373, -6850836, 7156050, 18438162, 18077424, 15713985, 22339423, 32138632, 33470120, 27796988, 23886895, 20857847, 12281427, 2307074, 1647433, 9145679, 12604084, 8284515, 5066386, 7578131, 9596912, 7689996, 7510897, 10996343, 9966223, -155094, -10678859, -11603637, -4920147, 1181049, 3782297, 3976700, 1408751, -2563609, -2552277, 2810745, 6140144, 1449108, -6515220, -10006338, -9811084, -11514962, -15216311]
45092a5216311j808014J47513j24681J004069L840256K615914l426168o729771
45084a9697193l843554l46325J302283O387396J3837407J1345664m657150j6724479
45076a2395951q702605Q972853J3180755J583500o468584j193901N077372J181403
45068A234842n004776k032012N391510N310371j439667m034853q0203K363577
45060A708789P4388p44495L135746O226524M422515J106838q72750l937387p724344
45051C395824o246485L31401J412584p253343j2467671j855913J4919831J8631327
45043A0867555Q606166R06721J284148k62405o810324p648752l54356R02977r803689
45034b311959j5773935l563671J2504535J1088728k191260l805819R845904J6771077
$$ y = [-15216311, -17024325, -16876812, -17001493, -15997424, -12157168, -9541254, -12967422, -19697193, -23540747, -23887072, -22584789, -16197393, -2359986, 8985678, 4328528, -12395951, -21098556, -12125703, 1055052, 2638552, -3830032, -5023933, 53439, 1234842, -3769934, -5801946, -410436, 4899935, 3460268, -574585, -654788, 1708789, 1783177, 1038682, 4174428, 10400952, 14823467, 15930305, 15057555, 11120168, 3395824, -2850661, -2519260, -1106676, -8360019, -20827690, -22683603, -7763772, 10867555, 19473721, 20380442, 21664590, 21402185, 14591861, 6943109, 6588753, 7491730, -2311959, -18085894, -21649565, -9145030, 1943698, -247562, -4053381, 5792523, 22563600]
45026B2563600L602355j4798792j7761364o003572M154993M685967K323871L678106
45018B445164L971911m913110j9079197k2849315q174772J1934672J8288757J0916504
45010g459386O811194J1756258J1286688k890903j4833055p549005Q867695J1214135
45002A7203621k478208j2604286q887394j882914k182665n572099l783516K937770
44994a7249691Q921541R659694L378127n702780o705670N325339J8286406J6440117
44986C2353083K837957n730260m686127n793436j4011047j8178331j0282273J944742
44978b1545692Q981520J2203776J4780116J2424836K115850r669662j5057480
44971D233264j3338146p060755J230208N481807Q49787n167259N8203J2325934
$$ y = [22563600, 26165955, 11367163, -6394201, -12397773, -8242780, -3556813, -1232942, 2445164, 6417075, 1503965, -17575232, -40424547, -48599319, -36664647, -18375890, -7459386, -648192, 11108066, 22394754, 19503851, 4670796, -2878209, 5989486, 17203621, 14725413, 2121127, -6766267, -8649181, -10831846, -16403945, -20187461, -17249691, -8328150, 1331544, 4709671, -993109, -7698779, -2373440, 15912966, 32353083, 35191040, 29460780, 24774653, 18981217, 4970170, -13208161, -23490434, -21545692, -12564172, -360396, 14419720, 26844556, 28960406, 19290744, 4233264, -9104882, -16165637, -14935429, -9453622, -8603835, -13771094, -13712891, -1386957]
44963a386957J2165981n348033j9985812j5431781j955648K506487j996056n398296
44955c6830115o604941p814466k791118J0978138J9565077J1340325j409601l75443
44947a3942144P956711L087934j3320840j8231948m334768R297938Q742096L869674
44939a6875347O523154J0750175P064422r6221k602126l428642p820844j0209078
44931a6694507l887228M138816K263131o575176q587665L3617Q599410Q668304
44923a2041298M225365K586273M146301N196082M419712K331328j179441n027210
44915D657112o447527n698043p308376j2512201j4424900o792821N144890J0048795
44907c3333071N909109J690584K702825M121745K764999M635347J2951933J8030396
$$ y = [-1386957, 10779024, 5430991, -14554821, -29986602, -31942250, -29435763, -31431819, -36830115, -43435056, -51249522, -54040640, -43062502, -23497425, -12157100, -13566701, -13942144, -5985433, -2897499, -16218339, -34450287, -38785055, -29487117, -20745021, -16875347, -10352193, 397982, 7462404, 7366183, 4764057, 1335415, -6485429, -16694507, -20581735, -16442919, -14179788, -20754964, -29342629, -29309012, -20709602, -12041298, -7815933, -5229660, -1083359, 4112723, 8532435, 10863763, 9684322, 4657112, -1790415, -7488458, -14796834, -27309035, -41733935, -48526756, -43381866, -33333071, -27423962, -25733378, -23030553, -18908808, -16143809, -11508462, 1443471, 19473867]
44899A9473867J0131769m259704j1114548q677338n686251m582703j736196q26103
44891g277207p901037j4227473m741400J3962775J6600403k911212j9411913j3777781
44883c9684845J33864J713991m419757l563845K24172m176591p936521M701976
44875e3007556K4055292K4571910M693824j0210585o409566K568341L734243L515918
44867f488179R697753J5124398J1100947K032860l494995m608453l903421k264701
44859A7196209k803948q521330j3111191p511789K337273R84672r804128r583387
44851c0817619P953708K1160543J1870380p404552j3110902k913922P895843J0470765
44843E104244O758851o68277p932157p284698J031433L419290o829760j4635097
$$ y = [19473867, 29605636, 25345932, 14231384, 5554046, -132205, -4714908, -6451104, -7277207, -15178244, -29405717, -34147117, -20184342, -3583939, -6495151, -25907064, -39684845, -39550981, -37836990, -42256747, -45820592, -45596420, -49773011, -57709532, -53007556, -28952264, -4380354, 313470, -9897115, -16306681, -13738340, -10004097, -6488179, 3209574, 18333972, 29434919, 31467779, 27972784, 23364331, 19460910, 17196209, 14392261, 5870931, -7240260, -14752049, -12414776, -11430104, -21234232, -30817619, -22863911, -1703368, 10167012, 2762460, -10348442, -13262364, -5366521, 5104244, 11863095, 11194818, 3262661, -4022037, -2990604, 428686, -6401074, -21036171]
44835b1036171m891955J1373786J2545851P6705n884020j9106L235299j595421
44827f195032k089627O604106J0159142l04879j0751063n523742P630557R594256
44819I123718j528353r671249n610867J607997J63207p673788r688123n47549
44811b3825007J1112551J3278770M869355m345936p132785o087710n620136l965609
44803b1716507J177670N649001N571689N528910J0053580J1835643J100364j5781454
44795C418896k1397506j1452010N51403M908171O620484R946424Q350255q15961
44787A30156o043727J247365J0616287P695722l343746p600605l210172p18153
44779a226873k226924J060241R676370J1424882J245029q785134p135835M63205
$$ y = [-21036171, -25928126, -14554340, -2008489, -1931784, -7815804, -7834910, -4599611, -6195032, -8284659, -1680553, 8478589, 8173710, -2577353, -8101095, -470538, 9123718, 7595365, -2075884, -7686751, -6078754, -5915547, -13589335, -23277458, -23825007, -12712456, 566314, 5435669, 1089733, -6043052, -12130762, -17750898, -21716507, -20538837, -14889836, -9318147, -3789237, 6264343, 18099986, 19200350, 3418896, -17978610, -29430620, -28879217, -23971046, -17350562, -7404138, 946117, 130156, -5913571, -4666206, 5950081, 13645803, 10302057, 2701452, -508720, -1226873, -3453797, -2393556, 7282814, 18707696, 19952725, 11167591, 4031756, 4494961]
44771D494961J069279o367905j1215362o270276M918305J3527148J2931471L041911
44763A6129532q488887j1686623m415991N116143Q227295M600293p79534m494703
44755D207525n229306k540705J002810J259676p49168J05383K116790l397933
44747c224928j4881789j5149642M418438K4652641K1032760r87961j3550721p082965
44739d774167k58791n734270j0431708j467764R662372O259254n806331r087320
44731b1638725k784279Q2728k744060r38521Q016085J4710715J4379678J2097538
44723B1181159J0530557O382211k8683m436027q034393j4556493j9016641j3739972
44715b1718282m491823l708576p422999J312007K2164611L1760619J6876321n889738
$$ y = [4494961, 5564240, -803665, -12019027, -18289303, -13370998, 156150, 13087621, 16129532, 7640645, -4045978, -8461969, -3345826, 4881469, 9481762, 8702228, 4207525, -1021781, -3562486, -2559676, -1300000, -2049168, -1943785, 173005, -3224928, -18106717, -33256359, -28837921, -4185280, 16847480, 15859519, 2308798, -4774167, -5032958, -10767228, -21198936, -22666700, -13004328, -6745074, -12551405, -21638725, -24423004, -24340276, -27084336, -28022857, -20006772, -5296057, 9083621, 21181159, 31711716, 38093927, 38065244, 33629217, 25594824, 11038331, -7978310, -21718282, -26210105, -29918681, -37341680, -36029673, -13865062, 17895557, 34771878, 28882140]
44707B8882140j5143153j1783235p508508l075223M580395P022254l922281j7569532
44699a8517143j6756529l467517N694425N623875O420946J2630153J6204710J1835950
44691A9668870M689302k3306l521692p052216q537585p109758l547700K514052
44683b920033Q477651O470190m857223j2137103m344270P431274M154478j0717949
44675h442985j4887652j546291J1112169R138470R52296j657499j304632k917344
44667i553468j196384O714942J0643630L405040n171596m224362P3614k580072
44659a888656p144057l929365J067656l804293j2348207q421371N607325J0242452
44651b0618516J58743o924021J602502J4721601J6364852P511407o99952m175333
$$ y = [28882140, 13738987, 1955752, -5552756, -8627979, -4047584, 2974670, -947611, -18517143, -35273672, -38741189, -33046764, -27422889, -21001943, -8371790, 7832920, 19668870, 24358172, 24334866, 20813174, 13760958, 5223373, -1886385, -5434085, -2920033, 5557618, 12027808, 7170585, -4966518, -9310788, -1879514, 2274964, -8442985, -23330637, -24876928, -13764759, -4626289, -3673993, -5331492, -6636124, -9553468, -10749852, -4034910, 6608720, 10013760, 4842164, 617802, 691416, -1888656, -9032713, -12962078, -11894422, -15698715, -28046922, -36468293, -30860968, -20618516, -20459773, -27383794, -25781292, -11059691, 5305161, 12816568, 12116616, 7941283]
44643G941283n121549k993984K516305N241206l58860r151120j0794720k940450
44635a5661889P549376J3686566J2426149L103771j0534270j8536661j2950787
44628b0917745J495840J1048289Q568370P66636j486808M244411J1184645J2059561
44620B6963199N858064k981224r802403j3125286j3237799r578901k187228M999651
44612a3091927O502062K299182j472761r73398L83032j395193l814671k716140
44604a4279814o03443l334219r772442j1498672l613555R114781J7492681J5482100
44596a012583L582589j0335909j4767899n420544Q160567J3339332J0510476R657322
44588A3713351J1690380O176028q555606j7063520q050083P159123R962789O09662
$$ y = [7941283, 2819734, -174250, 2342055, 7583261, 7224401, -1926719, -12721439, -15661889, -8112513, 5574053, 18000202, 21103973, 10569703, -7966958, -20917745, -19421905, -8373616, 194754, 961390, -525418, 3718993, 14903638, 26963199, 32821263, 29840039, 20037636, 6912350, -6325449, -15904350, -18091578, -13091927, -6589865, -4290683, -5763444, -6736842, -6353810, -7749003, -11563674, -14279814, -14883257, -18217476, -27989918, -39488590, -43102145, -33987364, -16494683, -1012583, 2570006, -7765903, -22533802, -27954346, -19793779, -6454447, 4056029, 13713351, 25403731, 31579759, 23024153, 5960633, -2089450, 5069673, 15032462, 15642124]
44580A5642124n060750n68820M228070N42742q007280j3110005j0539279m52430
44572a7325628J1441111J3636817J120436j2515465q763706Q853242J7196433
44565A3643240P002137l304730L525839J7034397J5812166p03460j3857166j3220361
44557B5932062o839676n929467j1702413j7133913j3258964L944034K5193627
44550B05290L1100327J3394813j1449737k0358903j1096650J057L100189L023738
44542G920124M062635K471677l254873p765127q231941p670932o275519q5878
44534a8829834R076674J2954385R019791L205313j570517q277344j4635766j1871112
44526b0928410N13286J0559238J0197717M907833J733500p28658m196097m567704
$$ y = [15642124, 10581374, 10012554, 14240624, 14783366, 6776086, -6333919, -16873198, -17325628, -5884517, 7752300, 8872736, -3642729, -12406435, -3553193, 13643240, 20645377, 17340647, 20866486, 37900883, 53713049, 53009589, 39152423, 25932062, 19092386, 13162919, 1460506, -15673407, -28932371, -24988337, 205290, 31305617, 44700430, 33250693, 12891790, 1795140, 1796197, 4896386, 7920124, 11982759, 14454436, 11199563, 3434436, -4797505, -12468437, -18743956, -18829834, -9753160, 3201225, 12221016, 15426329, 13855812, 5578468, -9057298, -20928410, -20415124, -9855886, 341831, 5249664, 6983164, 6254506, 2058409, -2509295]
44518b509295j384814j860975p649615r540653l629215O73655j212709J669439
44510b5444182J4168446J8558977K38676k2435991j9487914N544360J9278354
44503i579274P753714n966994j451635P934767J19231j8317043k1639481l389312
44495d4536027J5172568J4930821J737818n070100K723441J5213471J7966273
44488A8138265P632207o083723j1743673p486758n32104K416518J475988J074153
44480D890873M106681Q660247Q799909P8574j3310877j9604804j2168997J056021
44472a7492373O523468K037457k111878J235390P192268P816115L189780m37528
44464G952699J004422O367884J1043392R406649l64172j1443832j3116698m076889
$$ y = [-2509295, -3894109, -5755084, -13404699, -22945352, -26574567, -25900912, -27113621, -25444182, -11275736, 7283241, 7521917, -14914074, -34401988, -28857628, -9579274, -1825560, -7792554, -9244189, -1309422, -1190191, -19507234, -41146715, -44536027, -29363459, -14432638, -12694820, -17764920, -15041479, 171992, 18138265, 25770472, 19686749, 7943076, 456318, -75786, 2340732, 3816720, 4890873, 8997554, 17657801, 26457710, 26536284, 13225407, -6379397, -18548394, -17492373, -10968905, -8931448, -11043326, -9807936, -2615668, 5200447, 8390227, 7952699, 8957121, 15325005, 26368397, 35775046, 35410874, 23967042, 10850344, 6773455]
44456F773455L612682q91029j2165287j4940225m396643P749657R628847M172633
44448d55910J457555J580156l992283j4071538j3995574K136933J6588894R345176
44440a406591j1774416j9878577p004820O267191L984910k994058M85161Q085392
44432b4235808O385985L79111L092370R870312O668489j998389J092357J3492992
44424A4747419J3195246m717201j7290059q932034N671711O980558r70163l510625
44416E174852o26935j443466m621130j723811O510731J1636444J0323099M854091
44408C0083875l136274j0013085q995138j201693J194543o838163j2193390l199713
44400a4299038J0238693J0842136o02688r695108j0525302p132584l16144R453317
$$ y = [6773455, 10386137, 9495108, -2670179, -17610404, -22007047, -14257390, -4628543, -455910, 1001645, 2581801, -1410482, -15482020, -29477594, -27340661, -10751767, -1406591, -13181007, -33059584, -40064404, -33797213, -29812303, -32806361, -32321200, -24235808, -17849823, -17470712, -14378342, -4508030, 2160459, 162070, 1254427, 14747419, 27942665, 23225464, 5935405, -2996629, 2675082, 9655640, 8685477, 5174852, 4547917, 3104451, -1516679, -3240490, 3270241, 14906685, 25229784, 30083875, 26947601, 16934516, 7939378, 6737685, 7932228, 1094065, -11099325, -14299038, -4060345, 6781791, 6179103, -3516005, -14041307, -21173891, -21490035, -12036718]
44392a2036718J2376255J346940j1419696r170874K308721L189928q005754j3319700
44384c4730898o175550N57911O3314J543113R000255J2201953O255193j21777
44376a1406486k819828p962337j2579476l519130J4607915J6529243l632935j5587972
44368b6371006K707005K7611915K3854038k573442j6701761p965733J476426k600208
44360e62766r102815p335878k641453K14913O556414J6254501J7203522L715790
44352B4302228j2448674j7446648j1031163j550742M638189M701427m03271m356915
44344a3595569k311804R54778r28154k714952M446304J4498489J2711133K05758
44336A3265983o211780j100921K189842l685373p822571k346204K939322j003629
$$ y = [-12036718, 339537, 1686477, -9733219, -18904093, -16595372, -13405444, -21411198, -34730898, -40906448, -40348537, -40285223, -38742110, -29741855, -17539902, -11284709, -11406486, -14226314, -22188651, -34768127, -38287257, -23679342, -7150099, -10783034, -26371006, -23664001, 3947914, 27801952, 25228510, 8526749, 561016, 2037442, -562766, -9665581, -17001459, -19642912, -19427999, -12871585, 3382916, 20586438, 24302228, 11853554, -5593094, -16624257, -18174999, -13536810, -8835383, -9238654, -13595569, -15907373, -14952595, -15880749, -18595701, -14149397, 349092, 13060225, 13265983, 7054203, 5953282, 8143124, 4457751, -3364820, -5711024, -2771702, -3775331]
44328c775331n861007j405337O392541O741470J609444j869038n418789j1768253
44320a5354300j3182034l288869Q365530R424524M955074Q158354J6808490J6499970
44312C2386739M577139o082456p322776n062304o508189r883808r622309l791545
44304a1309509M599578Q560549K448104q456886j0447437o75690N630276k003076
44296a1654091j0415415k812155J2131647J2230798k498995r674285j98302R350096
44288c540702N144518m156864m968890J090900M867310M309146J995587j623276
44280C117729m887546l702510R39473K804459Q73207K70687J399356m0150j569635
44271g94930L103864Q960569N010941l429902R37461J5753631J6129000n805218
$$ y = [-3775331, -9636338, -11041675, -4649134, 2092336, 3701780, 1832742, -3586047, -15354300, -28536334, -31825203, -23459673, -14035149, -9080075, -921721, 15886769, 32386739, 36963878, 30881422, 23558646, 18496342, 11988153, 2104345, -7517964, -11309509, -6709931, 1850618, 4298722, -4158164, -14605601, -15281291, -9651015, -11654091, -22069506, -24881661, -12750014, -519216, -3018211, -12692496, -12890798, -3540702, 1603816, -2553048, -7521938, -6431038, -1563728, 2745418, 4741005, 3117729, -1769817, -5472327, -4532854, -1728395, -855188, -584501, 814855, 774705, -794930, 2308934, 11269503, 16280444, 12850542, 13788003, 29541634, 45670634, 39865416]
44263C9865416k3406352j4507262M842161P461432l487732o147820J358509K695427
44255H673779m317057n701016P65498J928281n112138p164205J425067R348117
44247a53674P158756j410372j0160217j6115900j2507234N637752K4952979K1999536
44239A9401626m282882k5673215k0122980Q64085J1711757O572187l63920M76937
44231a1416405M386384M808640K854263K368896L096594K191145n99133k411750
44223E278634k101601k883771o706688p920516J232J0830975R622195m650115
44215A470345j2991561k715684J2462259J2904640K569779n13370N076740N301484
44207B3564632j535919k446544L741030J818291j1892591j9198770p278902J1855807
$$ y = [39865416, 16459064, 1951802, 6793963, 14255395, 10767663, 4619843, 5978352, 8673779, 4356722, -1344294, -578796, 1349485, -3762653, -10926858, -9501791, -153674, 7005082, 5594710, -4565507, -20681407, -33188641, -27550889, -2597910, 19401626, 15118744, -10554471, -30677451, -29813366, -18101609, -11529422, -11893342, -11416405, -7030021, -2221381, 632882, 3001778, 6098372, 8289517, 7690384, 5278634, 3177033, 293262, -6413426, -14333942, -14332710, -3501735, 6120460, 1470345, -11521216, -14236900, -1774641, 11129999, 13699778, 13186408, 18263148, 23564632, 22028713, 19582169, 23323199, 25141490, 13248899, -5949871, -13228773, -1372966]
44199a372966J9483201J2819423M78435j0628855j5102540q875085K575762P544080
44191F921455M941781M362527O038515r58383j4776574j6505624k65096J3643203
44183C401804R508733j24807J860025R086716P035781m59855k016029j919141
44175B6373227r468832j6625424j0229572K243557L274906m694158l996572P162297
44167e960571J2010772L234264p522346r498425m138104M124469J2079195J3119256
44159A7448510M038015m937356k340362N063570J649276j1252307j7153860j0223796
44151a7708310p98914L968245O628011P131811K160890l620352l140273j919433
44143g298325q984413j6247146q840492O652682R416447m43658j302243J2456126
$$ y = [-1372966, 18110235, 30929658, 31408093, 20779238, 5676698, -3198387, -622625, 6921455, 11863236, 16225763, 22264278, 21305895, 6529321, -9976303, -10241399, 3401804, 12910537, 12785730, 14645755, 23732471, 30768252, 30308397, 28292368, 26373227, 16904395, 278971, -9950601, -7707044, -4432138, -9126296, -13122868, -5960571, 6050201, 9284465, 1762119, -7736306, -11874410, -7749941, 4329254, 17448510, 21486525, 16549169, 14208807, 19272377, 20921653, 9669346, -7484514, -17708310, -18507224, -14538979, -7910968, -779157, 1381733, -2238619, -5378892, -7298325, -16282738, -32529884, -41370376, -34717694, -25301247, -25744905, -27047148, -14591022]
44135a4591022K0793680J2651798K210052Q48937j09711o820002r206637l404753
44127B372342k533633j0209662q995112P471676J6834093L588024j2419300q024214
44119a1915786M897106J787427j2032657j2806317N296N730617j66221j124589
44111b5625124R380005J8247600J5993953P885464J16656o810235j0111637o305104
44103B771578n62424m60354k887941o17695K976125K32914n666718o772452m368611
44094a5355578j832234O202005J9607696K0499119j390508k3222119j7475454
44087a2967073M006042P588332p215464r235273P759488J2541542q989898k7224649
44079c3736953j6071952P674851J5610324R268173M812424J341590p274699r289053
$$ y = [-14591022, 6202658, 18854456, 21064508, 21913445, 21803734, 14983732, 5777095, 2372342, -161291, -10370953, -19366065, -11894389, 4939704, 8527728, -3891572, -11915786, -7018680, -5231253, -17263910, -30070227, -30064931, -24334314, -24500535, -25625124, -16245119, 2002481, 17996434, 25881898, 25998554, 19188319, 9076682, 2771578, 2209154, 1748800, -1139141, -1756836, 1219289, 1452203, -4214515, -10986967, -15355578, -17187812, -10985807, 8621889, 29121008, 27730500, 4508381, -12967073, -8961031, -1372699, -8588163, -17823436, -10063948, 2477594, -6512304, -33736953, -49808905, -42134054, -26523730, -17255557, -12443133, -11101543, -18376242, -27665295]
44071b7665295O110252K1753992J4276800p250490j3662420k46681R695706L652784
44063F664648n156652m270129P36500J679187R68167J818290M03974m996117q755468
44054a0907600p440650m577008j911848L868694J1573693J2945796N425017j208711
44046G767383J992930R445710Q166725m147303j5308661j3975592l951704J230575
44038h779937l007288n775725K412576J2721367Q984907o667766j3908034l307532
44030a7327432R858310R067797l90904m026391j658237k638007o150509l736495
44022a7001868L032923M434924L62097J88352N066403N953608R84166q6689P340135
44013A0274051J4378002J2083548K942509n332900q732548o822598k249668k029825
$$ y = [-27665295, -21555043, 198949, 14475749, 7225259, -6437161, -6683842, 3011864, 6664648, 1507996, -2762133, -2025633, -346446, 621721, 2440011, 2843985, -2152132, -10907600, -18348250, -22925258, -24837106, -20968412, -9394719, 3551077, 8976094, 7767383, 9760313, 19206023, 27372748, 23225445, 7916784, -6058808, -10010512, -8779937, -11787225, -17562950, -15150374, -2429007, 6555900, -111866, -14019900, -17327432, -7469122, 1598675, 1207771, -2818620, -4476857, -7114864, -13265373, -17001868, -13968945, -9534021, -9171924, -8983572, -3917169, 2036439, 3020605, 2933916, 10274051, 24652053, 36735601, 39678110, 34345210, 25612662, 18790064, 16540396, 14510571]
44005A4510571j0077473j7533469j1474576N156202J4699597R179934O75508J829233
43997F965527Q412791R038991J794844p211822j3268522j3247100m670195P567897
43989d617589J1478993K948867p225055q958494o678024q096906q639805r2261
43981b9880274J2024199J4632076P406835K241534L266569K083930n052928r469875
43973b747934m970551J302262O78660l419960k944553N1940k903747j0599503
43965b5553386j1202147l31922R388766M274161j0285718j5628624n194162O906952
43957d7626080P138481J615540L851640J1529096J0670432K17588n108385N54986
43949a7156702M485779j659649o255032J489050R948185K979443j1023268j0436196
$$ y = [14510571, 4433098, -13100371, -24574947, -19418745, -4719148, 4460786, 5136294, 6965527, 15378318, 24417309, 26212153, 19000331, 5731809, -7515291, -12185486, -4617589, 6861404, 9810271, 2585216, -6373278, -13051302, -21148208, -29788013, -29880274, -17856075, -3223999, 4182836, 6424370, 9690939, 11774869, 6721941, -2747934, -7718485, -6416223, -5737563, -9157523, -12102076, -12050136, -14953883, -25553386, -36755533, -37087455, -27698689, -23424528, -33710246, -49338870, -54533032, -47626080, -40487599, -38872059, -35020419, -23491323, -12820891, -12603303, -17711688, -17156702, -12670923, -14330572, -20585604, -19096554, -9148369, -6168926, -17192194, -27628390]
43941b7628390L915949Q988542k545231r305222M222588K1501285J8260535j869105
43933A5540951j4407687q335578M381663R793607O238605j980551j0753686j3689031
43925a3211707n477803Q428320J4883511R493834J766527L57836J820062p48131
43917A7312449n799774p520790o297557o533749o981787k054506P085562J0591803
43909a98349K278456j0942605j6068833q495549L879480J0514708Q960775M370511
43901e701406R50791j916898m673870l812631K731986R708137J0052238M877132
43893A2215479J293958Q82044j159353m257484q10115Q485247R088694p084056
43885A8654414k4495377k1159667J317083J9498563J8533155O002703n122729
$$ y = [-27628390, -23712441, -14723899, -17269130, -26574352, -22351764, -850479, 17410056, 15540951, 1133264, -7202314, -2820651, 6972956, 13211561, 11231010, 477324, -13211707, -18689510, -10261190, 4622321, 14116155, 15882682, 16240518, 18060580, 17312449, 11512675, 3991885, -2305672, -8839421, -15821208, -17875714, -10790152, -198349, 2080107, -8862498, -24931331, -33426880, -29547400, -19032692, -10071917, -5701406, -4750615, -6667513, -11341383, -15154014, -12422028, -2713891, 7338347, 12215479, 13509437, 14391481, 13232128, 8974644, 8164529, 16649776, 25738470, 18654414, -5840963, -27000630, -25683547, -6184984, 12348171, 18350874, 13228145]
43878A3228145j1091814j0832409j339833J1843150J3730229L89585j1544288
43871D382765p681125K989556L675226l720083m870457J244419K319020m033856
43863e694535o324778J6474N558309M630478M264513R450328J3296587Q940893
43855C4138269j27959q013338j4133714j7316901j3022801k659056M706170N741575
43847a0687755P042174J0502106P805235k725368q245661j619859M161814l849309
43839B383377j5891882j4092793p71181O583469L161665N89247M820483Q345930
43831d871685N404582o57194o878736j3579977j6455665r592705J771543M997760
43823c9862077j090938m140214K460571J1314077J4661970J2745768N622477q329346
$$ y = [13228145, 2136331, -8696078, -10035911, 1807239, 15537468, 15927053, 4382765, -3298360, -308804, 3366422, -353661, -5224118, -3979699, -1660679, -5694535, -12019313, -12002839, -6444530, -1814052, 2450461, 11900789, 25197376, 34138269, 34010310, 25996972, 11863258, -5453643, -18476444, -21135500, -16429330, -10687755, -3645581, 6856525, 14661760, 11936392, 3690731, 2070872, 6232686, 2383377, -13508505, -27601298, -28372479, -21789010, -18627345, -18038098, -13217615, -4871685, 532897, -124297, -7003033, -20583010, -37038675, -46631380, -44859837, -39862077, -40953015, -45093229, -42632658, -31318581, -16656611, -3910843, 1711634, -6617712]
43815f617712k0859904j6659792M048262J9805615J4752476q61007p350655j673585
43807a5416302M760585N036083J129961l926571o967047l078280P112605J3737801
43799B388835R992188K140917j196242k210567o263279q921476l153226O441754
43791g81096R612504O103754K591037j223250r159231j5140708r608892J905691
43783a5700191L760516m669714o173343O932549J8941928J3286021l792184j2982350
43775c96768p049160L955137P642914J239062q402907j1151846k732761R183960
43767g712369J1859014K540290q717600j2983220j1732075r217535m420924L582736
43759c6801683R846053J0173291P702761O659997N627958L283085L674316P891115
$$ y = [-6617712, -27477616, -44137408, -40089146, -20283531, -5531055, -6392062, -13742717, -15416302, -10655717, -5619634, -4489673, -8416244, -15383291, -18461571, -11348966, 2388835, 12381023, 14521940, 13325698, 11115131, 4851852, -4069624, -7222850, -781096, 8831408, 14935162, 17526199, 16302949, 7143718, -7996990, -17605882, -15700191, -11939675, -16609389, -22782732, -15850183, 3091745, 16377766, 12585582, -396768, -7445928, -3490791, 4152123, 5391185, -3011722, -14163568, -16896329, -7712369, 4146645, 6686935, -2030665, -15013885, -26745960, -35963495, -40384419, -36801683, -26955630, -16782339, -9079578, -2419581, 3208377, 6491462, 10165778, 18056893]
43751A8056893P801898j816833j1425123r206897l73203M11716o827798p489297
43743a0868644K097490P077845j290623r639057k780665J2299841J7121957Q399471
43735B2417615j152996m125540m709828m889966m92902O158424M721175n892750
43727A2033232j1920137m806943M909637M460520r06140J521398Q788016O625246
43719B0704829n944183j3904546r830381l696412m114588n015456P41994P578761
43711a3479982P523468L888174L320290L126361j062124k873584M761199J2464677
43703A7668479M270726j6036497k5129969j0735711J1710991J9491062R166098
43696A0405179m777885j0168117p629483m178108l117695j333875M519077J0236763
$$ y = [18056893, 25858791, 24041958, 12616835, 3409938, 3036735, 3448451, -3379347, -10868644, -8771154, -1693309, -2983932, -12622989, -15403654, -3103813, 14018144, 22417615, 21264619, 17139079, 12429251, 7539285, 7046383, 13204807, 17925982, 12033232, 113095, -4693848, 215789, 4676309, 3770169, 5291567, 14079583, 20704829, 14760646, 856100, -8974281, -12670693, -16785281, -21800737, -21058743, -13479982, -5956514, -2068340, 1251950, 4378311, 3316187, 442603, 5203802, 17668479, 21939205, 5902708, -19227261, -29962972, -18251981, 1239081, 10405179, 5627294, -4540823, -12170306, -16348414, -19466109, -20799984, -16280907, -6044144]
43688f044144P151665l772363q201374K441452J4862595J0645775n198100j0415905
43680A469601j80886N552062m403997j3174851l529813J3240659J4565819J45165
43672A3683759j1559525j2196074q902542n599922J132144Q555613Q369090J848111
43664d669346j465724p20201l393424p744761l848826N411596M305104q570597
43656b0696179j3088409J893125J9109354J8182489M978057j052637L109918N171385
43648A7607103P50579l159688m014112o058142q522416o226531p73331K080692
43640h315846L999747R384911J2337074M362767p120002o501552L657057M365936
43632A6170092q378588j5693832o904849L305864J088323l641867K875981J2817979
$$ y = [-6044144, 1107521, -2664842, -10866216, -8424764, 6437831, 17083606, 11885506, 1469601, 1288715, 6840777, 2436780, -10738071, -14267884, -1027225, 13538594, 13683759, 2124234, -10071840, -18974382, -24574304, -23442160, -14886547, -6517457, -4669346, -6135070, -6855271, -10248695, -17993456, -21842282, -16430686, -12125582, -20696179, -33784588, -31891463, -12782109, 5400380, 10378437, 9325800, 12435718, 17607103, 18357682, 15197994, 11183882, 5125740, -3396676, -9623207, -10396538, -8315846, -4316099, 5068812, 17405886, 21768653, 14648651, 8147099, 11804156, 16170092, 7791504, -7902328, -14807177, -11501313, -10412990, -14054857, -11178876, 1639103]
43624A639103J1147907J793772j781999j322529o684711j2792984p965335R37301
43616a5029475j983100j0196779j734391K0714086K7383603P449270j2125521
43609A4477693q164780N018847L041361r969122j3808154o474023r85918Q04215
43601a6059881O780689J3917270J1641565J699082n004077p067556r556800q202498
43593a1852206K817146J2821687P316742n196030m308120O444192L591032j3865640
43585b231197j7620927L987677K3230009J3850840j0076535j7805937n473534
43578a2139604P103579R358657O470094K088335l520540l830780N559709J2996370
43570B4085820L927455j4700671k1250242r604822M502543P773265L558887l76015
$$ y = [1639103, 12787010, 14580782, 12798783, 11476254, 4791543, -8001441, -15966776, -15029475, -17012575, -27209354, -28943745, -8229659, 19153944, 26603214, 14477693, 6312913, 11331760, 14373121, 4403999, -9404155, -15878178, -16864096, -16059881, -9279192, 4638078, 16279643, 17978725, 12974648, 5907092, -3649708, -11852206, -9035060, 3786627, 11103369, 5907339, 1599219, 8043411, 11634443, -2231197, -19852124, -15864447, 7365562, 21216402, 11139867, -6666070, -12139604, -5036025, 4322632, 10792726, 12881061, 9360521, 5529741, 11089450, 24085820, 28013275, 13312604, -7937638, -17542460, -13039917, -5266652, -1707765, -2083780]
43562b083780k868117l640919M40463P778005J0861078P904262P091553J3912792
43554C9395337K1105140J6807847q93243k0971440k9077948j9959471l042010
43547C364212N442355r46394j2157308j4535375o302592M143655R842358Q709701
43539b439388J150858p327837o357646O487460J7459735J2189500l992672j3106947
43531D063063r200220k964003k927173n915693p236191o867319k999012P672799
43523b6373749J9455269J9672261O135589q072392j2007124q656757m707248K4979
43515a4529172N970589O999600o96774j0150195j2408826q198719l610345K61411
43507c6362431N549951R837317Q424882K537595j675252j953329k170479m864910
$$ y = [-2083780, -4951897, -8592816, -8152353, -374348, 10486730, 18390992, 25482545, 39395337, 60500477, 77308324, 76415081, 55443641, 26365693, 6406222, 3364212, 8806567, 7860173, -4297135, -18832510, -25135102, -20991447, -11149089, -2439388, -1288530, -8616367, -14974013, -8486553, 8973182, 21162682, 17170010, 4063063, -5137157, -8101160, -11028333, -16944026, -24180217, -31047536, -34046548, -26373749, -6918480, 12753781, 18889370, 10816978, -1190146, -9846903, -14554151, -14529172, -8558583, -1558983, -2255757, -12405952, -24814778, -33013497, -36623842, -36362431, -30812480, -20975163, -12550281, -10012686, -11687938, -13641267, -15811746, -20676656]
43499b0676656n790734Q44138J2419180J7279535Q177368n870218q861095M83007
43491a995475O903006K468959j420862M395798Q084494l299408j7205012j1853465
43483a3921965P807926J6540054R060425N166284J1272982P754927j3677375k8950417
43475A052841j7196425N533782J0592707k206630j0902839o257731K537215Q549808
43467h297272J1993381R815592l30639r443976p269322Q45929K467591j729234
43459a947950k208502N15609j141891m036777J818899J3134196J5357945N589678
43451B7081207l018652j624619M092942N955903K533432m766051j2735233j3532823
43443C986106l041604Q818986Q915476L22722l275226n78026l100246j2293358
$$ y = [-20676656, -26467390, -25623252, -13204072, 4075463, 12252831, 6382613, -2478482, -1995475, 4907531, 7376490, 5955628, 10351426, 18435920, 15136512, -2068500, -13921965, -6114039, 10426015, 19486440, 24652724, 35925706, 43680633, 30003258, 1052841, -16143584, -10609802, -17095, -2223725, -13126564, -19384295, -16847080, -8297272, 3696109, 13511701, 13181062, 3737086, -3532236, -2686307, -218716, -1947950, -4156452, -3640843, -4782734, -8819511, -7000612, 6133584, 21491529, 27081207, 24062555, 22437936, 26530878, 32486781, 35020213, 30254162, 17518929, 3986106, 944502, 9763488, 18678964, 19001686, 15726460, 15148434, 12048188, -245170]
43435b45170j4522739l204514J0089599J2576313N321317l344734p527511l636267
43427d493706P168645J3938578O322386q227399j2033468l507329J075018m820476
43419d577751q034197k87222O808132K310905n560793m675042J432257K917707
43411i666004P89424J211974K503647M91351j626311M5472J896366J046423K180374
43402a127284O538803N381112m458734j0512739l202014P434225Q175097L957834
43394A2186300N802489Q540293O95512j1776187j3309655m888758n05510j213009
43386d468525M043485J2815661R214238o957499j5165250n764148N110682K345531
43378A174175o301743p676326m859159o163446o849063J291662J2140016J3463127
$$ y = [-245170, -14767909, -17972423, -7882824, 4693489, 10014806, 6670072, -857439, -4493706, 2674939, 16613517, 22935903, 14708504, 2675036, -832293, 242725, -4577751, -12611948, -12899170, -6091038, -3780133, -9340926, -14015968, -12583711, -9666004, -8876580, -7664606, -5160959, -4669608, -6295919, -6250447, -4354081, -3307658, -1127284, 5411519, 10792631, 6333897, -4178842, -7380856, 53369, 8228466, 12186300, 17988789, 26529082, 27224594, 15448407, 2138752, -2750006, -3255516, -4468525, -425040, 12390621, 21604859, 14647360, -517890, -6282038, -1171356, 1174175, -5127568, -12803894, -17663053, -23826499, -30675562, -29383900, -17243884, -3780757]
43370c780757O140114N62124l71473n97628J335375Q662846J4072500O827882
43362C2850983q455139j5238506q513399n57030p18287l761857l087204j629102
43354i109541k258432j4474O610561Q059537q97823q201813j612747Q812530L485696
43345D873494j4290103j8877995O29503K2414816K0886632m26956j7490445j7298004
43337a9579058o857327L282689R829633J2250771R804427M858258J042541k340704
43329A2291230p136767r074049k447009Q432897J1959063M698216m431859p208827
43321G082895n189431l582951l863379n274082o871603n725254M27394P200554
43313a5795857P361639J825937j256345K80448j23692m732849o241386j45419
$$ y = [-3780757, 2359357, 2921481, 2550008, 1952380, 3287755, 11950601, 26023101, 32850983, 24395844, 9157338, 643939, 86909, -631378, -4393235, -7480439, -9109541, -11367973, -11382447, -4771886, 3287651, 2389828, -5811985, -7424732, 1387798, 4873494, -9416609, -28294604, -27665101, -5250285, 15636347, 15209391, -2281054, -19579058, -26436385, -23153696, -13324063, -1073292, 8731135, 13589393, 14631934, 12291230, 5154463, -3919586, -6366595, 2066302, 14025365, 18723581, 14291722, 7082895, 1893464, -1689487, -5552866, -10826948, -17698551, -23423805, -22996411, -15795857, -8434218, -6608281, -7864626, -7584178, -7707870, -12440719, -18682105, -18827524]
43305a8827524P372712R440747P329936L924041j843745p690158n696296M195309
43297a794978Q503796j430463j4144587j3180863o23933P592175N267420J174134
43289h637299K305350M591724K009426m166270p614948l658270O054538J2722469
43281C606720Q163461l397332q335236l196706j214767j0790601j8909849r861903
43273d3936213Q692588J5736433P559053m2367K063307O734359P739613Q108591
43265A2655364P898958Q13425j1400150j6383979r386714n20744K177301L303719
43257a0842820O977596P148434M1747n948825k868910M447659Q048802R025708
43249A6029391J0336064P407711k771672j1585773r863615k385222L87817j143142
$$ y = [-18827524, -11454812, -2014065, 5315871, 9239912, 7396167, -293991, -5990287, -1794978, 6708818, 5278355, -8866232, -22047095, -22671028, -15078853, -9811433, -8637299, -6331949, -1740225, 269201, -3897069, -11512017, -15170287, -9115749, 3606720, 11770181, 8372849, 37613, -3159093, -4373860, -15164461, -34074310, -43936213, -35243625, -19507192, -11948139, -11990506, -9927199, -3192840, 4546773, 12655364, 20554322, 21367747, 9967597, -6416382, -15803096, -16323840, -14146539, -10842820, -3865224, 3283210, 3324957, -2623868, -5492778, -1045119, 7003683, 16029391, 26365455, 33773166, 31001494, 19415721, 9552106, 7166884, 7554701, 6411559]
43241F411559k1487J751169l495708j2449926j2205470q9849J0531922Q662743
43233i05047J43130k192808L580461P101421M51745j0412563j1072585M037402
43225i268844K1663674K2089090K989982j5279147j3242362L984865J3732565
43218B6669823L619298j5485743k3905913j3770745N809092J9004729J7081555
43211A9022096M958259n111956p083138n891845p192953p702729j314696R195382
43203a121580J4167055R380027l24098q666230j2389948r259307P3289P583190
43195e57602M123356o974304j0943881j159668R910054O823404p160827j4331839
43187b0271307o917063L362219L476934k262439p1333J1304879J7532953R553248
$$ y = [6411559, 6390072, 8141241, 4645533, -7804393, -20009863, -20099712, -9567790, -905047, -761917, -2954725, 625736, 7727157, 8178902, -2233661, -13306246, -9268844, 12394830, 34483920, 37473902, 22194755, 8952393, 12937258, 26669823, 30289121, 14803378, -9102535, -22873280, -17064188, 1940541, 19022096, 23980355, 18868399, 11785261, 5893416, -1299537, -9002266, -10316962, -1121580, 13045475, 22425502, 22101404, 13435174, 1045226, -8214081, -8140792, -557602, 3565754, -3408550, -14352431, -15512099, -5602045, 1221359, -5939468, -20271307, -27188370, -23826151, -20349217, -22611656, -22682989, -11378110, 6154843, 15708091]
43179A5708091k604843m205886K803782L913196m487896q834701K44284J1797235
43171A4333262R176255o191319j6943390j3145154k494535L558449L640594K448606
43163e617232J212675j126193j916757K525787R120629R180104n98350j2043195
43155G37468j3778194m580709M939702N307187k73263j340511M368252P658502
43147C038434K453499l751728j148187N762653L582655q655656j5718050p968076
43139b2404456M282286O663128J773377J957798O937635M625432n914518r553498
43131a1632816M81530Q772190K87527j4940193j5652637q62448J0689085J0357991
43123a2499771R109164J3598927J2516379k494037j8013489j6256837j537679
$$ y = [15708091, 13103248, 8897362, 11701144, 15614340, 11126444, 2291743, 2536027, 14333262, 23509517, 17318198, 374808, -12770346, -15264881, -11706432, -8065838, -5617232, -4404557, -5530750, -7447507, -4921720, 4198909, 13379013, 12780663, 737468, -13040726, -17621435, -12681733, -7374546, -7647809, -8988320, -4620068, 3038434, 5491933, 1740205, 592018, 6354671, 9937326, 1281670, -14436380, -22404456, -18122170, -11459042, -9685665, -7727867, -790232, 3835200, -2079318, -11632816, -11151286, -2379096, -2091569, -17031762, -32684399, -33546847, -22857762, -12499771, -3390607, 10208320, 22724699, 20230662, 2217173, -14039664, -15577343]
43116a5577343O768443K375995k797673k37115L664779O09200o787527r915220
43108b1896461m540637O850995J7389333J9225403J0387991j124952n539078k903193
43100A7849401m80433p05173k33139M21106l142585q574843o713054M521533J5015356
43091A7958169J5063023N962034m600653j0668358r647058l336754J085319j375241
43083A0440481m877857q36552O291587M094389o255599r319609l92684N826191
43075D970347l44004p277846k311770O745491O038635k55230J637790J0075081
43067A9278494J0095215k080765j3113476j1800590j734172O393730N948713j802894
43059A1184255p830249k287993J1708327J7093067M612654j1730148j3046658
$$ y = [-15577343, -8808900, -6432905, -9230578, -9467693, -5802914, -5193714, -11981241, -21896461, -26437098, -19586103, -2196770, 17028633, 27416624, 26291672, 20752594, 17849401, 17368968, 16663795, 16430656, 16851762, 13709177, 5134334, -1578720, 2942813, 17958169, 33021192, 38983226, 34382573, 23714215, 14067157, 10730403, 11815722, 10440481, 5562624, 4726072, 11017659, 15112048, 8856449, -463160, -855844, 4970347, 4626343, -2651503, -4963273, 1782218, 7820853, 7565623, 9203413, 19278494, 29373709, 27292944, 14179468, 2378878, 644706, 7038436, 12987149, 11184255, 3354006, 1066013, 12774340, 29867407, 34480061, 22749913, 9703255]
43052I703255k402464J921781m784528r119914k994667N514624P390896M335138
43044I564121J608194J076529L829560Q673269P387654n819384j9671402j5839685
43036i191144L706149J5736017P894288m569863l524344N573094N347762n980624
43028A4991335j4085584j0591918j740198M353905P946124J2521717J6441201
43021B9836582J4139993M121311p039833j0822128o952491l652079n530136p014982
43013G086237l121353L42452l046644o300619J031977J2586276J1623005k044397
43005A8156934r458320r40448J0494516J1429230O803083N727663L800948o313426
42997C9700180j7968312j9285680j1495591m954790k505331O72100N264767P751442
$$ y = [9703255, 7300791, 9222572, 4438044, -4681870, -7676537, -2161913, 5228983, 9564121, 11172315, 12248844, 16078404, 24751673, 32139327, 26319943, 6648541, -9191144, -5484995, 10251022, 18145310, 13575447, 10051103, 15624197, 20971959, 14991335, 905751, -9686167, -11426365, -7072460, 873664, 13395381, 29836582, 43976575, 48097886, 41058053, 30235925, 23283434, 19631355, 14101219, 7086237, 3964884, 4307336, 1260692, -5039927, -4007950, 8578326, 20201331, 18156934, 8698614, 7758166, 18252682, 29681912, 36484995, 42212658, 46013606, 39700180, 21731868, 2446188, -9049403, -14004193, -16509524, -15837424, -10572657, -2821215]
42989b821215Q462390R061137N807651m070469j2947878j0775292O782P835499
42981E58605Q026930N329630K695740j791984p434892j0041245q557797m815967
42973a6030980J575344R760797J2167097L330747p683793o188539O322435J2260042
42965A5513150L001985q791497q399260M1658J466062p343179j3285262m866574
42957b2662917J2531756K2231939J5081882M4510o040855J312629R068507M595743
42949C6163194p029045j0823527l122967N060221N512804K757623L038480L126118
42941C4682901k854052j1672139j4251392q263527n62222K676941K711334L904724
42933F372568O735827P872959N710547L030478L159150M813619K996329m323996
$$ y = [-2821215, 5641175, 14702312, 20509963, 16439494, 3491616, -7283676, -7276894, 558605, 8585535, 13915165, 16610905, 14818921, 7384029, -2657216, -11215013, -16030980, -14455636, -4694839, 7472258, 10803005, 3119212, -3069327, 3253108, 15513150, 18515135, 9723638, 1324378, 1366036, 2832098, -4511081, -17796343, -22662917, -10131161, 12100778, 27182660, 27227170, 21186315, 22498944, 31567451, 36163194, 29134149, 18310622, 15187655, 20247876, 25760680, 28518303, 31556783, 34682901, 31828849, 20156710, 5905318, -2358209, -2920431, -243490, 2467844, 6372568, 13108395, 20981354, 26691901, 29722379, 32881529, 37695148, 40691477, 36367481]
42925C6367481j2183979j3038021m923248N647816Q974077J037850j1400190j5504812
42917e023026n375918R729467J4413929N183837n782849o994373j250118K022599
42909F923548J748233L963672Q645545P899791j077029r450134p717142J456826
42901A2393310O363052O59119r272820j2173959n269154K330093P02128p839663
42893a2107894j0373536P07417J6936848K2470687J2026599l609717j0239082
42886A5811322n238837K198460M274541L674518O379547R235709L600642p405434
42878C2530468p422593Q759914K0696828Q027772j6374262k0121740K521537K1821587
42870E0439511J6084642J8756l493813K344025K214035r00089N598961J5989538
$$ y = [36367481, 24183502, 11145481, 6222233, 11870049, 20844126, 21881976, 10481786, -5023026, -10398944, -669477, 13744452, 18928289, 13145440, 6151067, 4900949, 6923548, 8671781, 12635453, 21280998, 29180789, 28103760, 18653626, 10936484, 12393310, 18756362, 19415481, 10142661, -2031298, -7300452, -4970359, -4268231, -12107894, -22481430, -21774013, -4837165, 17633522, 29660121, 26050404, 15811322, 10572485, 12770945, 17045486, 20720004, 27099551, 36335260, 39935902, 32530468, 25107875, 33867789, 54564617, 62592389, 46218127, 26096387, 28617924, 50439511, 66524153, 66542909, 63049096, 65393121, 67607156, 66707067, 72306028, 88295566]
42862H8295566J3859001K542500J370833J2000388J4606482J960310p364680J038156
42854A28308556J5409865J8206890J1785482R845256J5240095J9875484J9099722
42847B37771350J5142284J1267375J0000701J2205600J3232124O385461o504934
42840B99499961j6022997j8966032k0727320k1527099j4184840r33429K968338
42833B10106582q507425k0779959k0576233j4934348j4838178j4191331l054810
42826A13224298R495147O873442p328775j4682506j1487793j0855203j5374958
42819F9863652j1163770M994083J4278130L176869j4389407j6353399k392117
42812D8014041R943330J1340739Q112059O699519M872301L5580m318964m771123
$$ y = [88295566, 102154567, 104697067, 106067900, 118068288, 132674770, 134635080, 127270400, 128308556, 143718421, 161925311, 173710793, 183556049, 198796144, 218671628, 237771350, 252913634, 264181009, 274181710, 286387310, 299619434, 306004895, 299499961, 283476964, 264510932, 243783612, 222256513, 208071673, 207138244, 210106582, 201599157, 180819198, 160242965, 145308617, 130470439, 116279108, 113224298, 122719445, 129592887, 122264112, 107581606, 96093813, 85238610, 69863652, 58699882, 63693965, 77972095, 81148964, 66759557, 50406158, 48014041, 57957371, 69298110, 77410169, 84109688, 88981989, 89017569, 84698605, 79927482]
42804G9927482l970253n740756p866799m536846M863440J3331941J4060983Q376752
42796I8445944L293415K176652J577218j926290o062352o910845m960447k933117
42788H2700178m29299L933469O813891K924907o130459j1481149p183869L195009
42780G4342678J1364332J2030591N287296m364017j0277890r205007n699133o510550
42772F6968300r820251o454267N450473J4203775Q956202n121217j3788612j2373324
42764D8021079q454801p300522n189875J01403K240824l373875r322691n352029
42756A1369513N479279R585977J863392p199782o307144K396116Q741347Q298437
42748C4227135M361364n1491m911835q814735q394393l480563J325856J794028
$$ y = [79927482, 75957229, 70216473, 62349674, 57812828, 62676268, 76008209, 90069192, 98445944, 101739359, 103916011, 105493229, 103566939, 97504587, 90593742, 85633295, 82700178, 82270879, 86204348, 93018239, 95943146, 89812687, 78331538, 71147669, 74342678, 85707010, 97737601, 103024897, 98660880, 88382990, 79177983, 73478850, 66968300, 57148049, 50693782, 56144255, 70348030, 79304232, 74183015, 60394403, 48021079, 39566278, 32265756, 27075881, 27177284, 29418108, 26044233, 16721542, 11369513, 16848792, 26434769, 28298161, 21098379, 14791235, 17187351, 25928698, 34227135, 38588499, 38537008, 33625173, 24810438, 16416045, 12935482, 14261338, 16055366]
42740A6055366j499821m277365k420019M400119J0998565J0487983K573456m556532
42732C1761752m498047j542994l495831q651505q405465j835244K388231N40818
42724F261715k3840N765050J0483990N182998n919542j0440497l811549P539319
42716A5037644J6029721J8193056J2590867J304325o961853m132873N228716P103768
42708F4393371l712653j5656477j5461036n309134J713962j40768l537074q06438
42700B1483753M852009N005584j196504n219846L14779J3320644K5065029K7917186
42692I1542634J9471512L330772j1083868j3129679p20705J5243165K0808397
42685A25462228J3465593K813331k904033n373618r599299j4379266j4269811
$$ y = [16055366, 14555545, 10278180, 7858161, 12258280, 23256845, 33744828, 36318284, 31761752, 27263705, 25720711, 22224880, 13573375, 5167910, 3332666, 5720897, 6261715, 6237875, 12002925, 22486915, 27669913, 21750371, 11309874, 7498325, 15037644, 31067365, 49260421, 61851288, 63155613, 56193760, 52060887, 57289603, 64393371, 60680718, 45024241, 29563205, 24254071, 25968033, 25827265, 22290191, 21483753, 26335762, 31341346, 30144842, 24924996, 25239775, 38560419, 63625448, 91542634, 111014146, 114344918, 103261050, 90131371, 89410666, 104653831, 125462228, 138927821, 141741152, 138837119, 133463501, 123864202, 109484936, 95215125]
42678I5215125q593650l502422m588908j0238838j3364423q704722J915321J0816408
42670E8953891J0781609J286692j0119319j2814622k165871J4137787K0945209
42663H1005376J0864553o368052j4431972r316477j163272K094671L157632N161052
42655G1003511M593695N29585l27785L448184J407439j0809519j8306794p593980
42647D3944336R137558R868391l658679j0172176l297257K412604K26883K55594
42639D8717254M892334J541357j0450189j1100944P568843K3307874J5900336
42632H0376865k508406r356533n859731o440338r030388j727913J0513211J1585404
42624F7552171J839344l215785P20453K761851k080597o999033p718027n568787
$$ y = [95215125, 86621475, 83119053, 78530145, 68291307, 54926884, 46222162, 48137483, 58953891, 69735500, 71022192, 60902873, 48088251, 45922380, 60060167, 81005376, 91869929, 85501877, 71069905, 61753428, 60590156, 62684827, 65842459, 71003511, 75597206, 76126791, 75799006, 79247190, 80654629, 69845110, 51538316, 43944336, 53081894, 62950285, 59291606, 49119430, 45822173, 48234777, 48461660, 48717254, 53609588, 55150945, 44700756, 33599812, 41168655, 64476529, 80376865, 77868459, 68511926, 62652195, 56211857, 47181469, 45453556, 55966767, 67552171, 69391515, 66175730, 66896183, 69658034, 67577437, 60578404, 52860377, 47291590]
42616D7291590J507944J3797154J9078768O124591j3740618j8718132q301289
42609D7040008j545586m588023l972312M997916Q389910j63826o239976J118706
42601D5036817J0775388P673230n085586j4004994j3515019p289981j279650j629550
42593B0680655r201550j3005691k174197J3715534J3570032k582849j0654348
42586A0347586N44018J1659000M363451j0349422j1762010N0366J0846431J4757560
42578C0456980J2764484K153658j4258232k0399900p262867R502661J0763051
42571B3719835K057798P50305N625801K772496n520324l574714Q045989J0833573
42563D4710759j368892j3038875j3043429r769975j2835907j7032956j3515815
$$ y = [47291590, 48799534, 62596688, 81675456, 87800047, 74059429, 55341297, 47040008, 45494422, 40906399, 36934087, 41932003, 50321913, 50158087, 43918111, 45036817, 55812205, 63485435, 58399849, 44394855, 30879836, 23589855, 22310205, 20680655, 11479105, -1526586, -3700783, 10014751, 23584783, 21001934, 10347586, 10891604, 22550604, 26914055, 16564633, 4802623, 4852989, 15699420, 30456980, 43221464, 45375122, 31116890, 10716990, 3454123, 12956784, 23719835, 25777633, 26527938, 32153739, 34926235, 29405911, 25831197, 33877186, 44710759, 43341867, 30302992, 17259563, 7489588, -5346319, -22379275, -35895090]
42556c5895090l579745O879464J5493579J9342137J3750091K206805k666300M136744
42548A9667685J0825332M585653j0005454j6667974p810489P610614J5040832
42541B3246199Q707396m244535j1844873r670351m140150k202158j809333K268051
42533C10246P226040N441919k364856o520026k230148M315244O134698M234722
42525A6547839K694484J402824j540987m186235k194803N048707J2049944J1212705
42517D1034478K47107j3463180j8388725j1033082K94694O363491P138625O859480
42509A9052888M653749k340312r849450r180718J065205J2372262J5662090R200401
42501D0636115j418888p624555m912634J342406J470433m574899o590205j407917
$$ y = [-35895090, -39474835, -32595371, -17101792, 2240345, 15990436, 18197241, 15530941, 19667685, 30493017, 35078670, 25073216, 8405242, 594753, 8205367, 23246199, 31953595, 27709060, 15864187, 6193836, 2053686, -148472, -1957805, 310246, 7536286, 12978205, 10613349, 4093323, 1863175, 6178419, 12313117, 16547839, 19242323, 20645147, 19104160, 14917925, 12723122, 17771829, 29821773, 41034478, 41281585, 27818405, 9429680, -1603402, -1308708, 5054783, 12193408, 19052888, 23706637, 21366325, 11516875, 2336157, 3401362, 15773624, 31435714, 40636115, 39217227, 31592672, 26680038, 28022444, 29492877, 24917978, 18327773, 16919856]
42493A6919856M78400o275955r269600J967341J5322221J2942318k64148n757131
42485B6063302k570949n442011j4357693j2632697J449542P840791j862471r303840
42477a0816026o81692R490247L204011j0952359j2405877m7250J0569045J1975629
42469C35728Q408592K189737n847624q160540J52587Q281898K802171r602566
42461a440017j0037588L118532J0545290M70614j5126023j8458843p668056N958614
42453c2637477J3261872J3123884R118059N575581M028542J914282k300190m633548
42445G451005k080849p11080p595918j5533308q559359J3291535K7376505J6155081
42437B9793612p206286j3834828L338470K0720716J5696678m782649j6069882
$$ y = [16919856, 17398256, 11122301, 1852701, 3820042, 19142263, 32084581, 31820433, 26063302, 23492353, 18050342, 3692649, -8940048, -7490506, 350285, -1512186, -10816026, -11497718, -2007471, 1196540, -9755819, -22161696, -22208946, -11639901, 335728, 8744320, 10934057, 5086433, -3074107, -2921520, 5360378, 8162549, -1440017, -11477605, -8359073, 2186217, 2656831, -12469192, -30928035, -38596091, -32637477, -19375605, -6251721, 2866338, 8441919, 12470461, 14384743, 12084553, 7451005, 5370156, 4659076, -2936842, -18470150, -27029509, -13737974, 13638531, 29793612, 22587326, 8752498, 12090968, 32811684, 48508362, 43725713, 27655831]
42430B7655831q986160J690508J440828m716197l912057L658961O965076K572164
42422B6368954j552184j58412K852045L751060L833029J960208o425187j7532263
42414A3097250j7734839k502744J2317676R121403p380027j6235981p778071N996379
42406a1098954R191331J059531o145362l202282O187124J0810496N316300m150412
42398G967772r059402r268804r241863p580892m54040O211241J541365j0887710
42390c0772333j3196237R88003J5279320J4464998O068639N722546J3004959J6577683
42382B8137578J4007757J0753274O318817l068897j3070261j6596863j5267134
42375A1214271j2449518k796148J5406005K5917144J2700883j2909329k4387047
$$ y = [27655831, 18669671, 20360179, 21801007, 17084810, 13172753, 16831714, 23796790, 26368954, 24816770, 24658358, 27510403, 31261463, 35094492, 37054700, 30629513, 13097250, -4637589, -7140333, 5177343, 14298746, 6918719, -9317262, -17095333, -11098954, -1907623, -848092, -6993454, -10195736, -4008612, 6801884, 12118184, 7967772, -1091630, -10360434, -19602297, -27183189, -27637229, -21425988, -19884623, -30772333, -43968570, -42980567, -27701247, -13236249, -7167610, -1445064, 11559895, 28137578, 42145335, 52898609, 59217426, 56148529, 43078268, 26481405, 11214271, -1235247, -4031395, 11374610, 37291754, 49992637, 37083308, 12696261]
42368A2696261j6169538n966149l344961k41046O301896P126510J467995P83515
42360B654483N956554L970213n770954o530446M967107Q619195n064773j6624140
42352g822761j0260145l14790m226844j1253780k776985J4592659K2288623K0665264
42344B0891241J9882753J4288976m655719k1628966j5856697J458715J726214
42337A6106517j3377702j4720689L330698J2756091N31629r717068O284J1904402
42329F820162O163595l689248L973443J9668388J8157023m12337j3102273j0684696
42321B6894057n575767o168916o624799l115282n20072k87300K213416N935447
42313A2750784M351106q19031q10220K796578k379186j7187841k3520982q869410
$$ y = [12696261, -3473277, -9439426, -12784387, -13025433, -6723537, 402973, 1870968, 2654483, 8611037, 12581250, 6810296, 279850, 5246957, 13866152, 8801379, -7822761, -18082906, -18397696, -22624540, -33878320, -36655305, -22062646, 225977, 20891241, 40773994, 55062970, 50407251, 28778285, 12921588, 14380303, 16106517, 2728815, -11991874, -8661176, 4094915, 4626544, -5090524, -5084240, 6820162, 12983757, 9294509, 13267952, 32936340, 51093363, 50681026, 37578753, 26894057, 21318290, 15149374, 8524575, 5409293, 4889221, 4601921, 6815337, 12750784, 17101890, 16282859, 15472639, 18269217, 15890031, -1297810, -24818792, -33688202]
42305c3688202J3520921K0938276J0058209k652069n021284r86075J576136K943043
42297F688955O611127J0212224Q606454K623764k165264m500381q431895j3897386
42289E747598j3319486k447018J0544136J3739692O673253n21438j883572j381857
42281A7151308l420721o158498o767015n459681j123241Q773057J9382411J8371607
42273D0749227J883693j6408816k0622302j1739970k989341j165542k350890k781675
42265a5425616l130178k687033R23860N525441O188577L918455M643812Q797250
42257H754568J0033157N877019J577490O14765j218391q244742j7003149k0043254
42249a9652537j4145887k357623Q920399J3613750J0395640M387631J263125L16012
$$ y = [-33688202, -20167281, 770995, 10829204, 8177135, 3155851, 2169776, 3745912, 6688955, 13300082, 23512306, 32118760, 34742524, 32577260, 28076879, 19644984, 5747598, -7571888, -10018906, 525230, 14264922, 20938175, 20416737, 18533165, 17151308, 13730587, 7572089, 805074, -4654607, -5777848, 2995209, 22377620, 40749227, 42632920, 26224104, 5601802, -6138168, -9127509, -10293051, -12643941, -15425616, -18555794, -21242827, -20318967, -14793526, -8604949, -4686494, -42682, 8754568, 18787725, 24664744, 26242234, 26856999, 25638608, 17393866, 390717, -19652537, -33798424, -36156047, -27235648, -13621898, -3226258, 1161373, 2424498, 2740510]
42241B740510k321253n308806l602873K295092O156261N657860M599689M507702
42233A4724182K133738k796343n466595m132112k697359k954920k402087j515123
42225e106619l497090m860184J611475J1038276Q535115n612792r445429Q874446
42217A537198K7811072J9723812r075389k7142372k1118873p058085L91121N563294
42209i368222J2848386J3064644J059885j0267991q064221Q12490K666219q02388
42201A948802R11874N862758L014685o018063o944262L308743R540537J721059
42193A3346133q772219o679494M078713Q052043K703772K34755N953512R802275
42185B8719490L920325m219460m821593k047939n598384j2260693r822358K277884
$$ y = [2740510, 419257, -4889549, -8492422, -6197330, -41069, 5616791, 10216480, 14724182, 16857920, 14061577, 8594982, 4462870, 1765511, -1189409, -3591496, -5106619, -8603709, -13463893, -11852418, -814142, 7720973, 2108181, -7337248, 1537198, 29348270, 49072082, 39996693, 12854321, -8264552, -15322637, -14931516, -9368222, 3480164, 16544808, 17604693, 7336702, -727519, 84971, 2751190, 1948802, 2860676, 8723434, 11738119, 5720056, -1224206, 2084537, 11625074, 13346133, 4573914, -2105580, 1973133, 10025176, 12728948, 12963703, 18917215, 28719490, 32639815, 28420355, 23598762, 21550823, 15952439, 3691746, -6130612, -3852728]
42177c852728J0534498P928680L180343L771263K837339o974977j7008465j3591737
42169a3175784n1469O521233l95038q432697m749980P328268J4265107Q331538
42161I641178n723463j5613949j1685605L614099J6149645J4308765J829183q444951
42153D074902j0631104p826907j368621R624436J7645045J0270388r923251k1760906
42145i896018j1227020R131670J7506741J1173232M109550K236986j893906r462256
42137A1678979q060968Q025625K3164298J8242426l378572k0063652j9292011
42130A0316125q620720O58186P015955J0646564N297805j0195206k1147205j3052108
42122a9080604N330163J1160813r5697q890669k579724O192823K595136n376610
$$ y = [-3852728, 6681770, 14610450, 17790793, 21562056, 24399395, 17424418, 415953, -13175784, -13227253, -6706020, -7101058, -15533755, -20283735, -12955467, 1309640, 9641178, 3917715, -11696234, -23381839, -19767740, -3618095, 10690670, 12519853, 4074902, -6556202, -14383109, -15751730, -6127294, 11517751, 21788139, 11864888, -9896018, -21123038, -11991368, 5515373, 16688605, 20798155, 23035141, 21141235, 11678979, 3618011, 11643636, 34807934, 53050360, 49671788, 29608136, 10316125, 1695405, 2353591, 9369546, 20016110, 25313915, 15118709, -6028496, -19080604, -13750441, -2589628, -2685325, -11575994, -14155718, -7962895, -5367759, -10744369]
42114a0744369j169523J2410592J8069064J0709791J437159k122289k795804k396640
42106B3397981R04096L697920L80321n045588m334289q31669m125230j0503374
42098C540168p542349J912179J989073p212718o790487P850675J6106191O414791
42090A6267523l148908M181374J4618844P753940q323107j1463794k412797m31553
42082A7041522r163209j3245753o763439q14394j221978Q5405P608217J3745985
42074G272356J2187141N933474r15901p133972r130677m100724J403496j472946
42066D042247q829446r062638j677693L528116M867788R487879J5046722R323678
42058B6726653p325819j6814530q363014O115524J0386972N067629J028503J771029
$$ y = [-10744369, -11913892, 496700, 18565764, 29275555, 30712714, 28590425, 25794621, 23397981, 24302077, 27999997, 28380318, 23334730, 19000441, 18168772, 14043542, 3540168, -4002181, -2090002, -100929, -7313647, -14104134, -6253459, 9852732, 16267523, 13118615, 17299989, 31918833, 39672773, 31349666, 19885872, 17473075, 17041522, 7878313, -5367440, -12130879, -12945273, -14167251, -14081846, -6473629, 7272356, 19459497, 25392971, 24477070, 17343098, 8212421, 4111697, 5515193, 4042247, -4787199, -13849837, -15527530, -11999414, -7131626, 2356253, 17402975, 26726653, 19400834, 2586304, -5776710, 338814, 10725786, 15793415, 16821918, 18592947]
42050A8592947K192306j348716p137504j0456865o903654J813826N767487j588890
42042I30937j1001892p683816O387189J3853984P238151j848697k696358J42990
42034E322488r89674l811744l322909r55450J166560N194941J0002453Q400925
42026B1007590j563997j1579792j4581228j2005406n987266M111961J3343654
42019g254484J2414408K451381m686495n404061q357392j4473867j1594511K627494
42011c4277527J2074046P645717J636627L454671K480266p482652r053894R647878
42003a3874868K6503485J5167320j1243297j8266426k336888R019795M975553
41996I944674L981387J5506360K2601539J2396152l607858j1315516j3011655
$$ y = [18592947, 20785253, 19436537, 12299033, 1842168, -5061486, -3247660, 2519827, 930937, -10070955, -17754771, -11367582, 2486402, 9724553, 7875856, 5179498, 5322488, 4332814, 521070, -2801839, -3757289, -2590729, 2604212, 12606665, 21007590, 19443593, 7863801, -6717427, -18722833, -24710099, -20598138, -7254484, 5159924, 7611305, 2924810, -2479251, -10836643, -25310510, -36905021, -34277527, -22203481, -14557764, -12921137, -9466466, -6986200, -14468852, -23522746, -13874868, 12628617, 27795937, 16552640, -1713786, -4050674, 4969121, 9944674, 13926061, 29432421, 52033960, 64430112, 60822254, 49506738, 36495083]
41989C6495083j3456293q310444J883749N435698j289741o244181l465778l291323
41981G756770r770482r118883M447659J2579799J773775j0880549m374719J0241259
41973B654629Q396412n162737l976958J3722615J9493843O92381j8453461j4589942
41965B776782Q79888L659141o123872r696527j772444M937982L679831K372121
41957G12902O317405Q272918J740708p318425r516221n336196j974897j363042
41949h464848J608741J0336622K0860927K4748078J5631759m779642k4730810
41942C5210827k9725311j6136195L955817J4664087J1025930n75489j1992167
41935F427499j7650147j3505016m32530J1998999J3213003M006679n186496q102515
$$ y = [36495083, 23038790, 14728346, 16612095, 22047793, 20758052, 14513871, 11048093, 7756770, -2013712, -11132595, -6684936, 5894863, 7668638, -3211911, -7586630, 2654629, 11051041, 5888304, 1911346, 15633961, 35127804, 35820185, 17366724, 2776782, 3656670, 7315811, 1191939, -8504588, -10277032, -5339050, -1659219, 712902, 7030307, 15303225, 17043933, 9725508, 209287, -5126909, -7101806, -8464848, -6856107, 3480515, 24341442, 49089520, 64721279, 59941637, 35210827, 5485516, -10650679, -6694862, 7969225, 18995155, 18419666, 6427499, -11222648, -24727664, -25160194, -13161195, 51808, 4058487, -1128009, -9230524]
41927i230524p049850l842195L596289J2989186J5798914Q409171k188954p950091
41919A0531946q026298m655224O02929L221076j812753r572239q213353K177451
41911a5746465O314956k938580j1526361n698380O392894Q990744L510497K282931
41903h417764O138387O186522J900415m86359k831285j0179642j5205813o950072
41895b9845611P659552J1361433M228607K288631Q509051Q817881J72527k582004
41887A0610067M665431M993442r120792j8727030q380715P308841P101037l580274
41879e129993n261692K027759K345096n627154o281559M836144J2448367N859719
41871E216687n164433o104584K793549J0431926J0410704N436766L22583l525750
$$ y = [-9230524, -16280374, -20122569, -16526280, -3537094, 12261820, 20670991, 18482037, 10531946, 2505648, -2149576, -1546647, 1674429, -138324, -9710563, -17923916, -15746465, -9431509, -12370089, -23896450, -29594830, -23201936, -14211192, -10700695, -8417764, -2279377, 3907145, 5807560, 5321201, 2489916, -7689726, -22895539, -29845611, -22186059, -10824626, -6596019, -4307388, 4201663, 13019544, 13192071, 10610067, 15275498, 20268940, 11148148, -7578882, -15959597, -8650756, -1549719, -5129993, -10391685, -8363926, -6018830, -11645984, -17927543, -13091399, -643032, 5216687, 52254, -6052330, -3258781, 7173145, 17583849, 23020615, 23343198, 19817448]
41863A9817448p151946j0360489j0303996m905457K583177N426034J092767n498931
41855i301393p434058j994767Q215229J6489694J5365827M192061p511931j0418630
41847G602032p307843o699599p502188j864012P888782R917946K272781m012223
41839B95676m960471r590201j9074170j8318530R4007J9697641K2030620J1444336
41831A618908L623965J740135k05501j202137K583644N769169J925467l508125
41823A2345525l009087j239500m776945p404548k142711K427792l382058r989257
41815a7170789m058293N339620Q37828j0713363p774070Q172730J4411378O055385
41807d899574K132159Q916867R089570l766287j0901343k191652M541310m588605
$$ y = [19817448, 12665502, 2305013, -7998983, -12904440, -10321263, -4895229, -3802462, -9301393, -16735451, -18730218, -10514989, 5974705, 21340532, 25532593, 18020662, 7602032, 294189, -6405410, -13907598, -15771610, -7882828, 2035118, 4307899, 295676, -4664795, -14254996, -33329166, -51647696, -51553689, -31856048, -9825428, 1618908, 5242873, 6983008, 6777507, 5575370, 8159014, 13928183, 15853650, 12345525, 9336438, 8096938, 3319993, -4084555, -6227266, -3799474, -7181532, -17170789, -21229082, -15889462, -15051634, -25764997, -33539067, -25366337, -10954959, -4899574, -2767415, 6149452, 15239022, 11472735, 571392, -1620260, 2921050, -1667555]
41799a667555j4234445p158025N535214M953197l024253r35393Q105393P225265
41791a200602l819995r594694n769493k797733m730642m170830J437061N353487
41783b5293441M360793K181938J84908k767104k611975M720479J1922963P981353
41775F79914l166080n841032M076029J2738865Q749018k030312p249373m341548
41767C615481k72383j085652o340053j0675336q890872j667260M449921N080362
41759a5785792K961495J689129k77518m140378n410830j325443K359413M68566
41751a9461358j956817R57597L678205j145800o981273k418563Q211820R967573
41743i148616J267758m758379k986547j861332l852236J31518J0910243J4710624
$$ y = [-1667555, -15902000, -23060025, -17524811, -12571614, -15595867, -16531260, -8425867, -1200602, -5020597, -14615291, -20384784, -23182517, -27913159, -32083989, -30646928, -25293441, -20932648, -18750710, -18565802, -21332906, -23944881, -19224402, -7301439, 679914, -2486166, -8327198, -4251169, 8487696, 17236714, 15206402, 7957029, 3615481, 3343098, 2257446, -4082607, -14757943, -23648815, -25316075, -20866154, -15785792, -12824297, -11135168, -11412686, -15553064, -20963894, -22289337, -19929924, -19461358, -21418175, -20460578, -16782373, -17928173, -24909446, -27328009, -19116189, -9148616, -7880858, -12639237, -15625784, -17487116, -21339352, -21207834, -10297591, 4413033]
41735D413033N897392j424616L832901J1072268N892676o735824j2475617r942118
41727E30095p030630l745184M385925J1848131R066029n29519m877798k336773
41719G310276j367264l067207J30221P939893R777799J424600r120213j4868539
41711a840434j6231901j2417338q46713J1307130J0385747k518058q422269K475341
41703a8108495J4624219J0141740l919831o747551N122532J4198255P622792p338637
41695A5595024j4653738o865420R834886K1081201J5830213j507125j3070617
41688B6244424p923807M397944Q815626O377106Q068600J2160842N480684j2100068
41680E1521351k2690042j5806442l005693J362886m9438K051248N596820L144280
$$ y = [4413033, 10310425, 8885809, 12718710, 23790978, 29683654, 22947830, 10472213, 530095, -6500535, -10245719, -5859794, 5988337, 15054366, 14524847, 9647049, 7310276, 5943012, 2875805, 3006026, 10945919, 20723718, 22148318, 13028105, -1840434, -18072335, -30489673, -31336386, -20029256, -9643509, -12161567, -20583836, -18108495, -3484276, 6657464, 2737633, -4009918, 1112614, 15310869, 22933661, 15595024, 941286, -5924134, 3910752, 24991953, 40822166, 39315041, 26244424, 18320617, 22718561, 31534187, 37911293, 45979893, 58140735, 63621419, 51521351, 28831309, 13024867, 10019174, 11382060, 11332622, 13383870, 18980690, 22124970]
41672B2124970k576741l338038l74600j093690m347850k529541L313352L990320
41664A5168182j693341m205775P57523N412786L384702j36193K356138Q973419
41656C0017441J1974108P665043j686689j0995412j4290979r196163k418140l977220
41648G091989j2212546j2579050K288416J8823505J7988730j71985j7283465j9779988
41640a5834394j1469354k796268K792502P958325J3394691J5758020J1571122
41633B1374644Q36667j1680683j8210069j3706544j154105J0398703J3474049
41626A332662O910891m991299j4675377j4394336k646168J1686865J6499328R299850
41618I022416j173695o741828p262710m640536K539225J2642170J6385035P846437
$$ y = [22124970, 19548229, 16210191, 15835591, 14741901, 10394051, 7864510, 11177862, 15168182, 13474841, 9269066, 10026589, 15439375, 18824077, 18687884, 21044022, 30017441, 41991549, 49656592, 47969903, 36974491, 22683512, 13487349, 11069209, 7091989, -5120557, -17699607, -15411191, 3412314, 21401044, 21229059, 3945594, -15834394, -27303748, -30100016, -27307514, -19349189, -5954498, 9803522, 21374644, 22211311, 10530628, -7679441, -21385985, -22540090, -12141387, 1332662, 8243553, 3252254, -11423123, -25817459, -28463627, -16776762, -277434, 9022416, 7848721, 1106893, -6155817, -10796353, -8257128, 4385042, 20770077, 28616514]
41610B8616514l986069n234272K846146N475540k828576r725343m656362M915494
41602A5423072O154763L19700k442900j341260l946757r603771q550157Q14831
41594c172479P071220K640285n322493o337328o1845O889315R626090N750350
41586A7083115m335050j3011977j0138411K359161J0007644O052492J185225M600404
41578A3802603P737354j9922j0160391o724098P200771J2893327L665289p984341
41570B0410592j0731101n840540K632497J2849393J7781777Q730742q977514j7989368
41562A8866478j1699226j710259K001136L594762P634489Q192404J399320m245876
41554B4033228j204947M136032K603002l135401n417020m028421j666883L733952
$$ y = [28616514, 24630445, 19396173, 22242319, 27717859, 24889283, 15163940, 10507578, 15423072, 21577835, 21897535, 19454635, 18113375, 14166618, 4562847, -3987310, -3172479, 3898741, 6539026, 1216533, -5120795, -5182640, 1706675, 11332765, 17083115, 12748065, -263912, -10402323, -8043162, 1964482, 8016974, 9202199, 13802603, 21539957, 21520035, 11359644, 4635546, 11836317, 24729644, 28394933, 20410592, 9679491, 3838951, 6471448, 19320841, 37102618, 45833360, 36855846, 18866478, 7167252, 5456993, 7458129, 11052891, 18687380, 26879784, 28279104, 24033228, 22828281, 26964313, 29567315, 26431914, 21014894, 16986473, 15319590, 19053542]
41546A9053542J1333006J1495536n5687j0683950o942438M814464P980957J01841
41538C7097271o834035o301956k761761K38915L332567L836287j767453q109932
41530A8729903n864760L579919R611738Q202961N077047L497972M24017m647626
41522C8611171p760419q106761p935402n499311J737692Q234997O175223q98047
41514B4559143k481495J523169J059100o248344j1377164r564322o080266m284220
41506a2894399j320109K144608J503708o61379K492641O893557K356102n695798
41498e181069j87488J6650914J9825871N6460j7722466j1129648N415938N109272
41490A2837784r250056j3388147j489701Q254010M276609n412987j0566268r587996
$$ y = [19053542, 30386548, 41882084, 41826397, 31142447, 24200009, 29014473, 36995430, 37097271, 30263236, 23961280, 21199519, 21438434, 24771001, 28607288, 26839835, 18729903, 12865143, 16445062, 26056800, 34259761, 39336808, 42834780, 43258797, 38611171, 30850752, 22743991, 14808589, 9309278, 11046970, 19281967, 25457190, 24559143, 22077648, 23600817, 24659917, 18411573, 7034409, -2529913, -8610179, -12894399, -14214508, -12069900, -10566192, -11227571, -8734930, -1841373, 514729, -5181069, -5368557, 11282357, 31108228, 31164688, 13442222, 2312574, 7728512, 12837784, 3587728, -9800419, -11290120, -3036110, 1240499, -4172488, -14738756, -24326752]
41482b4326752l189418N709877P072034m049593j2764038j292657K0669723K4696402
41474A2525578M752111j3694719j1662345n65049K003411j779837k935468n142005
41466a6498323j2543628j3397291K674899K1325002J9842866J679137p602122
41459d519460J755414J1305300M413534j0266176j4599777o354420K586385M862330
41451a0816870L522414L333734M920073O227250M473479j771958q825093r097794
41443h034765k04531R925076J1500592M105419m865838j0271777j2138378j0560455
41435b0544657m768462K440034O023280O051852P528507J0672524Q448954j727429
41427A4124603j0626181q769441m12407K958595K1369q0313N653737R004659N154571
$$ y = [-24326752, -27516170, -21806293, -14734259, -18783852, -31547890, -32840547, -12170824, 12525578, 17277689, 3582970, -8079375, -8644424, -6641013, -8420850, -11356318, -16498323, -29041951, -42439242, -39764343, -18439341, 1403525, 3082662, -4519460, -2764046, 8541254, 12954788, 2688612, -11911165, -18265585, -15679200, -10816870, -7294456, -3960722, 959351, 7186601, 11660080, 9888122, 1063029, -8034765, -8239296, 1685780, 13186372, 17291791, 12425953, 2154176, -9984202, -20544657, -25313119, -22873085, -16849805, -10797953, -3269446, 7403078, 15852032, 14124603, 3498422, -5271019, -5683426, -2724831, -2703462, -2783775, 2869962, 11874621, 17029192]
41418A7029192P50901R74855o16811r405294j5827277p798456P887446J1975189
41410D969745J98051j1002821r594714l835683n372155r727012n938422L208451
41402c7094560N199406j591094n532940n47892N288728L554938k321720m149486
41394c7194620p22867L430703N547757N266111K277587j225050K2794O527624
41386a6069961R640105K372438q236814q524022K529767J1073397P801087K39795
41378H25792J78524O646942R627874N760220P51511j925068m711147p251515l766574
41369F136559O267938J2455753N473794r524399j8358561j4473758m038397L956645
41361a2104426O079582L235094k058375n432494l362498J507910K471175j615484
$$ y = [17029192, 17780093, 18754948, 18138137, 8732843, -7094434, -14892890, -7005444, 4969745, 5167796, -5835025, -15429739, -19265422, -24637577, -34364589, -40303011, -37094560, -31895154, -33486248, -39019188, -39567080, -34278352, -30723414, -33045134, -37194620, -37917487, -34486784, -28939027, -23672916, -21395329, -22620379, -22597585, -16069961, -6429856, -4057418, -12294232, -20818254, -18288487, -7215090, 585997, 825792, 1004316, 7651258, 17279132, 23039352, 23790863, 21865795, 17154648, 9903133, 6136559, 12404497, 24860250, 30334044, 20809645, 2451084, -12022674, -16061071, -12104426, -6024844, -2789750, -4848125, -10280619, -13643117, -12135207, -9664032, -11279516]
41353a1279516m037835o94792K778548l87946o793282o948215J421772J0689859
41345a5251407J3344377Q970585J376691n678875r120077p565822k806307K581432
41337a4149403P925080J1271079P119832n451217j5143828r112758Q604095K0018054
41329A1080934J6180021N828174j481174o953236j1355391p668347L974459P991881
41321A7597321m821911j8532505j3147758M155189R491415j238934q940177l558699
41313a8996059L465633K608819l7691L65529k842399j1571432j4519233n563236
41305d7090069N692628J1722530J8011104K5162569J9842929q10053j4974350
41298A7557288o481722P470124K460272j3640105j4742218j22025O717341p38674
$$ y = [-11279516, -15317351, -16012143, -13233595, -13621541, -20414823, -27363038, -25941266, -15251407, -1907030, 7063555, 8440246, 2761371, -6358706, -13924528, -16730835, -14149403, -6224323, 5046756, 12166588, 6715371, -8428457, -17541215, -8937120, 11080934, 27260955, 33089129, 31607955, 24654719, 13299328, 5630981, 9605440, 17597321, 12775410, -5757095, -18904853, -14749664, -5258249, -6497183, -15437360, -18996059, -15530426, -12921607, -12959298, -12593769, -15436168, -27007600, -41526833, -47090069, -41397441, -29674911, -11663807, 13498762, 33341691, 32531638, 17557288, 11075566, 18545690, 21005962, 7365857, -7376361, -7498386, -781045, -1519719]
41290a519719l036011R533219K0353847J4129024j804986j3386020j7817428j6523440
41282a0071514p724570M369866Q431901L075255R49380Q105326J3852728R061727
41274C0050099j94956n603914q402826r612506m011023O152961P078333n267047
41266A0189121j4708377q539391K981122M886881O39669N18455N84044p104229
41258a0552705j3985957o472695Q465496J0877569j380689r560048k446002R807913
41250a5247118J3123004O223447l534223r359441p085447K326895J0138163P599338
41242D184618k568250q974146n272212M606485J2425187J1312880O1780j1999521
41234C776821j0797602M309607J5854573J0639895k495744q412848q256126j0878779
$$ y = [-1519719, -4555730, 4977489, 25331336, 39460360, 37655374, 24269354, 6451926, -10071514, -17796084, -13426218, -4994317, -1919062, -969682, 7135644, 20988372, 30050099, 29855143, 24251229, 15848403, 6235897, 2224874, 8377835, 15456168, 10189121, -4519256, -13058647, -10077525, -5190644, -4550975, -4032520, -3448476, -10552705, -24538662, -31011357, -22545861, -11668292, -13048981, -22609029, -25055031, -15247118, -2124114, 4099333, 565110, -8794331, -15879778, -13552883, -3414720, 4184618, 1616368, -7357778, -12629990, -8023505, 4401682, 15714562, 15776342, 3776821, -7020781, -2711174, 13143399, 23783294, 21287550, 12874702, 4618576, -6260203]
41226f260203j1936587j842496J1454803R903623n571601j4352148o104810P533016
41218a7176403J3797659J3206995R549967K654687m150983m543190j128954k716949
41210I492829p568603m869188N264771J0269077O179880K473978L021915J080544
41202B5345203l458951k401921J238156m936382j5943930j0964881R055242J4691260
41194A2623796n473097k1447033p745786J4862693J3375440m378040o495782Q317342
41186C639533J1976971l015679j3285891o439681J645057j030557m025648N25197
41178a0010698J490391p751639j2096400J381781J9517433K1301269P897678k940490
41170A8789325l998733l360876o335129p813812l083544M369967Q035622N553996
$$ y = [-6260203, -18196790, -20039286, -8584483, 1319140, -4252461, -18604609, -24709419, -17176403, -3378744, 9828251, 19378218, 22032905, 17881922, 13338732, 12209778, 9492829, 1924226, -2944962, 2319809, 12588886, 18768766, 21242744, 24264659, 25345203, 21886252, 19484331, 20722487, 15786105, -157825, -11122706, -2067464, 12623796, 7150699, -14296334, -22042120, -7179427, 6196013, 1817973, -4677809, 3639533, 15616504, 12600825, -685066, -7124747, -5479690, -6510247, -10535895, -10010698, -8520307, -16271946, -28368346, -26986565, -7469132, 13832137, 21729815, 18789325, 14790592, 11429716, 5094587, -2719225, -5802769, -1432802, 6602820, 12156816]
41162A2156816l93318n347854p262084q104201r452845p846989O3252Q459503
41154a7727720O864251m210900j1213625n943440K518009J617996n716461n732694
41146c9544584N395329J5379234J2149817k60626o296568K523565J6749408J8575464
41138B4671039K318006j7657538k2696355j1147568J717709L996116n57736k495294
41130b1851621m12360J137460J289011K656829M533741L736292J025925m9616
41122g934339j57320k848571n573038l16676J2798310K0092246J0257119q533244
41114A7784487j7013207r671870q40265k766711q195384l328920R467944J4383176
41106a80750N280589o555621r475979m776646R83630O123566R888653P880458
$$ y = [12156816, 11763498, 6415644, -846440, -8950641, -18403486, -26250475, -26187223, -17727720, -10863469, -15074369, -26287994, -32231434, -29713425, -28095429, -33811890, -39544584, -34149255, -18770021, -6620204, -6880830, -13177398, -10653833, 6095575, 24671039, 26989045, 9331507, -13364848, -24512416, -22794707, -18798591, -19356327, -21851621, -22263981, -21126521, -19837510, -17180681, -12646940, -8910648, -7884723, -7934339, -8091659, -10940230, -16513268, -16829944, -4031634, 16060612, 26317731, 17784487, 771280, -8900590, -9740855, -12507566, -20702950, -24031870, -14563926, -180750, 5099839, -1455782, -10931761, -15708407, -14724777, -8601211, 1287442, 9167900]
41098I167900r3512m968946l21301O606315N057441l413281r272146j0124057
41090g361587r886359o918597L083025J3573560J1726787q76210o680527K627710
41082g12198J2161401M517446j4808328k3977228j2647446O593415J4305265N228705
41074i338968q053558r925357P90410R838127O262160k112187J3859J1293457
41066a232057J4193970K316580p788888j382440J1026304R602268m198630j0812237
41058A1724870l284864M005026K81283n361983j155883P278562O208229m714251
41050A4980989j2793015j0829386m015875J340139N845831J1143536J3700576
41043A9372795R162491q74323j0027527j3291432j0437915n233948k272779k684932
$$ y = [9167900, 9074388, 4105442, 3784141, 10390456, 15447897, 12034616, 2762470, -7361587, -17247946, -24166543, -21083518, -7509958, 4216829, 3340619, -3339908, -712198, 11449203, 15966649, 1158321, -22818907, -35466353, -28872938, -14567673, -9338968, -17392526, -27317883, -26527473, -16689346, -10427186, -12539373, -12525514, -1232057, 12961913, 15278493, 7489605, 6107165, 17133469, 26735737, 22537107, 11724870, 8440006, 12445032, 12726315, 7364332, 6208449, 13487011, 19695240, 14980989, 2187974, -8641412, -12657287, -11317148, -5471317, 5672219, 19372795, 28535286, 27660963, 17633436, 4342004, -6095911, -11329859, -13602638, -16287570]
41035a6287570k808401N67351M480833L445846j577140l717630r32580N52735
41027a6276556l170723o464078k827310N088241J0521558J2058619J0644631L410629
41019A2985011r056761j4600451k823345J5224667J6707952j251758j5810688
41012A374627j0658502K068050L069222n051175n710121L906416J0818035Q328575
41004H145127L280894J069734j390136m917417l904294K010791L792304k616443
40996E470560p483881j400376R135589J0341054J281631n448295k892566R94353
40988I998069k722087r405166q330063J06581N211827L565278L888866R990390
40980A2303695J0995577j231563j4789662j2733782O16842O061877j08183k401863
$$ y = [-16287570, -19095971, -18528620, -14047787, -10601941, -12179081, -15896711, -16829291, -16276556, -19447279, -25911357, -28738667, -23650426, -13128868, -1070249, 9574382, 12985011, 3928250, -10672201, -13495546, 1729121, 18437073, 17185315, 1374627, -9283875, -7215825, -4146603, -9197778, -14907899, -11001483, -183448, 8145127, 11426021, 12495755, 11105619, 6188202, 2283908, 4294699, 8087003, 5470560, -2013321, -3413697, 5721892, 16062946, 17344577, 11896282, 9003716, 9998069, 7275982, -2129184, -10459247, -10352666, -5140839, -1575561, 2313305, 12303695, 23299272, 22067709, 7278047, -5455735, -4838893, 1222984, 1114801, -1287062]
40972a287062N043713Q138348n86779o910548m6866O806893r52687j2745022r988069
40963a2528079L043147Q461395M963837M535510O327235r5392r228958m466730
40955A011965J1219768J5778207K625255j0250499j0575404o556360n131598o84429
40947b563095N895423K418475r025784p605147J0394739J7535423k754855k4480857
40939a0185678j5581859J2873647K3805682Q149298q939308j0087201m155214
40932d120633k222630j556512J041218O34162m424263q020731p976651q657782
40924c5303822r004414j980639J0567111J6246558J0017347J562761p5291K065422
40916e904967J962881N26040L04087o32997l102183k726055K121039M827202m5502
$$ y = [-1287062, 3756651, 11894999, 11308220, 4397672, 4350806, 11157699, 10205012, -2540010, -12528079, -9484932, -1023537, 3940300, 8475810, 14803045, 14707653, 5478695, 1011965, 12231733, 28009940, 30635195, 20384696, 9809292, 3252932, -1878666, -2563095, 3332328, 5750803, -3274981, -10880128, -485389, 17050034, 14295179, -10185678, -25767537, -12893890, 10911792, 19061090, 10121782, 34581, -4120633, -6343263, -7899775, -6858557, -6224395, -10648658, -18669389, -26646040, -35303822, -44308236, -46288875, -35721764, -19475206, -9457859, -7895098, -7970389, -5904967, -3942086, -3416046, -3111959, -3744956, -6847139, -9573194, -7452155, -2624953, -2670455]
40907b670455o721163n032721M884343J1616775P069128k819033n257756L169797
40899D238915J1995636J0537122J592920m123125l950181m639226q406705r072880
40891a827524n038361l905770p929298o972035M578489J4920357J1139341m85946
40883D479253m427645M86201K475984k228361n276062k221715J155779p3955l257290
40874h887811l627110J175447J0414337J7114559J0835638p068209j7833536p470306
40866e346991J1947781J7852024P698272l351199r246397j5970614k0392448j1034859
40858b7844431P008482J2420584M29777p576516K242756J4437471J0526670j904732
40850I740061m103077M079932Q136510L315139k383502l725213j898549K558318
$$ y = [-2670455, -9391618, -14424339, -9539996, 2076779, 9145907, 6326874, 1069118, 4238915, 16234551, 26771673, 28364593, 24241468, 20291287, 15652061, 7245356, -1827524, -6865885, -10771655, -18700953, -25672988, -21094499, -6174142, 4965199, 4479253, 51608, 537809, 3013793, 785432, -4490630, -6712345, -5556566, -5630521, -8887811, -12514921, -11339474, -925137, 16189422, 27025060, 19956851, 2123315, -5346991, 6600790, 24452814, 32151086, 28799887, 19553490, 3582876, -16809572, -27844431, -20835949, -8415365, -7985588, -15562104, -13319348, 1118123, 11644793, 9740061, 5636984, 9716916, 17853426, 21168565, 18785063, 15059850, 13161301, 15719619]
40842A5719619P526419N067293p619010j7524910r832294R717391J9502885R038610
40834C1596003r702901j8760572j2489854K001167J4309232J7442252J0342064
40827C4737391k560963j4618139j9838095j4473365j163205Q307008K683246j2804720
40819a9730842j8835832o258198J0533911J2711311J824361n287268j122491N427154
40811b0737894N275822O71394j527990Q12659N858752J1647243J5591810J4159282
40803C1751078O439664l659747j0884163j3595555j3828317j2278351n352460
40796b1407851R123248K3086200K1782834J663737k0363673k4011950r253180
40789a9380635O000015R491609N207534J389211K20966J100231K981999J598174
$$ y = [15719619, 23246038, 28313331, 20694321, 3169411, -6662883, 3054508, 22557393, 31596003, 21893102, 3132530, -9357324, -7356157, 6953075, 24395327, 34737391, 32176428, 17558289, -2279806, -16753171, -17916376, -9609368, -6926122, -19730842, -38566674, -44824872, -34290961, -21579650, -19755289, -25042557, -26165048, -20737894, -15462072, -14790678, -16318668, -15506009, -9647257, 1999986, 17591796, 31751078, 38190742, 34530995, 23646832, 10051277, -3777040, -16055391, -21407851, -12284603, 10801597, 32584431, 34248168, 13884495, -10127455, -19380635, -13380620, -3889011, 1318523, 2707734, 2928700, 4028931, 7010930, 8609104]
40781H609104n062633q476134K15885J2245200J0400305k595031n740372N155575
40773A4751899Q137037p770849k0698395r905931R699030J1244973j884915m914082
40765a341233O927190J3916856N682341n729716p932405k838284K846188N101830
40757A6632767R7586j0840595j5518055n379454P765634O549088m491419n898333
40749a1082781N109789J1840557O704994K46677n45445r67069k059498K628474
40741A1875698Q754222K333498j3321283j4607951P094837K7593992K1434860
40734E1157873m826779k4629706k3603100p751452Q822612J3824633M806662n181672
40726A2619071j304663R642020N947915j3920953k4389565j0856163Q144970J1760978
$$ y = [8609104, 3546471, -4929663, -4713778, 7531422, 17931727, 15336696, 9596324, 14751899, 22888936, 15118087, -5580308, -15486239, -5787209, 5457764, 3572849, -1341233, 5585957, 19502813, 25185154, 19455438, 11523033, 8684749, 11530937, 16632767, 16730353, 5889758, -9628297, -15007751, -7242117, -693029, -5184448, -11082781, -5972992, 5867565, 12572559, 12819236, 12273791, 11306722, 9247224, 11875698, 20629920, 22963418, 9642135, -4965816, 2129021, 29723013, 51157873, 46331094, 21701388, -1901712, -9653164, -830552, 12994081, 17800743, 12619071, 11314408, 20956428, 26904343, 12983390, -11406175, -22262338, -14117368, -2356390]
40718b356390P243742R585438J1413887j266018j8509371j9446831o599503k53881
40710b0188927m029913k226008J0129836J8973418J4904640M943065j879494l834006
40702A6792611n98569O243596P630367k283116j2310143q376777K147241Q78326
40694A0123536r526063q433397O281110J1818216k154024j5851165j1759471j184907
40686b0686165j445470o257092K30098J3562040J5379352K789284q534414q279760
40678a3242127k163779J344021J623737J242544J42253k957228q108374j3023194
40670c5142147j2177584j271435J4071541K0477813J3058770K748244R75485M457689
40662G198376L720632o39201j529882p2863l938523j2665139j6465165j0295335
$$ y = [-2356390, 4887352, 14472790, 25886677, 24620659, 6111288, -13335543, -19935046, -20188927, -24218840, -26444848, -16315012, 2658406, 17563046, 22506111, 20626617, 16792611, 16194042, 22437638, 30068005, 27784889, 15474746, 7097969, 9245210, 10123536, 597473, -7835924, -1554814, 10263402, 8109378, -7741787, -19501258, -20686165, -22131635, -28388727, -28158629, -14596589, 782763, 3572047, -4962367, -13242127, -15405906, -14061885, -12438148, -11195604, -11053351, -14010579, -22118953, -35142147, -47319731, -48591166, -34519625, -14041812, -983042, 1765202, 2740687, 7198376, 10919008, 10279807, 8749925, 8677062, 4738539, -7926600, -24391765, -34687100]
40654c4687100M43865Q772205J2059055R178240R18238o161345n355274j57851
40646a4989967L36086k899695Q13459J2744559J8680091R296983m448733o870174
40638A2662609j91305J213548n685265r412933m124907J413578m66431l662504
40630h253610M81861P666497O583962l562742j1358046q473610J254595Q728296
40622f932797Q823362J610593q978453j5265776j0598916K214992J1470724R047288
40614h608983r36743q328344p707867m57716Q716835J3301762Q094160l761498
40606C11606j0937203o844209J426234L277845m06118n23787M885500Q135266
40598f74866M581126j157126l354282k191450m99244M21792j45659k416141m372088
$$ y = [-34687100, -34243235, -25471030, -13411975, -4233735, -3315497, -9476842, -14832116, -14989967, -14653881, -17553576, -16740117, -3995558, 14684533, 23981516, 19532783, 12662609, 12471304, 13684852, 7999587, -1413346, -5538253, -4124675, -4591106, -8253610, -7771749, -105252, 6478710, 2915968, -8442078, -16915688, -15661093, -6932797, 1890565, 3501158, -5477295, -20743071, -31341987, -29126995, -17656271, -8608983, -9545726, -17874070, -25581937, -26039653, -17322818, -4021056, 4073104, 311606, -10625597, -17469806, -16043572, -12765727, -13171845, -13695632, -8810132, -674866, 3906260, 2749134, -605148, -2796598, -3295842, -2874050, -3019709, -5435850, -9807938]
40589i807938m577448n709820r234205q722093K378551J6977998J9492394P035270
40581G832709n344333m782142L974318Q519460N079442j223814m558121j151935
40573H345584Q539712J5409675Q183672r880644k0441371j3575726j920475k077347
40565g416920j1381994j4609540o180649O451846J5496024J6945744P684536q904802
40557a915755j8998212j2701744J225231O850639K705262q08685k50048q269J469432
40548b2432149Q858893J5306133R090352m656885p699853L384035J1863328P549036
40540B1262890l77520l406747o835190j3463113j3051321p25121J0390887Q867342
40532B662107K841813L587219N146820k561039j2133884r514547J593380N584304
$$ y = [-9807938, -14385386, -20095206, -29329411, -38051504, -35672953, -18694955, 797439, 7832709, 2488376, -2293766, 1680552, 10200012, 15279454, 14055640, 9497519, 8345584, 16885296, 32294971, 40478643, 30597999, 10156628, -3419098, -5339573, -7416920, -18798914, -33408454, -39589103, -33137257, -17641233, -695489, 6989047, -1915755, -20913967, -33615711, -32390480, -25539841, -22834579, -23643264, -23893312, -23901581, -22432149, -13573256, 1732877, 10823229, 6166344, -1533509, 1850526, 13713854, 21262890, 20885370, 17478623, 10643433, -2819680, -15871001, -16596122, -6205235, 2662107, 5503920, 9091139, 14237959, 11676920, -456964, -9971511, -8378131, -2793827]
40524b793827L47424j972439K766514N691346K510920p47K492426N149883L517160
40515A7708660o20697m417346n997306k027651P010617J0943282Q26280j5246860
40507H178979j9673658r006447K355144L457805q83792k227180j161763k470565
40499b1431477o050640p408968k168973J0619854K4099749K5163778R190973r615751
40491B2398545j3514748m240224J755720j852956o672431q176947j0417147j0927000
40483c1647188j221945J2924098J2811679l120243j1470402J669696J8226326
40476a827979J5903204N92248q026816q067353j0267129j2281447k823644J3348796
$$ y = [-2793827, -2446403, -4418842, -1652328, 4039018, 6549938, 6549191, 9041617, 14191500, 17708660, 17087963, 12670617, 6673311, 4645660, 11656277, 22599559, 23425839, 8178979, -11494679, -20501126, -18145982, -14688177, -15571969, -17799149, -18960912, -21431477, -27482117, -34891085, -37060058, -26440204, -2340455, 22823323, 32014296, 22398545, 8883797, 4643573, 6399293, 4546337, -2126094, -10303041, -20720188, -31647188, -32869133, -19945035, -7133356, -10253599, -21724001, -20054305, -1827979, 14075225, 14667473, 6640657, -1426696, -11693825, -23975272, -26798916, -13450120]
$$ [...]
##END NTUPLES=NMR SPECTRUM
##END=
