##TITLE=31Pdec_MTPET2509
 CDCl3, 24 sc
 28.9.2020
##JCAMPDX= 6.0         $$ Bruker NMR JCAMP-DX V2.0
##DATA TYPE= NMR SPECTRUM
##DATA CLASS= NTUPLES
##ORIGIN= UXNMR, Bruker Analytische Messtechnik GmbH
##OWNER= root
$$ XWIN-NMR		Version 3.5
$$ Mon Sep 28 10:45:43 2020 Russian Standard Time (UT+4h)  she@DPX200
##.OBSERVE FREQUENCY= 81.013821
##.OBSERVE NUCLEUS= ^31P
##.ACQUISITION MODE= SIMULTANEOUS
##.ACQUISITION SCHEME= undefined
##.AVERAGES= 24
##.DIGITISER RES= 17
##SPECTROMETER/DATA SYSTEM= spect
##.PULSE SEQUENCE= zgpg30
##.SOLVENT NAME= CDCl3
##.SHIFT REFERENCE= (INTERNAL, CDCl3, 0, 182.463)
##AUDIT TRAIL= $$ (NUMBER, WHEN, WHO, WHERE, WHAT)
$$ ##TITLE= Audit trail, XWIN-NMR		Version 3.5
$$ ##JCAMPDX= 5.01
$$ ##ORIGIN= Bruker BioSpin GmbH
$$ ##OWNER= she
$$ F:/spectra/data/she/nmr/P31/1/pdata/1/auditp.txt
$$ ##AUDIT TRAIL=  $$ (NUMBER, WHEN, WHO, WHERE, WHAT)
(   1,<2020-09-28 10:44:06.43 +0400>,<she>,<DPX200>,
      <created by zg, POWCHK disabled, PULCHK disabled
       configuration hash MD5:
       00 E9 B6 7A A2 85 ED C7 34 08 36 98 17 FE 4E 26
       data hash MD5: 32K
       FA 25 A4 CD 58 99 95 84 95 F0 40 78 1E D2 0D 29>)
(   2,<2020-09-28 10:44:08.62 +0400>,<she>,<DPX200>,
      <Start of raw data processing
       efp BC_mod = 2 LB = 1 FT_mod = 6 PKNL = 1 PHC0 = -2742.268 PHC1 = 71.00175 SI = 64K 
       data hash MD5: 64K
       7B E3 90 CE 46 A1 37 B8 E5 83 10 21 7E 86 BC DF>)
(   3,<2020-09-28 10:44:28.75 +0400>,<she>,<DPX200>,
      <pk PHC0 = -3.849938 PHC1 = 0 
       data hash MD5: 64K
       23 51 C6 E0 0C 1A 68 70 03 C5 7F 7A 1A 01 B6 4F>)
$$ ##END=
$$ 
$$ hash MD5
$$ 04 BB FA 73 02 2E CC 78 A5 D1 77 0A CE 99 9C C0
##$RELAX= 
##$RELAX= 
##$RELAX= 
##$RELAX= 
##$RELAX= 
##$RELAX= 
##$RELAX= 
##$RELAX= 
$$ Bruker specific parameters
$$ --------------------------
##$DU= <F:/spectra>
##$EXPNO= 1
##$NAME= <P31>
##$PROCNO= 1
##$TYPE= <nmr>
##$USER= <she>
##$AMP= (0..31)
100 100 100 100 100 100 100 100 100 100 100 100 100 100 100 100 100 100 
100 100 100 100 100 100 100 100 100 100 100 100 100 100 
##$AQSEQ= 0
##$AQ_mod= 1
##$AUNM= <au_zg>
##$AUTOPOS= <>
##$BF1= 81.014009
##$BF2= 200.13
##$BF3= 200.13
##$BF4= 200.13
##$BF5= 200.13
##$BF6= 200.13
##$BF7= 200.13
##$BF8= 200.13
##$BYTORDA= 1
##$CFDGTYP= 0
##$CFRGTYP= 5
##$CHEMSTR= <none>
##$CNST= (0..31)
1 1 145 1 1 1 1 1 1 1 1 1 1 1 1 1 1 1 1 1 1 1 1 1 1 1 1 1 1 1 1 1 
##$CPDPRG= <waltz16>
##$CPDPRG1= <>
##$CPDPRG2= <waltz16>
##$CPDPRG3= <>
##$CPDPRG4= <mlev>
##$CPDPRG5= <mlev>
##$CPDPRG6= <mlev>
##$CPDPRG7= <mlev>
##$CPDPRG8= <mlev>
##$CPDPRGB= <>
##$CPDPRGT= <>
##$D= (0..31)
0 1 0 0 0 0 0 0 0 0 0 0.03 2e-05 3e-06 0 0 0 0 0 0 0 0 0 0 0 0 0 0 0 0 
0 0 
##$DATE= 1601275445
##$DBL= (0..7)
120 120 120 11 120 120 24 19 
##$DBP= (0..7)
150 150 150 150 150 150 150 150 
##$DBP07= 0
##$DBPNAM0= <>
##$DBPNAM1= <>
##$DBPNAM2= <>
##$DBPNAM3= <>
##$DBPNAM4= <>
##$DBPNAM5= <>
##$DBPNAM6= <>
##$DBPNAM7= <>
##$DBPOAL= (0..7)
0.5 0.5 0.5 0.5 0.5 0.5 0.5 0.5 
##$DBPOFFS= (0..7)
0 0 0 0 0 0 0 0 
$$ [...]
##$SUBNAM2= <"">
##$SUBNAM3= <"">
##$SUBNAM4= <"">
##$SUBNAM5= <"">
##$SUBNAM6= <"">
##$SUBNAM7= <"">
##$SUBNAM8= <"">
##$SUBNAM9= <"">
##$SW= 369.568048894756
##$SWIBOX= (0..15)
0 1 3 0 0 0 0 0 0 0 0 0 0 0 0 0 
##$SW_h= 29940.119760479
##$TD= 32768
##$TD0= 1
##$TE= 0
##$TE2= 300
##$TE3= 300
##$TEG= 300
##$TL= (0..7)
0 120 53 12 22 120 120 120 
##$TP= (0..7)
150 150 150 150 150 150 150 150 
##$TP07= 0
##$TPNAME0= <>
##$TPNAME1= <>
##$TPNAME2= <>
##$TPNAME3= <>
##$TPNAME4= <>
##$TPNAME5= <>
##$TPNAME6= <>
##$TPNAME7= <>
##$TPOAL= (0..7)
0.5 0.5 0.5 0.5 0.5 0.5 0.5 0.5 
##$TPOFFS= (0..7)
0 0 0 0 0 0 0 0 
##$TUNHIN= 0
##$TUNHOUT= 0
##$TUNXOUT= 0
##$USERA1= <user>
##$USERA2= <user>
##$USERA3= <user>
##$USERA4= <user>
##$USERA5= <user>
##$V9= 5
##$VALIST= <valist>
##$VCLIST= <CCCCCCCCCCCCCCC>
##$VD= 0
##$VDLIST= <DDDDDDDDDDDDDDD>
##$VPLIST= <PPPPPPPPPPPPPPP>
##$VTLIST= <TTTTTTTTTTTTTTT>
##$WBST= 1024
##$WBSW= 4
##$XGAIN= (0..3)
0 0 0 0 
##$XL= 0
##$YL= 0
##$YMAX_a= 13824
##$YMIN_a= -12301
##$ZGOPTNS= <>
##$ZL1= 120
##$ZL2= 120
##$ZL3= 120
##$ZL4= 120
##$ABSF1= 0
##$ABSF2= 0
##$ABSG= 0
##$ABSL= 0
##$ALPHA= 0
##$AQORDER= 0
##$ASSFAC= 0
##$ASSFACI= 0
##$ASSFACX= 0
##$ASSWID= 0
##$AUNMP= <proc_1d>
##$AZFE= 0.1
##$AZFW= 0.5
##$BCFW= 0
##$BC_mod= 2
##$BYTORDP= 0
##$COROFFS= 0
##$CY= -3
##$DATMOD= 1
##$DC= 0
##$DFILT= <>
##$DTYPP= 0
##$F1P= 0
##$F2P= 0
##$FCOR= 1
##$FTSIZE= 65536
##$FT_mod= 6
##$GAMMA= 0
##$GB= 0
##$INTBC= 1
##$INTSCL= 5.30512e-09
##$ISEN= 30
##$LB= 1
##$LEV0= 0
##$LPBIN= 0
##$MAXI= 10000
##$MC2= 0
##$MEAN= 0
##$ME_mod= 0
##$MI= 50
##$NCOEF= 0
##$NC_proc= -6
##$NLEV= 6
##$NOISF1= 182.463
##$NOISF2= 159.3651
##$NSP= 0
##$NTH_PI= 0
##$NZP= 0
##$OFFSET= 182.463
##$PC= 4
##$PHC0= -2746.118
##$PHC1= 71.00175
##$PH_mod= 1
##$PKNL= yes
##$PPARMOD= 0
##$PSCAL= 0
##$PSIGN= 0
##$REVERSE= no
##$SF= 81.0140089999434
##$SI= 65536
##$SIGF1= 159.3651
##$SIGF2= -187.1042
##$SINO= 113.3802
##$SIOLD= 16384
##$SREGLST= <1H.CDCl3>
##$SSB= 0
##$STSI= 65536
##$STSR= 0
##$SW_p= 29940.119760479
##$SYMM= 0
##$S_DEV= 0
##$TDeff= 32768
##$TDoff= 0
##$TI= <>
##$TILT= no
##$TM1= 0
##$TM2= 0
##$TOPLEV= 0
##$USERP1= <user>
##$USERP2= <user>
##$USERP3= <user>
##$USERP4= <user>
##$USERP5= <user>
##$WDW= 1
##$XDIM= 65536
##$YMAX_p= 388920275
##$YMIN_p= -30766368
$$ End of Bruker specific parameters
$$ ---------------------------------
##NTUPLES= NMR SPECTRUM
##VAR_NAME=  FREQUENCY,     SPECTRUM/REAL,   SPECTRUM/IMAG
##SYMBOL=    X,             R,               I
##VAR_TYPE=  INDEPENDENT,   DEPENDENT,       DEPENDENT
##VAR_FORM=  AFFN,          ASDF,            ASDF
##VAR_DIM=   65536,         65536,           65536
##UNITS=     HZ,            ARBITRARY UNITS, ARBITRARY UNITS
##FACTOR=    0.456856943014862, 1,           1
##FIRST=     14782.0589164792, 0,            0
##LAST=      -15158.0608439998, 0,           0
##MIN=       -15158.0608439998, -30766368,   0
##MAX=       14782.0589164792, 388920275,    0
$$ Real data points
##PAGE= N=1
##DATA TABLE= (X++(R..R)), XYDATA
$$ [...]
40559H28411m33700o09808M9979Q59326Q67877Q0572o72729q36225m82776K20222
40549a28851J048263J243153R0661j655403k054131m35853J437730J690562Q33848
40540B069979N53517Q47859L20836j000325j394197l49541M43287j10281p32905
40531F48229j02777Q55805P20727R2062L24851R16196M50905o47535p94708k27566
40521B236189o25309j762828j426473P11825J990122P83888r43110q57903K27469
40512C33870K35193o12683o32932J61493L69371l4060K34797J237861J679516
40503B972426J203799O69435K01352q15106j756282j167986M87602R03453n73067
40494B125626j863978j515216p58408r00860r45892L47559J918720K030987J037762
$$ y = [828411, 394711, -215097, -165118, 694208, 1562085, 1642657, 969928, 133703, -349073, -128851, 919412, 2162565, 2253226, 597823, -1456308, -1892161, -454431, 1236131, 2069979, 2623496, 3471355, 3792191, 2791866, 1397669, 1048128, 1491415, 1381134, 648229, 545452, 1401257, 2121984, 2214046, 2538897, 3455093, 3905998, 3258463, 2463755, 2236189, 1610880, -151948, -1578421, -866596, 1123526, 1907414, 964304, 106401, 333870, 569063, -43620, -676552, -515059, -145688, -179748, 55049, 1292910, 2972426, 4176225, 4845660, 5047012, 4231906, 2475624, 1307638, 1795240, 2698693, 2125626, 261648, -1253568, -2011976, -2912836, -3858728, -3511169, -1592449, 438538, 1476300]
40485A476300M20680K08417n01024j356757j317562p68472q57225j131997j35486
40476c963126J740814K328524R76383l36831Q3420J355473J577035L81165j006187
40467C136670j419931p43628K12031M37959k42567q81519o40503N0927L24444
40458B33883K57026L09188P5869q57756j432325m51692R72242O24097j169604
40449a439072j642777K02452K091056K072113J046815L91221m25748j985073k853465
40440b542478j660916L21577R41816L25523J48761P54658J102073Q38516M81803
40431G11333J58426j63239K7668O64447M08648j101011j706964J69503K237924
40422A406735J213668j881941k826300m58488J837399J527043K28931K44679R60925
$$ y = [1476300, 1896980, 2105397, 1604373, 247616, -1069946, -1838418, -2695643, -3827640, -3963126, -2222312, 106212, 1082595, 745764, 829184, 2184657, 3761692, 4142857, 3136670, 1716739, 973111, 1185142, 1623101, 1380534, 499015, -141488, -90561, 233883, 490909, 800097, 875966, 18210, -1414115, -1865807, -893565, -269468, -1439072, -3081849, -2879397, -788341, 1283772, 2330587, 2721808, 2296060, 310987, -2542478, -4203394, -3881817, -2940001, -2614478, -2465717, -1711059, -608986, 229530, 711333, 869759, 706520, 734188, 1398635, 1807283, 706272, -1000692, -831189, 1406735, 2620403, 738462, -2087838, -2546326, -708927, 818116, 1047047, 1291726, 2252651]
40413B252651P25997j48710m96999n95072j168458j462372m34556J043932J179881
40404H96294l5469q27208j86596R29936J036694r6931j233208r77084N44761J485782
40394A536971M42137j472936j931347o01921O03179O00458L99050O97442M55693
40385G28726q88289j787521q48549Q43433J382681P08086n6109o46987j278380
40376a842909j355933m07779O72392J006153J254922K016446K053900L44818j354115
40367B387895o92370J346760J624097l97416k016540j484690J3699R46022J253041
40358B980498R53945m10264k011543j888801J3381J268659O37145n9091P10123
40349B194052J302425l81622l050041l499205j102448J533820K127756R90760
$$ y = [2252651, 2978648, 2829938, 2332939, 1737867, 569409, -892963, -1327519, -283587, 896294, 860825, 33617, -152979, 776957, 1813651, 1716720, 483512, -493572, 51189, 1536971, 1979108, 506172, -1425175, -2027096, -1423917, -823459, -424409, 273033, 728726, -159563, -1947084, -2795633, -1952200, -569519, 138567, 82458, -564529, -1842909, -3198842, -3606621, -2934229, -1928076, -673154, 1343292, 3397192, 3742010, 2387895, 1695525, 3042285, 4666382, 4268966, 2252426, 767736, 781435, 1727457, 2980498, 3934443, 3524179, 1512636, -376165, -362784, 905875, 1543020, 1483929, 2194052, 3496477, 3114855, 64814, -3434391, -4536839, -3003019, -875263, 115497]
40341A15497k66312o64196j98703N85398R84369P41316L97603O09135J176958
40332C481065J156156p9165j995729l048583j996011M15282J617287J73351j911019
40323b187366j506787J193436K756117J416033o09769q22969O8329J96707j91375
40314C12356N2054K89265n53115j268723j14941J572708R07690j613328k266569
40305b682603K02248K454219J543364r06403j523148L9741J439250J278137J87002
40296B031807q44678j284954p73711L38568O45786o25294k045950j625374L34412
40287c849388J609040J128693O4928k82143p6170O6310K52874O50944P12361M6055
40277C23504o32302m18661L26619M37429k89535p71911k88859M13915K26002o87725
$$ y = [115497, -150815, -815011, -1013714, -428316, 556053, 1297369, 1694972, 2304107, 3481065, 4637221, 4558056, 2562327, -486256, -2482267, -2066985, -449698, -276347, -2187366, -3694153, -2500717, 255400, 1671433, 1061664, 238695, 307024, 503731, 312356, 364410, 653675, 100560, -1168163, -1283104, 289604, 1197294, -416034, -2682603, -2480355, -26136, 1517228, 610825, -912323, -872582, 566668, 1844805, 2031807, 1187129, -97825, -871536, -532968, 112818, -512476, -2558426, -4183800, -3849388, -2240348, -1111655, -1046727, -1328870, -1405040, -1338730, -1085856, -434912, 277449, 323504, -308798, -727459, -400840, 36589, -252946, -1024857, -1313716, -899801, -673799, -1361524]
40267a361524j141737o40911M2783K21987L71568J191602K184139K150532R57502
40258C975941j98279m52299k67693m07030p92531r67620r23876p49728j41342
40249i24457Q73202J333354N30925o49502p81289q044K69342k47334l10616N89048
40239F74629J162573M53550m16533K1460J156704J195635q1710j084934q00177
40230B281197M5929L62420K8341m06249m15420K27431J017983P16983j095650
40221B762965k671277j848698P75919K266883J381794J52231M67194J191383L99882
40212D878276j262442j700654p26902O0119R3902J81774L71357j18354q30684
40203I46392l43498J045129J253170k96735j576387j092979J3457K56051J60177
$$ y = [-1361524, -2503261, -3144172, -3101389, -2879402, -2507834, -1316232, 867907, 3018439, 3975941, 3777662, 3325363, 3057670, 2650640, 1858109, 890489, -33387, -783115, -924457, -51255, 1282099, 1813024, 1163522, 382233, 374189, 643531, 396197, 85581, 674629, 1837202, 2290752, 1874219, 1895679, 3052383, 4248018, 4166308, 3081374, 2281197, 2327126, 2689546, 2717887, 2311638, 1896218, 2123649, 3141632, 3858615, 2762965, 91688, -1757010, -981091, 1285792, 2667586, 2819817, 3287011, 4478394, 4878276, 3615834, 1915180, 1188278, 1248397, 1342299, 1524073, 1895430, 1777076, 946392, 602894, 1648023, 2901193, 2604458, 1028071, -64908, -51451, 204600, 364777]
40194C64777P35657J342442R74307L14893N05909Q80248m18j695678k312859j290520
40184a81242P1687P13713P40643L24609n97490j371805r78101L06142R63620L48816
40174C40592m92276m94759J33721P46327J215909J456679J018159j01261j011379
40165B811712j013518n29956l31438m00392k48903N3032o6835p12286j238816
40156a677400j068834l75578K84881P67254J329519J813891J455457K4251j359634
40147A193807j470655p32213n14784q25664l58702Q90161J124489j71566q06350
40138a671477P50760K522846J912456j33525p52683J05330k7527j449740j567926
40129c11486N18193K183491J421753j83662m79775j44990p95897j730784j160956
$$ y = [364777, 1100434, 2442876, 3417183, 3732076, 4237985, 5118233, 5117815, 3422137, 1109278, -181242, -109555, 604158, 1344801, 1669410, 1071920, -299885, -1277986, -971844, -8224, 340592, -151684, -646443, -512722, 233605, 1449514, 2906193, 3924352, 3823091, 2811712, 1798194, 1268238, 936800, 536408, 287505, 340537, 273702, -438584, -1677400, -2746234, -3121812, -2836931, -2069677, -740158, 1073733, 2529190, 2553441, 1193807, -276848, -1009061, -1523845, -2349509, -2708211, -1818050, -693561, -865127, -1671477, -920717, 1602129, 3514585, 3381060, 2628377, 2733707, 2706180, 1256440, -311486, 206707, 2390198, 3811951, 3628289, 3148514, 3003524, 2207627, 476843, -684113]
40120f84113N49974J349599N76944m80928p36736k69678N65706J439299J628052
40111C938119O72975o08448q96873j02928O05411M06484l54790q73636p82433
40102B003881l89940l26406p32783q18706J39993J433239J569554L58528q89411
40093B347949j335207j280094p65152N20933J564742O56940j467348j779122M04470
40084a131889J807412K33432j739107r58555J100483J023228p32805r69515N61557
40075h05759J096588M6756k18713R58928J336472O4874p73382j05084L30795m38350
40065A493125p25160M01509J083355P6152q27056l9669Q87236P4895j320087j194398
40055i0098K0029N70002L90887L67801J10938r75891j706413p17864R98047J507224
$$ y = [-684113, -134139, 1215460, 1792404, 1311476, 574740, 305062, 870768, 2310067, 3938119, 4611094, 4002646, 3105773, 3002845, 3608256, 4014740, 3659950, 2786314, 2003881, 1613941, 1287535, 554752, -263954, -123961, 1309278, 2878832, 3237360, 2347949, 1012742, -267352, -1032504, -511571, 1053171, 1710111, 242763, -1536359, -1131889, 675523, 908955, -830152, -1788707, -688224, 335004, -397801, -1367316, -805759, 290829, 337585, 118872, 1077800, 2414272, 2479146, 1705764, 1600680, 1931475, 1493125, 767965, 1169474, 2252829, 2328981, 1501925, 1462256, 2349492, 2424387, 1104300, -90098, -70069, 499933, 890820, 1258621, 1369559, 393668, -1312745, -2030609, -1032562, 474662]
40045D74662Q26456J68184m98564j674019k269919j054525P16473Q91129o8397
40036b488520l7548R08174P51940n42812p23236P34676J526269L81863q67281
40027c56475m19329P65497R13213J21974m81192o66819o82194k18451P91187J391929
40017A159340Q65297r7481m58577j93756K11169O00951O80408j45474j498550
40008A123327j758726k38944J410986J295312j16923r30567o65273m70565q11410
39999a162783p42792K03806R74189O30027q3871P9163P46354L66179j167725j791723
39989a949176j33634J967181J531234j249898k879553j330677J201060J757502
39981a085961Q26498P50023J408070O35156j520955k331529p46337Q41488M12458
$$ y = [474662, 1301118, 1469302, 970738, -703281, -2973200, -4027725, -3311252, -2420123, -2488520, -2526068, -1617894, -865954, -1408766, -2132002, -1397326, 128943, 510806, -356475, -775804, -10307, 902906, 1024880, 543688, -123131, -805325, -1023776, -232589, 1159340, 2024637, 1927156, 1468579, 1274823, 1485992, 2086943, 2767351, 2621877, 1123327, -635399, -874343, 536643, 1831955, 1715032, 784465, 119192, -351373, -1162783, -1905575, -1701769, -727580, -97553, -181424, -102261, 644093, 1010272, -157453, -1949176, -2082810, -115629, 1415605, 165707, -2713846, -4044523, -2843463, -1085961, -259463, 490560, 1898630, 2533786, 1012831, -1318698, -2065035, -1223547, -811089]
39972h11089p66729p13059P1519K2203o15103n62017K4493J5050m98515l81460
39962d214707O37717J785440K458201K306553Q97344j238219k116918o28733J404466
39953A291144J423783k45740j111381l98314K52592o95P8759J143072J702964
39944D136184N60971j020425j161596j34001K90772n22071j557054j856077j416388
39935b679685m97264P89459J966363K186279J284769L46662N51620J526319J563558
39926G038080j30239k053854k165716o55907L29815k15134r40646o17411r4409
39917D94579n00135j025232l27748R60657J211261N31490L28490O47319L06093
39908B626774n39484m93518L06752J39206j111086j393237q302R67711R9172j058572
$$ y = [-811089, -1577818, -2290877, -2219358, -2197155, -2812258, -3374275, -3349782, -3334732, -3833247, -4214707, -3576990, -1791550, 666651, 2973204, 3870548, 2632329, 515411, -113322, 1291144, 2714927, 2469187, 1357806, 959492, 1212084, 1211389, 1290148, 2433220, 4136184, 4697155, 3676730, 2515134, 2381133, 2671905, 2149834, 592780, -1263297, -2679685, -3176949, -2387490, -421127, 1765152, 3049921, 3396583, 3948203, 5474522, 7038080, 6907841, 4853987, 2688271, 2032364, 2362179, 2147045, 1206399, 588988, 494579, -5556, -1030788, -1358536, -397879, 813382, 1344872, 1673362, 2320681, 2626774, 2087290, 1593772, 1900524, 2039730, 928644, -464593, -472895, 494816, 593988, -464584]
39898d64584p05688L73154O97915P47357J424171J636245N0113k007482k142109
39889c90908n97025K92590j33363k99157M88966R24633P9374j231946j959069
39880b825905j937448j158434L94122J850591K024993J194341P53523R13526M90989
39871A700298p44639j465708j077769o48676p29190k05497J474207K698819J900637
39862B902482O2617o45457J19826Q02422L89111m85520p55150k51210K23177k49668
39852B112630j516089k000539l94845K163610K910213R87107j293292j621716
39844A347079o16908k34483o63199o64665m9010K78856L00246Q47372J642610
39835B187898J358702l4836q05797m0476Q18158J6111j950041k901257j645932
$$ y = [-464584, -1170272, -797118, -99203, 648154, 2072325, 3708570, 3758683, 1751201, -390908, -987933, -695343, -828706, -1127863, -638897, 285736, 365110, -866836, -2825905, -4763353, -5921787, -5527665, -3677074, -1652081, -457740, 295783, 1209309, 1700298, 955659, -510049, -1587818, -2236494, -2965684, -3171181, -1696974, 1001845, 2902482, 2965099, 2319642, 2439468, 3241890, 3631001, 3145481, 2390331, 2139121, 2362298, 2112630, 596541, -1403998, -1798843, 364767, 3274980, 4262087, 2968795, 1347079, 730171, 495688, -167511, -832176, -881186, -602330, -302084, 545288, 2187898, 3546600, 3511764, 2705967, 2665491, 3483649, 3499760, 1549719, -1351538, -2997470]
39826b997470P29766K095847J364324n63145j744030j167342K98656J091024P37885
39817a54485o772m39982n29077l69126J14423P36726R90242O75235J59354j46209
39807A030329k09336k02575k24880k35589q0567K86745N05068J39557m82523m35560
39797I0669L81018Q11736J59046n61325j54027P55100O31114o03308j622984j770344
39787a883305j495188r67404L4032R12229P56363J65577O26820J772817J447058
39778A368999p24856k058942n08606K199079K883848J068022r90866j541538q74073
39769H21067j07774L3443n69045j320629j202024N2887J434591J894108J465233
39760B501857O39750l86638j150197q10984M22307J005259L02258k88506J97170
$$ y = [-2997470, -2267704, -171857, 1192467, 629322, -1114708, -2282050, -1983394, -892370, -154485, -161257, -601239, -1130316, -1499442, -1385019, -648293, 341949, 1017184, 1176538, 1030329, 820993, 618418, 393538, 157949, 77382, 364127, 869195, 1008752, 526229, 90669, 471687, 1283423, 1442469, 881144, 727117, 1482217, 2113331, 1510023, -112961, -1883305, -3378493, -4345897, -4311865, -3399636, -2643273, -2477696, -1850876, -78059, 1368999, 644143, -1414799, -1923405, 275674, 3159522, 4227544, 3236678, 1695140, 821067, 713293, 746736, 177691, -1142938, -2344962, -2292075, -857484, 1036624, 2501857, 3141607, 2754969, 1604772, 793788, 1216095, 2221354, 2523612, 2235106, 2432276]
39751B432276L58014j085567k466634j484163P55078J101841o47255j399235K65323
39742b170322J932094J229409q10065j745072j003218L75522J610122K277645
39734A696115J844155M86368o09753q06452q16895j125673r72690L5436P32416
39725D63027J80862n83122j39073R64542J071886l7947j025227r96235k91206
39716c92493M11222O14982k1279j150788j539628m42395J173609J748842J073717
39707A475789J62471l15650l98783o5008P03257J297323R92985o566q58319j196026
39697A791473j230715j089448p96765n26395k35602L78450R81572N93554p23839
39688h57715j325008k53251J166944J405619J064397J344716J536378L87105j095823
$$ y = [2432276, 2790290, 1704723, -761911, -2246074, -1490996, -389155, -1036410, -2435645, -2170322, -238228, 991181, 181116, -1563956, -2567174, -2191652, -581530, 1696115, 3540270, 4026638, 3416885, 2610433, 1793538, 667865, -304825, -269389, 463027, 643889, 60767, -78306, 886236, 1958122, 1920175, 894948, -101287, -392493, 18729, 633711, 612432, -538356, -2077984, -2520379, -1346770, 402072, 1475789, 1638260, 1322610, 923827, 858819, 1562076, 2859399, 3852384, 3845818, 2987499, 1791473, 560758, -528690, -1325455, -1851850, -2087452, -1709002, -727430, -133876, -857715, -2182723, -2435974, -1269030, 136589, 1200986, 2545702, 4082080, 4469185, 3373362]
39679C373362r76722J55187O3383j156736j263602j05469p9053j633104k007537
39670c630291O7497J932947J369376J86814P75850J906805J216298l52509k63875
39661C208912R33201M78331j698468k648160j064506R86952J491866Q14248m3503
39652B458873r41857j549646j086620k7970R781j013911j035783Q18199K431354
39643F2420J675551m66020j453265o68303L64395M55957j41099p08030q19685
39634a698079k89769O58417J260832R38446K3180o58544o35450K4497Q47745J032478
39624A503753J16561j122371j286813k55237N41918K32350l00957r8243K79341
39615c89698p464l89173K6886N30724k40920j805008k093546l33830J861211K633719
$$ y = [3373362, 2396640, 2551827, 2615210, 1458474, 194872, 89403, 10350, -1622754, -3630291, -3562794, -1629847, -260471, -73657, 702193, 2608998, 3825296, 3472787, 3208912, 4142113, 4620444, 2921976, 273816, -790690, 196262, 1688128, 2502376, 2458873, 1517016, -32630, -1119250, -1147220, -1137439, -2151350, -3187133, -2368934, 62420, 1737971, 1271951, -181314, -849617, -485222, -29265, -170364, -878394, -1698079, -1987848, -1329431, -68599, 869847, 893027, 234483, -400967, -376470, 471275, 1503753, 1620314, 497943, -788870, -1044107, -502189, -269839, -570796, -669039, -389698, -397162, -786335, -759449, -228725, -469645, -2274653, -4368199, -4702029, -2840818, -207099]
39605b07099J882807P36118R0498J61240O49349Q81185L59944n55466j054360
39596B944216j016315j055907j363010j336788o20871K70242O98308O46667M45598
39587c87860L39549N15657R30823R83285J17795j088953j361106n16564K05926
39578b61448O0035j41095L49296P24729L7867q28907k82715J288397J751600L28816
39568C026575j234611j250020l73620k40895q91400r68255r739Q76429O97363
39559c68173j93707q54804q56692k36367Q46801J833760J805887N76025o56323
39550A896407n74254M94021R20776o1675j365550j518747m71906N42612N53012
39541D14696k19880p74210l45896Q45414J701452J309060n686j008165j016352
$$ y = [-207099, 1675708, 2411826, 2502324, 2663564, 3312913, 4194098, 4554042, 3998576, 2944216, 1927901, 871994, -491016, -1827804, -2448675, -2178433, -1480125, -833458, -387860, -48311, 467346, 1398169, 2381454, 2499249, 1410296, 49190, -467374, -261448, -201413, -342508, 6788, 731517, 769384, -59523, -342238, 946159, 2697759, 3026575, 1791964, 541944, 168324, -72571, -963971, -1932226, -1941965, -1065536, -368173, -561880, -1416684, -2273376, -2509743, -1662942, 170818, 1976705, 2552730, 1896407, 1322153, 1816174, 2736950, 2675275, 1309725, -209022, -680928, -138316, 414696, 194816, -579394, -925290, -79876, 1621576, 2930636, 2924950, 1916785, 900433]
39532I00433n60041m23387o24770o87463l50095M04668J414351J936479R48989
39523B959164j329578k906296k141038r899J025395K68360m84566K89371J709885
39514f19202J872076M18791j174815j459939m46030O69134P85361k388m94914
39505d51926J81668J310257J294797k78964j938386j992050m31067J155192J249351
39496I8872j77879j630663j459169L73940K043069J886555M04711n68040l94692
39487E76704j26069m59981o91857k25765K41883l2560m62935o2957R71205J623135
39477A350803J506235J071594P32430M93573J59070n45199j642597k463386k247669
39468a585146j390439j030909j109699l00960J471229K217067Q35519q21846o16357
$$ y = [900433, 340392, -82995, -707765, -1395228, -1745323, -1340655, 73696, 2010175, 2959164, 1629586, -1276710, -3417748, -3427647, -2402252, -2133892, -2618458, -2329087, -619202, 1252874, 1671665, 496850, -963089, -1409119, -739985, 45376, 42988, -451926, -270258, 1039999, 2334796, 2055832, 117446, -1874604, -2305671, -1150479, 98872, -79007, -1709670, -3168839, -2794899, -751830, 1134725, 1539436, 971396, 576704, 450635, -9346, -701203, -926968, -685085, -717645, -1180580, -1243537, -272332, 1350803, 2857038, 3928632, 4661062, 5154635, 5313705, 4768506, 3125909, 662523, -1585146, -2975585, -4006494, -5116193, -5417153, -3945924, -1728857, -893338, -1715184, -2331541]
39459b331541O16931O52197m42843p52732L7546L71084j58883k19723N48095Q11715
39449h68154J50321p8861O08121O47009q03696j986237j078344R70817J839414
39440e99610R44620l88374j009633q16128j90507K90561J26657l42948j82658
39431b168020N38133N18287o28261j375985n70333O71944Q01347L02752N58497
39422a351639J294186J195334L84920J24635L56229k53795j702459k207033r49404
39413c109026N35668N84502l74339q00997k33953N11199P42351O18387O70903
39404h55305J096415J487626J209956K20352o90048q70628p10040r06616j167624
39395a185912o13159N95160J163313N34815j38979M37502J785785K096311N04567
$$ y = [-2331541, -1714610, -1062413, -1505256, -2257988, -2220442, -1849358, -2008241, -2227964, -1679869, -868154, -717833, -796694, -188573, 458436, -345260, -2331497, -3409841, -2439024, -599610, 345010, -43364, -1052997, -1869125, -2059632, -1769071, -1642414, -1985362, -2168020, -1629887, -1111600, -1739861, -3115846, -3686179, -3014235, -2212888, -1910136, -1351639, -57453, 1137881, 1522801, 1647436, 2003665, 1749870, 47411, -2159622, -3109026, -2573358, -1988856, -2363195, -3164192, -3398145, -2886946, -2144595, -1526208, -855305, 241110, 1728736, 2938692, 3159044, 2468996, 1598368, 888328, -18288, -1185912, -1799071, -1203911, -40598, 494217, 355238, 792740, 2578525, 4674836, 5179403]
39386E179403j649292k173033n70821J201932J003571p85484j796264r62997J05053
39377d47932k64091j285549j219123k48766N8730m14798j71544J225764K306650
39368d60659J964073Q89383J69086p7276q0860J49565J85313o43874j798865j731677
39358a435791k95332O28788n5661q38286l6842J397947J381547k3743r17625o33676
39348h28674l82242q37445j071328l65453N47029P84694O30041P36064R44600
39339A57286P16274J06472m26496p41401q93491o51801J80415J108546J251436
39330H07240M27083m86119n19186K39713P30414J81013r24914j358300n87782
39321a490838N55638Q15714l9152r35334p04368N51605J481357R95333l95824
$$ y = [5179403, 3530111, 1357078, 786257, 1988189, 2991760, 2206276, 410012, -552985, -447932, -712023, -1997572, -3216695, -3465461, -3406731, -3821529, -3993073, -2767309, -460659, 1503414, 2392797, 2561883, 2484607, 2403747, 2553312, 2738625, 2094751, 295886, -1435791, -1731123, -1102335, -1157996, -1996282, -2033124, -635177, 746370, 722627, -194998, -828674, -1210916, -2048361, -3119689, -3485142, -2938113, -2153419, -1523378, -787314, 157286, 873560, 980032, 553536, -187865, -1081356, -1733157, -1552742, -444196, 807240, 1234323, 748204, 229018, 468731, 1199145, 1380158, 455244, -903056, -1490838, -935200, -119486, -158638, -1093972, -1798340, -1246735, 234622, 1229955, 834131]
39312H34131j155551o71842J6440j36631n57663m5344J075845J178742j98363
39303C39764j520051j440655n59749j14056P669P21561J879200K253288J220045
39294B787016n39267j914117k159870j082498O64768J662126J072462j49544l27751
39285A3325P01260J442608R05744j92428p07911n14615j41495J43446K27085j39866
39275A737153p86565q49694J42732J322817J435220M86850l53472l61557M5615
39266B819099J94267j04225q15322j800114k340550j468362N47936J821404R65667
39257a80200q74292j316884Q7694J369468J079245K19839L69663J164544J068242
39248B987319j02429j029965j016984o97169n47813j76956N30469Q88424N99343
$$ y = [834131, -321420, -993262, -976822, -1113453, -1671116, -1716460, -640615, 538127, 339764, -1180287, -2620942, -3180691, -3294747, -3287078, -2565517, -686317, 1566971, 2787016, 2247749, 333632, -1826238, -2908736, -2243968, -581842, 490620, 341076, 13325, 714585, 2157193, 3062937, 2870509, 2162598, 1647983, 1506488, 1649934, 1877019, 1737153, 950588, 100894, 243626, 1566443, 3001663, 3488513, 3135041, 2773484, 2819099, 3013366, 2909141, 2093819, 293705, -2046845, -3515207, -2967271, -1145867, -180200, -1054492, -2371376, -2283682, -914214, 165031, 384870, 754533, 1919077, 2987319, 2884890, 1854925, 837941, 140772, -407041, -583997, -53528, 834896, 1434239]
39239A434239L20785M35195L52361k70056p04435l96775l88j82509l71211J37849
39229G55055O75972J74479r47327j298127n93746J33048K31329P2330N1510J00219
39219f45258J73781K46966J2929m42070j57291J192418J915828L42120k065463
39210E73960k040641O91396K542861J112352j343647j383204O38365J562972K57396
39201B611810j264673j266460l37319L40195O69600Q11153L25734q13924j478828
39192d02712p07502Q62651J701166J108123l09071j444641j519328n42107N98468
39183f54953Q78899L21135j2178M87444J080577P70618k95470j180863j441215
39174d6006j282285p99780K3006O91617N24836k67954o62628k27051K99847K08783
$$ y = [1434239, 1755024, 2190219, 2542580, 2272524, 1568089, 1171314, 1170926, 988417, 617206, 755055, 1431027, 1605506, 658179, -639948, -1233694, -1100646, -869317, -796987, -745477, -645258, -471477, -224511, -211582, -653652, -810943, 381475, 2297303, 2639423, 573960, -1466681, -775285, 1767576, 2879928, 1536281, 153077, 791442, 2354414, 2611810, 1347137, 80677, -256642, 83553, 753153, 1564306, 1890040, 1076116, -402712, -1110214, -247563, 1453603, 2561726, 2252655, 808014, -711314, -1253421, -654953, 223946, 545081, 532903, 1020347, 2100924, 2871542, 2576072, 1395209, -46006, -1328291, -2128071, -2105065, -1413448, -888612, -1156566, -1819194, -2046245, -1746398, -1537615]
39164a537615r6406J96156R72284J238859M02518r66962j693628j125610K41060
39155b369344J198029J016726J71094l69858l84594l95793n76601n21146j96256
39146b427743r6612j32332M58611J492499J489916K021j069828p5185J600688
39137A242035J423344l84294j289584n46307p4082q30452j177028o5950Q12264
39128h90054k2166r60714J42618K115028K008523k50054j633979n13006J197620
39119A193816J102018m91505j554285j140938l1968O84888O78408K62436j59573
39110E43297m69051p27589p38430j15515R04497J267935L69231r20516j261856
39101a147997n58831J38687J66042j71934l66501k36377K10160P54443R30788
$$ y = [-1537615, -1634021, -1437865, -465581, 773278, 1175796, 208834, -1484794, -2610404, -2369344, -1171315, -154589, 16505, -353353, -737947, -1133740, -1710341, -2231487, -2427743, -2524355, -2656687, -2198076, -705577, 784339, 786360, -283468, -358653, 1242035, 2665379, 2281085, 991501, 445194, 371112, -459340, -1636368, -1702318, -890054, -912220, -1872934, -1730316, 384712, 2393235, 2143181, 509202, -3804, 1193816, 2295834, 1804329, 250044, -890894, -922862, -237974, 440434, 702870, 543297, 74246, -653343, -1391773, -1507288, -602791, 665144, 1034375, 113859, -1147997, -1706828, -1568141, -1402099, -1574033, -1940534, -2176911, -1966751, -1212308, -281520]
39092b81520N65780J02404o8914j00092k7301N46273J367961J177010m01183j594687
39082A285731o73253J345807J936589N49965r56285j156226n14880K8797K81980
39073B128225L88028M99261Q95970J366311R15278o39143j605576p06334N19561
39064C761581q6670j560759j218920O40358R10835j150483k525773j254038P14079
39055a769790J023525K58709m7258k9003r3812O49409K394033L180423J624256
39046G190492o85838j490987q52234r7109L24339K07105j057430k641266k129940
39037a232868O82841K375903P56736j501416j063890Q38977R91434l32859o29570
39028H85288o2682n83358j423586k22439K006764J855192o13917j717869k67867
$$ y = [-281520, 284260, 386664, 317750, 217658, 190357, 736630, 2104591, 3281601, 2880418, 1285731, 612478, 1958285, 3894874, 4444839, 3488554, 2332328, 1817448, 1846245, 2128225, 2516253, 3015514, 3911484, 5277795, 6193073, 5553930, 3948354, 3242020, 3761581, 3674911, 2114152, 895232, 1535590, 2446425, 1295942, -1229831, -2483869, -1769790, -746265, -487556, -534814, -563817, -657629, -8220, 2385813, 5566236, 7190492, 6504654, 5013667, 4161433, 4064324, 4388663, 4595768, 3538338, 897072, -1232868, -550027, 1825876, 2582612, 1081196, 17306, 856283, 1847717, 1514858, 885288, 822606, 239248, -1184338, -1406777, 599987, 2455179, 1841262, 123393, -144474]
39019a44474Q37861k854p00717J15700O15517l68197q74881M68048J637462O42900
39009B226365j070053j209877k95487k16264r80143j191187m09121P27479J505243
39000i13045J130777p01080k386236j609274J129275K559227J250368n13307p29957
38991g83252m98006j050386j124414K87282J431766P91672k5715O83226J348119
38982A060292O6443j458058o55256J196094J041721o31947p95126P48957J288670
38973A861790J15877o87860m13086n86240j278494n87202J324867J541924q70004
38964D21572k913141k134589J9069J161785J423338J777790J438723m55960k306435
38955a567848j855289M14918J932768J554936N54452L26523O58011M45463p53081
$$ y = [-144474, 693387, 690533, -10184, 105516, 721033, 352836, -522045, -53997, 1583465, 2226365, 1156312, -53565, -349052, -565316, -1545459, -2736646, -3145767, -2418288, -913045, 217732, -483348, -2869584, -4478858, -3349583, -790356, 460012, -53295, -783252, -1281258, -2331644, -3456058, -3168776, -1737010, -945338, -971053, -287827, 1060292, 1126735, -331323, -986579, 209515, 1251236, 619289, -175837, 573120, 1861790, 1977667, 1289807, 876721, 290481, -988013, -1575215, -250348, 1291576, 421572, -2491569, -4626158, -4607089, -3445304, -2021966, -244176, 1194547, 738587, -1567848, -3423137, -3008219, -1075451, 479485, 1033937, 1360460, 2018471, 2463934, 1710853]
38946A710853k080966k119543m96331J390926J938802J344860R36537Q31585o868
38937C449855j347342j433453J88619J592707J261142J51407k19347k5951n7258
38928C560379r637M78576M94103o25305j607070r92317M23205Q74466M81800O55756
38918C733956J294799R68579l06888q87303l18196o0678q38359j367769o26129
38909A592012M45261N84945J3209n24252j075801j606103j172332M98297J742582
38900D97818J016938o08529q77547L10318J039441N95322K39288M99993J11746
38891B824788j368941k121562q54378P71529N76062o32602m34253J114845J546694
38882A422182J14039r50243q2620J227237J098897K02600J57265N62208j18435
$$ y = [1710853, -370113, -2489656, -2985987, -1595061, 343741, 1688601, 2625138, 3456723, 3449855, 2102513, 669060, 857679, 2450386, 3711528, 3862935, 3643588, 3617637, 3560379, 3550742, 4029318, 4523421, 3898116, 2291046, 1298729, 1721934, 2596400, 3078200, 3733956, 5028755, 5997334, 5690446, 4803143, 4484947, 4424269, 3585910, 2218141, 1592012, 2037273, 2622218, 2635427, 2111175, 1035374, -570729, -1743061, -1244764, 497818, 1514756, 906227, 28680, 338998, 1378439, 1973761, 2213049, 2713042, 2824788, 1455847, -665715, -1520093, -748564, -172502, -805104, -1239357, -124512, 1422182, 1536221, 585978, 503358, 1730595, 2829492, 3032092, 3189357, 3751565, 3633130]
38873C633130j561834j798742l05290J144405J091724K28353m4713L59948N43732
38864C290713K27273L8829L36455N19318r8149j047344j060172N3742O91309m37261
38854B514713k110580k050839l64127M79729n19176j345244l29855J186290J262419
38845a276670M10532Q2682q1202r04374j161611M93407K275733J444592r65760
38836C17329j416346L15593P91080j019832j756223N63797K923327K094548l58319
38827B454954j021301Q5945N85210J18597J10502M37272j98187j231850p94897
38818E46245R08343J653632O85037m01970m57806j47137k04731l70746m28698
38809A782169n52488m21111L52496R19402J30271j275779j438241l94649r1955
$$ y = [3633130, 2071296, 272554, -32736, 1111669, 2203393, 2431746, 2387033, 2746981, 3290713, 3517986, 3556815, 3893270, 4412588, 4314439, 3267095, 2206923, 2260665, 2951974, 2514713, 404133, -1646706, -2010833, -1531104, -2050280, -3395524, -3725379, -2539089, -1276670, -866138, -783456, -864658, -1769032, -2930643, -2437236, -161503, 1283089, 317329, -1099017, -783424, 7656, -1012176, -2768399, -2204602, 718725, 2813273, 2454954, 1433653, 1519598, 2104808, 2223405, 2333907, 2771179, 2572992, 1341142, 546245, 1454588, 3108220, 3793257, 3391287, 2933481, 2786344, 2581613, 2210867, 1782169, 1229681, 808570, 1161066, 2080468, 2210739, 934960, -503281, -897930, -989885]
38800i89885j046369j413117k09576R00130L95877n52973r4667J246757J477337
38791b86486K50344p70495m03474O55495J018611K37856r01812j225932k99559
38782a725452J089594J773179J504253R19973L21236n89052j617430j841702r47707
38773a113108J70572P09447Q99596J029949O03123n71299j344397n30085J237398
38764A091196K109358J277587l42491j517536j832732j443115o21280J69578L92152
38755g17283J2477l27794J35Q22988J233404N75516o37365j099342k71356Q26975
38745D18355R44209L09051R6507M70740M78754l3713K3659R36865J277643J23135
38735E045205j205072j096572k44094m68659j638750j809631l50814J031506Q18783
$$ y = [-989885, -2036254, -3449371, -3658947, -2758817, -2362940, -2915913, -3010580, -1763823, -286486, -36142, -806637, -1210111, -554616, 463995, 701851, -199961, -1425893, -1725452, -635858, 1137321, 2641574, 3561547, 3882783, 3293731, 1676301, -165401, -1113108, -942536, -233089, 666507, 1696456, 2299579, 1728280, 383883, -146202, 1091196, 3200554, 4478141, 4135650, 2618114, 785382, -657733, -1279013, -1109435, -717283, -704806, -1032600, -1032465, -209477, 1023927, 1599443, 962078, -137264, -408620, 418355, 1362564, 1671615, 1768122, 2238862, 2717616, 2683903, 2707562, 3644427, 4922070, 5045205, 3840133, 2743561, 2499467, 2030808, 392058, -1417573, -1768387, -736881, 81902]
38726H1902m22016j329009j533441j288606m66699R45110K019679J688938K18029
38717h6113q75223m24573J192893K409944J915358r636j588369j382893J5842
38708A167230P54939J62797n07307p7410Q52715R41268M0515q33123r42646l32294
38698A226684O94818J636614J638522L30804j286342j795615j172439o35024o96791
38689e8769n87823J04202N17009n0369q42519p29318J64505Q57054R39609O49558
38679I63139M5594q07475j205296n26984N74153Q51315K74843j8563L81508O20661
38669A152895J86879k95079l79891n68880j001887p01638P68652K022409J608000
38660B791460K12755m02187m6987R516n35171n89194J67460N00357l58579j404775
$$ y = [81902, -340114, -1669123, -3202564, -4491170, -4957869, -4012759, -1993080, -304142, -86113, -961336, -1385909, -193016, 2216928, 4132286, 4122650, 2534281, 1151388, 1167230, 1922169, 2084966, 1577659, 1500249, 2352964, 3294232, 3334747, 2501624, 1558978, 1226684, 1921502, 3558116, 5196638, 5527442, 4241100, 2445485, 1273046, 638022, -58769, -646592, -542390, -25381, -75750, -918269, -1647587, -1483082, -626028, 313581, 963139, 1008733, 201258, -1004038, -1531022, -956869, -105554, 169289, 150726, 532234, 1152895, 1339774, 1044695, 664804, 95924, -905963, -1607601, -838949, 1183460, 2791460, 3004215, 2602028, 2555041, 2564557, 2029386, 1440192, 1607652, 2108009, 1749430, 344655]
38650C44655j433340p13661j54172J78084O26921Q30656K32205p22315r82028
38641a792995l21880M65374O72123K89934k72144m36057K91574J582362K090227
38632B568518Q64481j190017k171659j464307k39877L42138L61107K82723L1452
38623f15441l68482j59084J071113K177866J563041m93279j743270p33191J166356
38614A865629J383324n11031k116069j183417J526513L162683K186442j48314
38606F165760j791061k240708k200459j805397n23315J321600K250787J379660
38598B556867l65727j402546j301945q08722m91311j76221L61196Q63714R42617
38589A77922N26453k08542j020173j555496j446652p14917R0191M04032K46561
$$ y = [344655, -1088685, -1802346, -1956518, -1778434, -1151513, -320857, -88652, -810967, -1792995, -2114875, -1649501, -977378, -687444, -959588, -1395645, -1104071, 478291, 2568518, 3432999, 2242982, 71323, -1392984, -1632861, -1290723, -929616, -646893, -615441, -983923, -1143007, -71894, 2105972, 3669013, 3175734, 1432464, 699273, 1865629, 3248953, 2737922, 621853, -561564, 964949, 4127632, 6314074, 6165760, 4374699, 2133991, -66468, -1871865, -2395180, -1073580, 1177207, 2556867, 2191140, 788594, -513351, -1322073, -1813384, -1989605, -1628409, -764695, 177922, 704375, 495833, -524340, -2079836, -3526488, -4241405, -4151214, -3747182, -3500621]
38580c500621J40020M66331J073616J524733J542334J089977J91504j002657j920204
38571c94967j741383k89166J378638J781743N93357r60496j492812q98785j15418
38562b139289J83780J36252J22074K46040M37322N92438N17197J14496l17678
38553a07368m01506l18821n73057r89313o52418P75928K313077K766171K056946
38544D869639Q72117l86409j477095j729137p80133L22801Q3867j264152j858633
38535a347135q41266M68159P12240M24421O49299Q23563k50443j911125k055662
38526c327949j86747J663587J645772L54487m43266k12167K98124O18028R07920
38517A317789J031805M70142p01022j614661j673690j184419o67922j22663O04365
$$ y = [-3500621, -3360601, -2894270, -1820654, -295921, 1246413, 2336390, 2527894, 1525237, -394967, -2136350, -2425516, -1046878, 734865, 1328222, 367726, -1125086, -2023871, -2139289, -1955509, -1819257, -1697183, -1451143, -1013821, -421383, 95814, 210310, -107368, -508874, -827695, -1400752, -2390065, -3042483, -2266555, 46522, 2812693, 4869639, 5741756, 5355347, 3878252, 2149115, 1368982, 1691783, 1775650, 511498, -1347135, -2188401, -1720242, -1008002, -583581, 65718, 889281, 638838, -1272287, -3327949, -3514696, -1851109, -205337, 149150, -294116, -506283, -208159, 409869, 1317789, 2349594, 2819736, 2118714, 504053, -1169637, -2354056, -3021978, -3144641, -2540276]
38508b540276J135043Q36395k71227j306997j355289l25112J024948J733622J345393
38499B76500L05639k38313N72987K163426K684848R34359j975438l570631k782065
38490a628688j003038o2474p7502j18643j15658o43660j140234j30924K266835
38481b653986L653356K282138m06975j588537p34736R2488n11677j442856j053606
38472b364391L50791J047866K78546r51306j274883l70299J045995J997025J886749
38463A646093Q54013k76302o53858j80295M94714P27169L99924k42270q81245
38454A887943j155126q06248n6043M48535L35461o3230k37894k10788l63108p12559
38444i33057p74800j71406Q58096J552000J183689k09025j522909j498181k59337
$$ y = [-2540276, -1405233, -568838, -840065, -2147062, -3502351, -3827463, -2802515, -1068893, 276500, 582139, 343826, 916813, 3080239, 5765087, 6699446, 4724008, 1153377, -1628688, -2631726, -2694200, -2771702, -2890345, -3006003, -3649663, -4789897, -4920821, -2653986, 999370, 3281508, 2874533, 1285996, 551260, 643748, 132071, -1310785, -2364391, -2013600, -965734, -687188, -1638494, -2913377, -3283676, -2237681, -240656, 1646093, 2500106, 2223804, 1569946, 1389651, 1884365, 2611534, 3011458, 2769188, 1887943, 732817, -73431, -129474, 319061, 654522, 591292, 353398, 142610, -220498, -933057, -1707857, -1879263, -1021167, 530833, 1714522, 1505497, -17412, -1515593, -1774930]
38435a774930O62543M03901N9689Q57767J849011J152911q40056j724848q64091
38426b18103m49042j644776k168258J27890L219795L390870O89570j253129n84511
38417A110306P81344R28701N41386O03047L43106p58194j224850N5105J487394
38408C867345R84543q10224j680526j154992n04002k82678p0402R745k94273l1953
38398C2583J547880K799755J515877j291481k329271q80324L83176K2586j35210
38389A665571J038121J415598n78284k521055j521707R20926J170273p65927j561933
38380g38417k44789M05159j233170k834441j796360R37279K551337K042442N70932
38371c40028m91600m31440P18587J731104R94052j107849j974375k72198J806013
$$ y = [-1774930, -1112387, -708486, -648797, 208970, 2057981, 3210892, 2370836, 645988, -218103, -667145, -2311921, -4480179, -4352289, -1132494, 2258376, 2947946, 1694817, 1110306, 1891650, 2820351, 3361737, 3964784, 4307890, 3549696, 2324846, 2379951, 3867345, 4851888, 4041664, 2361138, 1206146, 702144, 419466, 349064, 358809, 64536, 32583, 1580463, 4380218, 5896095, 4604614, 2275343, 1395019, 1778195, 1800781, 1665571, 2703692, 4119290, 3541006, 1019951, -501756, 419170, 1589443, 823516, -738417, -983206, -578047, -1811217, -4645658, -6442018, -5504739, -2953402, -910960, -340028, -831628, -1263068, -544481, 1186623, 2180675, 1072826, -901549, -1173747, 632266]
38362F32266J482778o76602j868603j169991j98988p8562j67630N4285R4789o1925
38352a958183M12568J363550J314782j17250j167420m50895R10961J057989R9994
38343A466096m61275j67978J35290K6495k7451J72369K34449J24775L61686R98033
38333B862489J241053M76511q10700j467072q55853M77771J291006R05261o6990
38324D053476n68939n02726n90461r01869o18103L97539R90663L95256n66966
38315B087870q61524p37361p47528l95032P45001J493512N35896j123102j234501
38306b36769K77652J105197J34330q31904J10844K083066K712872J332396m68270
38297F219414j096751o83764m82318j149688j945002j688494l82021O47082M68476
$$ y = [632266, 2115044, 1438442, -430161, -1600152, -1799140, -1877702, -2045332, -1991047, -1896258, -1958183, -1545615, -182065, 1132717, 1015467, -151953, -602848, 308113, 1366102, 1466096, 1004821, 836843, 972133, 998628, 971177, 1143546, 1377995, 1502770, 1864456, 2862489, 4103542, 4580053, 3769353, 2302281, 1446428, 1924199, 3215205, 4120466, 4053476, 3484537, 2981811, 2391350, 1489481, 871378, 1268917, 2259580, 2654836, 2087870, 1226346, 488985, -258543, -653575, 91426, 1584938, 2120834, 997732, -236769, 40883, 1146080, 1280410, 448506, 559350, 2642416, 5355288, 6687684, 6219414, 5122663, 4438899, 3956581, 2806893, 861891, -826603, -1208624, -561542, -93066]
38288i3066l00951o54591o51334p27447m20007P73360J880585J518435J41455
38279A466439n67458l55855m68865j062286p83016O21481J475122P77552l26895
38270G76219o18609m90773n52340l53132L32994O35415J99254O8221P98484J360003
38260B155736J081499Q23019Q89468q4676k382654l512859j630624J190497J788381
38251C17787M90238o5123N45698M68622n89109q40198J79137P41373m7524r91047
38241B09854j153104j054430q70431K22133J986284K522451Q98155j244776j822374
38232c06238p90050M14783Q33064N77303K37262K27858K79150k92080j202092
38223b1040q78810J206501K825629J591650j388877k840965j925779q07996o64456
$$ y = [-93066, -394017, -1048608, -1699942, -2427389, -2847396, -2074036, -193451, 1324984, 1466439, 898981, 543126, 74261, -988025, -1771041, -1149560, 325562, 1103114, 776219, 157610, -333163, -885503, -1238635, -905641, -270226, -70972, -2751, 795733, 2155736, 3237235, 4060254, 4949722, 4865046, 2482392, -1030467, -2661091, -1470594, 317787, 808025, 742902, 1288600, 1757222, 1168113, 327915, 507052, 1248425, 1200901, 209854, -943250, -1997680, -2868111, -2645978, -659694, 1862757, 2760912, 1516136, -306238, -1096288, -681505, 151559, 728862, 966124, 1193982, 1473132, 1181052, -21040, -899850, 306651, 3132280, 4723930, 3335053, 494088, -1431691, -2239687, -2904143]
38214b904143k37907R95497J386349K05944o13119L94157J710056J398240J86773
38205B521847o9629O19230R65952O78826K63899l11236j052878j162034m05511
38196B048466l9525p64856j170822q2173J013934K01663j431176j311756L88342
38187a147903R59825m86210j720629j036419L17029M35204m51794q47449l00130
38178d278476N39009J320436K099791K377595J294033r21057k491755j804200
38170a864624N61636K239779J843978N89356L65731R43526O18879o56989q87403
38161C753869O56128J813811N99760j748099k557453j443818l14204k79869m98685
38152a8560j1784Q79362J324439R51319L2002o86827m67058N24123J192608R23958
$$ y = [-2904143, -3142050, -2146553, -760204, -554260, -1167379, -773222, 936834, 2335074, 2521847, 2452218, 3071448, 4037400, 4716226, 4980125, 4668889, 3616011, 2453977, 2048466, 2008941, 1244085, 73263, -8910, 1005024, 1206687, -224489, -1536245, -1147903, -188078, -674288, -2394917, -3431336, -3114307, -2679103, -3130897, -3978346, -4278476, -3739467, -2419031, -319240, 2058355, 3352388, 2431331, -60424, -1864624, -1302988, 936791, 2780769, 3370125, 3735856, 4679382, 5298261, 4641272, 3753869, 4409997, 6223808, 6823568, 5075469, 2518016, 1074198, 759994, 480125, -18560, -30344, 849018, 2173457, 3124776, 3156778, 2469951, 2002893, 2527016, 3719624, 4643582]
38142D643582L25375k9072n41974j355080j406140j26209J043618N80235n98816
38133B535519n43632N07262O10119n13079j077076l95419K7479p04183j206532
38124g59542j43974J497580J862240P70617m60733q83040m68764N06456J541899
38115C462739J798328Q54210o00356j444457j298224n89395J94100P99524J023302
38106D199771P76694K91452q5246k67148l58216k68852K80304J204077J707701
38097G480537R47392p76231j947012j477080o2852Q34906R93219J262650J591499
38088H847028Q58173q95433j776540o15340J175998J567661N49582n37168j160917
38079H013044j499056j162693J19445J168961O02856r14592j449203o18773J35334
$$ y = [4643582, 4968957, 4939885, 4397911, 3042831, 1636691, 1510482, 2554100, 3134335, 2535519, 1991887, 2499149, 3109268, 2596189, 1519113, 1123694, 1151173, 446990, -759542, -903516, 594064, 2456304, 3226921, 2766188, 1883148, 1414384, 1920840, 3462739, 5261067, 6115277, 5514921, 4070464, 2772240, 2182845, 2376945, 3176469, 4199771, 4976465, 5267917, 5182671, 4915523, 4557307, 4288455, 4568759, 5772836, 7480537, 8427929, 7651698, 5704686, 4227606, 4164754, 4999660, 5992879, 7255529, 8847028, 9705201, 8809768, 7033228, 6417888, 7593886, 9161547, 9711129, 9173961, 8013044, 6513988, 5351295, 5470740, 6639701, 7242557, 6327965, 4878762, 4259989, 4395323]
38070D395323J4617k34307p4433p5373n65463q76695n67839k25275m24227q16499
38060E49829q04523m16972o8926N5897J14135L87308R31888J247022O87271m86924
38050B196005j106686n80049L85107R63801J054580M72130j140762k748707k199162
38041b703743M99711K204520R35441r03378k37606J687642J476602o59056j377742
38032I22391P3551Q64998l09955j178743o5783J415707J388962M80589m0113l58084
38022C193520q13074p50597q2240P3762m79149l58144P88284J252987J37705r72620
38012A990434o38604K19009K33508k26100l02050k86836n66093n69679m2536K63615
38002G4668J73848N12642J054276K90002j650540k302253n49339J398260J383367
$$ y = [4395323, 4409940, 4175633, 4101200, 4025827, 3460364, 2583669, 2015830, 1790555, 1366328, 549829, -254694, -671666, -740592, -684695, -570560, -183252, 748636, 1995658, 2682929, 2196005, 1089319, 509270, 894377, 1858178, 2912758, 3384888, 2244126, -504581, -2703743, -2204032, 488, 935929, 32551, -205055, 1482587, 2959189, 2300133, 922391, 995942, 1860940, 1550985, 372242, 306459, 1722166, 3111128, 3591717, 3551604, 3193520, 2380446, 1629849, 1547609, 1621371, 1142222, 784078, 1572362, 2825349, 2963054, 1990434, 1351830, 1570839, 1804347, 1578247, 1276197, 989361, 423268, -146411, -188947, 74668, 248516, 761158, 1815434, 2105436, 454896, -1847357, -2396696, -998436, 384931]
37993C84931L22805J9384K23040o9686l98669p83N55423P02987J059530J697238
37983D496200J299643l54201j377189r10849o44607j349608r65761J405069K800506
37974D399203Q63702j886810j844938J82452J089337P19307Q30149Q91364n42771
37965D700995j875166o24567J606985J174690j331234j845043L27302J496170
37957C630132m8570j534590q00736M67655L28590k65466J24937P63505L72340
37948C037797p02102j362661j147047p9217J187842J065296j039903k771166j434486
37939c245647J672661K633901O58650r42584l9527J497591J300798k52508j556626
37930A726709j916442j089216Q64303K393383J576769q04306j786128m32303J108503
$$ y = [384931, 707736, 727120, 950160, 880474, 481805, 481022, 1036445, 1739432, 2798962, 4496200, 5795843, 5441642, 4064453, 3153604, 2508997, 1159389, 193628, 1598697, 4399203, 5262905, 3376095, 1531157, 1713609, 2802946, 3522253, 4352402, 5243766, 4700995, 2825829, 2201262, 3808247, 4982937, 3651703, 1806660, 2133962, 3630132, 3581562, 2046972, 1246236, 1713891, 2042481, 1777015, 1901952, 2665457, 3037797, 2335695, 973034, -174013, -253230, 934612, 1999908, 960005, -1811161, -3245647, -1572986, 1060915, 1719565, 776981, 737454, 2235045, 3535843, 3283335, 1726709, -189733, -1278949, -414646, 1978737, 3555506, 2751200, 965072, 532769, 1641272]
37921A641272J294475R99425Q85149Q1526j379994j758736n28385N62027N04302
37912B301061M47885J049822J199413N02333K04719N09949r7226j677302k065055
37903B375599n90029N66677J60944j97831N14624P30325m53885j320911p95449
37894I90064l56665o98897l3497J995465K482412J73955j524043J81653K694736
37885E905183K338202K40339l37176K20801n50965j957763j341061P61339J289862
37876F568761j61013j043116l79539K53377J36845K92561Q94828Q98261L59243
37867G820208M28133J009338Q44670j50732p67890m94249J67061Q15822J037685
37858A0710046J82880j240519j452402k37774J65337j151650j740474Q919J623335
$$ y = [1641272, 2935747, 3935172, 4820321, 4901847, 3521853, 1763117, 1234732, 1796759, 2301061, 2748946, 3798768, 4998181, 5500514, 5705233, 6215182, 6117956, 4440654, 2375599, 1785570, 2352247, 2513191, 2315360, 2829984, 3560309, 3106424, 1785513, 990064, 633399, -65498, -98995, 1896470, 4378882, 4552837, 3028794, 3210447, 5905183, 8243385, 8483724, 8146548, 8367349, 7816384, 5858621, 4517560, 5278899, 6568761, 6407748, 5364632, 4985093, 5238470, 5375315, 5667876, 6562704, 7460965, 7820208, 8248341, 9257679, 10102349, 9951617, 9183727, 8689478, 8856539, 9672361, 10710046, 10892926, 9652407, 8200005, 7962231, 8127568, 6975918, 5235444, 5244363, 6867698]
37849F867698O98985o90626L64537K376099K333733J253158J877975L104233K143611
37840B0329403L87837J337514M143880N134243M460524N121709O851071P640531
37832E5406712R516262J4989237K0094414K1318721K7421622M9072194P3613519
37825B71432681O7918409J8456420m3865246p4294839o2894640l7679400k4344869
37818A14728516k1430887j6865103j0193134q134767r839396q966606n258074
37811C4040549l740952m836924m078091q82553K79220j872584k992055p31728
37803A5184882J310144Q8695j736821q90245P62727J47203r55322P74912L475606
37794A8161781K923576M44455J050799M254781M581652J965940K684625P379051
$$ y = [6867698, 7566683, 6876057, 7240594, 9616693, 11950426, 13203584, 15081559, 18185792, 20329403, 20717240, 22054754, 26198634, 31332877, 35793401, 40915110, 47766181, 55406712, 64922974, 79912211, 100006625, 121325346, 148746968, 197819162, 271432681, 339351090, 357807510, 313942264, 239647425, 176752785, 139073385, 114728516, 93297629, 76432526, 66239392, 58104625, 48265229, 39298623, 34040549, 30299597, 25462673, 21384582, 20502029, 20781249, 18908665, 15916610, 15184882, 16495026, 16583721, 14846900, 13956655, 14719382, 14866585, 13911263, 14686175, 18161781, 21085357, 21529812, 22580611, 26835392, 31417044, 33382984, 36067609, 43446660]
37786D3446660Q431325M870497Q620528K5054421L6535823K1393216j3876572
37779A34475898l8267355l4136340j5903932n800650o175538n963767k347829
37772B5880487j580113m315625m252854j70920K036685l7720j906072o92672Q04188
37763A5765384M07252J91979J592631K498344J537696N99538J056265J588451
37755B5237540J463126K014489L267451L000390Q38395n63065j93750o44286l220775
37746C1199515m923245l138835j35510L36360j513056k671724k109263j290173
37738A5754069j102093j114503j239402j747632k029832j304109k47203k39208
37730F730087j204127j650722p82624N66700J098356L91564q40379j421922q88021
$$ y = [43446660, 51877985, 56748482, 65369010, 90423431, 126959254, 148352470, 134475898, 96208543, 62072203, 46168271, 40367621, 34192083, 28228316, 25880487, 24300374, 19984749, 15731895, 15560975, 17597660, 17559940, 15653868, 14961196, 15765384, 16172636, 16364615, 17957246, 20455590, 21993286, 22592824, 23649089, 25237540, 26700666, 28715155, 31982606, 34982996, 35821391, 35258326, 35064576, 34420290, 31199515, 26276270, 23137435, 23001925, 23338285, 21825229, 19153505, 17044242, 15754069, 14651976, 13537473, 12298071, 10550439, 8520607, 7216498, 6969295, 6730087, 5525960, 3875238, 3092614, 3659314, 4757670, 5149234, 4308855, 2886933, 1998912]
37721A998912j06079j85017q23016p10381L79851J183379R30137L68222K66087
37712C302095K46288j50011m78443l17678r2340j39104L3676P23345J215582Q18520
37702E161930q9476p06168o94610N716J186488J754102M81194j911602k871361
37693B316213j202696J214565K028937J385893R13835R90865P30361j35594j046859
37684G195520j763337k232565j819913j90318J420544J354177j93198j380762
37676B390148j093423J13112J234259J692012J123749l60071j665769j678904
37668A755113p91803l43413o00712n89773N3147N34750M91135O61661J418867
37659B588972J916631J427592M67413j30870l15888l10916L9795O49922P87255
$$ y = [1998912, 1892833, 1707816, 884800, 174419, 554270, 1737649, 2667786, 3036008, 3302095, 3548383, 3398372, 2919929, 2602251, 2509911, 2370807, 2404483, 3127828, 4343410, 5161930, 5072454, 4366286, 3671676, 3677392, 4863880, 6617982, 7099176, 5187574, 2316213, 1113517, 2328082, 4357019, 5742912, 6656747, 7647612, 8377973, 8242379, 7195520, 5432183, 3199618, 1379705, 1189387, 2609931, 3964108, 3770910, 2390148, 1296725, 1409837, 2644096, 4336108, 5459857, 5099786, 3434017, 1755113, 963310, 619897, 19185, -570588, -517441, 17309, 508444, 1170105, 2588972, 4505603, 5933195, 6400608, 6269738, 5953850, 5642934, 5682729, 6332651, 7119906]
37650G119906J06387o76632q80555p99568p95878m59201L25775N15959n51247
37641C904946j640803j210187J64706O80567J12486j90543J69909K31013j88969
37632B033125j32417M08110K97943l29115Q5782J431820J365214p53853k120463
37623B286146p46059J178700Q98127l46067J75561J542989P59529j587722j833282
37614B327922O00231K063760N80516j334115j244581k89158q6184K75234J586731
37605D480356J954587r2571k309433j705060Q68448K061361P53953j202172j998403
37596B811066j319091K86856J477352O70929j616745k433891l49029K044475J922913
37587C494835N31012P19243K073879K152654J182913J403687K398682J388407
$$ y = [7119906, 7226293, 6549661, 5669106, 4869538, 4073660, 3614459, 3940234, 4456193, 3904946, 2264143, 1053956, 1218662, 1899229, 2011715, 1821172, 1991081, 2222094, 2033125, 1900708, 2308818, 2606761, 2277646, 2363428, 3795248, 5160462, 4406609, 2286146, 1540087, 2718787, 3616914, 3270847, 3446408, 4989397, 5748926, 4161204, 2327922, 2928153, 4991913, 5572429, 4238314, 2993733, 2704575, 2618391, 2893625, 4480356, 6434943, 6342372, 4032939, 2327879, 3196327, 5257688, 6011641, 4809469, 2811066, 1491975, 1778831, 3256183, 3927112, 2310367, -123524, -472553, 1571922, 3494835, 4025847, 4745090, 6818969, 8971623, 10154536, 11558223, 13956905, 15345312]
37579A5345312j661650l280850j668222Q25376J425622K18460j266541k161403
37571G776104k080084j090101l85583q86353j248770K17590K082817J499788q82311
37562E003097j560176Q9725R77785r0550n31049Q98818J702795M61315l39890
37553F611870J130126K756366K546797J989005K426095K462281K458019O535591
37545B8916150J4813567J8233150Q537441q790872j9138279j6036833p045074
37538A9489250j894232j719909k344412k057096j889957j859890j146963l29605
37530F247186m71395j052230q90769j69494Q4182l00677p22055q57499p14810
37521A152439l33185l7896k34839n99060l62753L77036O89489L40697J47128N38960
$$ y = [15345312, 13683662, 10402812, 8734590, 9559966, 10985588, 11204048, 9937507, 7776104, 5696020, 4605919, 4220336, 3333983, 2085213, 2302803, 4385620, 5885408, 5003097, 3442921, 3532646, 4510431, 4419881, 3888832, 4787650, 6490445, 6951760, 6611870, 7741996, 10498362, 13045159, 15034164, 17460259, 19922540, 22380559, 28916150, 43729717, 61962867, 70500308, 61709436, 42571157, 26534324, 19489250, 17595018, 15875109, 13530697, 11473601, 9583644, 7723754, 6576791, 6247186, 5775791, 4723561, 3832792, 3663298, 3747480, 3446803, 2724748, 1867249, 1152439, 819254, 781358, 546519, -52541, -415294, -38258, 651231, 991928, 1139056, 1678016]
37511A678016Q86984N93897p1158m73745k65175L84442O19013m65075k238284
37502F48915k607229q61081Q34579N12774m63810K30761J708707J266355p89575
37493D80396j401368J51440J213641M26656l42003P1475K17j411538j907841Q3189
37483b635736K292458K052222M96438L27204J286707J043903o06497j504762n71014
37474B180923J032155J918629J687244M73725j027023j568838q08966m1365k34807
37465C611677n21535p4987Q7362q72736j447308j53527J388254P29395j185318
37456A561277j443809r8485R1818j243050j292449Q37676K174848P01703j327901
37447c8372j173946J58057J76446q19710p11077O17920J358849R37835M71335
$$ y = [1678016, 2565000, 3158897, 3087739, 2613994, 2348819, 2733261, 3352274, 2887199, 648915, -1958314, -2819395, -1984816, -1472042, -1935852, -1705091, 3616, 1269971, 480396, -920972, -769532, 444109, 870765, 528762, 600237, 600454, -811084, -2718925, -2635736, -343278, 1708944, 2205382, 2532586, 3819293, 4863196, 4256699, 2751937, 2180923, 3213078, 5131707, 6818951, 7292676, 6265653, 4696815, 3887849, 3846484, 3611677, 3090142, 3015155, 3102517, 2229781, 782473, 628946, 2017200, 2746595, 1561277, 117468, 18983, 110801, -1132249, -2424698, -1587022, 587826, 1289529, -38372, -1212318, -1054261, -877815, -1697525, -2408602, -1790682, -431833, 506002, 977337]
37438I77337M27650J77181k45655n7942N39323M67513k47322m07511K22559M91149
37428B344282r1089o27613o22983o90373q19793J17032K025916K659349P24395
37419E019123j603391j407943P12388J515152j24824j824320j432846J16157O99505
37410A669001k9080q92806j167547r12608j42581R98016J697542J257894J47178
37401B625009n99488o95956n29483k22366L11788P49581P44377O30369Q38863
37392C852694R73392M55266k86874m05472r1807j83442n61541l79915J86459L3334
37382C592094q18999r19418L11989J495422J286490J36603q02542j294268j525686
37373A461685j113059J85219J509897J773086R90772n9536q82248j232426q38293
$$ y = [977337, 1404987, 1582168, 1336513, 1278571, 1817894, 2285407, 2038085, 1630574, 1853133, 2344282, 2253193, 1625580, 1002597, 312224, -507569, -390537, 1635379, 4294728, 5019123, 3415732, 2007789, 2720177, 4235329, 4110505, 2286185, 853339, 969496, 1669001, 1639921, 747115, -420432, -1333040, -1475621, -477605, 1219937, 2477831, 2625009, 2025521, 1329565, 800082, 577716, 889504, 1639085, 2383462, 3013831, 3852694, 4826086, 5281352, 4994478, 4589006, 4497199, 4313757, 3752216, 3372301, 3558760, 3592094, 2773095, 1853677, 2165666, 3661088, 4947578, 5084181, 4281639, 2987371, 1461685, 348626, 533845, 2043742, 3816828, 4807600, 4748064, 3865816, 2633390, 1795097]
37364A795097j396L41889L3075K03822J315241J795291J74585k276285k909323
37355D71996j300545L78784N23716j87691m70258j26418M52061J040026J206772
37346A988443L89717j021637j700309j055272L8013O14418O64232L28544o76834
37337d30685k002361k210802n38500J726983K787654K549699K085222J555645
37329E522855K41119j584977k475422j846462q34499n15270l94648M78784J731135
37320C22615K057151J047269l28172j001907q00043j03681P05236J154814O85561
37311C738843o68141j871836j754608l12423J232518J732693J147762K22861m15962
37302C051707n38490n9514Q82774J611973J310478Q3618q10801l57851P96128
$$ y = [1795097, 1793701, 2135590, 2168665, 2372487, 3687728, 5483019, 5657604, 3381319, 471996, -828549, -449765, 73951, -113740, -583998, -710416, -258355, 781671, 1988443, 2378160, 1356523, -343786, -1399058, -1361045, -746627, -82395, 246149, -430685, -2433046, -4643848, -5182348, -3455365, -667711, 1881988, 3967210, 5522855, 5763974, 4178997, 1703575, -142887, -977386, -1492656, -1887304, -1408520, 322615, 2379766, 3427035, 3098863, 2096956, 1296913, 1193232, 1898468, 3053282, 3738843, 3070702, 1198866, -555742, -868165, 364353, 2097046, 3244808, 3467669, 3051707, 2513217, 2453703, 3336477, 4948450, 6258928, 6342546, 5531745, 5173894, 5970022]
37293E970022J017629j56036j308952j018032K74115J030666P69625L71695L96631
37284G347363L62007J1783K6579O65204P68805o43459k420104k368130k23590
37275C526458J778519J618722k26441j670725j430722m3685J017131P63748n22250
37266D810755j650230j772704j208716p56440m88388J12158R70670J277489P30429
37257B025023J31494L11403R77662J077370P4520j367001j891694p63110J130196
37248A705863J931515Q88254p04953j225176p48498m32367n22515l09232L15000
37239H97891P30386Q36180R54869P14355l19868j125299l22611J260347J394116
37230E020366j77o21256M41703J480749J462522J494684J935931J606186J559961
$$ y = [5970022, 6987651, 6831615, 5522663, 4504631, 4778746, 5809412, 6579037, 6950732, 7347363, 7709370, 7721153, 7747732, 8412936, 9181741, 8538282, 6118178, 3750048, 3526458, 5304977, 6923699, 6697258, 5026533, 3595811, 3552126, 4569257, 5333005, 4810755, 3160525, 1387821, 179105, -577335, -1065723, -953565, 17105, 1294594, 2025023, 2156517, 2467920, 3445582, 4522952, 4597472, 3230471, 1338777, 575667, 1705863, 3637378, 4525632, 3820679, 2595503, 1847005, 1414638, 892123, 582891, 897891, 1628277, 2464457, 3419326, 4133681, 3813813, 2688514, 2365903, 3626250, 5020366, 5020189, 4398933, 4840636, 6321385, 7783907, 9278591, 11214522, 12820708, 14380669]
37221A4380669N320913J2063993J3813329M810274q842132j4973555j0027882
37214A6545609k169666M12836j690246l567077l502645k652340j302602N39948
37206B613817J213288m06469k273533j718539M99367J393955J97576r74865n85882
37197d1285M92242Q05720K75103j82057o4818J17567m41217j465604j388899N32099
37187a361149K385211J681777q05863j644667K96422K159160J576772M4575j80652
37178D151586Q8834r43992k218196j443199O58900J228647j29466r80463k86234
37169A26417K39100m74558j065345l39622Q09101J212763J080021P58518j74959
37160B171436j393333j275009O47355K263674J526154o83985j899714j294928
$$ y = [14380669, 19701582, 31765575, 45578904, 50389178, 41547046, 26573491, 16545609, 14375943, 14788779, 13098533, 9531456, 6028811, 3376471, 2073869, 2613817, 3827105, 3420636, 1147103, -571436, -72069, 1321886, 1519462, 544597, -41285, 450957, 1256677, 1531780, 1349723, 1284905, 1402472, 961255, -504349, -1893248, -1361149, 1024062, 2705839, 1899976, 255309, 551731, 2710891, 4287663, 4332238, 4151586, 4240420, 3296428, 1078232, -364967, 293933, 1522580, 1393114, 412651, 126417, 365517, -109041, -1174386, -1514008, -704907, 507856, 1587877, 2346395, 2171436, 778103, -496906, 150449, 2414123, 3940277, 3256292, 1356578, 61650]
37152F1650J1364J056527J691802J565390K40565j533576k134385j105568J71020
37143B4789L71334l9882L05910J551247K249935J244358p36145j876841j455903
37134A638802n41094l35128n69057k24840O50544R22585J57067o46760n26014
37125E26105J24931L59296J26365O1614K41707J53286j52263P4716Q92486J094712
37115C502955j41060j656467j555443R8588J209849O56532j22179L97572J154572
37106C544919J84648j856192k299985o13544O66619n6350j053861m51637N42190
37097a393193o9338j338305q67708R53348J393438j22665j092276l1074J402734
37088a165039J435763P42734N06220J80434r30717j688009q48760N51068P47209
$$ y = [61650, 73014, 1129541, 2821343, 4386733, 4627298, 3093722, 959337, -146231, 24789, 396123, 356241, 662151, 2213398, 4463333, 5707691, 4971546, 3094705, 1638802, 1097708, 762580, 193523, -31317, 619227, 1541812, 1698879, 1052119, 526105, 651036, 1010332, 1136697, 1198311, 1440018, 1593304, 1441041, 1515757, 2408243, 3502955, 3361895, 1705428, 149985, 248573, 1458422, 2114954, 1992775, 2390347, 3544919, 3729567, 1873375, -426610, -1040154, -373535, -429885, -1483746, -1935383, -1393193, -1462531, -2800836, -3668544, -2715196, -1321758, -1444423, -2536699, -2567773, -1165039, 270724, 1013458, 1519678, 1700112, 769395, -918614, -1767374, -1216306, -469097]
37079d69097J62515M26285J182687N50899j268229j641190L85632K074966P27300
37070B131768k337538l570067j953963K20452J027754J066242J418727J519120
37062d77505M62617q71364q04279N33163J295916O39778k43272j89078K98535
37053F44511K26808k66601m55606k90952j10807J86774O71024P52325J20436l03399
37043A174513M22380J560069J509939O3509j403604j809553j262692k90005O24320
37034E88876R15747N23232L05843P11102O66053o23531j590445l44757J728115
37025B880235J398792j227919k368196m14403J397682K15860j825792j308805
37017a252546P55193P99960j217662j863481l4496J415635O35108l23885P33358
$$ y = [-469097, -306582, 119703, 1302390, 1853289, 585060, -1056130, -670498, 1404468, 2131768, -205770, -3775837, -5729800, -5509348, -4481594, -3415352, -1996625, -477505, -14888, -886252, -1690531, -1157368, 138548, 778326, 535054, 345976, 644511, 871319, 604718, 149112, -141840, -252647, -65873, 605151, 1357476, 1477912, 1174513, 1596893, 3156962, 4666901, 4730410, 3326806, 1517253, 254561, -35444, 588876, 1504623, 2027855, 2333698, 3044800, 3710853, 3087322, 1496877, 1152120, 2880235, 4279027, 3051108, 682912, 268509, 1666191, 1882051, 56259, -1252546, -497353, 302607, -915055, -2778536, -2813032, -1397397, -762289, -1086174, -352816]
37008c52816K374126J871054n24512k084347j511198j90562K51236j44477m86279
36999g97775m22795o4962O91267J924686K948879K598198O61698j399363j865478
36990D274355q12307N9793k04157o38362j22797P34918N97458m24541r48135m01771
36980B114454L63098N25094J75731l43234q45642q41574J78447J576793J742188
36971D645355J17666j707718j744210n3754J287659O48439j274323k290624j240159
36962a611669P68426J875279J693011J182500O45145o69934k577846l240791j586208
36953c522087Q52401J910180J506022Q57644J56446r80533j693866r20751K94039
36944a540505Q1904r51246n30572J162401J372901n51654j723317l99465J097596
$$ y = [-352816, 2021310, 3892364, 3367852, 1283505, -227693, -418255, -167019, -311496, -797775, -1220570, -1285532, -594265, 1330421, 4279300, 6877498, 7539196, 6139833, 4274355, 3462048, 3521841, 3317684, 2679322, 2556525, 3291443, 3888901, 3464360, 2516225, 2114454, 2477552, 3002646, 3178377, 2835143, 1989501, 1147927, 1326374, 2903167, 4645355, 4763021, 3055303, 1311093, 1257339, 2544998, 3193437, 1919114, -371510, -1611669, -843243, 1032036, 2725047, 3907547, 4552692, 3882758, 1304912, -1935879, -3522087, -2669686, -759506, 746516, 1604160, 1760606, 780073, -913793, -1834544, -1540505, -1458601, -2409847, -2940419, -1778018, -405117, -956771, -2680088, -3079553, -1981957]
36935a981957L42813j125603n69643J266756J529421p448r20879k92574K82768
36926a476346j18935m03895K05010Q88527J011125J177200J695387J692885O63842
36917E334800m69998p25476m08963l46170o53282r21475r06080n59327P915L67273
36907G19217K32864P7923M29487O81231j50494j470312j484385K0999R61608k2837
36897d699j361381q44266J004933J740554P11565r0623P28111J723098Q33720
36888D441012j306292k048378n58299Q44366j0827j938003k087191r2565J531247
36879a224930J202530K79992L88623Q27222K98739m30417J68697J443406J380631
36870D334493l7148p71931q8839M49525j69913q85558p59895n80071j049148j250157
$$ y = [-1981957, -1639144, -2764747, -3334390, -2067634, -538213, -545661, -1466540, -1759114, -1476346, -1595281, -1999176, -1794166, -905639, 105486, 1282686, 2978073, 4670958, 5334800, 4864802, 4139326, 3730363, 3384193, 2730911, 1809436, 903356, 344029, 351944, 719217, 952081, 1030004, 1459491, 2140722, 1990228, 519916, -964469, -943470, 18138, -4699, -1366080, -2210346, -1205413, 535141, 1246706, 1156083, 1884194, 3607292, 4441012, 3134720, 1086342, 528043, 1372409, 1361582, -576421, -2663612, -2756177, -1224930, -22400, 257592, 646215, 1473437, 1772176, 1341759, 1510456, 2953862, 4334493, 4297345, 3525414, 3436575, 3886100, 3716187, 2830629, 2070734, 1490663, 441515, -808642]
36860h08642m10153L63819j76296j129992p38608P67380J426411M02426r62342
36851a265997j045192K04511J458610J364169k67026k135718k547751j223733
36843e458127L90621R58633P22724O58722R78020J216418J138625P91654K36413
36834A633703j63023R8085O54637M00768o78092j020436J54697J311768Q02430
36825C194537o22988j201841r43063r89351j095051j55174J183225J026671n41277
36816a44312j240355j19815J027617O47057k99515k46234N18444P09684J40854
36807I93425l26042j24189N97174J174483O52319j120542k385853j074288K001020
36798C87507L505902K047386J01924M4883N88366m93204k093948j466916Q60578
$$ y = [-808642, -1218795, -854976, -1031272, -2161264, -2899872, -2132492, -706081, -303655, -1265997, -2311189, -2106678, -648068, 716101, 449075, -1686643, -4234394, -5458127, -5067506, -4108873, -3386149, -2727427, -1749407, -532989, 605636, 1397290, 1633703, 1470680, 1568765, 2223402, 2624170, 1946078, 925642, 1080339, 2392107, 3194537, 2571549, 1369708, 426645, -562706, -1657757, -1812931, -629706, 396965, -144312, -1384667, -1504482, -476865, 170192, -129323, -375557, 142887, 852571, 993425, 667383, 543194, 1140368, 2314851, 2967170, 1846628, -539225, -1613513, 387507, 3893409, 5940795, 6042719, 6087602, 6675968, 6182764, 4088816, 2621900, 3482478]
36789C482478J436222p89156k811652k131905j09359O51784n8544p77440r15744
36780b023316o41474M39818K392509L562499K215401o93497k307456j514194r2045
36771A338245P3283p58047j348019j359005j003701k3740J599587K632632J779694
36762B930929l15011j579701j106728o6631J86147k25842m19443j31312L09083
36753d18509O48890O75636J55809n29456l92532O93621J246532J5816j920052
36744A75755k244979m75135J416501J668561P83976L77442R36035J474416R44752
36735E057324n53429j790889j553074q2458Q46609l3722j648116j844405l74938
36726a977098Q38286P01840M96220J427857K191370P30673k347282m060028k787163
$$ y = [3482478, 4918700, 4129544, 1317892, -814013, -923372, -271588, -330132, -1107572, -2023316, -2664790, -2224972, 167537, 3730036, 5945437, 5251940, 2944484, 1430290, 1338245, 1411528, 653481, -694538, -2053543, -3057244, -3080984, -1481397, 1151235, 2930929, 2615918, 1036217, -70511, -137142, 49005, -176837, -596280, -727592, -418509, 230381, 906017, 1061826, 532370, 139838, 833459, 2079991, 2095807, 175755, -2069224, -2544359, -1127858, 540703, 1324679, 1702121, 2638156, 4112572, 5057324, 4503895, 2713006, 1159932, 1077474, 1924083, 1890361, 242245, -1602160, -1977098, -1138812, -436972, 59248, 1487105, 3678475, 4409148, 2061866, -1998162, -4785325]
36717d785325j11844J525763J668437J449423J322628N91008q43099j606597o06871
36708a396477J059624J245396k44590j220841k41908J262873J186520j91401j064944
36699C94252j110145j434803j937125j219292O32752J645673J008129K21221L57305
36690a442033N40776K43132N09434J339814N72170k349503m061348j766606K016132
36681d398032K753775N24128o05171Q64807K136924J248660r2366j2666N83170
36672C003229K75520l41986k08192K22997K13332J99709N54628N27445k15856
36663D230826o23078j76234j06430j188103j961891r20856R25797J552529Q50088
36654B582648J72134j01913n87994j142322j020006m36384k40742k93396J77555
$$ y = [-4785325, -4897169, -3371406, -1702969, -253546, 1069082, 1660090, 816991, -789606, -1396477, -336853, 908543, 663953, -556888, -798796, 464077, 1650597, 1459196, 394252, -715893, -2150696, -4087821, -5307113, -4674361, -3028688, -2020559, -1799338, -1442033, -901257, -658125, -148691, 1191123, 1763293, -586210, -4647558, -6414164, -4398032, -1644257, -1120129, -1725300, -860493, 1276431, 2525091, 2432725, 2420059, 3003229, 3278749, 2936763, 2728571, 2951568, 3164900, 3364609, 3919237, 4446682, 4230826, 3607748, 3431514, 3325084, 2136981, 175090, -745766, 180031, 1732560, 2582648, 2754782, 2652869, 2064875, 922553, -97453, -533837, -774579, -1067975, -890420]
36645h90420P87689L03427j121127j647938k38377J793051K406843J229156l62617
36636B259687j103664j123890j311793j811266j704779m33437J058069J406971
36628b764102P29427L29682O33209P57119K74566j21461j32789m14963r65495
36619a674807o81836N07207Q70373l97034j400847k99249J639398J850778K86082
36610G00065q38311m50020M25977Q00980P48761L86013l28113p57956j73824Q67460
36600A381032J195373Q62858P60837P11150k57420j842471k517440j759550n86243
36591b051874J78110N49803L64646n88379j364546o64532R89887J728996J150109
36582B92220O94722R83674R54140J78804j71752M58771Q76885K26007o46027r23593
$$ y = [-890420, -102731, 200696, -920431, -2568369, -2806746, -1013695, 1393148, 2622304, 2259687, 1156023, 32133, -1279660, -3090926, -4795705, -5229142, -4171073, -2764102, -2034675, -1704993, -1071784, -314665, -40099, -161560, -294349, -709312, -1674807, -2356643, -1849436, -979063, -1376097, -2776944, -3076193, -1436795, 413983, 700065, -138246, -588266, -162289, 638691, 1387452, 1773465, 1445352, 687396, 513572, 1381032, 2576405, 3439263, 4200100, 4911250, 4653830, 2811359, 293919, -1465631, -2051874, -1873764, -1323961, -959315, -1547694, -2912240, -3576772, -2586885, -857889, 292220, 986942, 1970616, 2924756, 3103560, 2931808, 3390579, 4267464, 4493471, 3847444, 2923851]
36572B923851j109638j497625j183511J50843J177052R45122L27402J49069l29929
36563A552636j506606j840991k01310J674677J339756p46271j997459j403576
36555c129144k56109M19585R83464J685732J906782J260254J93267p25436j192477
36546A145918r45838o7401O78427O23150J073o77181j385299j921102j443094
36537c991347J59768J354735Q58927l21289l06898Q42992J413056O58750n33108
36528A35586j283236j397674p11487O24751J491836J050147K82362N83007J292198
36519B067490O97698q49811j242276r4606O06209j90873j111196r92030o66258
36510a775653r83928j184859n86478p055q3048Q0172J053023J558721N59009o11117
$$ y = [2923851, 1814213, 316588, -866923, -716080, 460972, 1406094, 1733496, 1882565, 1552636, 46030, -1794961, -1996271, -321594, 1018162, 271891, -1725568, -3129144, -3385253, -2965668, -1982204, -296472, 1610310, 2870564, 3063831, 2338395, 1145918, 200080, 132679, 811106, 1434256, 1435329, 758148, -627151, -2548253, -3991347, -3831579, -2476844, -1617917, -1939206, -2246104, -1403112, 9944, 668694, 135586, -1147650, -2545324, -3256811, -2632060, -1140224, -90077, 192285, 775292, 2067490, 2765188, 1915377, 673101, 578495, 1184704, 993831, -117365, -1109395, -1775653, -2759581, -3944440, -4530918, -4537973, -4621021, -4540849, -3487826, -1929105, -1370096, -1981213]
36500a981213j59309J252988J557090M43708n22103m86187j49259k33250o79731
36491i57266j224040j451893o29186J179412K296803J293165p30062j409139l85172
36482b017378N66176N53846N85573J236238J484945P32868K8827R5567j18749
36473C147913j389875k228312r35101J293685J562832o21889k575031k142481
36465c888259l12967P66319Q14390J024056J606123J500377M46895k75001K16089
36456A898022R07341L55873j022088j397716k05103Q93475K80065j319773j804603
36447a414507n39464R31069J143393N81231N75111J100977Q61030n06663j525346
36438A206831q25170Q39840J536891P46621j78240k32088j68930j024828k223504
$$ y = [-1981213, -2140522, -887534, 669556, 1113264, 591161, 104974, -44285, -277535, -957266, -2181306, -3633199, -4262385, -3082973, -786170, 506995, -223067, -1632206, -2017378, -1451202, -897356, -311783, 924455, 2409400, 3142268, 3171095, 3266662, 3147913, 1758038, -470274, -1405375, -111690, 1451142, 829253, -1745778, -3888259, -4201226, -3434907, -2620517, -1596461, 9662, 1510039, 1956934, 1681933, 1898022, 2805363, 3161236, 2139148, 741432, 536329, 1429804, 1709869, 390096, -1414507, -1953971, -1022902, 120491, 701722, 1276833, 2377810, 3238840, 2732177, 1206831, 381661, 1221501, 2758392, 3505013, 3326773, 3094685, 2925755, 1900927, -322577]
36429c22577k242398p06041J196646K147371J679103M9348j796493k356347r53587
36420c304975R59183J209678j58016q23568M38046J945613J685432K19087m77851
36411A692629j4033L34146l1289l43556j0452O13283J007345Q92727N7645j067739
36401C130706j138110K86862J196024m89441l220769l201003M8868K480217J308650
36392D02004q83926l13405K104873K429641l9144k006622j580832o45984q78642
36383a412037q13273J111012L146107K508726l73635k435089k123517p18156K66803
36374h43059Q59138J476308J719982J073708j80118j287791j674075j133089l7201
36365b6197O66456M29683m3902J82940O37024O9379j312248j820301q73385M5114
$$ y = [-322577, -2564975, -3271016, -2074370, 73001, 1752104, 1801452, 4959, -2351388, -3304975, -2345792, -1136114, -1294130, -2117698, -1679652, 265961, 1951393, 2170480, 1692629, 1678596, 2012742, 1981453, 1637897, 1627445, 2240728, 3248073, 4140800, 4198445, 3130706, 1992596, 2279458, 3475482, 2986041, -234728, -3435731, -3386863, -906646, 402004, -481922, -795327, 1309546, 3739187, 3700043, 1693421, 112589, -533395, -1412037, -2225310, -1114298, 2031809, 4540535, 4166900, 1731811, -391706, -1109862, -843059, 16079, 1492387, 3212369, 4286077, 4105959, 2818168, 1144093, 11004, -26197, 640259, 1069942, 1026040, 1208980, 1846004, 1915383, 603135, -1217166, -2090551, -2045437]
36355b045437j85033n54089J36540R91152M78459p42866n62152J238833K413043
36346A168450J410772n63621j397894p08464K62968N21167J74264j23605R6035
36337H40072O93222Q79193l8097j612663k442913j705651o5435J201114J487322
36328g63836J015112L12502r0534K8592K14541k13507j046194j190355j95976
36319a929655R66801J213053O73387M4684n67903j212228j229335p7993J400609
36310g18580J823434J152361M73686O7442p96596j982262k045309l85131J488152
36301i22803J844626R52981L40367N03177N20501k83497j287952j330761m2872
36292B93767J610923K025370N66192j383269j689091j27835J131795L99334j187183
$$ y = [-2045437, -2230470, -2784559, -2648019, -1656867, -1178408, -1921274, -2483426, -1244593, 1168450, 2579222, 2015601, 617707, -90757, 172211, 693378, 867642, 744037, 840072, 1533294, 2412487, 2374390, 761727, -1681186, -3386837, -3452272, -2251158, -763836, 251276, 563778, 473244, 501836, 716377, 502870, -543324, -1733679, -1929655, -962854, 250199, 923586, 968270, 400367, -811861, -2041196, -2119189, -718580, 1104854, 2257215, 2730901, 2798343, 2001747, 19485, -2025824, -2410955, -922803, 921823, 1874804, 2215171, 2718348, 3238849, 2955352, 1667400, 336639, 293767, 1904690, 3930060, 4496252, 3112983, 1423892, 1296057, 2427852, 2827186, 1640003]
36283A640003j375228q0533O75564j52295j359462j548245q40434O7459J081346
36274a891825J989057J801263R9847j724343j886787m58243R23054J219340O94612
36265G65975k46013j461961k202274j323776R42756K591708K128373M58734m82588
36256A170934l39672l26586r17873j062141r4804R16833P50271N1160L72404J513464
36246B033990J467959n36153k475518k145534k37438P85985K98836N5962J016808
36237B64897J643409L21995k050553l228692k380177m45447J390982K264189J496273
36228g23124m85863j650002n11110J518660J726992j21350j615846j402040p60183
36219d023866q51691p60928L72649J323683P53888k96719J0200J234540J327250
$$ y = [1640003, 264775, 184242, 859806, 707511, -651951, -2200196, -3040630, -2973171, -1891825, 97232, 1898495, 1998342, 273999, -1612788, -2071031, -1147977, 71363, 765975, 519962, -941999, -3144273, -4468049, -3525293, -933585, 1194788, 1653522, 1170934, 831262, 504676, -413197, -1475338, -1570142, -653309, 96962, 148122, 520526, 2033990, 3501949, 2965796, 490278, -1655256, -1892694, -1106709, -807873, -751911, 264897, 1908306, 2230301, 179748, -3048944, -5429121, -5874568, -4483586, -2219397, -723124, -1208987, -2858989, -3370099, -1851439, -124447, -245797, -1861643, -3263683, -4023866, -4875557, -5636485, -5263836, -3940153, -3186265, -3482984, -3472784, -2238244, -910994]
36210i10994j17058j350845j163457k61910K64505L48173M27317O60903R74830
36201a128536J072755M16246r46624j784729j029716N11098J088836N20327K65999
36192a014344R26609J304620M51618q15162j184959n06566N22592J325553J466196
36183B476157O45033o64795j379742j133012o43119l96011M070O97285R74247
36174E80113N41610K27247N16472M88330o43616j856479j549262R3024J284897
36165c17664R68692j47518q05256n38227K26658P30419M81732l10644r51049j039845
36155a702702p42698k75699K41883L78497k35833r39469n88783N73738R64994
36146b326072J40451l84607K67883P17444j91075j019801J7995J812842J922719
$$ y = [-910994, -1028052, -2378897, -3542354, -3804264, -3539759, -3191586, -2764269, -2103366, -1128536, -55781, 360465, -586159, -2370888, -3400604, -2889506, -1800670, -1280343, -1014344, -87735, 1216885, 1668503, 853341, -331618, -838184, -315592, 1009961, 2476157, 3121190, 2456395, 1076653, -56359, -699478, -1095489, -1091419, -394134, 580113, 1121723, 1348970, 1865442, 2353772, 1710156, -146323, -1695585, -1602561, -317664, 651028, 503510, -301746, -839973, -613315, 117104, 598836, 288192, -662857, -1702702, -2445400, -2721099, -2479216, -2100719, -2336552, -3276021, -3864804, -3291066, -2326072, -2185621, -2570228, -2302345, -1584901, -1775976, -2795777, -2777782, -964940, 957779]
36137I57779N09826j14046M77952K85971j304896k198730j141125Q7480l25117
36128b764906j206440m53855J418837K059713Q38274n01506n95730n7211M51l41429
36118a603802k60285M06297R19529O62516j2786j86027M16149R66093O25018k56871
36108A675831o49049l10074R2336K42682N22758R22864P20166k57462j018677
36099A941375p39873O0042L69498L0957m67952q84524j078929n77174P12453J702962
36089A068835J155583n18753j517354r65136n6416k87979j243765j148956M74130
36080c039811J859168J358187j25984l57505R00034J476079J66771j289558q91287
36071E6094N00219O67797l49168n82740K80254L38204j045314j790229l48357
$$ y = [957779, 1467605, 1353559, 1831511, 2117482, 812586, -1386144, -2527269, -2439789, -2764906, -3971346, -4425201, -3006364, -946651, -108377, -609883, -1205613, -1262824, -1262373, -1603802, -1864087, -1457790, -538261, 124255, 111469, -74558, 341591, 1307684, 1932702, 1675831, 1026782, 716708, 809044, 1051726, 1574484, 2497348, 3217514, 2960052, 1941375, 1201502, 1261544, 1631042, 1661999, 1194047, 309523, -769406, -1346580, -634127, 1068835, 2224418, 1705665, 188311, -776825, -833241, -1121220, -2364985, -3513941, -3039811, -1180643, 177544, 51560, -305945, 594089, 2070168, 2236939, 947381, 56094, 556313, 1224110, 874942, 292202, 572456, 910660, -134654, -1924883, -2273240]
36062b273240J680921J806253M9508j515905j551893l03603J407020K572373K154925
36053D026359K98764j191775q82033L53570O55696k17844j001721j043811p64084
36044B33121l70083K85343P06920J75511p79452p78450L41118J192788Q58733
36035A865549j7954n32924o93587p29128l27277O08818J189155M79549j022890
36026H19311j641320m42922J470498K017218N69244j136466j084529L97078J158794
36017B126906K76279r29525j315198j553130k257954k258775n34431J518630J913183
36008c014015J142839J079191J638586J271277K79998N27912J749218J480246
36000F155252n94101j617069l08615N85779j169970l282100k452820L24160J474515
$$ y = [-2273240, -592319, 1213934, 1263442, -252463, -1804356, -2107959, -700939, 1871434, 4026359, 4325123, 3133348, 2251315, 2604885, 3260581, 3042737, 2041016, 997205, 233121, -136962, 148381, 855301, 1030812, 251360, -527090, -185972, 1006816, 1865549, 1847595, 1314671, 621084, -108044, -435321, 173497, 1362652, 1842201, 819311, -822009, -1264931, 205567, 2222785, 2792029, 1655563, 571034, 968112, 2126906, 2403185, 1473660, 158462, -1394668, -3652622, -5911397, -6445828, -4927198, -3014015, -1871176, -791985, 846601, 2117878, 2397876, 2925788, 4675006, 6155252, 5561151, 3944082, 3635467, 4221246, 3051276, -230824, -2683644, -2359484, -884969]
35991h84969M10920k90157L78218O89162m8629j01279J279442K049444N57331
35982D039483j721386k335528j079616M72861J236030R65606l00548j632879j308349
35973a664326Q24698K275817J097967r63668q20022J262492K104960O16023p16688
35964D017253p3371R24410K93758r71445r17532j27784n26259j816477j926497
35955a123944n58578M32645K55257J71192Q28414J095335M08766k9900M00099
35946A879286L18629j189168k522438j818775J58530J292822J161301Q91851Q69816
35937A041854N74957J33084J56779M00696K03065j78278k22981m70691j408353
35928B30132j788913k45401J950090K200206M38151r06668p90748n76208q12498
$$ y = [-884969, -474049, -764206, -385988, 303174, 254545, 153266, 1432708, 3482152, 4039483, 2318097, -17431, -1097047, -624186, 611844, 1577450, 1276902, -355977, -1664326, -839628, 1436189, 2534156, 1570488, 750466, 2012958, 4117918, 4733941, 4017253, 3943882, 4868292, 5162050, 4190605, 3273073, 3145289, 2619030, 802553, -1123944, -1682522, -1249877, -994620, -823428, 4986, 1100321, 1509087, 1479187, 1879286, 2197915, 1008747, -1513691, -3332466, -3173936, -1881114, -719813, 172038, 1041854, 1616811, 1749895, 1906674, 2307370, 2510435, 2332157, 2109176, 1638485, 230132, -1558781, -1804182, 145908, 2346114, 2784265, 1877597, 1086849, 510641, -301857]
35919c01857j18259J638026K051519j26863k508712k408702o59669J71151k78056
35910b541422m50198R4802M19816L28821M93813Q17190O35577K86114O18803J142810
35900A846126N21482j033223j633060l64561J356339J623928K63609j225508j316826
35891C8306J54901J817050K051061P95943l59323k81820K81282J06384n71594
35882D032190o67708j34795O4846m32324r50717p97149P5953J100053J202864
35873C493213l35899k400664k537659j06853K229418J717358q35271k412355j848037
35864c036749m67071N44129J049893P22413o12805j536075m49051J515369J588971
35855f80976l56581j384796j2824J651362J479895M08634K74631P89387O60657
$$ y = [-301857, -420116, 1217910, 3269429, 3142566, 633854, -1774848, -2434517, -2263366, -2541422, -2991620, -2896818, -2477002, -2148181, -1654368, -837178, -201601, 84513, 703316, 1846126, 2367608, 1334385, -298675, -663236, 693103, 2317031, 2580640, 1355132, 38306, 193207, 2010257, 4061318, 4857261, 4497938, 4216118, 4497400, 4603784, 4032190, 3364482, 3229687, 3294533, 2862209, 1911492, 1114343, 1190296, 2290349, 3493213, 3157314, 756650, -1781009, -1887862, 341556, 2058914, 1223643, -1188712, -3036749, -3503820, -2959691, -1909798, -1187385, -1800190, -3336265, -3785316, -2269947, -680976, -1037557, -2422353, -2435177, -783815, 696080, 1104714, 1379345, 2168732, 2829389]
35846B829389N8045o4429J09663j14293l42094J40153P32041K94266r20179j541643
35836A180919j014271j29723J59280l25764r53422p18736P36304K243291K136405
35827C314283M85472q54619q37393m25661n48556n22286L72069J247964R61646
35818C192919o3872o87842o81906l50840K99880Q45698K47644j273714j631043
35809a03076K12288K110095J455448j093000k603790j688612N42855K407745K674308
35800C914261P34526k199405l154816q93116J740730J428516q01894j325355M16860
35791a39693J503046N56951m62667o0504N37382J8434q66963r84193m39265L64863
35781B7391J262730J398387m909j584630j085181R70380J741607O74445K61439
$$ y = [2829389, 2887434, 2823005, 2932668, 2818375, 2476281, 2616434, 3348475, 3642741, 2722562, 1180919, 166648, 36925, 196205, -129559, -1082981, -1801717, -1065413, 1177878, 3314283, 3799755, 2945136, 2107743, 1682082, 1133526, 611240, 983309, 2231273, 3192919, 3129047, 2441205, 1759299, 1408459, 1708339, 2554037, 2801681, 1527967, -103076, 109212, 2219307, 3674755, 2581755, -22035, -1710647, -1167792, 1239953, 3914261, 4648787, 2449382, -705434, -1598550, 142180, 1570696, 768802, -556553, -139693, 1363353, 1920304, 1457637, 1397133, 1934515, 1952949, 1085986, 101793, -337472, 27391, 1290121, 2688508, 2683599, 1098969, 13788, 984168, 2725775, 3400220, 3661659]
35772C661659J302728J231718j101039k792852j592758J81165m51452k222390
35764a783221k100968l27164P20724Q39363J430425K011367J048489o62603j021527
35755A54885l05874l79018r07138k0848J644908J416341p68967j875752m96533
35746a537996J332965J757868J306944O46032o53368k013005j614814L89160J313674
35737I27460L4619j132565k42035J315630J494036O74262L2402p53969j902555
35728D47285j879090J00213J847902J172900n96809q62547j1462k55409j303958
35719a340975p39781J534961K674636J253217p06525j049201l53386j87342m89122
35710E96482k62687M13932O09642R0079n41932q65050q78733m64841N62853J791076
$$ y = [3661659, 4964387, 6196105, 5095066, 2302214, 709456, 890621, 439169, -1783221, -3884189, -4211353, -3490629, -2651266, -1220841, 790526, 1839015, 1176412, 154885, -150989, -530007, -1437145, -1457993, 186915, 1603256, 834289, -1041463, -1537996, -205031, 1552837, 2859781, 3505813, 2852445, 839440, -775374, -386214, 927460, 962079, -170486, -412521, 903109, 2397145, 3071407, 3103809, 2349840, 447285, -1431805, -1331592, 516310, 1689210, 1092401, 229854, 218392, -37017, -1340975, -2080756, -545795, 2128841, 3382058, 2675533, 1626332, 1272946, 1085604, 596482, 333795, 747727, 1357369, 1447448, 905516, 40466, -838267, -1303108, -740255, 1050821]
35700A050821K172342J064599p91540j782533j220603k55363l46291j139625r54206
35691b202399O10153J916004J593121K55048p91875j212391j124053l27277P76849
35682e06820Q81328k34676q05903K24968J133796J10742j435872r56080R32318
35673f56199J355658q4803q88853j12668K31082r24062j723892q12236K36744
35664c379229j44921o88841K89505J666081J251720o32212j784702j403912m97581
35655e324092K77703J057926J521982J178084O31322Q41820J407747J210834L96761
35646C200087n802p5903o91497j418328q41122P71571J294849m2669j235847m48953
35636E06386J204775J352826j80799j275835n53222R44944J362023L19059r42631
$$ y = [1050821, 3223163, 4287762, 3496222, 1713689, 493086, 237723, -108568, -1248193, -2202399, -1592246, 323758, 1916879, 2171927, 1380052, 167661, -956392, -1283669, -506820, 374508, 139832, -666071, -441103, 692693, 803435, -632437, -1588517, -656199, 699459, 614656, -274197, -386865, -155783, -1079845, -2803737, -3615973, -3379229, -3524150, -4212991, -3923486, -2257405, -1005685, -1637897, -3422599, -4826511, -5324092, -5046389, -3988463, -2466481, -1288397, -657075, 184745, 1592492, 2803326, 3200087, 3194285, 3118382, 2426885, 1008557, 167435, 939006, 2233855, 2191186, 955339, 506386, 1711161, 3063987, 2883188, 1607353, 1054131, 1999075, 3361098, 3680157, 2737526]
35627B737526j227926n82974J65400N34402O16793M21709l05670j374288j877318
35618h92346j156200K87480J278697J122802R684j303289j886805j248941L4152
35609c754766Q31448R29278J188898J813771J663707K22161j038888p47078K1076
35600A129607n53591j762637j265891Q95241J882449L31800j473684j072045N98967
35591a289784R67761k50078j048949m23177L94520J16829p27352p02237N63060
35582b399407J894024J884594M67410r58111j125078l55625J33984P1495K06548
35573a80166N99488L02645p61543j138679m5296J141163R22625M829q0152L16290
35563A081204k75385j446056j039931J416683L544880L208192J092768q09368
$$ y = [2737526, 1509600, 926626, 1092026, 1626428, 2243221, 2664930, 2359260, 984972, -892346, -2048546, -1761066, -482369, 640433, 650117, -653172, -2539977, -3788918, -3754766, -2923318, -1994040, -805142, 1008629, 2672336, 2894497, 1855609, 1108531, 1129607, 576016, -1186621, -2452512, -1557271, 325178, 656978, -816706, -1888751, -1289784, -322023, -572101, -1621050, -2044227, -1649707, -1532878, -2260230, -2962467, -2399407, -505383, 1379211, 1846621, 888510, -236568, -592193, -458209, -386714, -180166, 419322, 721967, -39576, -1178255, -1223551, -82388, 840237, 845066, 764914, 1081204, 805819, -640237, -1680168, -263485, 3281395, 6489587, 7582355, 6772987]
35555F772987j799573k246748j997599p61465M73547J98065j331640k041992p64933
35546c499351J164839J784324J048568M39086N65335N08874l22798r81276l73516
35537C34085R75738J588152J037711K15462k44514o21322j043810j007747m89078
35528G44677m13285j159400j540205m15408J343383J848008Q48123m6395J24783
35519A334281M00154k80506j211231r51616M26843J325757Q12904j76004k44240
35510A436342N24517P84367p0867r83593p38064K60712N82931j11125o62384l18662
35500G04174J15805k81232r51343p39547K88735J098843J340568J476040J453405
35491D505448O59231o52732j265211q09931m43215r96500j561116r36300L56733
$$ y = [6772987, 4973414, 2726666, 729067, -32398, 441149, 639214, -692426, -2734418, -3499351, -2334512, -550188, 498380, 937466, 1502801, 2011675, 1688877, 707601, 334085, 1309823, 2897975, 3935686, 4151148, 3906634, 3285312, 2241502, 1233755, 744677, 331392, -828008, -2368213, -2783621, -1440238, 407770, 1255893, 1209498, 1334281, 1734435, 1453929, 242698, -708918, -282075, 1043682, 1856586, 1680582, 1436342, 1960859, 2745226, 2674359, 1690766, 952702, 1213414, 1796345, 1685220, 1022836, 704174, 819979, 538747, -412596, -1152143, -863408, 235435, 1576003, 3052043, 4505448, 5164679, 4511947, 3246736, 2436805, 1993590, 997090, -564026, -1500326, -1143593]
35482a143593Q06159K63464J57416J176677K017038J221739n42038j225941k79149
35473B451772N06895l54118j654842j143177R27518J805392K44681j426387o07826
35464G49908J712612K430825Q17037q20179q46001k79776m77331r79834q05689
35455A501572k30819K4167J17577L33430J28794p41725j156436j46365J307129
35446A137324J523669N80690o0330J0905k27047j191323j854759j320377q2661
35437a483909P23227N79549j38773n78096j05447R02753J259834N22745k50096
35428A431787j30727R6375p15350j884079j784921m55343O32139J104048J724868
35419A8797J962973L03528k368012k711417J79300K622040J427174j229750j106018
$$ y = [-1143593, -337434, -73970, 83446, 1260123, 3277161, 4498900, 3956862, 2730921, 2451772, 2958667, 2604549, 949707, -193470, 734048, 2539440, 2784121, 1357734, 749908, 2462520, 4893345, 5710382, 4890203, 4044202, 3764426, 3287095, 2307261, 1501572, 1270753, 1294920, 1412497, 1745927, 1874721, 1132996, -23440, -169805, 1137324, 2660993, 3241683, 3181353, 3192258, 2965211, 1773888, -80871, -1401248, -1483909, -760682, -181133, -319906, -898002, -1003449, -100696, 1159138, 1681883, 1431787, 1301060, 1397435, 682085, -1201994, -2986915, -3442258, -2810119, -1706071, 18797, 1981770, 2285298, -82714, -2794131, -2614831, 7209, 1434383, 204633, -901385]
35410i01385J574304K577794J51974k675531k895543j328107k41249J72192R61962
35401b603589J874796J772663O68300l74305p82340o13386J38368J063244R27054
35392B070805p18066k122092j296382R58936J934254Q95414r5273K60002M93483
35383B381081p00884j691182l64419J995709K133549k10543j682147k93013J675327
35374C243478J246870r34770k016625j237301l37023l15096l20212J30237J68637
35365c71805n18977p82627R064P08216K80297m11886n3926R81246J381664R66695
35355B187961N32050K15474m63752j244206j248169l95344N22250J060698J255899
35346B422861P82513n96117j808993j322543M94610J405200K90192j310355j447479
$$ y = [-901385, 672919, 3250713, 3402687, 727156, -2168387, -3496494, -3737743, -3565551, -2603589, -728793, 1043870, 1712170, 1337865, 555525, -57861, 80507, 1143751, 2070805, 1352739, -769353, -2065735, -1106799, 827455, 1722869, 1627596, 1887598, 2381081, 1680197, -10985, -375404, 1620305, 3753854, 3543311, 1861164, 1568151, 3243478, 4490348, 3555578, 1538953, 301652, -35371, -350467, -670679, -540442, -371805, -890782, -1673409, -1664345, -956129, -675832, -1087718, -1141644, -160398, 1221266, 2187961, 2720011, 2935485, 2471733, 1227527, -20642, -415986, 106264, 1166962, 2422861, 3205374, 2609257, 800264, -522279, -27669, 1377531, 1667723, 357368, -1090111]
35337a090111k90173O35134P12620N12642M29055K79750N4167N8058K89889L50215
35327A941246K1622m80098p92459o73369j32589M94952P99672P21522M72587J24861
35317B497947k42647j74643N46354J005489M6425j741943k289276q55561Q09193
35308c98662R80377K23093r7281k12468j093723k129632j734870J2086J260957
35299c190123J012417K11805J2963M19798R40953J267034R99059p0551j166629
35290D36726j234041n82179m87833j018381q43901M22966J429003J263610P04386
35281I0356M25559k06288j305258j260893Q39160L020866K781048O66119p10534
35272D340135n69214m77929j156917j304523j41094J096300J199712P72383P94223
$$ y = [-1090111, -1380284, -745150, -32530, 480112, 909167, 1188917, 1243084, 1301142, 1591031, 1941246, 1962868, 1482770, 690311, 16942, -115647, 379305, 1178977, 1900499, 2373086, 2497947, 2255300, 2080657, 2627011, 3632500, 3678925, 1936982, -352294, -1207855, -398662, 581715, 804808, 707527, 495059, -598664, -2728296, -4463166, -4451080, -3190123, -2177706, -1965901, -1952938, -1533140, -592187, 674847, 1673906, 1603355, 436726, -797315, -1379494, -1867327, -2885708, -3729609, -3306643, -1877640, -614030, 90356, 515915, 309627, -995631, -2256524, -1417364, 1603502, 4384550, 5050669, 4340135, 3770921, 3292992, 2136075, 831552, 690458, 1786758, 2986470, 3758853, 4553076]
35263D553076Q44704J12814q88834j073071n67329l54804n33209l25812K73898
35254B041433K46793p58134j631733j333322l96074r9788n86085o89922L43065
35245b863767J714101K009407Q88652o05270j298278j033022n03944l04772l94614
35236b391507l54834Q2800P50071J124341P32291l40205j322633j347381l07792
35227c374849R56532J484181J171429P38130O91943O66637J12819o44212p16640
35218A085970o7214K25594m23329j029850m44117P58312R96677P3188n39780J3608
35208F49059Q06376Q34692N66735Q06253J101847N93755k87974m51123j15416
35199D504204n92307j977544k553285j134924J067470J861799Q07896l92603k06189
$$ y = [4553076, 5397780, 5510594, 4621760, 3548689, 2981360, 2626556, 2093347, 1767535, 2041433, 2288226, 1530092, -101641, -1434963, -1831037, -1930825, -2516910, -3206832, -2863767, -1149666, 859741, 1748393, 1143123, -155155, -1188177, -1692121, -1996893, -2391507, -2746341, -2663541, -1913470, -789129, -56838, -397043, -1719676, -3067057, -3374849, -2418317, -934136, 237293, 975423, 1667366, 2334003, 2446822, 1802610, 1085970, 1018756, 1244350, 821021, -208829, -652946, 105366, 1102043, 1175231, 635451, 649059, 1455435, 2290127, 2856862, 3663115, 4764962, 5358717, 5070743, 4619620, 4504204, 3911897, 1934353, -618932, -1753856, -686386, 1175413, 1983309, 1590706, 1384517]
35190A384517P83175P15148r72632k513615j866329O16674K531023K440411J357472
35181D475844P48294M29607m17634j309111j222679o32811q79573j750467j687134
35172b245664m98984K56819R5946N27368K065938K593123N85834j846237j668615
35163a34472M44812J062732p02014j859264k32985K223071K428380N38749p82929
35154B986080l21513O63299R31795O60914J79860p58907j778320j603418n7914
35145I01876J008188J88005j114028n66268J398039J920925l1507j930928j265238
35136E09064R11443J698945M79593p26351o33688k75157p75924j357937o83547
35127h53559Q71134J562114N83722r26120j280020j43937J137176J038201l72607
$$ y = [1384517, 2167692, 2882840, 1910208, -603407, -2469736, -1853062, 677961, 3118372, 4475844, 5224138, 5653745, 5236111, 3927000, 2704321, 2071510, 1191937, -558530, -2245664, -2744648, -2487829, -2391883, -1864515, 201423, 2794546, 3380380, 1534143, -134472, 310340, 1373072, 671058, -1188206, -1421191, 801880, 3230260, 3769009, 2986080, 2664567, 3327866, 4259661, 4920575, 5100435, 4341528, 2563208, 959790, 901876, 1910064, 2098069, 984041, 417773, 1815812, 3736737, 3705230, 1774302, 509064, 1420507, 3119452, 3599045, 2872694, 2239006, 1963849, 1187925, -170012, -853559, 17575, 1579689, 2163411, 1237291, -42729, -186666, 950510, 1988711, 1616104]
$$ [...]
##END NTUPLES=NMR SPECTRUM
##END=
