##TITLE=31Pdec_MTPDP2509
 CDCl3, 24 sc
 28.9.2020
##JCAMPDX= 6.0         $$ Bruker NMR JCAMP-DX V2.0
##DATA TYPE= NMR SPECTRUM
##DATA CLASS= NTUPLES
##ORIGIN= UXNMR, Bruker Analytische Messtechnik GmbH
##OWNER= root
$$ XWIN-NMR		Version 3.5
$$ Mon Sep 28 11:00:06 2020 Russian Standard Time (UT+4h)  she@DPX200
##.OBSERVE FREQUENCY= 81.013821
##.OBSERVE NUCLEUS= ^31P
##.ACQUISITION MODE= SIMULTANEOUS
##.ACQUISITION SCHEME= undefined
##.AVERAGES= 24
##.DIGITISER RES= 17
##SPECTROMETER/DATA SYSTEM= spect
##.PULSE SEQUENCE= zgpg30
##.SOLVENT NAME= CDCl3
##.SHIFT REFERENCE= (INTERNAL, CDCl3, 0, 182.463)
##AUDIT TRAIL= $$ (NUMBER, WHEN, WHO, WHERE, WHAT)
$$ ##TITLE= Audit trail, XWIN-NMR		Version 3.5
$$ ##JCAMPDX= 5.01
$$ ##ORIGIN= Bruker BioSpin GmbH
$$ ##OWNER= she
$$ F:/spectra/data/she/nmr/P31/1/pdata/1/auditp.txt
$$ ##AUDIT TRAIL=  $$ (NUMBER, WHEN, WHO, WHERE, WHAT)
(   1,<2020-09-28 10:59:33.59 +0400>,<she>,<DPX200>,
      <created by zg, POWCHK disabled, PULCHK disabled
       configuration hash MD5:
       00 E9 B6 7A A2 85 ED C7 34 08 36 98 17 FE 4E 26
       data hash MD5: 32K
       89 A8 DE EA 2E 23 8D BE 10 E2 DE 10 1A F0 60 81>)
(   2,<2020-09-28 10:59:35.75 +0400>,<she>,<DPX200>,
      <Start of raw data processing
       efp BC_mod = 2 LB = 1 FT_mod = 6 PKNL = 1 PHC0 = -2746.118 PHC1 = 71.00175 SI = 64K 
       data hash MD5: 64K
       EF FE A6 5F 2F 89 33 C6 7D D2 04 68 97 0B 32 AF>)
$$ ##END=
$$ 
$$ hash MD5
$$ 9A B1 FC 4C 7E 5E 71 2A F8 57 19 54 87 7E 88 4D
##$RELAX= 
##$RELAX= 
##$RELAX= 
##$RELAX= 
##$RELAX= 
##$RELAX= 
##$RELAX= 
##$RELAX= 
$$ Bruker specific parameters
$$ --------------------------
##$DU= <F:/spectra>
##$EXPNO= 1
##$NAME= <P31>
##$PROCNO= 1
##$TYPE= <nmr>
##$USER= <she>
##$AMP= (0..31)
100 100 100 100 100 100 100 100 100 100 100 100 100 100 100 100 100 100 
100 100 100 100 100 100 100 100 100 100 100 100 100 100 
##$AQSEQ= 0
##$AQ_mod= 1
##$AUNM= <au_zg>
##$AUTOPOS= <>
##$BF1= 81.014009
##$BF2= 200.13
##$BF3= 200.13
##$BF4= 200.13
##$BF5= 200.13
##$BF6= 200.13
##$BF7= 200.13
##$BF8= 200.13
##$BYTORDA= 1
##$CFDGTYP= 0
##$CFRGTYP= 5
##$CHEMSTR= <none>
##$CNST= (0..31)
1 1 145 1 1 1 1 1 1 1 1 1 1 1 1 1 1 1 1 1 1 1 1 1 1 1 1 1 1 1 1 1 
##$CPDPRG= <waltz16>
##$CPDPRG1= <>
##$CPDPRG2= <waltz16>
##$CPDPRG3= <>
##$CPDPRG4= <mlev>
##$CPDPRG5= <mlev>
##$CPDPRG6= <mlev>
##$CPDPRG7= <mlev>
##$CPDPRG8= <mlev>
##$CPDPRGB= <>
##$CPDPRGT= <>
##$D= (0..31)
0 1 0 0 0 0 0 0 0 0 0 0.03 2e-05 3e-06 0 0 0 0 0 0 0 0 0 0 0 0 0 0 0 0 
0 0 
##$DATE= 1601276373
##$DBL= (0..7)
120 120 120 11 120 120 24 19 
##$DBP= (0..7)
150 150 150 150 150 150 150 150 
##$DBP07= 0
##$DBPNAM0= <>
##$DBPNAM1= <>
##$DBPNAM2= <>
##$DBPNAM3= <>
##$DBPNAM4= <>
##$DBPNAM5= <>
##$DBPNAM6= <>
##$DBPNAM7= <>
##$DBPOAL= (0..7)
0.5 0.5 0.5 0.5 0.5 0.5 0.5 0.5 
##$DBPOFFS= (0..7)
0 0 0 0 0 0 0 0 
##$DE= 6
##$DECBNUC= <off>
##$DECIM= 4
##$DECNUC= <off>
##$DECSTAT= 4
##$DIGMOD= 1
##$DIGTYP= 9
##$DL= (0..7)
0 0 52 120 120 21 21 25 
##$DP= (0..7)
$$ [...]
##$SUBNAM2= <"">
##$SUBNAM3= <"">
##$SUBNAM4= <"">
##$SUBNAM5= <"">
##$SUBNAM6= <"">
##$SUBNAM7= <"">
##$SUBNAM8= <"">
##$SUBNAM9= <"">
##$SW= 369.568048894756
##$SWIBOX= (0..15)
0 1 3 0 0 0 0 0 0 0 0 0 0 0 0 0 
##$SW_h= 29940.119760479
##$TD= 32768
##$TD0= 1
##$TE= 0
##$TE2= 300
##$TE3= 300
##$TEG= 300
##$TL= (0..7)
0 120 53 12 22 120 120 120 
##$TP= (0..7)
150 150 150 150 150 150 150 150 
##$TP07= 0
##$TPNAME0= <>
##$TPNAME1= <>
##$TPNAME2= <>
##$TPNAME3= <>
##$TPNAME4= <>
##$TPNAME5= <>
##$TPNAME6= <>
##$TPNAME7= <>
##$TPOAL= (0..7)
0.5 0.5 0.5 0.5 0.5 0.5 0.5 0.5 
##$TPOFFS= (0..7)
0 0 0 0 0 0 0 0 
##$TUNHIN= 0
##$TUNHOUT= 0
##$TUNXOUT= 0
##$USERA1= <user>
##$USERA2= <user>
##$USERA3= <user>
##$USERA4= <user>
##$USERA5= <user>
##$V9= 5
##$VALIST= <valist>
##$VCLIST= <CCCCCCCCCCCCCCC>
##$VD= 0
##$VDLIST= <DDDDDDDDDDDDDDD>
##$VPLIST= <PPPPPPPPPPPPPPP>
##$VTLIST= <TTTTTTTTTTTTTTT>
##$WBST= 1024
##$WBSW= 4
##$XGAIN= (0..3)
0 0 0 0 
##$XL= 0
##$YL= 0
##$YMAX_a= 36635
##$YMIN_a= -32551
##$ZGOPTNS= <>
##$ZL1= 120
##$ZL2= 120
##$ZL3= 120
##$ZL4= 120
##$ABSF1= 0
##$ABSF2= 0
##$ABSG= 0
##$ABSL= 0
##$ALPHA= 0
##$AQORDER= 0
##$ASSFAC= 0
##$ASSFACI= 0
##$ASSFACX= 0
##$ASSWID= 0
##$AUNMP= <proc_1d>
##$AZFE= 0.1
##$AZFW= 0.5
##$BCFW= 0
##$BC_mod= 2
##$BYTORDP= 0
##$COROFFS= 0
##$CY= -3
##$DATMOD= 1
##$DC= 0
##$DFILT= <>
##$DTYPP= 0
##$F1P= 0
##$F2P= 0
##$FCOR= 1
##$FTSIZE= 65536
##$FT_mod= 6
##$GAMMA= 0
##$GB= 0
##$INTBC= 1
##$INTSCL= 5.30512e-09
##$ISEN= 30
##$LB= 1
##$LEV0= 0
##$LPBIN= 0
##$MAXI= 10000
##$MC2= 0
##$MEAN= 0
##$ME_mod= 0
##$MI= 50
##$NCOEF= 0
##$NC_proc= -4
##$NLEV= 6
##$NOISF1= 182.463
##$NOISF2= 159.3651
##$NSP= 0
##$NTH_PI= 0
##$NZP= 0
##$OFFSET= 182.463
##$PC= 4
##$PHC0= -2746.118
##$PHC1= 71.00175
##$PH_mod= 1
##$PKNL= yes
##$PPARMOD= 0
##$PSCAL= 0
##$PSIGN= 0
##$REVERSE= no
##$SF= 81.0140089999434
##$SI= 65536
##$SIGF1= 159.3651
##$SIGF2= -187.1042
##$SINO= 113.3802
##$SIOLD= 16384
##$SREGLST= <1H.CDCl3>
##$SSB= 0
##$STSI= 65536
##$STSR= 0
##$SW_p= 29940.119760479
##$SYMM= 0
##$S_DEV= 0
##$TDeff= 32768
##$TDoff= 0
##$TI= <>
##$TILT= no
##$TM1= 0
##$TM2= 0
##$TOPLEV= 0
##$USERP1= <user>
##$USERP2= <user>
##$USERP3= <user>
##$USERP4= <user>
##$USERP5= <user>
##$WDW= 1
##$XDIM= 65536
##$YMAX_p= 317372332
##$YMIN_p= -2537532
$$ End of Bruker specific parameters
$$ ---------------------------------
##NTUPLES= NMR SPECTRUM
##VAR_NAME=  FREQUENCY,     SPECTRUM/REAL,   SPECTRUM/IMAG
##SYMBOL=    X,             R,               I
##VAR_TYPE=  INDEPENDENT,   DEPENDENT,       DEPENDENT
##VAR_FORM=  AFFN,          ASDF,            ASDF
##VAR_DIM=   65536,         65536,           65536
##UNITS=     HZ,            ARBITRARY UNITS, ARBITRARY UNITS
##FACTOR=    0.456856943014862, 1,           1
##FIRST=     14782.0589164792, 0,            0
##LAST=      -15158.0608439998, 0,           0
##MIN=       -15158.0608439998, -2537532,    0
##MAX=       14782.0589164792, 317372332,    0
$$ Real data points
##PAGE= N=1
##DATA TABLE= (X++(R..R)), XYDATA
$$ [...]
42552i06071j00638r3892J72901N08493N39111K23268o1956o3816L1259l993o0999
$$ -906071 -1006709 -1100601 -927700 -419207 119904 343172 281216 217400 248659 244666 183667
42541A83667K0822Q8608o4197k70411j89317J48581L32450J20527k61112m35356
$$ 183667 204489 293097 228900 -41511 -230828 -82247 250203 370730 109618 -325738
42531c25738l09395r9437k4750r3289j85465k43600k77946k34916l9327K00523
$$ -325738 -635133 -734570 -759320 -852609 -1038074 -1281674 -1559620 -1794536 -1833863 -1633340
42521a633340K52899J33713J55991M17341N40329K47050j02168j7241K95393K22723
$$ -1633340 -1380441 -1246728 -1090737 -673396 -133067 113983 11815 -5426 289967 512690
42511E12690k21137l54299N5807L36633p7522p45314q25940k24483L86193N02335
$$ 512690 291553 -62746 -6939 329694 252172 -493142 -1319082 -1543565 -1157372 -655037
42501f55037K73669R0550Q0252J17291J12272J31427K40765L18289J58427j89717
$$ -655037 -381368 -290818 -210566 -93275 18997 150424 391189 709478 867905 678188
42491F78188l88899k83235j61920k67449l11922N5658N23668M85796L6495j30878
$$ 678188 289289 6054 -155866 -423315 -735237 -679579 -155911 329885 366380 235502
42481B35502J31643J84037k71421o24444l47905J61066K83983J18862Q6728J11980
$$ 235502 367145 551182 279761 -344683 -692588 -531522 -247539 -128677 -41949 70031
42471G0031r6111l19108j30783K89324L37908j00297n00689m19923Q1029O42769
$$ 70031 -26080 -345188 -475971 -186647 151261 50964 -449725 -869648 -788619 -145850
42461a45850Q46349M24197l58583p59847m30042O4883Q4365j07949J03086N06117
$$ -145850 700499 1124696 766113 6266 -423776 -358893 -274528 -382477 -279391 226726
42451B26726L64551k41088m01790J53686N70615K12477l72917l74069Q2396L00973
$$ 226726 591277 350189 -51601 102085 672700 885177 512260 138191 220587 521560
42441E21560J21824j7873J11347K57415J56300j47009m36275n09661k76522J24870
$$ 521560 643384 625511 736858 994273 1150573 1003564 567289 57628 -218894 -94024
42431i4024L84296L54739K14528J60190J20853k8762j58631o5679J25795M2644
$$ -94024 290272 645011 859539 1019729 1140582 1111820 953189 887510 1013305 1055949
42421A055949m12239q22430o80433Q016O61903P26436K66799j74071k68557j95266
$$ 1055949 643710 -178720 -859153 -851137 -189234 537202 804001 629930 361373 166107
42411A66107j76835j01683J22198J93397j39511n01956l33616K04591L92630L5322
$$ 166107 -10728 -112411 9787 203184 63673 -438283 -771899 -567308 -174678 -139356
42401a39356k80693j63543L0668n9811j36884J83606O02678N27816k9929m80389
$$ -139356 -420049 -583592 -552924 -612735 -749619 -566013 36665 564481 534552 54163
42391E4163m43918r2702J91701J51250k32919o34667n49736R2184O57219N34666
$$ 54163 -389755 -482457 -290756 -139506 -372425 -1007092 -1556828 -1464644 -807425 -272759
42381b72759l2555k95451n1581J86285O9950j10453j3628J83399J29582j04988
$$ -272759 -305314 -600765 -652346 -466061 -396111 -506564 -520192 -336793 -207211 -312199
42371c12199j46498J04015L19223J77653k32881m99305l28836J11600L56906J96441
$$ -312199 -458697 -354682 -35459 142194 -90687 -589992 -918828 -807228 -450322 -253881
42361b53881m9176L1619L33306L60749l4001l92482k81123J19190L15743J85801
$$ -253881 -303057 -271438 61868 422617 388616 -3866 -284989 -165799 149944 335745
42351C35745K7150K0550k081j97437m15318m22166k31352k6187J30410L02373
$$ 335745 362895 383445 381364 183927 -231391 -653557 -884909 -911096 -780686 -478313
42341d78313M36802L38885k9211l79679l74440j7133L52067M38496K57029R566
$$ -478313 -41511 297374 268163 -111516 -485956 -503089 -151022 287474 544503 554069
42331E54069j63166k28059j68036L341J51724R5656j68996m17144m46100l03009
$$ 554069 390903 162844 -5192 -1851 149873 245529 76533 -340611 -786711 -1089720
42321a089720j66458p7462N9315K37452L09219K33747J73628K33993K79385J66898
$$ -1089720 -1256178 -1333640 -1274325 -1036873 -727654 -493907 -320279 -86286 193099 359997
42311C59997K22n5347o5426j66576k30570l1406K98112L71723J56128N3018K36268
$$ 359997 360219 304872 239446 72870 -157700 -189106 109006 480729 636857 689875 926143
42300I26143L37729N4491l19716l38092p7219N3399k9202o5042K0722L0516q3060
$$ 926143 1263872 1318363 998647 660555 583336 636735 607533 542491 563213 593729 510669
42289E10669j27542n3916o2114k27149l24196j49345K03775M75698M82616K05232
$$ 510669 383127 329211 267097 39948 -284248 -433593 -229818 245880 728496 933728
42279I33728j84734l91106k71361k7325N3180l4677j05991j15830j14950j6779
$$ 933728 748994 357888 86527 59202 112382 77705 -28286 -144116 -259066 -275845
42269b75845K29087L44379L9724m26964m88820q9871K18024P8459k46689l78189
$$ -275845 -46758 297621 337345 -89619 -578439 -668310 -450286 -371827 -618516 -996705
42259i96705k70638j0768L57090O08989M21684p9946l04842J2768M42730N40344
$$ -996705 -1267343 -1278111 -921021 -312032 109652 29706 -275136 -262368 180362 720706
42249G20706M13134K87565L5129m20305o92184m69278r8790q1380k93399k76625
$$ 720706 1133840 1421405 1456534 1036229 344045 -125233 -224023 -305403 -598802 -875427
42239h75427l0905Q4712L4338O9812J55074M5513j41921n3808K37973L07802J12429
$$ -875427 -906332 -821620 -787282 -717470 -562396 -516883 -658804 -712612 -474639 -166837 -54408
42228e4408L0683J12445m4158m85101o25209j21994N06394N68038J31318j66753
$$ -54408 -23725 88720 44562 -440539 -1065748 -1187742 -681348 -113310 18008 -148745
42218a48745j3270K91452L39346Q2704k03103k37559q786J98791R7444k63301
$$ -148745 -162015 129437 468783 551487 348384 110825 102039 300830 398274 134973
42208A34973n43310m94509j70776K10027M34604L61493N1443j74708n4374K33996
$$ 134973 -408337 -902846 -1073622 -863595 -428991 -67498 -16055 -190763 -245137 -11141
42198a1141K69899j7538k65068k33265j08711j22694j90979j27582M1191J85125
$$ -11141 258758 241220 -23848 -257113 -365824 -488518 -679497 -807079 -765888 -580763
42188e80763K89181L71125L51713J85122j7679j29245j36730o0265O8560Q7124
$$ -580763 -291582 79543 431256 616378 598699 469454 332724 272459 341019 428143
42178D28143j70231n19060n20865j11680K13134J11671p0147J15403M14823K36620
$$ 428143 257912 -261148 -782013 -893693 -680559 -568888 -639035 -523632 -108809 127811
42168A27811l24216m96513K6078N77874M69327n6074k77833p3291M3107j66242
$$ 127811 -196405 -692918 -666840 -88966 380361 324287 46454 -26837 16270 -149972
42158a49972l25768j46447Q1127R537j54977m338L58396M62599K27478M4748O8589
$$ -149972 -475740 -622187 -541060 -531523 -686500 -690838 -332442 130157 357635 402383 470972
42147D70972k5602l77280n63604k56405J65721J51048j65543j92316J70991L98360
$$ 470972 445370 68090 -495514 -751919 -586198 -435150 -600693 -793009 -622018 -223658
42137b23658J74606j68857k10236M880J79768K06554J52600N6213l1253K2685
$$ -223658 -49052 -217909 -428145 -423265 -243497 -36943 115657 171870 140617 163302
42127A63302K44017M11599K81769j00921m21720l94414l3221L07261K25994k48257
$$ 163302 407319 818918 1100687 999766 578046 183632 150411 457672 683666 435409
42117D35409n66601k82453L11056M99483J02719k88834j64417K13236K40045j78835
$$ 435409 -131192 -413645 -102589 396894 499613 210779 46362 259598 499643 320808
42107C20808n50763m54402R566M15373M69703K37124p849j07368j44914k10011
$$ 320808 -229955 -684357 -674791 -259418 210285 447409 439560 332192 187278 -22733
42097b2733j91282O628J78211O0449k07449k42852l2816M1664j36123k14892l643
$$ -22733 -214015 -207387 -29176 31273 -176176 -419028 -451844 -410180 -546303 -761195 -764838
42086g64838J89277J30146R1295L01157L98174j8764o01936o46018j23469L03143
$$ -764838 -575561 -445415 -354120 -52963 345211 326447 -275489 -921507 -1044976 -741833
42076g41833K85381J70754K54636K68604n4421l81440k21406K81432M82477J17785
$$ -741833 -456452 -285698 -31062 237542 183121 -198319 -419725 -138293 344184 461969
42066D61969l67375m58848k06518j8486n2985r8906K1535K20046L42314L51529
$$ 461969 94594 -364254 -570772 -589258 -642243 -741149 -719614 -499568 -157254 194275
42056A94275K33508l6834l05822k74474P3162L15559J36210k02507k57803o6284
$$ 194275 427783 390949 85127 -189347 -116185 199374 335584 133077 -124726 -191010
42046a91010R886p6720p4965Q435o3994j89667M903M36871N39110J45201k15710
$$ -191010 -181124 -257844 -332809 -324374 -388368 -578035 -573132 -136261 402849 548050 332340
42035C32340j64156O986k1009n3250R0360J24327j03707j52166K53730N50566
$$ 332340 168184 175170 154161 100911 191271 315598 211891 59725 313455 864021
42025H64021J70526m24053m01636R2112K07850j74478l11800P3758L40283N1462
$$ 864021 1034547 610494 208858 300970 508820 334342 22542 96300 436583 488045
42015D88045l31983k93767o8605j12130l16407k82094o653J78209J35138J5124
$$ 488045 156062 -137705 -206310 -318440 -634847 -916941 -923594 -745385 -610247 -595123
42005e95123k8564L8714J66477K14040P3631j09211o2922J81229K64460J7696
$$ -595123 -623687 -584973 -418496 -204456 -130825 -240036 -302958 -121729 142731 160427
41995A60427k79585k94826l4666K84608M94206M76899J88020j82949l14025j36513
$$ 160427 -119158 -413984 -448650 -164042 330164 807063 995083 812134 498109 361596
41985C61596J02773K19921K52031J98106l0329l01059l01309m6900M3709k09893
$$ 361596 464369 684290 936321 1134427 1104098 803039 501730 454830 498539 288646
41975B88646m28039k49506J34931L28842K80263J61750M677j89130k29260j0334
$$ 288646 -139393 -388899 -253968 74874 355137 516887 521564 332434 103174 92840
41965I2840J91387N8751k83300m59721l70813j91810Q019K74779M79308L88647
$$ 92840 284227 342978 59678 -400043 -770856 -962666 -954647 -679868 -200560 188087
41955A88087M1290k33724k05627M3987K75258K83965J992m02339n77699l35529
$$ 188087 229377 -4347 -209974 -165987 109271 393236 395228 -7111 -584810 -920339
41945i20339R0222K85653J16632j79601k88393q2310L12556N91654N15163J81629
$$ -920339 -830117 -544464 -427832 -607433 -895826 -978136 -665580 -73926 441237 622866
41935F22866o5675q0104n5649j24245r5861J69880L94249K14120k60088n43070
$$ 622866 557191 477087 421438 297193 201332 371212 765461 979581 719493 176423
41925A76423l66862P5209M13301M23523J46810j37305j58126l007k7537k79410
$$ 176423 -190439 -115230 298071 721594 868404 731099 572973 569966 542429 263019
41915B63019l27975O2659M38333K62067k53777m50399j95231K8837l4829q4614
$$ 263019 -64956 -2297 436036 698103 444326 -6073 -201304 -172467 -207296 -291910
41905b91910J23835L66492L68626K09788O9357r1678l34963m85436l28221P2907
$$ -291910 -168075 198417 567043 776831 846188 754510 419547 -65889 -394110 -321203
41895c21203M24980M79527J94614k35059m79560l73941j25830m1271r3121k8275
$$ -321203 103777 583304 777918 542859 63299 -310642 -436472 -477743 -570864 -599139
41885e99139J47674J63130j5049q1033Q9140K22431J38182N5725J59426K31510
$$ -599139 -451465 -288335 -303384 -384417 -295277 -72846 65336 121061 280487 511997
41875E11997N2400j52056o1283J81116J91278k6797j24886j3859K7797j19440
$$ 511997 564397 412341 351058 532174 723452 696655 571769 557910 585707 466267
41865D66267k02915m3532J52636J24263n9511j58108j20402o5451k6936N2525
$$ 466267 263352 219820 372456 496719 437208 279100 158698 93247 66311 118836
41855A18836J25754N9727j36101k84026k91320k65034k83305k09032R5963M62402
$$ 118836 244590 304317 168216 -115810 -407130 -672164 -955469 -1164501 -1068538 -606136
41845f06136N49066L02283N6692P5070J82647M8536k89819m28081j23766L76571
$$ -606136 -57070 245213 301905 376975 559622 608158 318339 -109742 -233508 143063
41835A43063O14388M08519l316k45972j72266L2514Q9580n0326j85348j69481
$$ 143063 757451 1165970 1162654 916682 744416 776930 866510 816184 630836 461355
41825D61355j06821j48713k36908k19581j23538r0777q8091O9002L65473M92401
$$ 461355 354534 205821 -31087 -250668 -374206 -464983 -553074 -484072 -118599 373802
41815C73802K18859k86065o12341n10877q7500L11453L70384O4207l02579l85940
$$ 373802 592661 306596 -305745 -816622 -904122 -592669 -222285 -158078 -460657 -846597
41805h46597j45190J68428L18929K53890J9804k84161m52689k95219R8094L74452
$$ -846597 -991787 -823359 -504430 -250540 -230736 -514897 -967586 -1262805 -1164711 -790259
41795g90259K99682J263k29247k38373n8292J84263L14410K12958j6717j07832
$$ -790259 -490577 -489314 -718561 -956934 -1015226 -830963 -516553 -303595 -320312 -428144
41785d28144M4391K37289K41193J03066N3434K10349M83315O78726O09743K19087
$$ -428144 -383753 -146464 94729 197795 251229 461578 944893 1623619 2233362 2452449
41775B452449k89745n55696m36542j97281j80425l65803m27098j91831J31827
$$ 2452449 2162704 1607008 1170466 973185 792760 426957 -141 -191972 -60145
41766f0145K25999M3983j47649p3872K35013M47248K75812j80898n04162l88251
$$ -60145 165854 209837 62188 -11684 223329 670577 946389 765491 261329 -126922
41756a26922M0061L64743L05036k5292k58338j65206R6783J87876L2760r7737
$$ -126922 -86861 277882 582918 557626 299288 134082 230865 418741 451501 353764
41746C53764l2414J0039j82971l51327j00162L95818N34023J85489q7135P5917
$$ 353764 321350 331389 148418 -202909 -303071 92747 626770 812259 725124 801041
41736H01041K62195Q069l78076k89237J70009L09782p8839m28784k84296P3551
$$ 801041 1063236 1071305 693229 403992 574001 883783 804944 376160 91864 165415
41726A65415J37699j16513l46633l65468k25919R803K68973L63067J80929p3995
$$ 165415 303114 186601 -160032 -525500 -751419 -741616 -472643 -109576 71353 -2642
41716b642j00192Q0765J68139L9886r8073p6576j7100q2520j87650j59620m2090
$$ -2642 -102834 -22069 146070 185956 87883 11307 -5793 -88313 -275963 -435583 -477673
41705d77673q826n6933k7119J08922K29397L08262L85678K86913k26420q79074
$$ -477673 -486499 -543432 -570551 -461629 -232232 76030 461708 748621 522201 -356873
41695c56873r14738p2681Q34995Q45416J23473k94183L5623M41263K32802l37567
$$ -356873 -1271611 -1344292 -509297 336119 459592 165409 201032 642295 875097 537530
41685E37530n83267l49720K492K40476L77622L48188O4754k60230k81893k8842
$$ 537530 -45737 -395457 -392965 -152489 225133 573321 638075 377845 95952 67110
41675F7110J09637n4693k65777k22717K3090J83046R1338j40440k55172j10462
$$ 67110 176747 122054 -143723 -366440 -343350 -160304 -68966 -209406 -464578 -575040
41665e75040J56035K66239J36751m2945j18231j60474k23855j42715J87357N00550
$$ -575040 -419005 -152766 -16015 -58960 -177191 -337665 -561520 -704235 -516878 -16328
41655a6328M32527K1133l33692l67568j76586J3979Q4240M2418j2921J7279P6254
$$ -16328 416199 437332 103640 -263928 -440514 -426535 -342295 -299877 -312798 -295519 -219265
41644b19265N485j44977r5510J91230L17158K8309l14720k52420O3377J75473
$$ -219265 -213780 -358757 -454267 -263037 54121 82430 -232290 -484710 -421333 -245860
41634b45860R8866J84118L61375K24910j52046k24081J06711L11321J60170P1605
$$ -245860 -146994 37124 398499 623409 471363 247282 353993 665314 825484 897089
41624H97089K31617J50676m06337p72247l46462L48895L80157j99628n02788j75994
$$ 897089 1128706 1279382 873045 100798 -245664 103231 483388 283760 -219028 -395022
41614c95022K15941J86300m8251j08270o480Q2158J43499J75312P1819j36027
$$ -395022 -179081 7219 -41032 -149302 -155782 -73624 69875 245187 317006 180979
41604A80979k23486j23977n7468j54231k29495j02713J16995K46857K96241L20213
$$ 180979 -42507 -166484 -223952 -378183 -607678 -710391 -593396 -346539 -50298 269915
41594B69915K22023o7229l65736m30031k76092j17065n3120r538N9633R0083M5897
$$ 269915 491938 424709 58973 -371058 -647150 -764215 -817335 -826873 -767240 -677157 -631260
41583f31260O896O7900K08533K94863K05243l0142k18182j78667O0857K95545
$$ -631260 -624364 -556464 -347931 -53068 152175 122033 -96149 -274816 -213959 81586
41573H1586L58256K27452n1962m02381o31865n03790l0516M19841M82127K01111
$$ 81586 439842 667294 615332 212951 -418914 -922704 -953220 -533379 -51252 149859
41563A49859p8697j66915j54891j05376R3164M25524N57532K19773l31199n33296
$$ 149859 71162 -95753 -250644 -356020 -262856 162668 720200 939973 608774 75478
41553G5478k00678K70888M18680J86588j82171m58231m97856k55041Q6929K08582
$$ 75478 -125200 145688 564368 750956 568785 110554 -387302 -642343 -555414 -346832
41543c46832P1990J6009K17901L50916J08219k26125j96221O8308R5417p1865
$$ -346832 -274842 -258833 -40932 309984 418203 192078 -4143 64165 159582 87717
41533H7717M2811M07211L99378j23808m48399r8063L84375L02095j36403k91613
$$ 87717 130528 537739 937117 813309 364910 266847 651222 953317 816914 525301
41523E25301j58921j92398l74555k82775M9492J38735p7112j25161J38016K57691
$$ 525301 366380 173982 -200573 -483348 -433856 -295121 -372233 -497394 -359378 -101687
41513a01687j0899k67062j45356J07890J08255l8887J7264K81214M24350K40865
$$ -101687 -112586 -379648 -525004 -417114 -308859 -347746 -330482 -49268 375082 615947
41503F15947j43566m09359k95016J23375L96088J96846j83147k09994O9440J10471
$$ 615947 472381 63022 -231994 -108619 287469 484315 301168 91174 160614 271085
41493B71085j80707k60404N3509J35740l97663q54549m09091N68442R59990M65539
$$ 271085 90378 -170026 -116517 19223 -378440 -1232989 -1642080 -1073638 -113648 351891
41483C51891j17433j66511J8899n6750k89480k74976M0654L87153N80665N93559
$$ 351891 234458 67947 86846 30096 -259384 -534360 -493706 -106553 474112 1067671
41473A067671L86860m7284n31124p69966n95050j18032L15923L76524O5187k52911
$$ 1067671 1454531 1407247 876123 106157 -488893 -606925 -291002 85522 150709 -102202
41463a02202k51299q492J65560J51795N7297o2279k31092l53762k85017r2336
$$ -102202 -353501 -361993 -196433 -44638 12659 -49620 -280712 -634474 -919491 -1011827
41453a011827L1638J04880K90124M90956L86737l5883l44750k21996J34100L42047
$$ -1011827 -980189 -875309 -585185 -94229 292508 256625 -88125 -310121 -176021 166026
41443A66026L00198J29647q2407k52195k27113J0298K18167J86071J4459p6920
$$ 166026 466224 595871 513464 261269 34156 44454 262621 448692 463151 386231
41433C86231o5052n7257o7778p3714j46789k95620l07648j5064L64699M31434
$$ 386231 321179 263922 196144 122430 -24359 -319979 -627627 -642691 -277992 153442
41423A53442J27499j81573j71447R1896K98127K32324o1136l39144l69652j57996
$$ 153442 280941 99368 -72079 19817 317944 550268 489132 149988 -219664 -377660
41413c77660N8499R2502k581q6174j21463r0532R2213L74565M54394J60230j94687
$$ -377660 -319161 -226659 -229240 -315414 -436877 -527409 -435196 -60631 393763 553993 359306
41402C59306j91143M4322j5300m78208q06013n63481l336L44084L42190K09263
$$ 359306 168163 212485 197185 -281023 -1087036 -1650517 -1653853 -1309769 -967579 -758316
41392g58316P3403o8085j09750N2488K33486J47084j13585j43923J46228L30585
$$ -758316 -684913 -752998 -862748 -810260 -576774 -429690 -543275 -687198 -540970 -210385
41382b10385Q1528l07785l14965O6022L18132J28145j98344j78423K06325N17260
$$ -210385 -128857 -436642 -751607 -685585 -367453 -239308 -437652 -616075 -409750 107510
41372A07510M32002J07308p8084j2071M5019j59333m92066n54621j93224K44344
$$ 107510 539512 646820 568736 556665 601684 442351 -49715 -604336 -797560 -553216
41362e53216L00034o561j87969O6269M69890N24048J60716k27450l20720j83319
$$ -553216 -253182 -259743 -447712 -381443 88447 612495 773211 545761 225041 41722
41352D1722m7508l1539j24241k41573k34154k9491J83001J29177j26379k03063
$$ 41722 -5786 -37325 -161566 -403139 -637293 -666784 -483783 -354606 -480985 -684048
41342f84048L3564K33705Q9146j94882k38642n1526Q1792P8810M8023l3832k13001
$$ -684048 -650484 -416779 -327633 -522515 -761157 -812683 -730891 -652081 -604058 -637890 -850891
41331h50891k53181Q3440N09029M87005N7026j72780L4184K09049K4440j34401
$$ -850891 -1104072 -1020632 -511603 -24598 32428 -140352 -106168 102881 127321 -7080
41321g080J22778M26590J84331m39286p17721m08946p371N4281q3433j09626r946
$$ -7080 115698 542288 726619 287333 -430388 -839334 -846705 -792424 -875857 -985483 -995429
41310i95429P0601J14909J68700J87729J28267O8828J13484K38856L03204J84140
$$ -995429 -924828 -809919 -641219 -453490 -325223 -256395 -142911 95945 399149 583289
41300E83289p0389k08415j5326L37886L92260J6340l20495j82686J60480J34042
$$ 583289 512900 304485 289159 627045 1019305 1035645 715150 532464 692944 826986
41290H26986k23062k89496J72556O52865O70679M04497K52931J93917l1996l87846
$$ 826986 603924 314428 486984 1139849 1810528 2215025 2467956 2661873 2629877 2242031
41280B242031n88147n25178l26846j05290Q5962J55733P8032q526l725j6847j40171
$$ 2242031 1653884 1128706 801860 696570 782532 938265 1016297 1007771 1004046 987199 847028
41269H47028k24274j19962K6075k030j18791j07449l2337j22163l11042k77327
$$ 847028 622754 502792 528867 526837 408046 300597 268260 146097 -164945 -442272
41259d42272M7006L51572L83749K05068l6221k74144l87509k16400J35383K85857
$$ -442272 -395266 -43694 340055 545123 508902 234758 -152751 -369151 -233768 52089
41249E2089M2537l20938m13792j69380K01734N00201O09789M63653J42565j14824
$$ 52089 94626 -226312 -640104 -809484 -607750 -107549 502240 965893 1108458 993634
41239I93634j71549j48075j75405j56459K2646J97314J15304j58243l17525k76538
$$ 993634 822085 674010 498605 342146 364792 562106 677410 519167 201642 -74896
41229g4896k49374l23054k68990M9435L38698K21772j94998l97486j23125L03900
$$ -74896 -324270 -647324 -916314 -866879 -528181 -306409 -501407 -898893 -1022018 -718118
41219g18118M07008J47577r8133p0882P2881L9216j84465l22335j76837J24424
$$ -718118 -311110 -163533 -261666 -332548 -259667 -220451 -404916 -727251 -904088 -779664
41209g79664K87664J88618k0929j26615q9293j9570K1430P6245J42907J25551
$$ -779664 -492000 -303382 -324311 -450926 -540219 -559789 -538359 -462114 -319207 -193656
41199a93656K1370J1559J98124L61715K21921j11205k39958o2508P6829m8058
$$ -193656 -172286 -160727 37397 399112 621033 509828 269870 207362 284191 236133
41189B36133j70268J8175L17044K87547q2871l72623l31431j30584Q11M7437N6093
$$ 236133 65865 84040 401084 688631 605760 233137 -98294 -228878 -228067 -180630 -124537
41178a24537K3394K6285J84732L92737L58568L4796k57423k76882j71856j69173
$$ -124537 -101143 -74858 109874 502611 861179 895975 638552 361670 189814 20641
41168B0641k21530j96828j79105k84954l50623j29684K79150N10465M19425K18662
$$ 20641 -200889 -397717 -576822 -861776 -1212399 -1342083 -1062933 -552468 -133043 85619
41158H5619J14288O0297n4397j80252j83971m2115J26467J73373M5970j54586
$$ 85619 199907 260204 205807 25555 -158416 -200531 -74064 99309 145279 -9307
41148i307k60434k33352k15627l07164l81122k58013J0577K14265L03740M22897
$$ -9307 -269741 -503093 -718720 -1025884 -1407006 -1665019 -1654442 -1440177 -1136437 -713540
41138g13540N94622O02351L09508o9997k05738q4099j3364j74650l49396k30198
$$ -713540 -118918 483433 792941 722944 517206 433107 419743 245093 -104303 -334501
41128c34501J01179K35424J5486j91537k534L86840M52699J30286p2316J33886
$$ -334501 -233322 2102 17588 -173949 -176483 210357 663056 793342 721026 854912
41118H54912L42529P6972m42716o06321l11699n4561j32574k54726r2525K00620
$$ 854912 1197441 1274413 831697 225376 -86323 -140884 -273458 -528184 -620709 -420089
41108d20089K92426J99608J84041K77057K34989n5720l94047n38543m78605l42692
$$ -420089 -127663 71945 255986 533043 768032 712312 318265 -220278 -698883 -1041575
41098a041575j66727J04662M11657N17142K55226j93568m07866j72190K63429
$$ -1041575 -1208302 -1103640 -691983 -174841 80385 -113183 -521049 -693239 -429810
41089d29810M59486K68471n4096j74012l531K71469L76950J74113j97099m03580
$$ -429810 29676 298147 244051 70039 66508 337977 714927 889040 691941 288361
41079B88361k46759J03879K98675K03049r406j31119j36385j05601p8319m7405
$$ 288361 41602 145481 444156 647205 637799 506680 370295 264694 186375 138970
41069A38970j6920j1373n5590j42585k04314j75911j17897j51031k06933m1381
$$ 138970 122050 110677 55087 -87498 -291812 -467723 -585620 -736651 -943584 -984965
41059i84965L48977N55773K85970j37100j84425R6424J80754q2885k59184p4516
$$ -984965 -635988 -80215 205755 68655 -115770 -19346 161408 78523 -180661 -255177
41049b55177J59141J17714k2653L054M5116j14727k49871m0487K78624J91639
$$ -255177 -96036 21678 -975 2079 47195 -67532 -317403 -357890 -79266 112373
41039A12373k39444l55123J47271P05333N90033j65454q03533p07896m5439M59201
$$ 112373 -127071 -482194 -334923 370410 960443 794989 -8544 -716440 -761879 -302678
41029c02678L10956k48778n63131l28433J30753L68820L38375K56891K10110J42829
$$ -302678 8278 -240500 -803631 -1132064 -1001311 -632491 -294116 -37225 172885 315714
41019C15714P4541N8765L9963l0349o8841m9973j21934k96992k84473L8512K64298
$$ 315714 390255 449020 488983 458634 389793 339820 217886 -79106 -363579 -325067 -60769
41008f0769M243m34006m51922p1081J66607J08079J15062K71952K03463j54869
$$ -60769 -56526 -490532 -942454 -1013535 -846928 -738849 -623787 -351835 -148372 -303241
40998c03241l14033l9348K43578J87812O0481J47998K15897K7083j51381q2268
$$ -303241 -617274 -656622 -413044 -225232 -164751 -16753 199144 226227 74846 -7422
40988g422p4643l70807n13626l5824O20645O62031J39226k23260j98095j98412
$$ -7422 -82065 -452872 -966498 -1002322 -381677 280354 419580 196320 -1775 -200187
40978b00187l37048k43420R9071J93972p7792j92158J04899L48022J83134k6400
$$ -200187 -537235 -780655 -681584 -487612 -565404 -757562 -652663 -304641 -121507 -147907
40968a47907J19112L52551K44162n8118j42790l2027k0414q1544L5044K82154
$$ -147907 -28795 323756 567918 509800 367010 334983 314569 233025 268069 550223
40958E50223L67249K28836O1629n8111k29565m67379o55274o89405m83235L669
$$ 550223 917472 1146308 1207937 1149826 920261 452882 -202392 -891797 -1375032 -1371363
40948a371363N49498P26594M27595P7347L6404R2701r3785l54864k97859J0978
$$ -1371363 -821865 -95271 332324 409671 446075 538776 444991 90127 -207732 -196754
40938a96754J68155Q5778J2609K3180q9K0961K25987L77386J34561k82520l29512
$$ -196754 -28599 57179 69788 92968 92879 113840 339827 717213 851774 569254 239742
40927B39742l3048L9897k16170k35313K01784N10101K60712r7850j3952K56071
$$ 239742 206694 246591 30421 -204892 -3108 506993 767705 669855 655903 911974
40917I11974J42363k77016m79978l59671k25291j58145l068J43321O2093n8583
$$ 911974 1054337 777321 297343 -62328 -287619 -445764 -448832 -305511 -243418 -302001
40907c02001J51288N22060M93062L1868k54036q3489P3855j65297m43054k94347
$$ -302001 -150713 371347 864409 896277 642241 558752 632607 467310 24256 -270091
40897b70091M9920O8326j53642p5417L48988N14517R0753m23926l79482J40047
$$ -270091 -220171 -151845 -305487 -380904 -31916 482601 573354 149428 -230054 -90007
40887i0007M88567L45875L1924o9753l0476j37603l81145m54776k01196J78802
$$ -90007 398560 744435 776359 706606 676130 538527 157382 -297394 -498590 -319788
40877c19788L83403L13144R2727p1894l7518J43142K22537L8164k10806j62052
$$ -319788 63615 376759 469486 397592 360074 503216 725753 763917 553111 391059
40867C91059K00601M58815K72866k17202o08968o57550l66868J09214M88336M92624
$$ 391059 591660 1050475 1323341 1106139 497171 -160379 -527247 -418033 70303 562927
40857E62927J63866j21725j29466n6507j51080k88357k14455l158P8648J6516
$$ 562927 726793 605068 475602 419095 268015 -20342 -234797 -237955 -159307 -142791
40847a42791L092N2892K2976n6710l6693K3338m7809j42808J6780L70427N17061
$$ -142791 -139699 -86807 -63831 -120541 -157234 -133896 -181705 -324513 -307733 62694 579755
40836E79755K87547n0028k29307k64488k07606j0842K33329K71031O9856q9953
$$ 579755 867302 817274 587967 323479 115873 105031 338360 609391 679247 589294
40826E89294n0372J7247j7640j1817J29255K23351J15085q4985k46863l91650
$$ 589294 538922 556169 538529 526712 655967 879318 994403 909418 662555 270905
40816B70905m42636j90469K49110L56918o1320m50917k49705K71076M25342J35138
$$ 270905 -171731 -362200 -113090 243828 182508 -268409 -518114 -247038 178304 313442
40806C13442n9491P2139J29264j94911n65961m55146J42023O85035O89393K15259
$$ 313442 253951 326090 455354 260443 -305518 -760664 -618641 66394 755787 971046
40796I71046k20262j99414J27672K30143j11855n04364m75724j03190J47084N9988
$$ 971046 750784 551370 679042 909185 797330 292966 -182758 -285948 -138864 -78876
40786g8876j39501j76477m0883R3975R0581j8410l7455J61092L68852K18982k63813
$$ -78876 -218377 -394854 -435737 -341762 -251181 -269591 -307046 -145954 222898 441880 178067
40775A78067n81215m20299p2034P9141J28139L21423M93151L47278N8864J1371
$$ 178067 -403148 -823447 -895481 -816340 -688201 -366778 126373 473651 532515 543886
40765E43886R3357j07056m71034m04074J81812N98140L38714k25209m18934j32110
$$ 543886 637243 530187 59153 -344921 -163109 435031 773745 548536 129602 -2508
40755b508J98995J99609j03624l67080k36666K38452N06865J32357n28576o89265
$$ -2508 196487 396096 292472 -74608 -311274 -72822 434043 566400 37824 -651441
40745f51441j82062L52048L98091J42324m5646j26168j18307J25067N08840N56805
$$ -651441 -833503 -481455 -83364 58960 13314 -112854 -231161 -106094 402746 959551
40735I59551Q6368m12525m74587k97264k47623j94928J16503M28183L33951r82
$$ 959551 1045919 633394 158807 -138457 -386080 -581008 -464505 -36322 297629 296647
40725B96647j25379q1493k38678n10620m44754m7110J76083N4986j9410J69353
$$ 296647 171268 89775 -148903 -659523 -1104277 -1151387 -975304 -920318 -939728 -770375
40715g70375L29278K64246K25511L66500L64455l3393m89168n21632k00169J6908
$$ -770375 -441097 -176851 48660 415160 779615 746222 257054 -264578 -464747 -447839
40705d47839l7984j15338l1768O7809k2029k61867m15240l08099J04K75225L42719
$$ -447839 -485823 -601161 -632929 -565120 -587149 -849016 -1264256 -1572355 -1572251 -1297026 -954307
40694i54307K57446J95395K08643J91155P5686o6449j41502j26105j8362J78780
$$ -954307 -696861 -501466 -292823 -101668 -25982 -92431 -233933 -360038 -378400 -199620
40684a99620L80895M37895K87241K9921j74220k42144k08738j81350k21001k34662
$$ -199620 181275 619170 906411 936332 762112 519968 311230 129880 -91121 -325783
40674c25783p8965J70370K16123m4608k72613j00815L16968M70407J70209k41301
$$ -325783 -404748 -234378 -18255 -62863 -335476 -436291 -119323 351084 521293 279992
40664B79992l80294k31101N522J96969K76522J74748p3339k72398k51722m4407
$$ 279992 -100302 -331403 -325881 -128912 147610 322358 249019 -23379 -275101 -319508
40654c19508J77985K79348K40715J44095Q3622M0792q9861k72650k66381L5352
$$ -319508 -141523 137825 378540 522635 606257 647049 557188 284538 18157 53509
40644E3509L36827K77304n0427k23631r3102P0330M8047n5002r3197j10489j58333
$$ 53509 390336 667640 617213 393582 300480 370810 418857 363855 270658 160169 1836
40633A836j60604r7106p7703j10128l4703J85868L49258L11110J69693M2506r1303
$$ 1836 -158768 -255874 -333577 -443705 -478408 -292540 56718 367828 537521 580027 488724
40622D88724k08185j73843o767O2292m7250j21177l6347J4478j04163j86696m6595
$$ 488724 280539 106696 99929 162221 114971 -6206 -42553 -28075 -132238 -318934 -365529
40611c65529J32452J20561N2761J56309K85981J33886k29822m12023k27713J41953
$$ -365529 -233077 -112516 -59755 96554 382535 516421 286599 -125424 -353137 -211184
40601b11184M46143N22329K62395k45532o11707n12536j21914J22905J11158Q3025
$$ -211184 234959 757288 1019683 774151 162444 -350092 -472006 -349101 -237943 -154918
40591a54918J43915J52512Q1767P6016Q9327j23885n23421o63983k74973L19961
$$ -154918 -11003 141509 223276 299292 388619 264734 -258687 -922670 -1197643 -877682
40581h77682N88431L97660M3686j62895j44359P092J61425K34907K18996J26301
$$ -877682 -289251 108409 152095 -10800 -155159 -148067 13358 248265 467261 593562
40571E93562n2959k66559l52425k28443o5860q2297k12970k04920N226K48358
$$ 593562 540603 274044 -78381 -306824 -372684 -454981 -667951 -872871 -867645 -619287
40561f19287M11960M92051L95878L6753l58433m09071j22488R3942N5657K2867
$$ -619287 -207327 284724 680602 717355 358922 -50149 -172637 -78695 -23038 -171
40551a71J45346J42731j76702m87279m07566o6692J77665K90523L98071L48587
$$ -171 145175 287906 111204 -376075 -783641 -850333 -672668 -382145 15926 364513
40541C64513m2133m75628m56445l5788K55751K07702J25982J84716J54469o0266
$$ 364513 322380 -153248 -609693 -645481 -389730 -182028 -56046 128670 283139 222873
40531B22873j67457m6542n7766m18612p02007m26067J70819M58892L16851J70554
$$ 222873 55416 8874 -48892 -467504 -1169511 -1595578 -1424759 -965867 -649016 -478462
40521d78462K38405K94332K08651J88625L21394L37065P3043j97985k00477j17202
$$ -478462 -240057 54275 262926 451551 772945 1110010 1183053 985068 784591 667389
40511F67389k67192n27266m69264j0308M30801M68953J73074j28883k54511k60269
$$ 667389 400197 -127069 -596333 -606641 -175840 293113 466187 337304 82793 -177476
40501a77476k58500k62352j93414j1636J73143J93473P0229L5089J86849K76346
$$ -177476 -435976 -698328 -891742 -903378 -730235 -536762 -466533 -431444 -244595 31751
40491C1751N2886k93074l41445o3425J22532j4562j84865n4812K58351M28396
$$ 31751 84637 -208437 -549882 -613307 -490775 -505337 -690202 -745014 -486663 -58267
40481e8267M09155L70736L20176J32708j18824k04745j02659j8819k5219K0683
$$ -58267 350888 721624 1041800 1174508 1055684 850939 748280 729461 704242 724925
40471G24925J27484O0190k53111m71950k57901K15456M41475K17228j50731k94104
$$ 724925 852409 912599 659488 187538 -70363 145093 586568 803796 653065 358961
40461C58961j98476p1395N573R8489J92749J73704M6362l4344k5122q4969k69386
$$ 358961 160485 89090 94663 193152 385901 559605 605967 571623 546501 461532 192146
40450A92146l34624q0905K53746K50813r4513l65959l15881j08830Q0224L08617
$$ 192146 -142478 -223383 30363 281176 186663 -179296 -495177 -604007 -523783 -215166
40440b15166N45870N17051J43479k04876k24268j28128k09279k75345j7888L10957
$$ -215166 330704 847755 991234 786358 562090 433962 224683 -50662 -68550 242407
40430B42407K02211k46488m21632j59616M1686q7238j58169J12797L29524P3859
$$ 242407 444618 198130 -223502 -383118 -341432 -428670 -586839 -474042 -144518 -70659
40420g0659l27948k68671J89016M08179J18621k67686l11734p6837J25208J90415
$$ -70659 -398607 -667278 -478262 -70083 48538 -219148 -530882 -607719 -482511 -292096
40410b92096K31561L05761L17267J68494p2387j95315p6786J39502J92420L2597
$$ -292096 -60535 245226 562493 730987 658600 463285 386499 526001 718421 751018
40400G51018j44330k10742k51735l24573k97715p3877K11546L71252L86561L15352
$$ 751018 606688 395946 144211 -180362 -478077 -551954 -340408 30844 417405 732757
40390G32757J65525K834k5624N8587K1675j90889k93071j30147J624j48482k83012
$$ 732757 898282 901116 875492 934079 955754 764865 471794 341647 343271 194789 -88223
40379h8223k5302L57884L00615j11685k07167J99899M75870J46751l86962m98359
$$ -88223 -113525 244359 544974 433289 226122 426021 901891 1048642 661680 163321
40369A63321k27899n9314j27790j62704n2193K3750j0900j3859N4704M1574q6360
$$ 163321 -64578 -123892 -251682 -414386 -466579 -442829 -453729 -467588 -412884 -371310 -457670
40358d57670j29178K2244J84790J61849M3523L9909J30980J06091o6882j38629
$$ -457670 -586848 -564604 -379814 -217965 -174442 -134533 -3553 102538 35656 -102973
40348a02973N6061K96524K34131j05631l10006j28127J80796K09878m3394k22549
$$ -102973 -46912 249612 483743 378112 68106 -60021 120775 330653 287259 64710
40338F4710j35840L4311O8602K917k2041n73L26N383P1476J46899J39312P5587
$$ 64710 -71130 -36819 31783 34700 12659 12086 12412 17795 89271 236170 375482 451069
40326D51069N9623R6428Q4642j0737q5783l4108J08496J93998J08716j27669l86465
$$ 451069 510692 607120 691762 681025 595242 561134 669630 863628 972344 844675 458210
40315D58210n33520n14510l55634j06652J87953M58498N87784M75418J62328j31142
$$ 458210 -75310 -589820 -945454 -1052106 -864153 -405655 182129 657547 819875 688733
40305F88733j73619K4419J99076J59219M2711R1688K36572J62217j70966l71212
$$ 688733 515114 539533 738609 897828 940539 1032227 1268799 1431016 1260050 888838
40295H88838j56285K02044K38892p4916l68916m22397l39459k18759j0389K36747
$$ 888838 732553 934597 1173489 1098573 729657 307260 -32199 -250958 -261347 -24600
40285b4600L06889J34708m6407k0858J17761J22504q8148l62242m59476k25283
$$ -24600 282289 416997 370590 349732 467493 589997 501849 139607 -319869 -545152
40275e45152K42503N78021M75006P1541j82432r3495N6333m7760l10934l87346
$$ -545152 -302649 275372 750378 821919 639487 545992 602325 554565 243631 -143715
40265a43715j36231K29138L71475J43226k35685l15345R9249O07359O02594M0795
$$ -143715 -279946 -50808 320667 463893 228208 -87137 12112 619471 1222065 1262860
40255A262860m73954m64085j16284J24370J64178J81061J92437N8481j94138l48611
$$ 1262860 788906 324821 208537 332907 497085 678146 870583 929064 734926 386315
40245C86315k64067J4437L33019M78101K88804j21302m05150l89564k48569j28845
$$ 386315 122248 136685 469704 947805 1236609 1115307 710157 320593 72024 -56821
40235e6821J05345N02727P06055L79272k55351o89351p57753o09848k64277L00429
$$ -56821 48524 551251 1257306 1636578 1381227 691876 -65877 -675725 -940002 -639573
40225f39573P39399O05301L9694l26722k35819n4721o7784p0393J10737K22008
$$ -639573 99826 705127 744821 418099 182280 127559 59775 -10618 100119 322127
40215C22127N9076q7162J13688M28605L64012r5159m69636m46513j89791K2803
$$ 322127 381203 294041 407729 836334 1200346 1105187 635551 189038 -753 22050
40205B2050J55775K94757L76815K29012j42923m39597l64799k3010J61732J0662
$$ 22050 177825 472582 849397 1078409 935486 495889 131090 108080 269812 280474
40195B80474j59865o4777M4373j96611n37137l84753K26117N86309L74298J08622
$$ 280474 120609 55832 100205 -96406 -633543 -1018296 -792179 -205870 168428 277050
40185B77050K40357M34886K28946j52944k41724j46244k46192l83778j27019L30191
$$ 277050 517407 952293 1181239 1028295 786571 640327 394135 10357 -116662 213529
40175B13529L39437j24258l43068J3019L58559J22219l93741n20141j62508K25044
$$ 213529 552966 428708 85640 98659 457218 579437 185696 -334445 -496953 -271909
40165b71909L42955K93687K49799K15863J02504j42922m40674n54311l07965J18620
$$ -271909 71046 364733 614532 830395 932899 789977 349303 -205008 -512973 -394353
40155c94353L24384J93886K2928M0458R9153L581j49715j79884j08694r043J76565
$$ -394353 -69969 123917 146845 187303 286456 290037 140322 -39562 -148256 -157299 19266
40144A9266M12072M22082P2944l26809m26203l15737k67530k17871O0226M27222
$$ 19266 431338 853420 926364 599555 173352 -142385 -409915 -627786 -567560 -140338
40134a40338N00243K48115J0057o2172j34351k50167k23483m2404O1406N0414
$$ -140338 359905 608020 618077 555905 421554 171387 -52096 -94500 -33094 17320
40124A7320J50024L51465L08915o8425l74615l18552j47380j48219j53035O0593
$$ 17320 167344 518809 827724 759299 384684 66132 -81248 -229467 -382502 -321909
40114c21909K58210J26756j29037j03137J03978O0160k26219k93843O243K87286
$$ -321909 -63699 63057 -65980 -169117 -65139 -4979 -231198 -525041 -518798 -231512
40104b31512K68759J46200J62463K48588K85778L34878L89219K57012o7371k43053
$$ -231512 37247 183447 345910 594498 880276 1215154 1604373 1861385 1794014 1550961
40094A550961o8463J61448Q5192j89758l16375k67779k86470l89909l24435k1042
$$ 1550961 1482498 1643946 1729138 1539380 1223005 955226 668756 278847 -45588 -66630
40084f6630K39603K11976L850j03701j2482J21733J17246k638l4033J27087K92934
$$ -66630 172973 384949 388799 285098 272616 394349 511595 508957 474924 602011 894945
40073H94945K21214J4555J9610K53862K66231j93996o72008n55795N0440M45816
$$ 894945 1116159 1130714 1150324 1404186 1670417 1476421 804413 248618 299058 744874
40063G44874K70162j29300l14497k88437k40790j61494M187R4469m3842k30129
$$ 744874 1015036 885736 571239 282802 42012 -119482 -115295 -20826 -64668 -294797
40053b94797j70698P5833J66202M165r7681J07994M10743M26297J45843m5479
$$ -294797 -465495 -389662 -223460 -219295 -316976 -208982 201761 628058 773901 728422
40043G28422Q7545K93780J88885j92334m26659k77670L08M8913r5757j04615J29733
$$ 728422 815967 1109747 1298632 1106298 679639 401969 402277 451190 355433 250818 380551
40032C80551L23798J93008j65532l88814k70366L0770J98221J14812l6525k9268
$$ 380551 704349 897357 731825 343011 72645 103415 301636 416448 379923 350655
40022C50655J22977K20496J62477L7140o2606j39503j75331j03478L6242J12622
$$ 350655 473632 694128 856605 893745 831139 691636 516305 412827 449069 561691
40012E61691J47746L04079N12819M18309q4317n49219n33970k11483n7992j34209
$$ 561691 709437 1013516 1526335 1944644 1860327 1311108 777138 565655 507663 373454
40002C73454j16820Q2726K12868J67650J21371J46094J10453Q711j339O8651N9561
$$ 373454 256634 339360 552228 719878 841249 987343 1097796 1106507 1105168 1173819 1233380
39991A233380L9844K14628M29360K88463j24168k22036J61830M07935K2070n94478
$$ 1233380 1273224 1487852 1917212 2205675 2081507 1859471 2021301 2429236 2451306 1856828
39981A856828p36425l59897J8627R0292m0247j94636k49996j07108J28332J47082
$$ 1856828 1120403 760506 779133 869425 829178 634542 384546 277438 405770 552852
39971E52852o9396n9884M17853Q27856N21342k73676p10805m56315M223J50863
$$ 552852 483456 423572 841425 1669281 2190623 1916947 1206142 749827 754050 904913
39961I04913k1821k74685m45040l98711p4998L05930M06223K08734M606n6441
$$ 904913 883092 608407 163367 -235344 -310342 -4412 401811 610545 615151 558710
39951E58710p6090p5429P1826L14921L74935J19276k57122m68291l56782N9753
$$ 558710 482620 407191 479017 793938 1168873 1288149 1031027 562736 205954 265707
39941B65707N12168N67742J22109l15416k12933K24381L41521p577l25659k94455
$$ 265707 777875 1345617 1467726 1152310 939377 1163758 1505279 1497702 1172043 877588
39931H77588j55041j50834j35124M8868K37870K32674P8427r7806k20867j63939
$$ 877588 722547 571713 436589 485457 723327 956001 1034428 936622 715755 551816
39921E51816J30732L84121K50064j06301j73715J09015K66297R4541m7534N9982
$$ 551816 682548 1066669 1316733 1210432 1036717 1145732 1412029 1506570 1459036 1519018
39911A519018J31224k5156j44731o0144k0411j18194k4090L03076L00990k77291
$$ 1519018 1650242 1625086 1480355 1420211 1399800 1281606 1257516 1560592 1861582 1584291
39901A584291p60484n07869R8725L08975J42843R9959J68599o987k75759j93673
$$ 1584291 823807 315938 414663 723638 866481 966440 1135039 1128052 852293 658620
39891F58620R5561P6523j51458j2425M26455M09619k63572q20804o55314j36116
$$ 658620 754181 830704 679246 666821 1093276 1502895 1239323 418519 -236795 -372911
39881c72911J09579Q6372J38057K58214K04526R336o7930M2567J62966J50068
$$ -372911 -263332 -176960 -38903 219311 423837 433173 365243 407810 570776 720844
39871G20844N0632K8033J92562M21809L96130k2516n26199o92557m84057j74368
$$ 720844 771476 799509 992071 1413880 1810010 1787494 1261295 568738 84681 -89687
39861h9687P0233K16808J51627j38837l11081o2913L18054L18858J6963o3389
$$ -89687 -19454 197354 348981 210144 -100937 -163850 154204 473062 490025 426636
39851D26636J38451J42797j61155k55041J21509M81760L41089p6708k56398r2846
$$ 426636 565087 707884 546729 291688 413197 894957 1236046 1159338 902940 810094
39841H10094J65208L23667L10662J36277k1593N491L4702k25882n61539m33185
$$ 810094 975302 1298969 1609631 1745908 1724315 1729806 1764508 1538626 977087 543902
39831E43902J32923M87045L59841K08067K95461K18457k31503n17245k37934J43583
$$ 543902 676825 1163870 1523711 1731778 2027239 2245696 2014193 1496948 1259014 1402597
39821A402597J00583q2527N2546K38548K7869k89900j83060J41323J36946p5848
$$ 1402597 1503180 1420653 1473199 1711747 1739616 1449716 1266656 1407979 1544925 1469077
39811A469077j9627J53014m2403l87440k51443K31376L23373l5499j72769O3068
$$ 1469077 1449450 1602464 1560061 1172621 921178 1152554 1475927 1440428 1267659 1330727
39801A330727R5244j83060j19034M72819Q43307N12516j370j51064j71728l67579
$$ 1330727 1425971 1242911 1123877 1596696 2440003 2952519 2951149 2800085 2628357 2260778
39791B260778m24964q4564K35215J61144M4669K29952K99195j63585o38492l95160
$$ 2260778 1835814 1751250 1986465 2147609 2192278 2422230 2721425 2557840 1919348 1524188
39781A524188K78403N02361J79738J6350K97178N34235L64073K2391j90963k82657
$$ 1524188 1802591 2304952 2484690 2501040 2798218 3332453 3696526 3718917 3527954 3245297
39771C245297k82197j28504O3035Q8423M7120J93158M19832M01749K24181K96168
$$ 3245297 2963100 2834596 2897631 2986054 3033174 3226332 3646164 4047913 4272094 4568262
39761D568262O12499P20718N24105M76882P77123R89396P82399M82993M99293
$$ 4568262 5180761 5901479 6425584 6902466 7679589 8668985 9451384 9934377 10433670
39752A0433670O53224N31847J66390n2099J30130P62690J816372K957016L426028
$$ 10433670 11086894 11618741 11785131 11733032 11863162 12625852 14442224 17399240 20825268
39743B0825268K611008O95448j504220l193270l901532l502809k384112j369096
$$ 20825268 23436276 24131724 22627504 19434234 15532702 12029893 9645781 8276685
39735H276685r80750q97430n60460j05085r5182m69054n14788j0806L66804J04171
$$ 8276685 7295935 6398505 5838045 5732960 5637778 5168724 4653936 4643130 5009934 5114105
39725E114105l57694l85137j45588j93371m59897m17025o9433N785l46490n61948
$$ 5114105 4756411 4371274 4225686 4032315 3572418 3155393 3085960 3091745 2745255 2183307
39715B183307k73725J16803J39035j8746N1713K30285J27071j61611j67688J43611
$$ 2183307 1909582 2026385 2165420 2146674 2198387 2428672 2555743 2394132 2226444 2370055
39705B370055K68223l6356l46364j96016K63249N14531L52621L0483j37700p4707
$$ 2370055 2638278 2601922 2255558 2059542 2322791 2837322 3189943 3220426 3082726 3008019
39695C008019R7737K02691J30700n7267j71452j12453J5412Q5194J38641K69735
$$ 3008019 3105756 3308447 3439147 3381880 3210428 3097975 3113387 3198581 3337222 3606957
39685C606957M06884L89070K29939J17682J19361O8863j40465k97706j12025L19238
$$ 3606957 4013841 4402911 4632850 4750532 4869893 4938756 4798291 4500585 4388560 4707798
39675D707798N08147J58107m10658o16626l27848J8770J9159k35309l98185l24136
$$ 4707798 5215945 5374052 4963394 4346768 4018920 4037690 4056849 3821540 3423355 3099219
39665C099219j00165J76133M09525M44945K52838P4825J28422K63762J91463m5390
$$ 3099219 2999054 3175187 3584712 4029657 4282495 4357320 4485742 4749504 4940967 4895577
39655D895577j56146r4602r5186k28909l09475k72277k49135k09532L7007L72614
$$ 4895577 4739431 4644829 4549643 4320734 4011259 3738982 3489847 3280315 3317322 3689936
39645C689936L76577q332k81637j19260J56697J72309J05942K55836M09064J96045
$$ 3689936 4066513 4058181 3776544 3657284 3813981 3986290 4092232 4348068 4757132 4953177
39635D953177k00462k77493n225J68629M5127j10739q3666K2300P3235Q0634M4541
$$ 4953177 4752715 4475222 4469997 4638626 4683753 4573014 4489348 4511648 4584883 4665517 4710058
39624D710058n7082j17659l0548Q3980P6624Q2153K81822M83051L58447O351j74834
$$ 4710058 4652976 4535317 4504769 4588749 4665373 4747526 5029348 5512399 5870846 5877197 5702363
39613E702363q9200M4845J88863M63888P05752O15700L25781K23595K55120O9985
$$ 5702363 5613163 5658008 5846871 6310759 7016511 7632211 7957992 8181587 8436707 8506692
39603H506692j71589O1115O55739Q79050O14378O18790J183403J536998J160890
$$ 8506692 8335103 8396218 9051957 9931007 10545385 11164175 12347578 13884576 15045466
39594A5045466P45295J062450J722984J968804K004560K516480L394653L992994
$$ 15045466 15790761 16853211 18576195 20544999 22549559 25066039 28460692 32453686
39586C2453686M281928M702030N161360N216317N046764N257724N907512O724282
$$ 32453686 36735614 41437644 46599004 51815321 56862085 62119809 68027321 74751603
39578G4751603Q054281J0549989J4245087J9143936K6132947L5220673M2711542
$$ 74751603 82805884 93355873 107600960 126744896 152877843 188098516 230810058
39571B30810058M2493003L1482648J2586623q409470k7099881m0623717m6189798
$$ 230810058 273303061 304785709 317372332 308962862 281862981 241239264 195049466
39564A95049466m2638944l3053273k3134303j6365759j2231737r125448o914021
$$ 195049466 152410522 119357249 96222946 79857187 67625450 58500002 51585981
39557E1585981n967579n595907m884365m062857l799889l808992l287247k289126
$$ 51585981 45618402 40022495 35138130 31075273 27275384 23466392 20179145 17890019
39549A7890019j585724j371940j097009n64917l19455p22384j314284j429464
$$ 17890019 16304295 14932355 13835346 13270429 12950974 12228590 10914306 9484842
39541I484842j037744o44440n73295o45743n34530k35095o9793k38132n10452
$$ 9484842 8447098 7802658 7229363 6583620 6049090 5813995 5744202 5506070 4995618
39532D995618n28976l24239k53857m15407m60879j38447K97603M50341L02508
$$ 4995618 4466642 4142403 3888546 3473139 3012260 2873813 3171416 3621757 3924265
39523C924265J19141M1898N6501J78749L68141L96204J15153k37011l03528j10286
$$ 3924265 4043406 4085304 4141805 4320554 4688695 5084899 5200052 4963041 4659513 4549227
39513D549227K314r8318j97092j16712N5515J76644K25731J98554M2452k12108
$$ 4549227 4551541 4453223 4256131 4139419 4194934 4371578 4597309 4795863 4838315 4626207
39503D626207m14617m64274m05168l23199k49779j67144k3879K04300L84736K88472
$$ 4626207 4211590 3747316 3342148 3018949 2769170 2602026 2578147 2782447 3167183 3455655
39493C455655p1162l29986k34598l7882j12472l21430k01082K89239O77355O77629
$$ 3455655 3384493 3054507 2819909 2782027 2669555 2348125 2147043 2436282 3113637 3791266
39483C791266M99552L45481R5968k91782n40396n00372m24084m66289l33002J53856
$$ 3791266 4290818 4636299 4732267 4440485 3900089 3399717 2975633 2509344 2176342 2330198
39473B330198N37197L15817k20356l48995L6701L48725K35505r901m8263N2493
$$ 2330198 2867395 3183212 2962856 2613861 2650562 2999287 3234792 3224891 3176628 3229121
39463C229121J20148J52648J04998j51397m51746l73082Q5413L06325r1986o06372
$$ 3229121 3349269 3501917 3606915 3455518 3003772 2630690 2716103 3022428 2930442 2324070
39453B324070n36420k5635J62721k11456n51220l39340J52786L31019R5143j55816
$$ 2324070 1787650 1762015 1924736 1713280 1162060 822720 975506 1306525 1401668 1245852
39443A245852j68099j25604k57509m19995k81572J43876M08598K09136j46492
$$ 1245852 1077753 952149 694640 274645 -6927 136949 545547 754683 608191
39434F08191j32470K30298L98774J44807j00215K0046J68985j08209n34589m47943
$$ 608191 475721 706019 1104793 1249600 1149385 1169431 1338416 1230207 695618 247675
39424B47675J42668N20522L36254O0788J35274K71927J0884m77396o45439l57832
$$ 247675 390343 910865 1247119 1307907 1443181 1715108 1725992 1248596 603157 245325
39414B45325L8865K69346L34247K84573J86359K16066M13894M42773Q188n61956
$$ 245325 284190 553536 887783 1172356 1358715 1574781 1988675 2431448 2439636 1877680
39404A877680o37668j83774J81145J12215k2630J44630L60267K28411r9285j98180
$$ 1877680 1240012 1056238 1237383 1349598 1326968 1471598 1831865 2060276 1960991 1762811
39394A762811p0551n9972k01032j67580J26056L31369J88398j12782k50422j86049
$$ 1762811 1692260 1632288 1431256 1263676 1389732 1721101 1909499 1796717 1546295 1360246
39384A360246r3922o5373m6427L6103J93618L53978L88969K51285P5202J7829
$$ 1360246 1266324 1200951 1154524 1190627 1384245 1738223 2127192 2378477 2453679 2471508
39374B471508K8302n6236k06288k06132J6500K88882M65128N70370O10553M88744
$$ 2471508 2499810 2443574 2237286 2031154 2047654 2336536 2801664 3372034 3982587 4471331
39364D471331K24638K6435Q148M5920M2534R6898K53108L37019K47962J59523
$$ 4471331 4695969 4722404 4730552 4776472 4819006 4915904 5169012 5506031 5753993 5913516
39354E913516J87204J24784j75153m23864l11383q1520j82463m70265l65894J61933
$$ 5913516 6100720 6225504 6050351 5626487 5315104 5233584 5051121 4580856 4214962 4376895
39344D376895M16092J2883m70447l12925K97517N50320J37453m32758o09904m23484
$$ 4376895 4792987 4805870 4335423 4022498 4320015 4870335 5007788 4575030 3965126 3541642
39334C541642k22953j53754j06480P86J06867J33954R6552O2634N6201K5388r1702
$$ 3541642 3318689 3164935 3058455 3059241 3166108 3300062 3396614 3459248 3515449 3540837 3449135
39323C449135k81649m53755n16588m39383k63246q4417J3502N5438J37144K29568
$$ 3449135 3167486 2713731 2197143 1757760 1494514 1410097 1423599 1479037 1616181 1845749
39313A845749J44303j57503l51923j06498M02672O26720L27448j60064m08323
$$ 1845749 1990052 1832549 1480626 1374128 1776800 2403520 2730968 2570904 2162581
39304B162581l47655j47210L8744O6470j41230l62052k20022K31915M33987J03835
$$ 2162581 1814926 1667716 1706460 1772930 1631700 1269648 1049626 1281541 1715528 1819363
39294A819363k76152j44800L01479M46845J74875r9072j46186r4207L4303L49623
$$ 1819363 1543211 1398411 1699890 2146735 2321610 2222538 2076352 1982145 2016448 2366071
39284B366071O54235N66557J61709p5647l4511j12898m11861m49253J0178M45366
$$ 2366071 3020306 3586863 3748572 3672925 3638414 3525516 3113655 2664402 2674580 3119946
39274C119946L31467r7398l06692k50147j98823j62357k5722M5945r9088j61805
$$ 3119946 3451413 3354015 3047323 2797176 2598353 2435996 2410274 2456219 2357131 2195326
39264B195326J67344N53202M33417o2885k84822p5710Q0182n2125j40928j120
$$ 2195326 2362670 2915872 3349289 3286404 3001582 2925872 3006054 2953929 2813001 2811881
39254B811881P4382n1343m2575K53923M36424K50006J12275M22057Q08926O81612
$$ 2811881 2886263 2834920 2792345 3046268 3482692 3732698 3844973 4267030 5075956 5757568
39244E757568J87616k7187J92580M28131M96640O64610R91452J097937Q09732
$$ 5757568 5945184 5917997 6110577 6538708 7035348 7699958 8691410 9789347 10599079
39235A0599079N26921O62639J085436J410722J559157J733040K036228K367223
$$ 10599079 11126000 11788639 12874075 14284797 15843954 17576994 19613222 21980445
39227B1980445K537554K306504J482178K04146j035626j868663k390944k818332
$$ 21980445 24517999 26824503 28306681 28510827 27475201 25606538 23215594 20397262
39219B0397262l015571k710720k055633j563394j460374j455755j246244r22803
$$ 20397262 17381691 14670971 12615338 11051944 9591570 8135815 6889571 5966768
39211E966768p11091n85063l79877j22017n236j06011k96666l98303l11809p6594
$$ 5966768 5255677 4670614 4290737 4168720 4163484 4057473 3760807 3362504 3050695 2974101
39201B974101J06648L3795k09036k69236k598K67439K05897j0627J9690K44625
$$ 2974101 3080749 3114544 2905508 2636272 2633674 2901113 3107010 3096383 3116073 3360698
39191C360698K24711j18336l24984j32066R2222m9606l43095l33070o0864L2073
$$ 3360698 3585409 3467073 3142089 3010023 3102245 3052639 2709544 2376474 2315610 2347683
39181B347683k03971m75768n36423m23861k20678M2822K21960J59615O01M3477
$$ 2347683 2143712 1667944 1131521 707660 486982 529804 751764 911379 911980 955457
39171I55457K25578J62694j80609l04487R7987O18077O76272K94930m4256r1785
$$ 955457 1181035 1343729 1163120 858633 956620 1574697 2250969 2545899 2501643 2409858
39161B409858J6845J48442K92236L44698J69726r9156j59137j803L4670k27886
$$ 2409858 2426703 2575145 2867381 3212079 3381805 3282649 3123512 3121709 3156379 2928493
39151B928493n34856n71640l65167j42689L314R4824O1346j83418m89272n37329
$$ 2928493 2393637 1821997 1456830 1314141 1317455 1412279 1473625 1290207 800935 263606
39141B63606k36431J16849K05239J10023J70771M46360N74078L11114j7910O9409
$$ 263606 27175 144024 349263 459286 630057 1076417 1650495 1961609 1943699 2013108
39131B013108M67535N70222J63239k25161j12565K02988J09097l90686p14437
$$ 2013108 2480643 3050865 3214104 2988943 2876378 3079366 3188463 2797777 2083340
39122B083340n63019k42902j05795j23544j39697j56567j95006j63281l4631P3703
$$ 2083340 1520321 1277419 1171624 1048080 908383 751816 556810 393529 358898 432601
39112D32601J11150J49267J54277o918k43715k60449l8636N9571j26078k40642
$$ 432601 543751 693018 847295 840377 596662 336213 297577 357148 231070 -9572
39102i572K2588L85509L91384Q8631j07474n9791M672m9617j23638j48680j42184
$$ -9572 13016 398525 789909 878540 771066 711275 715947 666330 542692 394012 251828
39091B51828l6603K19701M29515L36764J7122k22312k69390k17097o2063K01515
$$ 251828 215225 434926 864441 1201205 1218327 996015 726625 509528 447465 648980
39081F48980K90323n0856m61802k91509L82122O85223J66747n08556m98234Q7766
$$ 648980 939303 888447 426645 135136 517258 1202481 1369228 860672 362438 450204
39071D50204N11242M68818K34315m346k98773n11804l64809N903P9367k80605
$$ 450204 961446 1430264 1664579 1660233 1361460 849656 484847 490750 570117 289512
39061B89512n31384j92129M49025O90086L07353k10732k95466O1747L84862L28973
$$ 289512 -241872 -434001 15024 705110 1012463 801731 506265 568012 952874 1281847
39051A281847P0726J391J42188J28152j69477l38226j4795M71346M64540r8423
$$ 1281847 1352573 1353964 1496152 1624304 1454827 1116601 1101806 1573152 2037692 1939269
39041A939269n86434n36751j95241m1540j44206k34053j56802J5341J65983K09122
$$ 1939269 1352835 816084 620843 579303 435097 201044 44242 59583 225566 434688
39031D34688R6106q7782j51152m9876L3549j7097p2821k7232j8503j59478k56218
$$ 434688 530794 443012 291860 241984 275533 258436 185615 158383 139880 -19598 -275816
39020b75816q5053K09618L12704K11800J29541P8172j13437l44914k65225J39632
$$ -275816 -360869 -151251 161453 373253 502794 580966 467529 122615 -142610 -2978
39010b978L94294J85428j73563k04456P3365K61667J87228M5844J7650N5378O6713
$$ -2978 391316 576744 403181 198725 272090 533757 720985 766829 784479 839857 906570
38999I06570N3236K0293n5032j18289p0778M3041M9717p5816j08130J21207M21983
$$ 906570 959806 980099 925067 806778 736000 779041 828758 752942 644812 766019 1188002
38988A188002M26850O4705l04024k99430K9540K91008K43015L4644q0325p1352
$$ 1188002 1614852 1679557 1375533 1076103 1105643 1396651 1639666 1674310 1593985 1522633
38978A522633k7540Q5452L03591M34118L15545K58727P40963J532021J659159
$$ 1522633 1495093 1580545 1884136 2318254 2633799 2892526 3633489 5165510 6824669
38969F824669O12185q30335j465870j072519m23260j34081j46988k74670n39665
$$ 6824669 7436854 6606519 5140649 4068130 3644870 3510789 3363801 3089131 2549466
38960B549466q27810q14542m67422j32868M8721K80823M93747K53252l84721o26928
$$ 2549466 1721656 907114 439692 306824 355545 636368 1130115 1383367 998646 371718
38950C71718p6552N21998L54246j95886j86123L76715O32148K82520p7919p0743
$$ 371718 295166 817164 1171410 975524 789401 1166116 1798264 2080784 2002865 1932122
38940A932122k3138j64503j92719N2535K21458R8820l3341L60n5795k74862k78232
$$ 1932122 1908984 1744481 1551762 1604297 1825755 1924575 1891234 1891594 1835799 1560937 1282705
38929A282705K1287Q9872l23529o26629l25747J06528K2004l03637j90030K65594
$$ 1282705 1303992 1393864 1070335 443706 117959 224487 246491 -57146 -247176 18418
38919A8418M24814K30930J70494K80702J31019k36586k63288J31833L56154J28294
$$ 18418 443232 674162 844656 1125358 1256377 1019791 756503 888336 1244490 1372784
38909A372784j05277K8424L05082M30300M40168L26126q3441n78373n70030q773
$$ 1372784 1267507 1295931 1601013 2031313 2471481 2797607 2714166 2135793 1565763 1556990
38899A556990L34202n4707o46436o64264j59720K51630L09223J94528K7615j65082
$$ 1556990 1891192 1836485 1190049 525785 366065 617695 926918 1121446 1149061 983979
38889I83979k16865m9528O9875o9856k10062m5281K07872J51801j22101k20920
$$ 983979 767114 717586 787461 717605 507543 462262 670134 821935 699834 478914
38879D78914j02427p087P5902K98758M53582K06510k23055k59272J17708K89583
$$ 478914 376487 369400 445302 744060 1197642 1404152 1181097 921825 1039533 1329116
38869A329116l8460l97533l10287M3634K27464J81724J09124N1421n9817j47254
$$ 1329116 1290656 893123 582836 626470 853934 1035658 1144782 1196203 1136386 989132
38859I89132j04744l0362q1037k03799k32714j57061q7654l3814Q0209K13007
$$ 989132 884388 854026 772989 569190 336476 179415 91761 57947 138156 351163
38849C51163K21200J03954O2181K15329L66449K12597k16122n18701m31110j81864
$$ 351163 572363 676317 738498 953827 1320276 1532873 1316751 798050 366940 185076
38839A85076j15700j38298P5375L94937K95933k59529n69343j58747M88522O33514
$$ 185076 69376 -68922 6453 401390 697323 437794 -131549 -290296 198226 831740
38829H31740L07375O5123L6804r9297l61269l86527j12917Q9588M6108r931O1896
$$ 831740 1139115 1204238 1241042 1141745 780476 393949 281032 370620 416728 406797 468693
38818D68693J01729L3500k0083o8212k11245k47498J08912N64116M56675k09856
$$ 468693 570422 603922 583839 515627 304382 56884 165796 729912 1186587 976731
38808I76731o28493l38205J65022L05274K35525L14822M19462L56735M17648Q38662
$$ 976731 348238 10033 175055 480329 715854 1030676 1450138 1806873 2224521 3063183
38798C063183J123589O29607m07327j098585j017756n16774o0167J84866J62803
$$ 3063183 4186772 4816379 4409052 3310467 2292711 1775937 1715770 1900636 2063439
38789B063439j19033m25532m89222l63606k59064j46816R8279L07547K14268o0651
$$ 2063439 1944406 1518874 1029652 666046 406982 260166 358445 665992 880260 819609
38779H19609j64662p6127o0166j28165k3304K56073L79846J84545j39319l83048
$$ 819609 654947 578820 518654 390489 367185 623258 1003104 1187649 1048330 665282
38769F65282m81223l59776k0488K42839J38406j20262n9789K89644L82602P936
$$ 665282 184059 -175717 -196205 46634 185040 64778 4989 294633 677235 685171
38759F85171l57296k46829J66277L87149K27004j05257k98788j82053J21503K30760
$$ 685171 327875 81046 247323 634472 861476 756219 457431 275378 396881 627641
38749F27641m9915l56536j96877K75323M00792j7242m33523m12863j95953j34441
$$ 627641 577726 221190 24313 299636 700428 683186 249663 -163200 -359153 -493594
38739d93594j08593Q5943K37986J02046p2378P9845L74037L22249r1282l87477
$$ -493594 -602187 -516244 -278258 -176212 -248590 -168745 205292 527541 436259 48782
38729D8782l03242p3187K5729K3427O8571J88148L27227M18217L58953J03363
$$ 48782 -254460 -327647 -301918 -278491 -209920 -21772 305455 723672 1082625 1185988
38719A185988j97469l13880k19890j06017r9185j23562p0993K8546P4925O2179
$$ 1185988 988519 674639 454749 348732 249547 125985 54992 83538 158463 220642
38709B20642J04122K81239M69955L94264m9040n50592o43789k43756K25290L16777
$$ 220642 324764 606003 1075958 1470222 1421182 870590 226801 -16955 208335 525112
38699E25112M0905k25294j87536R5874L17407K46087j452o6317J76260L85737
$$ 525112 566017 340723 153187 249061 566468 812555 811103 744786 921046 1306783
38689A306783K31528o1513l8552K02007R2563m56307p87856m53435J05093K36840
$$ 1306783 1538311 1476798 1438246 1640253 1732816 1276509 488653 35218 140311 377151
38679C77151l967j20384N514J08982J18832J69025J79419k3465k45844j23180
$$ 377151 373184 252800 258314 367296 486128 655153 834572 811107 565263 442083
38669D42083K45778L78506J42478r4493j05078q4715j70873j76007n798R0751
$$ 442083 687861 1066367 1208845 1114352 1009274 924559 753686 577679 571881 662632
38659F62632n7682k34725k05600q0641m8715l5744R0185K19721J95068R4579N1261
$$ 662632 604950 370225 164625 83984 35269 -475 89710 309431 504499 599078 650339
38648F50339p189j42978j40096J82986N35860M47645m2253l94456l15045r2313
$$ 650339 643150 500172 360076 543062 1078922 1526567 1484314 1089858 774813 682500
38638F82500n8609j01740K8489K25707J95707l5648j54051o0227R016q1523j34029
$$ 682500 623891 522151 550640 776347 972054 936406 782355 722128 731144 649621 515592
38627E15592K3693K15443J77993l3678j51168r8647m5254r1982j39615r1511p614
$$ 515592 539285 754728 932721 899043 747875 649228 603974 511992 372377 280866 273252
38616B73252m158j03310k05239j64873N0287K46130J91136j0693K9437M01971
$$ 273252 269094 165784 -39455 -204328 -154041 92089 283225 272532 301969 703940
38606G03940O53717M03669q3006l14435k83674k74060k22671Q1988L48643R6376
$$ 703940 1357657 1761326 1678320 1363885 1080211 806151 583480 665468 1014111 1110487
38596A110487m27841m80588m4417R2397k97297m17968J83049P38963M48639k54133
$$ 1110487 682646 202058 157641 250038 -47259 -465227 -282178 456785 905424 651291
38586F51291m37377n4934K67382L37394M06492M35396K06810p1406l0519K12987
$$ 651291 213914 158980 426362 763756 1170248 1605644 1812454 1741048 1710529 1923516
38576A923516L25313L64710M88638M50879P7995k01732k0423K78694L94704P36677
$$ 1923516 2248829 2613539 3102177 3553056 3631051 3429319 3408896 3687590 4082294 4818971
38566D818971J463333J881786K038820L557138O785647Q281235M262745l503573
$$ 4818971 6282304 8164090 10202910 13760048 20545695 28826930 33089675 29586102
38558B9586102q576210p485906l524038j523385j850295j855752p80646p7981
$$ 29586102 21009892 13523986 9999948 8476563 6626268 4770516 3989870 3911889
38550C911889j89748j01920L27406J93686m17602m43318J25445K38552j70646
$$ 3911889 3722141 3620221 3947627 4141313 3723711 3280393 3405838 3644390 3473744
38541C473744q7416N44737O19685m9904l08748L04777Q52643P66021O37239P91566
$$ 3473744 3386328 3931065 4550750 4500846 4192098 4496875 5349518 6115539 6752778 7544344
38531G544344P61292O71474J389506K753527L565908L980238N574528P863977
$$ 7544344 8305636 8977110 10366616 13120143 16686051 20666289 26240817 34104794
38523C4104794P271402J769861n323297q810780p715185n317836l988741l005753
$$ 34104794 41376196 43146057 37822760 29011980 21296795 15978959 11990218 8984465
38515H984465j474458l39398m41219q46130n00725N149l39153j143609j323701
$$ 8984465 7510007 7170609 6729390 5883260 5382535 5387684 5048531 3904922 2581221
38506B581221q18267l89990k50735R067M33073O08842M35171K11948L7189k47622
$$ 2581221 1762954 1372964 1122229 1131296 1564369 2173211 2608382 2820330 2857519 2609897
38496B609897n56421n67559k55510K6569K7090j66665l51723l91849k34855L581
$$ 2609897 2053476 1485917 1230407 1256976 1284066 1117401 765678 373829 138974 142555
38486A42555P5181m5716k4220L06882N04981P6517o45877p76756j07659N23250
$$ 142555 217736 172020 147800 454682 959663 1036180 390303 -386453 -494112 29138
38476B9138L65534k43140m49397q6339K76941L18750L34970N33969N93694K69632
$$ 29138 394672 151532 -297865 -384204 -107263 211487 546457 1080426 1674120 1943752
38466A943752m4243J18602M87542M61599K19242O56851J973657K979168K363319
$$ 1943752 1899509 2018111 2505653 2967252 3186494 3843345 5817002 8796170 11159489
38457A1159489L22061j639817k371894k014995j347488q24482m95965l92309n34387
$$ 11159489 11481550 9841733 7469839 5454844 4107356 3282874 2786909 2394600 1860213
38448A860213p11137o24085k76964J6486O1613J9072J03988K13553O8364l14847
$$ 1860213 1149076 524991 248027 264513 326126 345198 449186 662739 731103 416256
38438D16256n45033l59598K452J33404Q505p5317j5012J1803j6615J34043M64244
$$ 416256 -128777 -488375 -485923 -352519 -344014 -419331 -434343 -422540 -439155 -305112 159132
38427A59132N56897J71914k99337l36436j0864J92965J12976K8227J03117J49833
$$ 159132 716029 887943 588606 252170 241306 434271 547247 575474 678591 828424
38417H28424P865j90893k50473j54443J0462J77498K80984K69252J64341l778
$$ 828424 836289 645396 394923 240480 250942 428440 709424 978676 1143017 1139239
38407A139239k59105n32392n87997l25032q027Q7458R8078K71463M05153J00118
$$ 1139239 880134 347742 -240255 -565287 -573314 -485856 -387778 -116315 288838 388956
38397C88956m77423o78938l17700N4346K9079o7628J77757N24312M65914L7707
$$ 388956 -88467 -767405 -1085105 -1030759 -1001680 -1069308 -891551 -367239 98675 136382
38387A36382k68214k21487m8530Q652l3965m8551L4860J76658K12398J8446k11622
$$ 136382 -131832 -353319 -401849 -393197 -427162 -475713 -440853 -264195 -51797 -33351 -244973
38376b44973j16365K59112M00160R3703j61536O1563L45626O6535m94774m74540
$$ -244973 -361338 -102226 297934 391637 230101 291664 637290 703825 209051 -265489
38366b65489K04685O28814K42135l70169m38565j04133k067k00915k13983J24544
$$ -265489 -60804 568010 810145 439976 1411 -102722 -104789 -305704 -519687 -395143
38356c95143M16533L48607R0050p6385j36436j72802j06636J31935L42160K48923
$$ -395143 21390 369997 460047 383662 247226 74424 -32212 99723 441883 690806
38346F90806p2500k41840j23607p0237l86249p38015m92908L42935R63461P53932
$$ 690806 618306 376466 252859 182622 -203627 -941642 -1434550 -1091615 -128154 625778
38336F25778P1954l03285j91781j4449R519O6822J80378O5612k82518m21684j53616
$$ 625778 697732 394447 202666 188217 197736 264558 444936 510548 228030 -193654 -347270
38325c47270J11270K2727j36977O729K12311K7300l63510l45698J50894N24010
$$ -347270 -236000 -213273 -350250 -343521 -131210 -103910 -467420 -813118 -662224 -138214
38315a38214M13804J55241J20791J43876o1991l13458k31766J02610K13964q0246
$$ -138214 275590 430831 551622 695498 633507 320049 88283 190893 404857 324611
38305C24611m05216l38947N7217L57639K95341K1057j39739p8275J8490m3459
$$ 324611 -80605 -419552 -362335 -4696 290645 311702 171963 93688 112178 68719
38295F8719j95814k03511J2883K55137K67962J6018k80471l48494j09407K29474
$$ 68719 -127095 -330606 -317723 -62586 205376 221394 -59077 -407571 -516978 -287504
38285b87504L54131J74651n8122m5450J91677L46558K02792j45561m38681m87302
$$ -287504 66627 241278 183156 137706 329383 675941 878733 733172 294491 -192811
38275a92811k66922P9082L02328K46644K2248j21834j04263n7053p1552r0178
$$ -192811 -459733 -380651 -78323 168321 190569 68735 -35528 -92581 -164133 -254311
38265b54311q9970j53282k49149j57983K05468N51604N18364J39513j90582j98526
$$ -254311 -344281 -497563 -746712 -904695 -699227 -147623 370741 510254 319672 121146
38255A21146r693P0132p5295k64796k32378O7412L73160L87576J24372j20040
$$ 121146 111453 181585 106290 -158506 -390884 -323472 49688 437264 561636 441596
38245D41596j40091r063J29975K42147K74445R5927k47652m30590k44622O4133
$$ 441596 301505 292442 422417 664564 939009 1034936 787284 356694 112072 176205
38235A76205J25357k9998q8593K817j4023k16912l22538j05817K61942M12886
$$ 176205 301562 271564 182971 185788 171765 -45147 -367685 -473502 -211560 201326
38225B01326J56512l76884p92269o64969K6855P20022Q04786L43766o4547j18658
$$ 201326 357838 -19046 -811315 -1476284 -1449429 -729407 75379 419145 354598 235940
38215B35940p7074j32700o4290K35435L83308O5052l97764m89840k36052l7980
$$ 235940 158866 26166 -38124 197311 580619 645671 247907 -241933 -477985 -515965
38205e15965q457L5914Q5437k5406j66691l3678K75630L21777L1252j66199m4707
$$ -515965 -524422 -488508 -403071 -428477 -595168 -628846 -353216 -31439 -187 -166386 -211093
38194b11093P3558q6773k71717j44926J32631J57395r9053k94878k26626j9472
$$ -211093 -137535 -224308 -496025 -640951 -508320 -350925 -449978 -744856 -971482 -990954
38184i90954J42779K25406K75954L11201K89270J50185o0874j32054P8543L45119
$$ -990954 -848175 -622769 -346815 -35614 253656 403841 342967 210913 289456 634575
38174F34575K82149q6081k94043j19948O9698p7698l23984k57626J7713J06409
$$ 634575 916724 830643 536600 416652 486350 408652 84668 -172958 -155245 -48836
38164d8836K5339J17451L45811K85451j09355l21239o6979K38171J30406k12135
$$ -48836 -23497 93954 439765 725216 615861 294622 227643 465814 596220 384085
38154C84085l19902j55638m9529j07049j25764k4972M7756M1905P6260J31770
$$ 384085 64183 -91455 -140984 -248033 -373797 -398769 -351013 -309108 -232848 -101078
38144a01078O662k95329m19369j07602L93205N96210L49615o0853l33463m43435
$$ -101078 -94416 -389745 -809114 -916716 -523511 72699 422314 361461 27998 -415437
38134d15437m73188l76174q9936K23402K81424N7569j33540k5778K65506M33428
$$ -415437 -888625 -1264799 -1354735 -1131333 -849909 -792340 -925880 -951658 -686152 -252724
38124b52724L80908K47373J16835n9090k41114k48953k3375K34090K92424J37775
$$ -252724 128184 375557 492392 433302 192188 -56765 -80140 153950 446374 584149
38114E84149q4807k37132k23290k4364J98172J96054m4816k36133j72166j309
$$ 584149 499342 262210 38920 14556 212728 408782 363966 127833 -44333 -45642
38104d5642N4610M5218J10472J46403j2132j95560q5344K19378K36777j92492
$$ -45642 8968 54186 164658 311061 298929 103369 18025 237403 474180 281688
38094B81688o09870n43004j05475K44524L06298K22502J32881M9778J1502P4440
$$ 281688 -328182 -871186 -976661 -732137 -425839 -203337 -70456 -20678 -9176 65264
38084F5264J39387K1585k45430l67446j58489J76349K65809L1160k21349j96635
$$ 65264 204651 226236 -19194 -386640 -545129 -368780 -102971 -71811 -293160 -489795
38074d89795K6343J45458P2683J4266Q5265R7408r7060k75538j56549J00183Q4468
$$ -489795 -463452 -317994 -245311 -231045 -145780 -48372 -145432 -420970 -577519 -477336 -392868
38063c92868k05734l15324l0733K81406K34678k8736j22048K4321J77792J80940
$$ -392868 -598602 -913926 -944659 -663253 -428575 -457311 -579359 -555038 -377246 -196306
38053a96306M5395j60917k89767j68949J01114J58203o5980j25860K46757N85292
$$ -196306 -150911 -311828 -601595 -770544 -669430 -511227 -577207 -703067 -456310 128982
38043A28982L35315k30384l83557n2675J57257R141q3103P3064Q9155k02367l24561
$$ 128982 464297 233913 -149644 -202319 -45062 -35921 -119024 -45960 43195 -159172 -483733
38032d83733L1572M07151L09018Q88k3262J07146k6217k96163k49563M9494J16360
$$ -483733 -452161 -45010 264008 264896 241634 348780 322563 26400 -223163 -173669 -57309
38021e7309j00447j56477P5699J86898m2001k70114j70026R1499J89881J05426
$$ -57309 -157756 -314233 -238534 -51636 -93637 -363751 -533777 -442278 -252397 -146971
38011a46971K3869M1850J46953K78442L03684J37415p7563j34704q7733j24402
$$ -146971 -123102 -81252 65701 344143 647827 785242 707679 572975 485242 360840
38001C60840j70161m012K45318J85769j78265l54013q9313K60832L04748J24882
$$ 360840 190679 186667 431985 617754 439489 85476 -3837 256995 561743 686625
37991F86625j3920n7407j7553J57332L16049J42711k63962l41096O2748L12202
$$ 686625 672705 615298 597745 755077 1071126 1213837 949875 608779 671527 983729
37981I83729l3233m27102j96111K96150K04118l89892n96364j75850J22878j48220
$$ 983729 950496 523394 327283 623433 827551 437659 -158705 -334555 -211677 -359897
37971c59897m40262j88584K83908L73033J29645K1128J50054K52780K24844J74614
$$ -359897 -800159 -988743 -704835 -331802 -202157 -181029 -30975 221805 446649 621263
37961F21263J17064k444j12973j48732k14944l57561l75181j50118N9394n550
$$ 621263 738327 735883 622910 474178 259234 -98327 -473508 -623626 -564232 -569782
37951e69782j47678j4507L06978M03324J45340j95459l69097l30178q7089K54059
$$ -569782 -717460 -731967 -424989 -21665 123675 -71784 -440881 -771059 -858148 -604089
37941f04089L81744J29970j38975K7449M02052L12477l00092o88045l83935J29399
$$ -604089 -222345 -92375 -231350 -203901 198151 510628 210536 -477509 -861444 -732045
37931g32045K06700m1702j21686j1557l3878j46315k0397K75122L04612O193j79473
$$ -732045 -525345 -567047 -688733 -700290 -734168 -880483 -900880 -625758 -321146 -314953 -494426
37920d94426l7307J04025j3748j34460M0957L28772L63231J48040l6747p6740
$$ -494426 -531733 -427708 -441456 -575916 -534959 -206187 157044 305084 268337 191597
37910A91597n6146j9111M574r6197k78929k07971K67606O59766L61642m11229
$$ 191597 135451 116340 120914 24717 -254212 -462183 -194577 465189 826831 415602
37900D15602p47307k49828L88238L27831k94607o25876k68558K76752L54749l1224
$$ 415602 -331705 -581533 -193295 134536 -160071 -785947 -1054505 -777753 -423004 -454228
37890d54228l16778j08494L70880N82478L31213j097K8627L00473K91800j33690
$$ -454228 -771006 -879500 -508620 73858 405071 403974 432601 733074 1024874 891184
37880H91184m64540k76146J07606P5625l45071n19888j56818K76042K69574j2090
$$ 891184 426644 150498 258104 333729 -11342 -531230 -688048 -412006 -142432 -154522
37870a54522p9649R2621P3705k81531n30452k53932L13696N55045K81372k9083
$$ -154522 -234171 -141550 -67845 -349376 -879828 -1133760 -820064 -265019 16353 -12730
37860a2730J03129M97630N69422J44460l11363l52659j18859j0349p2142p4381
$$ -12730 90399 588029 1157451 1301911 990548 637889 519030 508681 436539 362158
37850C62158n2002k74640o43184o24709k6381N83533N88871J52693r8778M85O8592
$$ 362158 310156 35516 -607668 -1232377 -1258758 -675225 -86354 66339 -32439 -31954 36638
37839C6638o8928j11358J14967L08903K05398O000l1081o2638l06379n13611l12503
$$ 36638 -32290 -143648 -28681 280222 485620 491620 460539 397901 91522 -422089 -734592
37828g34592R8388J77559q3212j25754K30061M43391J40922k32220j10244L02584
$$ -734592 -636204 -458645 -541857 -667611 -437550 5841 146763 -85457 -195701 106883
37818A06883M13686J93022Q8466J65423L9326l29170m67889j86189R1546M8067
$$ 106883 520569 713591 802057 967480 1006806 677636 209747 23558 115104 163171
37808A63171m1265J08218K50172J04609n5165J34040M11293K58223k24632m47259
$$ 163171 121906 230124 480296 584905 529740 663780 1075073 1333296 1108664 661405
37798F61405k56276r5594k04193k75034q7856P5130n7123k45386j10096K81708
$$ 661405 405129 309535 105342 -169692 -257548 -182418 -239541 -484927 -595023 -313315
37788c13315N28750M15772O1081l06561m94032l93704q5671J99067L36508L96160
$$ -313315 215435 631207 692288 385727 -108305 -502009 -587680 -388613 -52105 344055
37778C44055L90233J76587k20810m51246k66363P8275J54644l6081j22369M4917
$$ 344055 734288 910875 690065 238819 -27544 50731 205375 169294 46925 91842
37768I1842K07461J35257o6587j89192k08158j98433j44768j166J66395K40377
$$ 91842 299303 434560 367973 178781 -29377 -227810 -372578 -373744 -207349 33028
37758C3028J99819J03871k0745j69430k70186k25434o1287O5313O0286J5619O2526
$$ 33028 232847 336718 315973 146543 -123643 -349077 -410364 -345051 -284765 -269146 -206620
37747b06620J64101J68761L8724j20976k62055m30761n46032l73887J02950M97603
$$ -206620 -42519 126242 164966 43990 -218065 -648826 -1194858 -1568745 -1465795 -968192
37737i68192M68922K13684J80815L79814L81349M2882k06778j3560L30686K85715
$$ -968192 -499270 -285586 -104771 275043 656392 699274 492496 478936 809622 1095337
37727A095337j80513n74523n35363k08603M7913Q6062J12j10406k48479l80966
$$ 1095337 914824 340301 -195062 -403665 -355752 -269690 -269578 -379984 -628463 -1009429
37717a009429l27324M0786M89917N61390J69724j84257p7995J96045R1584k75162
$$ -1009429 -1336753 -1295967 -806050 -244660 -74936 -259193 -337188 -141143 -49559 -324721
37707c24721k81138J38445K89695j81810o62903m73228J49319M91442L71490J31431
$$ -324721 -605859 -467414 -177719 -359529 -1022432 -1495660 -1346341 -854899 -483409 -351978
37697c51978n1419k30012k74475n529L50196L73420O9111j86023k19450j32252
$$ -351978 -403397 -633409 -907884 -913413 -563217 -189797 -120686 -306709 -526159 -658411
37687f58411P3890M23045O23209L51437j72105m30770l64009l08721k89373n0463
$$ -658411 -584521 -161476 461733 813170 641065 210295 -153714 -462435 -751808 -802271
37677h02271K41047J13773k98031k89951K49984N55246K04011k11998j37733L9242
$$ -802271 -561224 -447451 -745482 -1035433 -785449 -230203 -26192 -238190 -375923 -336681
37667c36681j89211m37426r1530N19881N62336K7661k84429k2355L23867L25921
$$ -336681 -525892 -963318 -1054848 -534967 27369 55030 -229399 -251754 72113 398034
37657C98034J54485O0453l3660j95383k45586r7896N1985N7301N104n2298k00125
$$ 398034 552519 612972 579312 383929 138343 40447 92432 149733 154837 102539 -97586
37646i7586l69086k96547N2603L35924K80472K0130j64154j90358j15603K2022
$$ -97586 -466672 -763219 -710616 -374692 -94220 -74090 -238244 -428602 -544205 -522183
37636e22183J35502P9234j21992k15430m8057K10429L13300K42678J20682k4906
$$ -522183 -386681 -307447 -429439 -644869 -692926 -482497 -169197 73481 194163 169257
37626A69257k16080l51830k86293o0900J03141Q1394J0981R8048K92290K76925
$$ 169257 -46823 -398653 -684946 -745846 -642705 -561311 -550330 -452282 -159992 116933
37616A16933j17830n76877n89043r7592L85596M29783J90076O5804J17511J33109
$$ 116933 -897 -577774 -1166817 -1264409 -878813 -449030 -258954 -193150 -75639 57470
37606E7470P7438J01224K05227K56743K71203L24554K61691j08605n69612o79140
$$ 57470 134908 236132 441359 698102 969305 1293859 1555550 1446945 877333 198193
37596A98193m03394j36052o9430k7602K6331j19994l73417k61221K94929O80894
$$ 198193 -205201 -341253 -410683 -438285 -411954 -531948 -905365 -1166586 -871657 -190763
37586a90763M56568K2115n2992Q9036l1891l36029l41728k7957J55843Q9818J15573
$$ -190763 265805 287920 234928 323964 292073 -43956 -385684 -413641 -257798 -167980 -52407
37575e2407K98372K22798k38083n29833j89866L89474M48348q0968m75634k11918
$$ -52407 245965 468763 230680 -299153 -489019 -99545 348803 267835 -207799 -419717
37565d19717L25095L52993k47486p12172l64877M41122P25745J87060l87070k32860
$$ -419717 -94622 258371 10885 -701287 -1066164 -625042 100703 287763 -99307 -332167
37555c32167L43330N03551J14118k10983j65827j15313k98065l76490j05088J43230
$$ -332167 11163 514714 628832 417849 252022 136709 -161356 -537846 -642934 -499704
37545d99704j6426k87985j47508K96605M60867J66772j72829k21238q1051O2553
$$ -499704 -516130 -804115 -951623 -655018 -194151 -27379 -200208 -421446 -502497 -439944
37535d39944K06470L00485J52372k21312m52548k72507J10856L08764K42036J10847
$$ -439944 -233474 67011 219383 -1929 -454477 -726984 -616128 -307364 -65328 45519
37525D5519M0775J9922O8277J77639J45203k11649o56946o88496k13130K37253
$$ 45519 86294 106216 174493 352132 497335 285686 -371260 -1059756 -1272886 -1035633
37515a035633J88712j29762j51377J77340L37914N5574k55613q4385M43355P37965
$$ -1035633 -846921 -976683 -1128060 -950720 -612806 -557232 -812845 -897230 -453875 284090
37505B84090N02889O221l46256m10867k59986j3993J72548J51975n3335k31550
$$ 284090 786979 793200 446944 36077 -223909 -237902 -65354 86621 33286 -198264
37495a98264k10685k9891J51808K15087J31332j3278k8297J79224L86378K55943
$$ -198264 -408949 -438840 -287032 -71945 59387 46109 17812 197036 583414 839357
37485H39357j67604m20474k39112M2322j8845k95823k76513J51034M99567L48486
$$ 839357 671753 251279 12167 54489 35644 -260179 -536692 -385658 113909 462395
37475D62395j19677m13461l28557n5280J49209J80317N2960j40328k21917m3787
$$ 462395 342718 -70743 -399300 -454580 -305371 -125054 -72094 -212422 -434339 -478126
37465d78126L00821M65751J82860l77633o93280m33996J51159N26490M82921K46673
$$ -478126 -177305 288446 471306 93673 -599607 -1033603 -882444 -355954 126967 373640
37455C73640J7171k54198n15374m49708K6174M28259L06458n2958m7422K71228
$$ 373640 390811 136613 -378761 -828469 -802295 -374036 -67578 -120536 -167958 103270
37445A03270K79147j64712m43130j67054K20535K03901r662M0347K45574J72747
$$ 103270 382417 217705 -225425 -392479 -171944 31957 22295 62642 308216 480963
37435D80963j52682l10315j84909m9580k8623Q159N3647m2505j94949j68340m4917
$$ 480963 328281 17966 -166943 -216523 -245146 -236987 -183340 -225845 -420794 -589134 -634051
37424f34051j23172l23822k23005K15014M70333K40954r4786p0889K08648L22217
$$ -634051 -757223 -1081045 -1304050 -1089036 -618703 -377749 -472535 -543424 -334776 -12559
37414a2559J36923j42813l09156k84482j08311L6023j6697j28124k1825J91722
$$ -12559 124364 -18449 -327605 -612087 -720398 -684375 -701072 -829196 -851021 -659299
37404f59299Q3286l35783m44923N4666N52172L84629j30286j65363L60828P06471
$$ -659299 -576013 -911796 -1356719 -1302053 -749881 -365252 -495538 -660901 -300073 406398
37394D06398M32176o5770k59314j53718k5656N3932J35094J18225j15733m15215
$$ 406398 838574 772804 513490 359772 334116 388048 523142 641367 525634 110419
37384A10419m35770l8885M67630N67086R8008m60650m78748K5381L88145K18846
$$ 110419 -325351 -364236 103394 670480 768488 307838 -170910 -145529 242616 461462
37374D61462j05036j37790q4177l02984m89661r1992O25956P45308J993p91427
$$ 461462 356426 218636 134459 -168525 -658186 -750178 -124222 621086 623079 -168348
37364a68348q64665m10402p0169k5398r596J26383K62645K54434Q6099r2532j7676
$$ -168348 -1033013 -1443415 -1513584 -1538982 -1548578 -1422195 -1159550 -905116 -819017 -911549 -929225
37353i29225L72380O77332M48822j23061l93466j91488j7140j66275k86950j01749
$$ -929225 -556845 120487 569309 446248 52782 -138706 -155846 -322121 -609071 -710820
37343g10820O3306p9829j83801J21134M87102L70030n5430j79476P5025K38933
$$ -710820 -647514 -727343 -911144 -790010 -302908 67122 11692 -167784 -92759 146174
37333A46174J17862j8431k0006l5722r7798n3807O4286P7670N5706J86161K78866
$$ 146174 264036 245605 225599 189877 92079 38272 102558 180228 235934 422095 700961
37322G00961m1682o04763p48626k69188K34319K09985j23270k07368P8637M05016
$$ 700961 659279 54516 -694110 -963298 -728979 -518994 -642264 -849632 -770995 -365979
37312c65979M89965L16806L1772j53416r8583Q2486J23926l3606j80514j80796
$$ -365979 123986 440792 472564 319148 220565 303051 426977 393371 212857 32061
37302C2061j27549r8474l8628L5781J5524l8098O1202K24118J21418k32196l68083
$$ 32061 -95488 -193962 -232590 -196809 -181285 -219383 -158181 65937 187355 -44841 -412924
37291d12924q1625J87322N0598j68347L6682M73400M90145k7422m76965l90167
$$ -412924 -494549 -307227 -256629 -424976 -388294 85106 575251 547829 70864 -319303
37281c19303K9217L32051L70104K36583n15k65779l91087k89733j02283j0891
$$ -319303 -290086 41965 412069 648652 648137 382358 -8729 -298462 -400745 -411636
37271d11636p615J5926M8381j651q9485m3075J63331K92552J37204j35303j20855
$$ -411636 -419251 -403325 -354944 -356595 -446080 -489155 -325824 -33272 103932 -31371 -152226
37260a52226K84769O73634O14918K19880l2874K7717R0959q0376k70832j90195
$$ -152226 132543 806177 1421095 1640975 1608101 1635818 1726777 1646401 1375569 1185374
37250A185374N3182J54084J02536J39462L09833M07715L78633M54124P76525J127392
$$ 1185374 1238556 1392640 1495176 1634638 1944471 2352186 2730819 3184943 3961468 5088860
37240E088860J169976Q10420K15719l79488p75035q62372p35191o55378p62698
$$ 5088860 6258836 7069256 7284975 6905487 6130452 5268080 4532889 3877511 3114813
37231C114813q77774p32096l40331J8785J65053J64120Q8825j27748m56451n95473
$$ 3114813 2237039 1504943 1164612 1183397 1348450 1512570 1601395 1473647 1017196 421723
37221D21723k98180K01041L83210R6365k61631k99084r3891O1832J09883J50952
$$ 421723 123543 324584 707794 804159 542528 243444 149553 211385 321268 472220
37211D72220J30770m9704k20686j19940J33383J23295k35280n19388l99795r2803
$$ 472220 602990 553286 332600 212660 346043 469338 234058 -285330 -685125 -777928
37201g77928J0961r8519j44575l0939Q1563P7917N434p9498j57350j44926M7013
$$ -777928 -766967 -865486 -1010061 -1041000 -959437 -881520 -876086 -955584 -1112934 -1257860 -1210847
37190a210847L22774M33672K62818l0505k03179j81349o9466K2087P1255P7683
$$ -1210847 -888073 -454401 -191583 -222088 -425267 -606616 -676082 -653995 -582740 -505057
37180e05057R71j51205k17856j9024L48318N04025K25232k11157l24372k2124
$$ -505057 -504086 -655291 -873147 -892171 -543853 -39828 185404 -25753 -350125 -372249
37170c72249L12676L28447R0418r1543n1281R6288J16186p7692k80439k14459
$$ -372249 -59573 268874 359292 267749 216468 312756 428942 351250 70811 -143648
37160a43648M1730N9565l04206n50787j98843M27550O02971K62386J0931P9063
$$ -143648 -101918 -42353 -346559 -897346 -1096189 -668639 -65668 196718 207649 286712
37150B86712K2000l52404n42449k38330P3471n0567k07919J11185N15680K98867
$$ 286712 308712 -43692 -586141 -824471 -751000 -801567 -1009486 -898301 -382621 -83754
37140h3754l12979m31944R0935M57895K00920j82189j30613J51599J63994j04038
$$ -83754 -396733 -828677 -737742 -279847 -78927 -261116 -391729 -240130 -76136 -180174
37130a80174k77695j80540L0618J44138R1399k3919k4056R1656O1191k48427m94811
$$ -180174 -457869 -638409 -607791 -463653 -372254 -396173 -420229 -328573 -267382 -515809 -1010620
37119a010620k67241K57688N09962L28888Q5738J8318j1435n3694L7989J38752
$$ -1010620 -1277861 -1020173 -510211 -181323 -95585 -77267 -88702 -142396 -104407 34345
37109C4345q5217m52720k97920M46444R00329M69013k22259k82889R9009R0878
$$ 34345 -50872 -503592 -801512 -355068 545261 1014274 792015 509126 608135 699013
37099F99013l56889m61101O3467N17174K90948k68689m48041j45616J59523J50971
$$ 699013 342124 -118977 -55510 461664 752612 483923 35882 -109734 49789 200760
37089B00760j5538p0699M257L8622m7643j37564r9119Q520K3014n1012l7987R8043
$$ 200760 185222 114523 118780 157402 109759 -27805 -126924 -118404 -95390 -146402 -184389 -86346
37077h6346J53142J5137j20169n6645O5557j0524k33115l09502j40381O8111J21510
$$ -86346 66796 81933 -38236 -94881 -29324 -39848 -272963 -582465 -722846 -654735 -533225
37066e33225N6471J7347O1664J19135P6812p1555j45193L1877L22079L60674N6925
$$ -533225 -476754 -459407 -397743 -278608 -201796 -273351 -418544 -386667 -64588 296086 353011
37055C53011k23247j49224J32053K76568K43209K17861K15572R7706j17081k78393
$$ 353011 129764 -19460 112593 389161 632370 850231 1065803 1163509 1046428 768035
37045G68035l64469m19218l21993L9667M24261M34053P7340k08312j56857Q880
$$ 768035 403566 -15652 -337645 -297978 126283 560336 637676 429364 272507 281387
37035B81387m1281l00667m85028l71566o164L18738L13324L9868r0291J43487
$$ 281387 240106 -60561 -545589 -917155 -923319 -604581 -291257 -251389 -341680 -198193
37025a98193L92970K06879k62027m33582j48570J25011K2935k22753k21839P438
$$ -198193 194777 401656 139629 -293953 -442523 -317512 -294577 -517330 -739169 -731731
37015g31731J70996J48082O2095O1360J97287L79516L65543K645m37980m50995
$$ -731731 -560735 -412653 -350558 -289198 -91911 287605 653148 655793 217813 -233182
37005b33182K1870L90994J44657m61135p39378m40468M3650K80371K72773K69873
$$ -233182 -211312 179682 324339 -136796 -876174 -1316642 -1272992 -992621 -719848 -449975
36995d49975L50914L65553J94324q8422l30305m65786m75438k74881J51850N19808
$$ -449975 -99061 266492 460816 372394 42089 -423697 -899135 -1174016 -1022166 -502358
36985e02358M41837j2230k75611n3995K00128j5813l97139k71855K74988M61866
$$ -502358 -60521 -72751 -348362 -402357 -202229 -218042 -615181 -887036 -612048 -150182
36975a50182M8472k61190O5001N69384N65167J51857r9957p3217r3925k34955
$$ -150182 -101710 -362900 -297899 271485 836652 988509 888552 815335 721410 486455
36965D86455k35679m0133Q8421j580j76288k70729k35193q4820N5308j8005k58542
$$ 486455 250776 210643 299064 297484 121196 -149533 -384726 -469546 -414238 -432243 -690785
36954f90785k69602J53018N89335N01000j1629l97642m44541l79626k92275l1391
$$ -690785 -960387 -807369 -218034 282966 271337 -126305 -570846 -950472 -1242747 -1274138
36944a274138L05154L50496O7189j33851l6998P9357j6162j18562k376J67157
$$ -1274138 -968984 -618488 -551299 -685150 -722148 -642791 -658953 -777515 -779891 -612734
36934f12734J51964N5233R1673J86256J22394q2854k37835k79435k70642k07972
$$ -612734 -460770 -405537 -313864 -127608 -5214 -88068 -325903 -605338 -875980 -1083952
36924a083952n4380J20854K15680K32430K17512J77702J59436K49678L79427L21242
$$ -1083952 -1138332 -1017478 -801798 -569368 -351856 -174154 -14718 234960 614387 935629
36914I35629L2444k12047k14545j52827k43393l38893j89938O7178Q0217j37212
$$ 935629 968073 756026 541481 388654 145261 -193632 -383570 -316392 -236175 -373387
36904c73387k02063L7076K77005K37880K7312j27700k18987l18523l36092j69393
$$ -373387 -575450 -538374 -261369 -23489 3823 -123877 -342864 -661387 -997479 -1166872
36894a166872N2013J23671P8061J03304K12045K44021J80216J75392K22949P8348
$$ -1166872 -1114859 -991188 -913127 -809823 -597778 -353757 -173541 1851 224800 303148
36884C03148l23722o25759m70651n531L15944L25380K21049J22755p2613l41578
$$ 303148 -20574 -646333 -1116984 -1122515 -806571 -481191 -260142 -137387 -210000 -551578
36874e51578m26145k32612r347N8485J04929K13129J53606j77873m04981j93572
$$ -551578 -977723 -1210335 -1219682 -1161197 -1056268 -843139 -689533 -867406 -1272387 -1465959
36864a465959J47627J06570j98772k17186J21444L35907K31251J31573J75349
$$ -1465959 -1318332 -1211762 -1410534 -1627720 -1506276 -1170369 -939118 -807545 -632196
36855f32196P1426k20767k54585J14824L52651J07501j51934P2137M24687L05323
$$ -632196 -560770 -781537 -1036122 -921298 -568647 -461146 -613080 -540943 -116256 189067
36845A89067p3154m8606L24328L46374j36257m64906k37953J08426Q1128j30253
$$ 189067 115913 67307 391635 738009 601752 136846 -101107 7319 88447 -41806
36835d1806q3789J99898L65460K72903O3420j31340k60973k74969j83615r3391
$$ -41806 -125595 74303 439763 712666 776086 644746 383773 108804 -74811 -168202
36825a68202n2631M967Q5201R2834N0015J26326L31498M12647K13706p8611k22508
$$ -168202 -220833 -215866 -130665 -37831 12184 138510 470008 882655 1096361 1017750 795242
36814G95242k52345l18867l71168k40303M9735K73326K83399J49645K4374k5360
$$ 795242 542897 224030 -147138 -387441 -337706 -64380 219019 368664 393038 367678
36804C67678m2780q5256j21162o4593N8943R0636j1923m4726J29607K86665J48152
$$ 367678 324898 239642 118480 53887 112830 203466 191543 146817 276424 563089 711241
36793G11241j34344j85200l4186p3080l41296l78244J8208L80425K40051j86283
$$ 711241 576897 391697 357511 284431 -56865 -435109 -416901 -36476 203575 17292
36783A7292l51508j16675K30570M41247M25908J37353k92589m83671k36493J33224
$$ 17292 -334216 -450891 -220321 220926 646834 784187 491598 7927 -228566 -95342
36773i5342K26067J20688J19797J57117m0654l29901k55870J97457M94568L13700
$$ -95342 130725 251413 371210 528327 487673 157772 -98098 99359 593927 907627
36763I07627l3123j36277n3814q6785k78991m25617m21250l50512k84829j59989
$$ 907627 874504 738227 684413 597628 318637 -106980 -528230 -878742 -1163571 -1323560
36753a323560J18015M92208P14496N63716J35674k14180k94970k66416k76227
$$ -1323560 -1205545 -713337 1159 564875 700549 486369 191399 -75017 -351244
36744c51244j72793J60372M37027L26905J6091m4893J28427P4757l31469o14750
$$ -351244 -524037 -363665 73362 400267 416358 371465 499892 574649 243180 -371570
36734c71570l72739J81252N44047M90067J54239j85739k74889o6527J62981J08551
$$ -371570 -744309 -563057 -19010 471057 625296 439557 164668 98141 261122 369673
36724C69673j34418k15739q4715j5642o9174l588J78472J21031k31738l91165
$$ 369673 235255 19516 -65199 -80841 -150015 -153603 24869 145900 -85838 -477003
36714d77003o2059L32003K66645j13344k83440j10869J08720J77090J38459M7352
$$ -477003 -539062 -207059 59586 -53758 -337198 -448067 -339347 -162257 -23798 23554
36704B3554n2377n2901K3782n0559l12384l99490r0481K46225J89361k6186J07258
$$ 23554 -28823 -81724 -57942 -108501 -420885 -820375 -910856 -664631 -475270 -501456 -394198
36693c94198M73427M65717k3372l97582k56341P5158J28235p2730k25158k30679
$$ -394198 79229 544946 521574 123992 -132349 -57191 71044 -1686 -226844 -457523
36683d57523j75070q5232L6159J10483J11744J45978K55754K93341J21962j79657
$$ -457523 -632593 -717825 -681666 -571183 -459439 -313461 -57707 235634 357596 177939
36673A77939m11952m38389k21672J66927N00232N15467J92610j82218l03021j24121
$$ 177939 -234013 -672402 -894074 -727147 -226915 288552 481162 298944 -4077 -128198
36663a28198J56905K93821J68028j09529k67624j60036L4273K8248j80275k98260
$$ -128198 28707 322528 490556 381027 113403 -46633 -12360 15888 -164387 -462647
36653d62647j30603J74638L16702J65017j40352l31243k43880L7936K82089L51575
$$ -462647 -593250 -418612 -101910 63107 -77245 -408488 -652368 -614432 -332343 19232
36643A9232K69467P4804j81920k88275k9817L78297L84881j27464n32870k83244
$$ 19232 288699 363503 181583 -106692 -136509 241788 626669 499205 -33665 -316909
36633c16909K92939M74508J63463j24548j13149k6525n7794j27449j78666k28351
$$ -316909 -23970 450538 614001 489453 376304 349779 291985 164536 -14130 -242481
36623b42481j42797J54798L20029l501m60238l35053L25373O65493K67450k70659
$$ -242481 -385278 -230480 89549 86048 -374190 -709243 -383870 281623 549073 278414
36613B78414k91333N3314K66336K50761J59096o911k14445k31561j7344J13470
$$ 278414 -12919 40395 306731 557492 716588 709677 495232 263671 246327 359797
36603C59797J9855l2904L9346j04726n04838n72513l3445M28841J63514l61011
$$ 359797 379652 346748 386094 281368 -223470 -795983 -829428 -400587 -237073 -598084
$$ [...]
##END NTUPLES=NMR SPECTRUM
##END=
