##TITLE=31Pdec_MTPA2509
 CDCl3, 24 sc
 28.9.2020
##JCAMPDX= 6.0         $$ Bruker NMR JCAMP-DX V2.0
##DATA TYPE= NMR SPECTRUM
##DATA CLASS= NTUPLES
##ORIGIN= UXNMR, Bruker Analytische Messtechnik GmbH
##OWNER= root
$$ XWIN-NMR		Version 3.5
$$ Mon Sep 28 10:52:59 2020 Russian Standard Time (UT+4h)  she@DPX200
##.OBSERVE FREQUENCY= 81.013821
##.OBSERVE NUCLEUS= ^31P
##.ACQUISITION MODE= SIMULTANEOUS
##.ACQUISITION SCHEME= undefined
##.AVERAGES= 24
##.DIGITISER RES= 17
##SPECTROMETER/DATA SYSTEM= spect
##.PULSE SEQUENCE= zgpg30
##.SOLVENT NAME= CDCl3
##.SHIFT REFERENCE= (INTERNAL, CDCl3, 0, 182.463)
##AUDIT TRAIL= $$ (NUMBER, WHEN, WHO, WHERE, WHAT)
$$ ##TITLE= Audit trail, XWIN-NMR		Version 3.5
$$ ##JCAMPDX= 5.01
$$ ##ORIGIN= Bruker BioSpin GmbH
$$ ##OWNER= she
$$ F:/spectra/data/she/nmr/P31/1/pdata/1/auditp.txt
$$ ##AUDIT TRAIL=  $$ (NUMBER, WHEN, WHO, WHERE, WHAT)
(   1,<2020-09-28 10:52:01.31 +0400>,<she>,<DPX200>,
      <created by zg, POWCHK disabled, PULCHK disabled
       configuration hash MD5:
       00 E9 B6 7A A2 85 ED C7 34 08 36 98 17 FE 4E 26
       data hash MD5: 32K
       2A 6D CD 8A 06 8C D6 CE 65 E0 CD 3B 88 79 8E 5F>)
(   2,<2020-09-28 10:52:03.82 +0400>,<she>,<DPX200>,
      <Start of raw data processing
       efp BC_mod = 2 LB = 1 FT_mod = 6 PKNL = 1 PHC0 = -2746.118 PHC1 = 71.00175 SI = 64K 
       data hash MD5: 64K
       D9 DB 67 70 86 4F CD 31 6E 35 C4 36 93 74 9D 4D>)
$$ ##END=
$$ 
$$ hash MD5
$$ B7 22 E2 D1 64 1E C8 58 80 1F AB B0 44 00 BB D4
##$RELAX= 
##$RELAX= 
##$RELAX= 
##$RELAX= 
##$RELAX= 
##$RELAX= 
##$RELAX= 
##$RELAX= 
$$ Bruker specific parameters
$$ --------------------------
##$DU= <F:/spectra>
##$EXPNO= 1
##$NAME= <P31>
##$PROCNO= 1
##$TYPE= <nmr>
##$USER= <she>
##$AMP= (0..31)
100 100 100 100 100 100 100 100 100 100 100 100 100 100 100 100 100 100 
100 100 100 100 100 100 100 100 100 100 100 100 100 100 
##$AQSEQ= 0
##$AQ_mod= 1
##$AUNM= <au_zg>
##$AUTOPOS= <>
##$BF1= 81.014009
##$BF2= 200.13
##$BF3= 200.13
##$BF4= 200.13
##$BF5= 200.13
##$BF6= 200.13
##$BF7= 200.13
##$BF8= 200.13
##$BYTORDA= 1
##$CFDGTYP= 0
##$CFRGTYP= 5
##$CHEMSTR= <none>
##$CNST= (0..31)
1 1 145 1 1 1 1 1 1 1 1 1 1 1 1 1 1 1 1 1 1 1 1 1 1 1 1 1 1 1 1 1 
##$CPDPRG= <waltz16>
##$CPDPRG1= <>
##$CPDPRG2= <waltz16>
##$CPDPRG3= <>
##$CPDPRG4= <mlev>
##$CPDPRG5= <mlev>
##$CPDPRG6= <mlev>
##$CPDPRG7= <mlev>
##$CPDPRG8= <mlev>
##$CPDPRGB= <>
##$CPDPRGT= <>
##$D= (0..31)
0 1 0 0 0 0 0 0 0 0 0 0.03 2e-05 3e-06 0 0 0 0 0 0 0 0 0 0 0 0 0 0 0 0 
0 0 
##$DATE= 1601275920
##$DBL= (0..7)
120 120 120 11 120 120 24 19 
##$DBP= (0..7)
150 150 150 150 150 150 150 150 
##$DBP07= 0
##$DBPNAM0= <>
##$DBPNAM1= <>
##$DBPNAM2= <>
##$DBPNAM3= <>
##$DBPNAM4= <>
##$DBPNAM5= <>
##$DBPNAM6= <>
##$DBPNAM7= <>
##$DBPOAL= (0..7)
0.5 0.5 0.5 0.5 0.5 0.5 0.5 0.5 
##$DBPOFFS= (0..7)
0 0 0 0 0 0 0 0 
##$DE= 6
##$DECBNUC= <off>
##$DECIM= 4
##$DECNUC= <off>
##$DECSTAT= 4
##$DIGMOD= 1
##$DIGTYP= 9
##$DL= (0..7)
0 0 52 120 120 21 21 25 
##$DP= (0..7)
$$ [...]
##$SUBNAM2= <"">
##$SUBNAM3= <"">
##$SUBNAM4= <"">
##$SUBNAM5= <"">
##$SUBNAM6= <"">
##$SUBNAM7= <"">
##$SUBNAM8= <"">
##$SUBNAM9= <"">
##$SW= 369.568048894756
##$SWIBOX= (0..15)
0 1 3 0 0 0 0 0 0 0 0 0 0 0 0 0 
##$SW_h= 29940.119760479
##$TD= 32768
##$TD0= 1
##$TE= 0
##$TE2= 300
##$TE3= 300
##$TEG= 300
##$TL= (0..7)
0 120 53 12 22 120 120 120 
##$TP= (0..7)
150 150 150 150 150 150 150 150 
##$TP07= 0
##$TPNAME0= <>
##$TPNAME1= <>
##$TPNAME2= <>
##$TPNAME3= <>
##$TPNAME4= <>
##$TPNAME5= <>
##$TPNAME6= <>
##$TPNAME7= <>
##$TPOAL= (0..7)
0.5 0.5 0.5 0.5 0.5 0.5 0.5 0.5 
##$TPOFFS= (0..7)
0 0 0 0 0 0 0 0 
##$TUNHIN= 0
##$TUNHOUT= 0
##$TUNXOUT= 0
##$USERA1= <user>
##$USERA2= <user>
##$USERA3= <user>
##$USERA4= <user>
##$USERA5= <user>
##$V9= 5
##$VALIST= <valist>
##$VCLIST= <CCCCCCCCCCCCCCC>
##$VD= 0
##$VDLIST= <DDDDDDDDDDDDDDD>
##$VPLIST= <PPPPPPPPPPPPPPP>
##$VTLIST= <TTTTTTTTTTTTTTT>
##$WBST= 1024
##$WBSW= 4
##$XGAIN= (0..3)
0 0 0 0 
##$XL= 0
##$YL= 0
##$YMAX_a= 3944
##$YMIN_a= -7791
##$ZGOPTNS= <>
##$ZL1= 120
##$ZL2= 120
##$ZL3= 120
##$ZL4= 120
##$ABSF1= 0
##$ABSF2= 0
##$ABSG= 0
##$ABSL= 0
##$ALPHA= 0
##$AQORDER= 0
##$ASSFAC= 0
##$ASSFACI= 0
##$ASSFACX= 0
##$ASSWID= 0
##$AUNMP= <proc_1d>
##$AZFE= 0.1
##$AZFW= 0.5
##$BCFW= 0
##$BC_mod= 2
##$BYTORDP= 0
##$COROFFS= 0
##$CY= -3
##$DATMOD= 1
##$DC= 0
##$DFILT= <>
##$DTYPP= 0
##$F1P= 0
##$F2P= 0
##$FCOR= 1
##$FTSIZE= 65536
##$FT_mod= 6
##$GAMMA= 0
##$GB= 0
##$INTBC= 1
##$INTSCL= 5.30512e-09
##$ISEN= 30
##$LB= 1
##$LEV0= 0
##$LPBIN= 0
##$MAXI= 10000
##$MC2= 0
##$MEAN= 0
##$ME_mod= 0
##$MI= 50
##$NCOEF= 0
##$NC_proc= -10
##$NLEV= 6
##$NOISF1= 182.463
##$NOISF2= 159.3651
##$NSP= 0
##$NTH_PI= 0
##$NZP= 0
##$OFFSET= 182.463
##$PC= 4
##$PHC0= -2746.118
##$PHC1= 71.00175
##$PH_mod= 1
##$PKNL= yes
##$PPARMOD= 0
##$PSCAL= 0
##$PSIGN= 0
##$REVERSE= no
##$SF= 81.0140089999434
##$SI= 65536
##$SIGF1= 159.3651
##$SIGF2= -187.1042
##$SINO= 113.3802
##$SIOLD= 16384
##$SREGLST= <1H.CDCl3>
##$SSB= 0
##$STSI= 65536
##$STSR= 0
##$SW_p= 29940.119760479
##$SYMM= 0
##$S_DEV= 0
##$TDeff= 32768
##$TDoff= 0
##$TI= <>
##$TILT= no
##$TM1= 0
##$TM2= 0
##$TOPLEV= 0
##$USERP1= <user>
##$USERP2= <user>
##$USERP3= <user>
##$USERP4= <user>
##$USERP5= <user>
##$WDW= 1
##$XDIM= 65536
##$YMAX_p= 136910280
##$YMIN_p= -481003978
$$ End of Bruker specific parameters
$$ ---------------------------------
##NTUPLES= NMR SPECTRUM
##VAR_NAME=  FREQUENCY,     SPECTRUM/REAL,   SPECTRUM/IMAG
##SYMBOL=    X,             R,               I
##VAR_TYPE=  INDEPENDENT,   DEPENDENT,       DEPENDENT
##VAR_FORM=  AFFN,          ASDF,            ASDF
##VAR_DIM=   65536,         65536,           65536
##UNITS=     HZ,            ARBITRARY UNITS, ARBITRARY UNITS
##FACTOR=    0.456856943014862, 1,           1
##FIRST=     14782.0589164792, 0,            0
##LAST=      -15158.0608439998, 0,           0
##MIN=       -15158.0608439998, -481003978,  0
##MAX=       14782.0589164792, 136910280,    0
$$ Real data points
##PAGE= N=1
##DATA TABLE= (X++(R..R)), XYDATA
$$ [...]
##PAGE= N=2
##DATA TABLE= (X++(I..I)), XYDATA
4670A3066665J9596957l525673j7506702j6972474j3060753r979726j974893J0308842
4662b0047757J8737312K3038687K9496195L1539111J1015185l1389094o3098540
4655g08901n2933963r917753K5978419K9166633J1418867r13475M54922L229285
4647E774034k671464j1172609j1234600m136205j313611o480254r479502j855789
4639d2570000R813290J3874515J0986214J1433315J7540018J9295213Q890288
4632D9262853p881162j6847878q560547J2205123K6833507J8444579p052545k3322368
4624D3081562j5578417K35098L242836n74987N741468J3744368J122888k2986500
4616B8028316k2401143P051633K1864217m095563l4231075k2521839J4433772
$$ y = [13066665, 32663622, 29137949, 11631247, -5341227, -18401980, -28381706, -30356599, -20047757, -1310445, 21728242, 51224437, 82763548, 93778733, 62389639, -708901, -53642864, -63560617, -37582198, -8415565, 3003302, 2089827, 2544749, 5774034, 3102570, -8070039, -19304639, -23440844, -24754455, -31234709, -40714211, -42570000, -32756710, -18882195, -7895981, 3537334, 21077352, 40372565, 49262853, 41381691, 24533813, 15973266, 28178389, 55011896, 73456475, 66403930, 43081562, 27503145, 27738243, 30981079, 30406092, 36147560, 49891928, 51014816, 28028316, 5627173, 12678806, 34543023, 30447460, -3783615, -26305454, -11871682]
4609a1871682K1682363j0439222l3312125j4447524J6849694J6639729j0155760
4602b5054527k0234826N983540L7843590L4388818k840099k9665073j3504874
4595a3083451K4313450L5508872R022939j6590459j1504963L928245k690351k1798112
4587G106170j9834859L354686J3902103j941694j9615341j6993617j177970J2998829
4579b2201693K1562571J9554007j4122k3902883k4450649j897999Q333340j1200908
4571c4218336k9254924j3404597J8478369K6778453J0797430L640353J5771480
4564a411772K1662570M914624j6022387j7499598k183104J1815976J6790978J7154793
4556C5222080J5282034Q373547l016856j1629901j1028128m407732k357025r069434
$$ y = [-11871682, 9810681, -628541, -33940666, -48388190, -31538496, -14898767, -25054527, -45289353, -39305813, -1462223, 32926595, 30086496, 421423, -13083451, 11229999, 46738871, 55761810, 39171351, 27666388, 31594633, 28904282, 7106170, -12728689, -9374003, 4528100, 2586406, -17028935, -34022552, -35200522, -22201693, -639122, 18914885, 18900763, -5002120, -29452769, -31350768, -23017428, -34218336, -63473260, -76877857, -58399488, -31621035, -20823605, -17183252, -1411772, 20250798, 25165422, 9143035, -8356563, -10539667, 1276309, 18067287, 35222080, 50504114, 58877661, 55860805, 44230904, 33202776, 28795044, 26438019, 17368585]
4548A7368585j4962434j0842765n157571j2151704k3241772j1902145K4025241
4541c6864565M7357204K7343300j6595252l9688078k8441376p220399M050488
4534e0058678R867147J6230734J5788614N371175k492144K012854J0087191Q314788
4526A5121681j413674o497744j796231N577118O347305j833272j3260455j8636986
4518a6392258j2438245J618378J2592238J0786212l150351j4509391m471107K6370665
4510D06141M7363732K7940620j8175889m0463638j5195152K0794094K0883542
4503D3553450o848574j6891273L906266K1625922J1485353q026564j0128158O96516
4495C9372938L815410l096299o429736k604502k361310j2446425k6007565l0713904
$$ y = [17368585, 2406151, -8436614, -13594185, -25745889, -48987661, -60889806, -36864565, 10492639, 37835939, 21240687, -18447391, -46888767, -54109166, -50058678, -40191531, -23960797, -8172183, -2801008, -5293152, -3280298, 6806893, 15121681, 13708007, 7210263, 5414032, 10991150, 17338455, 15505183, 2244728, -16392258, -28830503, -27212125, -14619887, -3833675, -6984026, -21493417, -25964524, 406141, 47769873, 75710493, 57534604, 17070966, 1875814, 22669908, 43553450, 36704876, 19813603, 23719869, 45345791, 56831144, 48804580, 38676422, 39372938, 43188348, 40092049, 33662313, 31057811, 28696501, 16250076, -9757489, -40471393]
4487d0471393j9798967L006739K5428006L5552667L0270549J3718292q002450
4480C9703443k5165122k5637739r841201K235350n121218j7911247j0593472J3733387
4472c8597819K5986301J5985276P276947J6945541K6100535Q500751k8951214
4465C3246318n3795325m6349884j5713146J4425093K4137989R729983j1158336
4458d5477308j3996377M687029K1814648J6874042l871517j9534670j9171158
4451e8675311n390766J4597810L0513860L0959804J4495417p194964k2379270
4444c073420k7116275j8874324K178545K1739215K0801495M587082J092082J9061549
4436B0395949K9898221R141968k4360110l3372221j1799013J3207533J8079828
$$ y = [-40471393, -60270360, -57263621, -31835615, 3717052, 33987601, 47705893, 39703443, 14538321, -11099418, -20940619, -18705269, -23826487, -41737734, -52331206, -38597819, -12611518, 3373758, 10650705, 27596246, 53696781, 62197532, 33246318, -20549007, -66898891, -82612037, -68186944, -44048955, -34318972, -45477308, -59473685, -54786656, -32972008, -16097966, -19969483, -39504153, -58675311, -64066077, -49468267, -18954407, 12005397, 26500814, 19305850, -3073420, -30189695, -49064019, -46885474, -25146259, -4344764, 242318, 1334400, 20395949, 50294170, 59436138, 35076028, 1703807, -10095206, 3112327, 21192155]
4429B1192155J836739k1554583l1276891j1466695K6004398M2746335J8509537
4422D5990995j7644183k3296925K319900K4347368K2421480O616853r297663k1019301
4414C0438524k2831131j0747120M124513Q698754J0468916K2472943L2716495
4407G5341894J9453014o885822j2526319O179227J4246668p581705l3618070l3139035
4399B1469852j0920255Q975566J6104093J3567396N225833j489767K547604J0960136
4391F6440458M757663j6364823k6540285j1313425Q669658R002136k842160l939275
4383B7869947P122829J2065617K906461r777146j4786883j2149956r144243j2405901
4375h299275j9872545j8200828J729485K5578588K8014323Q189754o879764j151262
$$ y = [21192155, 23028894, 1474311, -29802580, -41269275, -15264877, 27481458, 45990995, 28346812, 5049887, 7369787, 31717155, 54138635, 60755488, 51457825, 30438524, 7607393, -3139727, 984786, 9683540, 20152456, 42625399, 75341894, 94794908, 87909086, 75382767, 81561994, 95808662, 88226957, 54608887, 21469852, 10549597, 19525163, 35629256, 49196652, 54422485, 52932718, 55480322, 66440458, 71198121, 54833298, 28293013, 16979588, 25649246, 34651382, 31809222, 27869947, 34992776, 47058393, 49964854, 40187708, 25400825, 13250869, 4106626, -8299275, -28171820, -46372648, -44643163, -19064575, 8949748, 17139502, 10259738, 9108476]
4367I108476J0365100J0504141M549743O97575r273968k8404102l5770155j5690620
4359e3913810J1330356J4993603l33507o491627K724585P380234j187227q811035
4351c4308428n673730J502995Q124196J8178587K5981455J4447713j7551767m3653706
4343c2952685l8805182r177956J7201950K2770726J4294635P969242R137960J0072735
4335E11425N267725J330060M910294O974680o099608k6519923k9268988p703852
4327e0598187J5132328K0439257J7436136J8784171J5106670l808222k1925584
4320A0566569j8704742l881264j229322q125409k915903J3559345J7364877K598143
4312I232294q684567k565673R115779J3962998J5381697J5229147N033009j4227518
$$ y = [9108476, 19473576, 29977717, 34527460, 35225035, 25951067, -2453035, -38223190, -53913810, -42583454, -27589851, -27923358, -34414985, -31690400, -24310166, -25497393, -34308428, -39982158, -38479163, -30354967, -12176380, 13805075, 28252788, 10701021, -32952685, -71757867, -80935823, -63733873, -40963147, -26668512, -18699270, -9561310, 511425, 5779150, 7109210, 12019504, 18994184, 12894576, -13625347, -42894335, -50598187, -35465859, -15026602, 2409534, 21193705, 36300375, 32492153, 10566569, -8138173, -12019437, -13248759, -21374168, -24290071, -10730726, 6634151, 9232294, 547727, -2017946, 7097833, 21060831, 36442528, 51671675, 56704684, 42477166]
4304D2477166k5112307j8651940q111032o422097o647689K728560J6876940K1564106
4296A8701707J2001593m211084j6354045j8348772j3481184j1110772j1564050
4289d4366607j000210K5445422M4889928L2676243Q46251j5399912o780001L619525
4281C9930639K748670L010514R516586O823316r287841j9482817j5533126j5092416
4273B633525k4103033j8708128J0659064L0170753J0321447k3975770k7926555
4266d0928697j696870J7400773J3229163K424076l412141q213884p683368P180754
4258b1700194K1683826R241016k2320820l1112529M05856L8123195M3266798K0368664
4250E7955812j268075j2403762k5183508m0954111m2304995j9021355J4283452
$$ y = [42477166, 17364859, -1287081, -9398113, -15820210, -22467899, -19739339, -2862399, 18701707, 30703300, 26492216, 10138171, -8210601, -21691785, -32802557, -44366607, -45366817, -19921395, 24968533, 57644776, 58491027, 43091115, 36311114, 39930639, 42679309, 45689823, 55206409, 62029725, 52741884, 33259067, 17725941, 2633525, -21469508, -40177636, -29518572, 652181, 10973628, -13002142, -40928697, -42625567, -25224794, -11995631, -9571555, -12983696, -21197580, -28880948, -21700194, -16368, 9224648, -13096172, -44208701, -43802845, -5679650, 37587148, 57955812, 56687737, 44283975, 19100467, -21853644, -64158639, -83179994, -68896542]
4243f8896542L3179766K9477809J6758857J1483357J4215566J4086383P989608
4236E8294804M287947N322397m6555j7286959l1282360k4055852N0570K0185954
4228A5469946K4014087J4483206j269176j5144802j6406950l085500Q790043K900450
4220B9751304j3902383k0893680j1790190K343329J3206698J9504661J5578738
4213C3798477k376950j9988169j7038213K300685J3133404O042028k679198p67300
4205A2424764L613928K297913J057322L422379J791603m489209k902428Q082182
4197B5298454R438133q311923k4485523j6336795P540161K1354833J7674700R470566
4189D1642606N754419M138867K006220j239022q591955j8581513j9753965n478071
$$ y = [-68896542, -35716776, -6238967, 10519890, 22003247, 36218813, 50305196, 58294804, 62582751, 67905148, 67858593, 50571634, 19289274, -4766578, -4716008, 15469946, 39484033, 53967239, 52698063, 37553261, 21146311, 18060811, 26850854, 29751304, 15848921, -5044759, -16834949, -14491620, -1284922, 18219739, 33798477, 31421527, 11433358, -5604855, -3304170, 9829234, 15871262, 13192064, 12424764, 16038692, 18336605, 19393927, 22816306, 24607909, 20118700, 17216272, 25298454, 34736587, 26424664, 1939141, -14397654, -6857493, 14497340, 32172040, 41642606, 47397025, 51535892, 53542112, 52303090, 43711135, 25129622, 5375657, -102414]
4181a02414J1568007J3365839R4082j2822167j5682042j0122259j97292Q319145
4173e579101N644090r792155k1193424j1402397J1095519J9963951N400711j3315437
4165a9178243j2720331P489569K5285290J9424571p934115k9783241k1862337
4158c9278837N998443J9221200N241234q715219M03712J2166258m499939l5486119
4150d4949267l6726077j333138K8554795K4312267P642517Q798525K0919776J9676333
4142B6895731L668541j1124897j9927900k6760019k6443425j3691493l91068J24502
4134f7650028j933273J1663975L2346338L2687956R098339j0533869q047841O83139
4126a685264n454605j9601200j9590207k423592J1825932Q585291k114940J9879
$$ y = [-102414, 11465593, 24831432, 24925514, 12103347, -3578695, -13700954, -13898246, -5579101, 64989, -9727166, -30920590, -42322987, -31227468, -11263517, -5862806, -19178243, -31898574, -24409005, 876285, 20300856, 12366741, -17416500, -39278837, -33280394, -14059194, -8817960, -17533179, -17129467, -4963209, -9463148, -44949267, -81675344, -83008482, -54453687, -30141420, -22498903, -13700378, 7219398, 26895731, 30564272, 19439375, -488525, -27248544, -53691969, -67383462, -67774530, -67650028, -69583301, -57919326, -25572988, 7114968, 16213307, 5679438, -2368403, -1685264, -7139869, -26741069, -46331276, -48754868, -36928936, -28343645, -30458585, -30438706]
4118c0438706J7140664K6589624Q206539k4701189l5084818r154834K1513456
4111b5929264K0439281m154474j4103044J744069J6134807J0878036J986196M613383
4103A1608990M803467j0962574k4183195j2318806R781415J0067805r297570j5739523
4095c6239991J149979J5589960Q949075n215310j0216449j1371014j6222320j4196658
4087f7772728L875018K3942921K6983290J6010081O198554R8556p603125j1197783
4079i465216k399753Q535933L632143j2248571j4691850L136277J8571513J3351515
4071H421991N09963L172880J9340713K5467291J0643921r708327j7100526j3178511
4063B7569395j0864208j1528863n657866M987380L419049j5416313k8597493j3876612
$$ y = [-30438706, -13298042, 13291582, 21498121, -3203068, -38287886, -47442720, -25929264, -5489983, -9644457, -23747501, -22003432, -5868625, 5009411, 6995607, 11608990, 16412457, 5449883, -18733312, -31052118, -21270703, -11202898, -20500468, -36239991, -35090012, -19500052, -10550977, -15766287, -25982736, -37353750, -53576070, -67772728, -63897710, -39954789, -12971499, 3038582, 9237136, 9335692, 1732567, -9465216, -11864969, -3329036, 303107, -11945464, -26637314, -23501037, -4929524, 8421991, 8931954, 12104834, 31445547, 56912838, 67556759, 57848432, 40747906, 27569395, 16705187, 5176324, -481542, 4505838, 7924887, -7491426, -36088919, -49965531]
4055d9965531J4694899K2573913L987802j0448244p76487J4388522J0777754m670849
4047E61779j0289177m386387L3481J502629O547644J0120405M112444k784124
4039E418694J494893P009803k796729j7117572j1148643Q821502R454096j5017290
4031a3881246k8265722o248185K5541033K9845498Q384779q115619m014717Q596822
4023A1842643J1356417k186564k2329042k8415750r467224J5245568J3954748
4016i999204j2402191k5700509l749846K6709420K8992401O042879j2306445j2844496
4008a5257991m012789P234525J6431764J1428138j1073639k7808988j5419676
4001c8478656J2307629K1699495Q538865L08781J0273206K0109694J3602146m1842
$$ y = [-49965531, -35270632, -12696719, -8708917, -19157161, -19933648, -5545126, 5232628, 561779, -9727398, -14113785, -14080304, -12577675, -6030031, 4090374, 8202818, 5418694, 6913587, 13923390, 11126661, -5990911, -17139554, -8318052, 1136044, -13881246, -42146968, -48395153, -22854120, 6991378, 15376157, 7260538, 3245821, 11842643, 23199060, 21012496, -1316546, -29732296, -39199520, -23953952, -9999204, -22401395, -48101904, -51851750, -25142330, 3850071, 9892950, -2413495, -15257991, -19270780, -12036255, 4395509, 15823647, 4750008, -23058980, -38478656, -26171027, -4471532, 4067333, 4376114, 14649320, 34759014, 48361160, 48319318]
3993D8319318o465221p496936j0622526j3701262j0966588k857554O998561J4892876
3985A8100668J4203910Q63667j5694974j8571476l692446J4881962K1007069J0314427
3977D1412807r139665k1409040j3540832P511626J7065353M704218p639897J759870
3969B0724440J6903231O549489k3798472l5549947j3345189J4990647K1775072
3962H249271J2437792L950624j961233q519050r470821k047068K479808m120930
3954I98393j3160558j3498053o333727L300777J4848973K3373806J8040282r25607
3946B6644286j7305874j8280299n946139J3068529L2076994L6843684J6313949
3939H3415130j4696494k7772487k0769531j7791702k3754227j3940918J7557464
$$ y = [48319318, 41854097, 34357161, 23734635, 10033373, -933215, -3790769, 3207792, 18100668, 32304578, 33168245, 17473271, -1098205, -4790651, 10091311, 31098380, 41412807, 32273142, 10864102, -2676730, 4834896, 21900249, 26604467, 18964570, 20724440, 37627671, 44177160, 20378688, -15171259, -28516448, -13525801, 8249271, 20687063, 24637687, 22676454, 14157404, 4686583, 2639515, 5119323, 998393, -12162165, -25660218, -31993945, -28693168, -13844195, 9529611, 27569893, 26644286, 9338412, -8941887, -14888026, -1819497, 30257497, 67101181, 83415130, 68718636, 40946149, 20176618, 2384916, -21369311, -35310229, -17752765]
3932a7752765L6366052J8151372j2530473k1391556j2677131p742313m054375
3925b1631189Q141535J2930775n852361k4243375p607459K9659136L8481214O812989
3917C6691265k5104025k5307944p647378J303149L83902L463213J2895876J8322151
3909A5000209J1187074o261741k0561112j8731840o895516n631146j6745103j4360927
3901f3000102J2568290L3011308J8597481p178640m165293J7675720J5211427
3894B2720191j2708608k1281264N020200K6827227J4912926p410414j0157718
3887A7922540l387540r013027j8660046j1469667P912738J7271611Q561133q433426
3879G04316k1188161j9560235j402243J6750195J3714086l257787l791576J7262271
$$ y = [-17752765, 18613287, 36764659, 24234186, 2842630, -9834501, -17576814, -21631189, -13489654, -558879, -6411240, -30654615, -38262074, -8602938, 29878276, 36691265, 11587240, -13720704, -21368082, -20064933, -19681031, -16217818, -3321942, 15000209, 26187283, 19925542, -635570, -19367410, -26262926, -31894072, -48639175, -63000102, -50431812, -17420504, 1176977, -6001663, -10166956, 7508764, 22720191, 10011583, -11269681, -6249481, 20577746, 35490672, 28080258, 17922540, 14535000, 5521973, -13138073, -24607740, -16695002, 576609, 9137742, 704316, -20483845, -40044080, -41446323, -24696128, -10982042, -14239829, -18031405, -769134]
3871g69134K6502833L469141k4660137k3098113J669980J9209099J9851957J4844160
3863C7019786R033008M96399m925878k183785L96533m228713p353374j503679
3855B6750297L955805J294187O7625N917874M875841r668238j7285195l850216
3847A2057980Q494977l956283k2909272j5798305R529607J8066978M809274l026280
3839G268676L865115O258475k571533m777850N979756J1492488K174743p278371
3831B2411499o511470o391866j4999827k0753728j2866831N70593O845312N538561
3823b6157757K643145J841830P114233J9487658K7478595J6418968r080800k7224389
3815A2521483k5967105j2582463L685927J9768549K7897497J7218264p597728
$$ y = [-769134, 25733699, 29202840, 4542703, -18555410, -16885430, 2323669, 22175626, 37019786, 46052794, 46549193, 41623315, 39439530, 39836063, 35607350, 28253976, 26750297, 30706102, 32000289, 32067914, 37985788, 42861629, 33193391, 15908196, 12057980, 20552957, 16596674, -6312598, -22110903, -12581296, 5485682, 10294956, 7268676, 11133791, 17392266, 14820733, 10042883, 16022639, 27515127, 29689870, 22411499, 15900029, 9508163, -5491664, -26245392, -39112223, -38541630, -31696318, -26157757, -23514612, -21672782, -14558549, 4929109, 32407704, 48826672, 39745872, 12521483, -13445622, -26028085, -22342158, -2573609, 25323888, 42542152, 34944424]
3808C4944424k5962644k5080881j0686775O774809K0798123K3670298J1118427
3801C5575781o033499j2223238r670921j2087015j6757041n740661K1613521L9837429
3793C4514356K8875337k164925k8371021l2848433j6393716L359915N833629o244182
3785a3439040n501127J7048833K7025162l841946m3012466l7803593J648706J6401457
3777d1474014o306400j6020999J1125583L2499766J6351107m238767M834502J7450994
3769A4221772J01867k2147537j0448773J5326322J1407992j1250663q774617J4404511
3761B840874J4011159j2431654j9606064O645433K6897395J6652382J033862L234157
3753C9277544Q674109L131533K147597J5648364K0787405l72220k5764527k5608717
$$ y = [34944424, 8981780, -16099101, -26785876, -20011067, 787056, 24457354, 35575781, 29542282, 17319044, 7648123, -4438892, -21195933, -26936594, -5323073, 34514356, 63389693, 61224768, 32853747, 5314, -16388402, -13028487, -7194858, -13439040, -18940167, -1891334, 25133828, 21291882, -21720584, -59524177, -57875471, -41474014, -47780414, -63801413, -52675830, -20176064, -3824957, -8063724, -3229222, 14221772, 14323639, -7823898, -18272671, -2946349, 8461643, -2789020, -11563637, 2840874, 16852033, 4420379, -15185685, -8540252, 18357143, 35009525, 36043387, 39277544, 47951653, 51083186, 53230783, 68879147, 89666552, 89294332, 63529805, 37921088]
3745C7921088p278410P0145j0986381k3219946k3153057j0743906R687690K9378739
3737A675962L3538775J6388232p101069j7062580j1988277o613535j1010562j9637858
3729b1810912j8722838j422727K1246355K6949178P314343j7526709k2040605
3722b6013915q501068k23082m823425o244709M728502J5593992J4902719Q099299
3714b481687J014475j1396655k7082376k7244246j702861K9913526L9074741K1518285
3706B1613202l161284j6101047j2203401J846315J1241681L398248j5012233k0363065
3698b8741584j536390K2754845K7632129J3479609J10033k676127k554950n701203
3690B2766362o712311j513325J121647j0012551k9105058l3245079q849330K5020750
$$ y = [37921088, 30642678, 30712823, 19726442, -3493504, -26646561, -37390467, -27702777, 1675962, 35214737, 51602969, 44501900, 27439320, 15451043, 8837508, -2173054, -21810912, -40533750, -41956477, -20710122, 6239056, 13553399, -3973310, -26013915, -34514983, -34738065, -39561490, -45806199, -41077697, -25483705, -10580986, -2481687, -1467212, -12863867, -39946243, -67190489, -68893350, -38979824, 94917, 21613202, 18451918, 2350871, -9852530, -8006215, 3235466, 6633714, -8378519, -28741584, -30277974, -7523129, 20109000, 33588609, 33698642, 31022515, 28467565, 22766362, 16054051, 14540726, 15662373, 5649822, -23455236, -56700315, -65549645, -40528895]
3682d0528895L2955238Q025237j4814780l852019K5133799L2163711J0903620
3675D9985911o671111k569660L189354r323438k7351739k8462683j3952341J44555
3667c5011152R129917J7757559K3655818J9437860M863572j3031220k4529527
3660B272827j8679330N354160K5584650J6956200j0343465j8210574L543002J9185491
3652B5662961K626459k1483107j9713577l055003j616664r755409j91517K1007053
3644f518804K0292938n803398k3711838j7655762r393243j2829297r091603J4359110
3636e0351897L4178397K6395931N892463J964652J1050691M602229k1489427l4990546
3628b2747507j2745036K2324022K6626790p587835l9076642k8250507J2476082
$$ y = [-40528895, -7573657, 451580, -14363200, -18215219, 6918580, 39082291, 49985911, 43314800, 40745140, 43934494, 34611056, 7259317, -21203366, -35155707, -35011152, -25881235, -8123676, 15532142, 34970002, 39833574, 26802354, 2272827, -16406503, -11052343, 14532307, 31488507, 21145042, 2934468, 6477470, 25662961, 28289420, 6806313, -12907264, -15962267, -17578931, -27334340, -27525857, -6518804, 13774134, 7970736, -15741102, -33396864, -42790107, -55619404, -64711007, -50351897, -16173500, 10222431, 16114894, 18079546, 29130237, 33732466, 12243039, -22747507, -35492543, -13168521, 13458269, 5870434, -33206208, -61456715, -48980633]
3621d8980633L6273181K3408321K65548o103220k600821m288297l658926P726621
3613B041774J1803338o939795k4193653r388548J6467701N985422l4369515m4394721
3605h2987997k326851L7863410K8236288k610296j038044K6557176L0110334k380682
3597C1423338l0304570k4504464k210625R627646J1528212J7689587K8019205
3590D1268329K9756480J5925598p533643k7071112l1029078k0108786q042685
3583f834897n352007n995343J187603J3122480J6966791J0189432K135759k726157
3575B2693661q236109j2941117q815575K625838P397240j213331j1895315j1856831
3567b2241539l668429L329894R220180J9147725K7893826K2262674K00581k2351434
$$ y = [-48980633, -12707452, 10700869, 10966417, 4863197, 2262376, -2025921, -5684847, 2041774, 13845112, 6905317, -17288336, -26676884, -10209183, -4223761, -38593276, -82987997, -85314848, -47451438, -19215150, -21825446, -22863490, 3693686, 33804020, 31423338, 1118768, -23385696, -25596321, -15968675, -4440463, 13249124, 41268329, 71024809, 86950407, 79416764, 52345652, 21316574, 1207788, -6834897, -12186904, -18182247, -16994644, -3872164, 13094627, 23284059, 25419818, 22693661, 14457552, 1516435, -7299140, -4673302, 2723938, 1510607, -10384708, -22241539, -25909968, -22580074, -13359894, 5787831, 33681657, 55944331, 56144912, 33793478]
3559C3793478k7815403j4580488M640610J6558024J5424300K804737j3605419
3552A7219839k2784070j9202346r390149l724846j554560P512307K5339248L7773800
3544C1189223L1414540R895779j3770194l2599515m3257109l7172721j0549121
3537f4849118J9613785K7422806R516700r998477j0917825O85593Q448243R983432
3529a0094861J2903396J6322235J1767761L3164o504554j145897O985556N177491
3521C5444291o032227j4645503j4014208j0453188j1138772j1542576l597930
3514c5980113P656411Q903946J027874Q26346J3425842J9866753N650021j3577269
3506G799811j4022846K84042O729861J596152J601796J0287821J1396898m5374
$$ y = [33793478, 5978075, -8602413, -3961803, 12596221, 28020521, 30825258, 17219839, -5564231, -24766577, -34156726, -37881572, -39436132, -31923825, -6584577, 31189223, 62603763, 72499542, 58729348, 26129833, -17127276, -54299997, -64849118, -45235333, -17812527, -8295827, -18294304, -29212129, -28526536, -20078293, -10094861, 2808535, 19130770, 30898531, 30931695, 24427141, 23281244, 30266800, 35444291, 29412064, 14766561, 752353, -9700835, -20839607, -32382183, -35980113, -28323702, -19419756, -18391882, -17565536, -4139694, 15727059, 21377080, 7799811, -6223035, -5938993, 790868, 2387020, 3988816, 14276637, 25673535, 25628161]
3498B5628161p463150k649084q09042j2711546k3910229j7804143j608800P414702
3490c3913131P322358O789345O854205L278493j331142j198094L121445P662938
3482a413583R574584L627575j2967533k6843600j7220293J2097168K8493165J2191280
3474G538763j5628813k2815667q099262N716981O729088K191552J221022O167951
3466a6978385J3519784J2231263o221719k6667107j9348001J5718104L8111448
3459A0365387K1537486p053146j0571676K272773Q35409j0219232l151873J6740184
3451B0755312J6640304n542263j6602732m996111M024232j643844j619539J2083019
3443B3098378J4495814p078893k5545935j6314346M944428J1289748K523962r392171
$$ y = [25628161, 18165011, 15515927, 14706885, 1995339, -21914890, -39719033, -41327833, -33913131, -26590773, -19801428, -12947223, -9668730, -10999872, -12197966, -9076521, -1413583, 8161001, 11788576, -1178957, -28022557, -45242850, -33145682, -4652517, 7538763, -8090050, -30905717, -39004979, -33287998, -26558910, -24367358, -23146336, -16978385, -3458601, 8772662, 2550943, -24116164, -43464165, -27746061, 10365387, 31902873, 24849727, 14278051, 16550824, 17386233, 7167001, 4015128, 20755312, 37395616, 31853353, 15250621, 10254510, 14278742, 12634898, 11015359, 23098378, 37594192, 30515299, 4969364, -11344982, -6400554, 4889194, 7413156, -1979015]
3435a979015k4147655l6437763k3978651J6888945M7882952L5308926J145066
3428A4682805p626683J3620109K7252452J2371029j2996554k6898434k7075598
3421f670874j7007338J456850J5593961Q304064j4740869k6235166j2994660R057491
3413d3236541K1679669K4807332K1978920Q213089j2707426j8831202Q86055K1160058
3405B3949954Q741429k8255235m4791291j7849025K1424481K8511560K529041
3398e739086j8005505r011995J3658096K5031899K2915358J6460113L920879j6614584
3390C2615175k8092323j2866738J4882858K2369335M827131q286585J52524J0054898
3382C5656275m85862j9832343k3494045j2080523n075728p685226p105138K886929
$$ y = [-1979015, -26126670, -62564433, -86543084, -69654139, -21771187, 13537739, 14682805, 7056122, 20676231, 47928683, 60299712, 47303158, 20404724, -6670874, -23678212, -22221362, -6627401, 1676663, -13064206, -39299372, -52294032, -43236541, -21556872, 3250460, 25229380, 33442469, 20735043, 1903841, 2789896, 23949954, 32691383, 4436148, -40355143, -58204168, -36779687, -8268127, -5739086, -23744591, -32756586, -19098490, 5933409, 28848767, 45308880, 49229759, 32615175, 4522852, -8343886, 6538972, 28908307, 33735438, 25448853, 25601377, 35656275, 35170413, 15338070, -8155975, -20236498, -25312226, -32997452, -40102590, -37215661]
3374c7215661J3785184J7677214J4517722M552892j2102881k7298960k8530065
3367e4614555j3883825M135279J1494031N632412l031207o82481J4342300K5476772
3359a1131274J6924694r26850j408984J8032830K6816114O426183j7369453j1204053
3351B6159207J4164228K0199039Q6506j3555991k692708R319002j549907k1193575
3343C0935801k1249405l446181M908742p303342k0282722j2549091J0709209K5296195
3335G019206J6522798n933857j9282496j0314414J2558420K8070792K2686151
3328E1326600L378469r953874n809160N816741N236391j1313278k4934298j8704961
3320d957370j561674L907860p121355j7742607j6025782q498753l606799O53375
$$ y = [-37215661, -23430477, -5753263, 8764459, 13317351, 1214470, -26084490, -54614555, -68498380, -64363101, -52869070, -47236658, -50267865, -50950346, -36608046, -11131274, 5793420, 4866570, 3457586, 21490416, 48306530, 54732713, 37363260, 26159207, 40323435, 60522474, 60608980, 47052989, 44360281, 53679283, 52129376, 30935801, 9686396, 6240215, 11148957, 3845615, -16437107, -28986198, -18276989, 7019206, 23542004, 17608147, -1674349, -11988763, 569657, 28640449, 51326600, 54705069, 44751195, 38942035, 44758776, 49995167, 38681889, 13747591, -4957370, -6519044, -2611184, -9732539, -27475146, -43500928, -51999681, -55606480, -54953105]
3312e4953105N711309N990799K446677N824089J5969081J5752148q46338j3069036
3304a7174376l591922J2939494J3417699L096204K893912J1124615P256483j0911607
3296A9050502k2718409j7693679p147051j77152P423918J5551381J4068330K263725
3288A0621565n404705j126098M955614K261642o081680j2858022j7037400j8739047
3280d3408131j5707752r175671l253858K703982J0913997J6376012J3552750Q013516
3272a9985155P280183O215320r87762k654594J2733951K7810977J5260762j6487605
3264B9186077k9409530j0855909J1268539J4759934Q940915L240518j2025886
3257A5104658l4231767l3827610J444679L6435332L2671173O78278k0202670j5151912
$$ y = [-54953105, -49241796, -43250997, -40804320, -34980231, -19011150, -3259002, -4105340, -17174376, -20766298, -7826804, 5590895, 8687099, 11581011, 22705626, 29962109, 19050502, -3667907, -21361586, -28508637, -28685789, -21261871, -5710490, 8357840, 10621565, 5216860, 4090762, 9046376, 11308018, 5226338, -7631684, -24669084, -43408131, -59115883, -68291554, -71545412, -68841430, -57927433, -41551421, -27998671, -19985155, -12704972, -6489652, -7477414, -10132008, 2601943, 30412920, 45673682, 29186077, -223453, -11079362, 189177, 14949111, 23890026, 27130544, 15104658, -19127109, -52954719, -51510040, -15074708, 17596465, 18274743, -1927927, -17079839]
3249a7079839J081337J5278644K2860512J7033885k009472j7261379j6477645
3242C426043j0612332j0520723m448214J6070522K9243156J4065540j0496646
3235B6727346j3532978k583923n330086j5481155m756292J8649576J6378513j2715093
3227G355908k4664059j915141J8289700P524403r387897k345297J3134950Q694665
3219A6687232o188653n836380L238422l881591k3414112k8163412j1989003N232596
3211e4314901J2306663J4942201J2643426j028525j4863679q016436J3436762
3204b4894489J7862015m214360k1838220r157823J4741214J4626557p791585j7300531
3196c7967222J611921K1993154J4774953p633566q522124J8328634L5243379J2192540
$$ y = [-17079839, -15998502, -719858, 22140654, 39174539, 37165067, 19903688, 3426043, -7186289, -17707012, -22155226, -6084704, 23158452, 37223992, 26727346, 13194368, 10610445, 5280359, -10200796, -14957088, 3692488, 20071001, 7355908, -17308151, -19223292, -933592, 6590811, -2797086, -5142383, 7992567, 16687232, 10498579, 4662199, 7900621, 4019030, -19395082, -47558494, -59547497, -54314901, -42008238, -27066037, -14422611, -15451136, -30314815, -38331251, -24894489, -7032474, -11246834, -33085054, -42242877, -27501663, -12875106, -20666691, -37967222, -36355301, -14362147, 412806, -7220760, -15742884, 2585750, 37829129, 50021669]
3188E0021669k7325694l4935957m141538K1429472J2441982m896317O317304L2445809
3180E1356730K8257150j2278776m3124588l0749805K153480J4587548K841579
3173A3043318n779934J578088J0843344Q148109l966498j7550906k7322878k5727200
3165d6734557p567656J5644057K1914316O825088q330205n614691N202125M223993
3157a4437530o822972p874013P511685K1066211J5018874m408617j6247457j0313420
3149a6507239L439377P855080l197292j7731613j6730936L427994K1769911J5519291
3141b155427p699148j4722775R259598L6457100L0623906m866476l2262455k8422104
3133a3787781p371285P772078J3245447J5633106J3593563M222814n075454p657308
$$ y = [50021669, 22695975, -12239982, -16381520, 5047952, 17489934, 12593617, 18910921, 51356730, 79613880, 67335104, 24210516, -6539289, -4385809, 10201739, 13043318, 7263384, 8841472, 19684816, 27832925, 23866427, 6315521, -21007357, -46734557, -54302213, -38658156, -16743840, -9918752, -18248957, -23863648, -18661523, -14437530, -21260502, -29134515, -21622830, -556619, 14462255, 10053638, -6193819, -16507239, -13067862, -5212782, -8410074, -26141687, -42872623, -39444629, -17674718, -2155427, -9854575, -24577350, -15317752, 21139348, 51763254, 46896778, 14634323, -13787781, -21159066, -13386988, -141541, 15491565, 29085128, 33307942, 28232488, 20575180]
3125B0575180j1186195k2749609k8731022j1495408J7062066K4066890K680910
3118i777188j4428568j538212K2267474K2492101Q83820r308965N411859K0090574
3110C6092895R596744j6841406l1662340k4658078q687080J723778M193845M042061
3102b6199581O005995J0397597J2937414J0184812O803463J1409023K1801367
3095E3340090K2475095M017089k1335704l2228526k2813941p332478k244436r423434
3087a5546245j5348657m669921K0810512L6736704K1021261j3238810k6906143
3080B858701o616023J2668290l492727l5822644l7220097k246472K5572301J8082134
3072b6216537k032427k905702J1147069J6872326J0624283N148101M098054L648453
$$ y = [20575180, 9388985, -13360624, -42091646, -53587054, -36524988, -12458098, -9777188, -24205756, -25743968, -3476494, 19015607, 19899427, 10590462, 16002321, 36092895, 45689639, 28848233, -2814107, -27472185, -36159265, -34435487, -30241642, -26199581, -20193586, -9795989, 3141425, 13326237, 20129700, 31538723, 53340090, 75815185, 79832274, 58496570, 26268044, 3454103, -3878375, -6122811, -15546245, -30894902, -35564823, -14754311, 21982393, 43003654, 29764844, 2858701, -3757322, 8910968, 5418241, -30404403, -67624500, -69870972, -44298671, -26216537, -28248964, -31154666, -20007597, -3135271, 7489012, 12637113, 16735167, 20383620]
3064B0383620P773985J8803774K1886551K875444k3631200k8360254q614704P496132
3056A8613348J063190j4629920j8092736q284670J381070M170886K715107j389924
3048a4453649q524570j4275860j1174099J589506J5158003J9758532J4860072
3041B937935Q844561P976759P761256p25434j6093490k4621724j6520630J045045
3033b9395722J2255434J0199139J252310m577823k393782N787215J2896304J2357320
3025A8380395N622442J863390O706609J3746322J0575350p878557l2262818m2767341
3017b6014208k4004835J6075806M5436261L8920130R363208p955616k797586k00098
3009D8823062j5991062k8367279j3886548R784835P223195j9000588k8946328
$$ y = [20383620, 28157605, 46961379, 68847930, 71723374, 48092174, 19731920, 11117216, 18613348, 19676538, 5046618, -13046118, -21330788, -19949718, -15778832, -13063725, -14453649, -22978219, -37254079, -48428178, -46838672, -31680669, -11922137, 2937935, 11782496, 19759255, 27520511, 26795077, 10701587, -13920137, -30440767, -29395722, -17140288, -6941149, -5688839, -10266662, -12660444, -6873229, 6023075, 18380395, 24002837, 25866227, 32572836, 46319158, 56894508, 49015951, 16753133, -26014208, -50019043, -33943237, 11493024, 50413154, 59776362, 51820746, 49023160, 48823062, 32832000, 4464721, -9421827, 363008, 7586203, -11414385, -40360713]
3002d0360713l519437K7510460K7505203J584561j4410076l094058J4920023J2163841
2994B2299804q436453j8944621o460048P957565N53386j8610625k1345730n684448
2986d8671170M494552L861229J3689961L4994981L3302870n080412l7767318k3242951
2978b4418258J5332908K5645528M250730q362816K345647J0716622L468259k568337
2970B6410283Q7644k936440j2951880j2139138j176395k382941j5714186j3598704
2962c4401757Q048856J7262935J136869j0388542K534374J5876502P372672n012328
2954B429581j030297L867690p060987j5262690k498223J0176113N9911j1661776
2946b0980678K556320K1864722J1096588j3199746p809620K0166171K1807302
$$ y = [-40360713, -43880150, -16369690, 11135513, 12720074, -1690002, -4784060, 10135963, 22299804, 13863351, -5081270, -11541318, -3583753, -3030367, -21640992, -42986722, -48671170, -44176618, -40315389, -26625428, 8369553, 41672423, 36592011, -1175307, -24418258, -9085350, 16560178, 20810908, 12448092, 14793739, 25510361, 28978620, 26410283, 26497927, 23561487, 10609607, -1529531, -2705926, -5088867, -20803053, -34401757, -26352901, -9089966, -7953097, -18341639, -15807265, 69237, 7441909, 2429581, 1399284, 5266974, -1794013, -17056703, -19554926, -9378813, -9318902, -20980678, -18424358, 3440364, 14536952, 1337206, -6472414, 13693757, 35501059]
2939C5501059j1161769l2160694j5984630O153366N092200j564886J1153850K9692980
2931B6721476K5545158J54628k0270602k0092049n545217Q382392J0025300r54155
2923B3966931j1887103j2501521r638669j2069332q491717J4384022L7428067
2916B1190678K6336483j4314263l9866001k7256801k134972R154451J6451682
2909a0438743L1686684L4281268N498345k8101526k5107947R738144L1667705
2902D9223930J7677228j0796699k6424593k6520173j9875296r533851J063900
2895b5185554M048271j00817K18599R028698J4179423O811179k384596J499416
2887H114619J4211726J8274500Q645534k258170o447207j2120664k5400192l3001896
$$ y = [35501059, 24339290, -7821404, -23806034, -17652668, -12560468, -14125354, -2971504, 26721476, 52266634, 52421262, 32150660, 12058611, 6513394, 14895786, 24921086, 23966931, 12079828, -421693, -10060362, -22129694, -30621411, -16237389, 21190678, 47527161, 33212898, -6653103, -33909904, -36044876, -26890425, -10438743, 21247941, 55529209, 61027554, 32926028, 7818081, 17556225, 49223930, 66901158, 56104459, 29679866, 3159693, -16715603, -26249454, -25185554, -21137283, -21238100, -21019501, -11990803, 2188620, 8999799, 6615203, 8114619, 22326345, 40600845, 49246379, 46988209, 40541002, 28420338, 3020146, -29981750]
2879b9981750j8652470Q687207K1474014J0531113k468457K969551J8200461K2121637
2871C2881306J1758499o47660j0694600k2108812k9762466k3246522o363269N995460
2863d2188064J0878462J8329493K7831105K4454560M939383j1592844r586278
2856B3065817J206068J582937j0704504k1848132k1422681j0956955J617559Q383602
2848b9076289N937485j695236p329013q409137o092274N91390J0865360J5543415
2840a9664299O688402p351012j0669996l426795r05211p738697j1054395l782266
2832e7904269L390140R20098m988979m982859R74468J0746042K3613768K9893010
2824A661419J6229451q596744j4036663J0845867L5751889K8257642j788406j9033966
$$ y = [-29981750, -48634220, -39947013, -18472999, -7941886, -10410343, -7440792, 10759669, 32881306, 44639805, 43992145, 33297545, 11188733, -18573733, -41820255, -48183524, -42188064, -31309602, -12980109, 14850996, 39305556, 44244939, 32652095, 23065817, 24271885, 25854822, 15150318, -6697814, -28120495, -39077450, -37459891, -29076289, -23138804, -24834040, -32163053, -40572190, -46664464, -46073074, -35207714, -19664299, -12975897, -20326909, -30996905, -34423700, -35328911, -43067608, -54122003, -57904269, -54514129, -53594031, -58583010, -63565869, -62591401, -51845359, -28231591, 1661419, 17890870, 9294126, -4742537, 6103330, 41855219, 70112861, 68324455, 49290489]
2816D9290489j0816790N606998J5067825J7722117J3263356k894845k3717262
2809F3521888l0386353j5197579P075800J5079021J213706k2604043l2649961
2802a3947521j3052208K2268215L6196658J1477886k2440120k5712432k947272
2795h156794N779630j2930367k5696413m957083K8997808L9683483K4920849Q688477
2787E6329590j931908j9521903m0850372m1979785j6608193Q101300Q962937j028750
2779d8527084K893164J6999783J8062830M292987q20812J2387605K2975347J2083757
2771D0347577q576344j6096478q822417k204439k775710m120824k750296j532079
2763f531010n23944J683475N69407p692720j5875360j4152674m521656M692147
$$ y = [49290489, 38473699, 44080697, 59148522, 76870639, 90133995, 87239150, 63521888, 33135535, 17937956, 25013756, 40092777, 41306483, 18702440, -13947521, -26999729, -4731514, 31465144, 42943030, 20502910, -5209522, -8156794, -2377164, -15307531, -41003944, -45961027, -16963219, 22720264, 47641113, 56329590, 54397682, 34875779, -5974593, -47954378, -64562571, -56461271, -47498334, -48527084, -45633920, -28634137, -10571307, -6278320, -7099132, 5288473, 28263820, 40347577, 31771233, 15674755, 6852338, 4647899, 1872189, -2248635, -4998931, -6531010, -7054954, -5371479, -4802072, -12494792, -28370152, -42522826, -47044482, -42352335]
2755d2352335J1742091J6260512J1529144j364085l908007J2912246K4620233
2748B9439799N942781k2413362j7734863J6594437L1009352N820964j8518027
2741C0141081p389312J4347408O095470k4950273m1562494l3918567k0454282
2734g7690969p348559J3501996L3444823L0619901N066626j8417584k3966093
2727d4789859j7825337q589195K865353J3228271J6956313J7114069J9062770
2720a977615J6804253L821158q535817n741402K197034o008974k4249233k3540025
2712d7230621P25452J6926621M792901j2756431m960521K0088849K8679379J1020699
2704A7286328p608514n664614N907725L774449j1858500j8061075m824965P865914
$$ y = [-42352335, -30610244, -14349732, -2820588, -4184673, -8092680, 4819566, 29439799, 35382580, 12969218, -4765645, 11828792, 42838144, 48659108, 30141081, 22751769, 37099177, 43194647, 18244374, -23318120, -57236687, -77690969, -85039528, -71537532, -38092709, -7472808, -2406182, -20823766, -44789859, -62615196, -71204391, -68339038, -55110767, -38154454, -21040385, -1977615, 14826638, 18647796, 10111979, 4370577, 6567611, 558637, -23690596, -47230621, -46505169, -29578548, -24785647, -37542078, -42502599, -22413750, 6265629, 17286328, 9677814, 4013200, 9920925, 13695374, 1836874, -16224201, -21049166, -13183252]
2696a3183252q3222j4915632o194495K5331098M2397329K1284172j5639692l1200641
2688G795665j8140537L860820J8485488K0395203P249799j3598636k1127419n473581
2680e53198J1717423L317410k4410411m0520086l0294281o007633J6486816K9332472
2672d0931488K6636483J0434375j320448M647283J3081814P01956k4538290l1589347
2664d2877662j1626685J2132459K0426164J7209605J1064472L231807k467074
2657G093086j228704l58503q112086j2554645O86046J4365377k5922k7846064
2649b7981415k1596633K3557529N1150989K4021742j9015650k2409859M127091
2642A1853794Q036625k0826685l6557212r032535L2264447M1131516J4740957
$$ y = [-13183252, -13266474, -28182106, -34376601, -9045503, 33351826, 54635998, 38996306, 7795665, -10344872, -6484052, 12001436, 32396639, 39646438, 26047802, 4920383, -553198, 11164225, 14481635, -9928776, -50448862, -80743143, -86750776, -70263960, -40931488, -14295005, -3860630, -5181078, -533795, 12548019, 13249975, -11288315, -42877662, -54504347, -42371888, -21945724, -4736119, 6328353, 9560160, 7093086, 5864382, 5505879, -2606207, -15160852, -14474806, -109429, -135351, -27981415, -49578048, -26020519, 25130470, 49152212, 30136562, 7726703, 11853794, 19890419, -936266, -37493478, -46526013, -14261566, 26869950, 41610907]
2635D1610907r435147n350780J2352494J3329386o757392k2341399j5046392J016810
2627I378487J580624j2587540k0166399j1663999K461312J2561428J8246428J7197427
2619A7007768O207465n701188m804816N622449R732797M318480j90015j309568
2611C0883372m918383p828829m627868n997384k0533190k6059992J997776L8197012
2603A112514L1538709j3300816l3384879j810580L1363401K0371432p917601p494144
2595B0478036J1016534Q090503j5186103k7806614k5132514k3251606j4972243
2588f6764007J6520729N0328628M5407687M053712k7710071k5730515j2331339
2581a6225176j0172200j1010635j933600R974260J3779462J1900070R506168N324380
$$ y = [41610907, 32175760, 26824980, 39177474, 52506860, 45749468, 23408069, 8361677, 9378487, 10959111, -1628429, -21794828, -33458827, -30997515, -18436087, -189659, 17007768, 23215233, 17514045, 12709229, 18331678, 28064475, 32382955, 32192940, 30883372, 25964989, 18136160, 13508292, 7510908, -13022282, -39082274, -37084498, 1112514, 32651223, 19350407, -14034472, -15845052, 15518349, 35889781, 27972180, 20478036, 31494570, 39585073, 24398970, -3407644, -28540158, -51791764, -66764007, -50243278, 85350, 45493037, 49546749, 21836678, -3893837, -16225176, -26397376, -37408011, -39341611, -29367351, -15587889, -3687819, 5818349, 11142729]
2573A1142729R61630K840969R368165J1324908P935395O993374P259621k052590
2565E5774201k0045563k8347872j4038273J1924747K5747395J5067582j0579231
2558C5502986l0075838l0560670j7784826n781939M8282L287307N603629P195151
2550c2565918J2462254K0282345J6408836m582975k0343002j1056595L790991
2543a5604064l657461j4952310O327451L8451900K1154508m0486919o7189320
2536g5956215k5420331K0973437J8254813L404815K1427703L7427173N019393
2529E130788m0551753m0147982r859440J386765M143133K8542871M0105546l592101
2521a4842173n4809362m5336791j4854000m1849832p8172503o541173J40507030
$$ y = [11142729, 12104359, 14945328, 24313493, 35638401, 43573796, 50567170, 57826791, 55774201, 35728638, 7380766, -6657507, 5267240, 31014635, 46082217, 35502986, 5427148, -25133522, -42918348, -48700287, -48652005, -45364698, -39761069, -32565918, -20103664, 178681, 16587517, 12004542, -8338460, -19395055, -15604064, -19261525, -34213835, -27886384, 10565516, 31720024, -8766895, -75956215, -101376546, -80403109, -62148296, -58743481, -37315778, 111395, 5130788, -35420965, -75568947, -85428387, -84041622, -79898489, -51355618, -11250072, -14842173, -69651535, -114988326, -129842326, -171692158, -249864661, -256405834, -115898804]
2514a15898804J87380105P5327519m6051327m9010652K801561J842035k6263549
2507C0126888q277618K6447394J0912741k5734418j6897602J0989792q750581
2500A8816596m8636210l0757006K8833725M3440953M344410j4283771P518912
2493I277609J1065013k0636122l0131336M196184K6160992L478514j6970616M200126
2485i359636L2595871K4655978l701157j6711904j5443408j4051772m162733J7446908
2477A1268147K3419881l657506l5033670l3895712n869957J6329981J7220350
2470a0218486M191679j0829508j5253290l87058K1448825K3647202K582338j3410682
2462A771020n900275O215081j207338j8398948j6154188J1582931L8040734L4674891
$$ y = [-115898804, 71481301, 146808820, 100757493, 51746841, 54548402, 56390437, 30126888, 21849270, 48296664, 59209405, 33474987, 16577385, 27567177, 18816596, -29819614, -60576620, -31742895, 11698058, 16042468, 1758697, 9277609, 20342622, -293500, -30424836, -26228652, -67660, 3410854, -13559762, -9359636, 23236235, 47892213, 44191056, 27479152, 12035744, -2016028, -6178761, 11268147, 34688028, 31030522, -4003148, -37898860, -43768817, -27438836, -10218486, -6026807, -16856315, -32109605, -32496663, -11047838, 12599364, 15181702, 1771020, -4129255, 2085826, 878488, -17520460, -33674648, -22091717, 15949017, 50623908]
2454E0623908L513066k3197006j9009495J652726M43227k6915401l7619853p080987
2446e7589815K5972745J7375143r663710l056427K7816048K6247643j3249026
2439A3852601l2180993m691258K2695799J2343596p354169q27415J4541836Q900531
2431B7280528n889685o702672m591209j5035251j7662913P055739L0739053J7029834
2423C2223424j4267993j4962984J4309383K6479439K431340k4951356k4534882
2416c273629m949123Q778001O101450q565212k3138987k2152859k333204J7590029
2408c1943534J9647464J2115827J2763246J7233304R323273n945976q269976L272937
2400B8196565R567587L421687m503612r753594j6959325k0271206r506489M599086
$$ y = [50623908, 54136974, 30939968, 11930473, 13583199, 14026426, -12888975, -50508828, -57589815, -31617070, -14241927, -23905637, -26962064, 853984, 27101627, 13852601, -18328392, -23019650, -323851, 12019745, 4665576, 3838161, 18379997, 27280528, 21390843, 14688171, 10096962, -4938289, -22601202, -15545463, 15193590, 32223424, 17955431, 2992447, 17301830, 43781269, 46212609, 21261253, -3273629, -8222752, 555249, 6656699, -1908513, -25047500, -47200359, -49533563, -31943534, -12296070, -180243, 12583003, 29816307, 39139580, 33193604, 24923628, 28196565, 37764152, 41185839, 36682227, 26928633, 9969308, -10301898, -19808387, -15209301]
2392a5209301J951980q809074J655037L0861341L8064485O559458k4034339j4607348
2384A6432239J3823669J2586152k0798555m0664497k0944324J1862465K1420243
2377f282608Q137271k843561q83429K438047l700882j5969578k5296224k6500432
2369g0901396j8587062m592945P211532R633936O205979P773678J7411247K5854154
2361a9990877K4474964J4853448K227374j0746313j8324300j1604488O011739
2354a3098453J4455785J866807j5415650j4311958J071972O870845l778265j4325472
2346c6664389j5010647j4676734j6764610q192081J5190161L2413959K3916942
2339a9787399R60480q834976J954198J3853177Q422944q205169j2659843P096236
$$ y = [-15209301, -13257321, -22066395, -20411358, 10449983, 48514468, 55073926, 31039587, 16432239, 30255908, 42842060, 22043505, -18620992, -39565316, -27702851, -6282608, 1854663, -988898, -1872327, 565720, -3135162, -19104740, -44400964, -70901396, -89488458, -94081403, -86869871, -77235935, -71029956, -63256278, -45845031, -19990877, 4484087, 19337535, 21564909, 10818596, -7505704, -19110192, -13098453, 1357332, 3224139, -12191511, -26503469, -25431497, -18560652, -22338917, -36664389, -51675036, -66351770, -83116380, -91308461, -76118300, -43704341, -19787399, -18826919, -27661895, -25707697, -11854520, -3431576, -11636745, -24296588, -17200352]
2331a7200352L2977880L3674639M314583k3369476k2760166q679499r497931j8217334
2323b8757656o825956J7970685J8318242r918069k3021566J936940K8882968K0477932
2315A9063520o078008j5482915j1152850j4308877j5289264O696453L4025198
2308b526743K9629493l261345k4596997j6516250J164911J1056440J4525181R591647
2300A9066337q620788k4621962j6962958L363343O455703m818745J058993K5325899
2292B45822L1288735P032289j1829600k071002R509624l813640k1234489j2318576
2284c190837R596756J1426953m221564p276362Q730137J9913063J0976465q513880
2276C7440731k3570869k5685446j0163775J5853924K8069988J0733815j6315861
$$ y = [-17200352, 15777528, 49452167, 53766750, 30397274, 7637108, -1042391, -10540322, -28757656, -35583612, -17612927, 705315, -9212754, -32234320, -30297380, -1414412, 19063520, 12985512, -2497403, -13650253, -27959130, -43248394, -36551941, -2526743, 27102750, 23841405, -755592, -17271842, -16106931, -5050491, 9474690, 19066337, 10445549, -14176413, -31139371, -27776028, -21320325, -26139070, -25080077, 245822, 31534557, 38566846, 26737246, 24666244, 34175868, 30362228, 9127739, -3190837, 6405919, 17832872, 13611308, 6334946, 15065083, 34978146, 45954611, 37440731, 13869862, -11815584, -21979359, -6125435, 21944553, 32678368, 16362507]
2269A6362507j9159846M290386K3200863J8198972K438794o088799r752592j7732722
2261A1757563k5221470k1386040q716809k82899n54553o656R436058K0822220
2253a4152586J9537102K968262j2924353j0688186P772535K2999218J9934523
2246C5446515K582258j3169544j5884065p447219j2827l068007j0573531o935675
2238a9062095Q681563J5157882m62564j7769414r777627J3418046J6707296n898429
2230I94658k2084222j2053747N920868J3513830K0201212L1803658K5928670r654229
2222E4570698m2440741l6723978q660962R10868p518459K60571K6124246L1991308
2214A8513551M467198j9930421j0908859J3468897K2374751J6628888J1769533
$$ y = [16362507, -2797339, 1493047, 24693910, 42892882, 45331676, 39242877, 29490285, 11757563, -13463907, -34849947, -43566756, -43849655, -44404208, -44410864, -34974806, -14152586, 5384516, 8352778, -4571575, -15259761, -7487226, 15511992, 35446515, 38028773, 24859229, 8975164, 1527945, 1515118, -1552889, -12126420, -19062095, -10380532, 4777350, 4314786, -13454628, -23232255, -9814209, 6893087, 994658, -21089564, -33143311, -27222443, -13708613, 6492599, 38296257, 64224927, 54570698, 12129957, -24594021, -33254983, -32344115, -39862574, -39602003, -13477757, 18513551, 22980749, 3050328, -7858531, 5610366, 27985117, 44614005, 56383538]
2207E6383538M273047j4708763l0296565k0486191O308975J8022435J880539k0908485
2199D68530k4719167p343920J4099281K2893180J5497312K094128m217480j788439
2191A6983425o65997o117572r954164m050384O123071R650701M564927l871385
2183A2662622j1692577j5091098r649180J49972P45220j0045809j3873036J737387
2175d5056499J9085532J3195262p968537j0764917J6314904M5397666M5361225
2168G5564636J5767818k1833851m7920113n1715105l1864554l088343J0817527
2161e4271985K530266j0347598j0796932l237843R43936L083854P519655O307022
2153e8269625o979666j8133692q367205J5860227K9889625K5129135J5814752
$$ y = [56383538, 60656585, 45947822, 15651257, -4834934, 1474041, 19496476, 21377015, 468530, -24250637, -31594557, -17495276, 5397904, 20895216, 22989344, 18771864, 16983425, 16317428, 10199856, 245692, -3804692, 2318379, 11969080, 16534007, 12662622, 970045, -14121053, -23770233, -23620261, -22875041, -32920850, -46793886, -45056499, -25970967, -12775705, -20744242, -31509159, -15194255, 30203411, 75564636, 91332454, 69498603, 21578490, -30136615, -62001169, -65089512, -54271985, -51741719, -62089317, -72886249, -76124092, -75180156, -72096302, -64576647, -58269625, -65249291, -83382983, -91750188, -75889961, -46000336, -20871201, -5056449]
2146e056449J2127973P724598k615122j2267571j5499149j4870519j1309404k407911
2138d4173554O415286P324537R653122L0605144N8701889N4594574O601749m0217882
2130H9504865l8311207k844421J0860065j3978239l6851759k3506580P028084
2123h099192J5557594k388633j8192324j4012663j521528J778295l873351p381640
2115c8133442o083687o970906j0910152p395870Q300937K0981225J2104918j0850592
2107c8957569j8035957L806052L1247043L3987027J2037238j0566732j8249750
2100d732648j3759926m205897M348178L839992n851142q283910R118662L0077677
2092A0550986K6955934J862954j4254710o717899L964596l193129j9472000k4451872
$$ y = [-5056449, 7071524, 14796122, 12181000, -86571, -15585720, -30456239, -41765643, -44173554, -37758268, -30433731, -20780609, 9824535, 68526424, 123120998, 129722747, 89504865, 51193658, 48349237, 59209302, 45231063, 8379304, -15127276, -8099192, 7458402, 5069769, -13122555, -27135218, -28656746, -26878451, -30751802, -38133442, -44217129, -51188035, -62098187, -69494057, -61193120, -40211895, -28106977, -38957569, -56993526, -53187474, -21940431, 12046596, 24083834, 13517102, -4732648, -18492574, -22698471, -18350293, -14510301, -20361443, -28645353, -19526691, 10550986, 37506920, 39369874, 25115164, 18397265, 22361861, 19168732, -303268, -24755140]
2084b4755140j5469792l690112N550152J3539624J8392903J6372060P542261m841805
2076A2640151j2812404k781915K7248239M9678294L1549765j5919354m0366927
2069D9235849j6515437J6668549J0880716k4520309m2456932k7165777n957770
2062c9831111j25167k172336l379728r073009j7639719j3592991N920088K1349022
2054e8544951K0637190J7820680K6418080L2824990J6258443j6046806l4351756
2047E015870k4123978j856281Q021266J7257j2241576j4689875o110951M657071
2039d1311197J0054009J0165501Q749191O426764P48306q007721j4145308j0981435
2031c8301890J719224J4753558J6827333Q041241K038411P800598J3596627J321088
$$ y = [-24755140, -40224932, -43915044, -38364892, -24825268, -6432365, 9939695, 17481956, 12640151, -172253, -2954168, 24294071, 73972365, 105522130, 89602776, 49235849, 32720412, 49388961, 60269677, 35749368, -6707564, -33873341, -39831111, -39956278, -42128614, -45508342, -54581351, -72221070, -85814061, -79893973, -58544951, -37907761, -20087081, 6330999, 39155989, 55414432, 39367626, 5015870, -19108108, -20964389, -12943123, -12925866, -25167442, -39857317, -45968268, -41311197, -31257188, -21091687, -12342496, -5915732, -5167426, -13175147, -27320455, -38301890, -36582666, -21829108, -5001775, 3039466, 5077877, 12878475, 26475102, 27796190]
2023B7796190k4489755l8144939k6949363o855516L354481N813730J0278416J4904530
2015c4292226J5819605J9442362K6564676J9859874r651825l7009409l1378607
2008c0645550p18821K0306480K0368617J7282254J6849297L439912k1516481k8753475
2000c387767n918611J7345773J0966979j2871197k2842795j5578256j2339271
1993d4625145j9120916j7361252N675720L6630559M9738748L1021990r848904
1986C2110800m3626905m1977207m897382L3853363L8021425O154420k7755066
1979h116552l0436980k453425K4241672K0130175j0468352l4461662k8284827
1972f9849951l615486J2277544J1549620O329988L079484j714284l388319Q601959
$$ y = [27796190, 3306435, -34838504, -61787867, -68643383, -65288902, -59475172, -49196756, -34292226, -18472621, 969741, 27534417, 47394291, 37742466, 733057, -30645550, -31364371, -11057891, 9310726, 26592980, 43442277, 46882189, 25365708, -3387767, -9306378, 8039395, 19006374, 6135177, -16707618, -32285874, -44625145, -63746061, -81107313, -75431593, -38801034, 10937714, 41959704, 32110800, -11516105, -53493312, -58390694, -24537331, 13484094, 19638514, -8116552, -38553532, -41006957, -16765285, 3364890, -7103462, -41565124, -69849951, -73465437, -61187893, -49638273, -43308285, -40228801, -41943085, -45331404, -36729445]
1964c6729445K7701084L3417202K2121890J0938547O362191l341724j7037060
1957D3432685j4297782N577998J1338367j2001500l4122904k5231195j242055
1950b6546386Q181855P823841J4872292J5245331j0570082l6872605k1972098
1943d9837852K0095523L3058347N074344j4704424K255031K1441413P999703j7854722
1935G527363k1475277j0158539j0531428j8626393j1743904Q926378K2865582
1928c3216218K3736348J8185730M936355j5558292k4296633p525190J4312227
1921a9425673J2938999l319497n347819O397503O637943m537326p03688J7594804
1913A0235246J5319043j5637727l2045824m058072L2742033K7107374j1973448
$$ y = [-36729445, -9028361, 24388841, 46510731, 57449278, 63811469, 60469745, 43432685, 29134903, 34712901, 46051268, 34049768, -73136, -25304331, -26546386, -18364531, -10540690, 4331602, 19576933, 9006851, -27865754, -49837852, -29742329, 3316018, 8390362, -6314062, -4059031, 17382382, 25382085, 7527363, -13947914, -24106453, -34637881, -53264274, -65008178, -56081800, -33216218, -9479870, 8705860, 13642215, -1916077, -26212710, -33737900, -19425673, -6486674, -9806171, -15153990, -8756487, -2118544, -6655870, -7359558, 10235246, 25554289, 9916562, -22129262, -26187334, 6554699, 33662073, 21688625]
1906B1688625l1282232j1697746J2708160J2849476J649915K219407J1403535
1899A9539140J3480216Q254502N118160K491773p127981j8415983j7495378m019853
1891A824596N466493o76211j4084670j8159062r026256J465391K691601m86938
1883c0985056M593115J7256262J8718998l397084l1052166l1122629J869220L3325967
1875b0793373K9985205K399708j1005249L100984J7718129P965486j2605912j4655035
1867B109943J290459O012926j1754943k4522268n538233K8019393L4366867M621532
1859C4605676k4453645k1626075j164520N247204l027914k632335Q066012M583666
1851d01931j8030719k8650867o239359K3994540K4853633j192014k1789150k2861599
$$ y = [21688625, -9593607, -21291353, -8583193, 4266283, 5916198, 8135605, 19539140, 33019356, 41273858, 46392018, 48883791, 41755810, 23339827, 5844449, 1824596, 7291089, 6614878, -7469792, -25628854, -34655110, -33189719, -30498118, -30985056, -26391941, -9135679, 9583319, 6186235, -24865931, -55988560, -54119340, -20793373, 9191832, 11591540, 586291, 3687275, 21405404, 29370890, 16764978, 2109943, 3400402, 9413328, -2341615, -26863883, -32402116, -4382723, 29984144, 34605676, 10152031, -11474044, -12638564, -7391360, -10419274, -13051609, -4985597, -401931, -18432650, -47083517, -53322876, -29328336, -4474703, -5666717, -27455867, -50317466]
1843e0317466j6681652r021151Q343047L0118743L3763894J3100823r140774j3591094
1835a3425630p858236o866327r932200r902899o569254J247982J8106533L4147504
1827a052527K6732137l731968k2355593n986104K0485743K0651905l76354j2426505
1819B1940734j3609040k6120654m5159108l7327998K733343L5177178L0651224
1812c1714321Q933650J420602N262944J520242m759385M765587K3310992K3670309
1804C2410620K70836j9813009j3529232R144526K1245961J2300903l481036q366473
1796C0183096k816635k006242j1637157j6341932j848091J8557445J8276572k750431
1788B9616625j6060592r089161m532548j8807809k8179102n121595L1243884L8005973
$$ y = [-50317466, -66999118, -76020269, -67677222, -37558479, -3794585, 9306238, 165464, -13425630, -21283866, -28150193, -38082393, -47985292, -54554546, -53306564, -35200031, -1052527, 25679610, 21947642, -407951, -6394055, 14091688, 34743593, 34367239, 21940734, 8331694, -17788960, -62948068, -100276066, -97542723, -62365545, -31714321, -22780671, -21360069, -16097125, -14576883, -19336268, -14570681, 8740311, 32410620, 32681456, 12868447, -660785, 8483741, 29729702, 42030605, 38549569, 30183096, 27366461, 25360219, 13723062, -2618870, -4466961, 14090484, 32367056, 29616625, 13556033, 4466872, -65676, -18873485, -47052587, -52174182, -20930298, 17075675]
1780A7075675J2519866o153915J34764O061514o672536j7014726n027588J0132830
1772A1055884L967821q380055J510802K1926806J6773295j1869431k1505558M667068
1764A8146632L0889126K3845167j738950j5680288j9161294k7734816l1335467
1757b2769890j0015669K1679328K5950810k196715k5881501k0524239m359182
1750c8117058j358872l756065O392525K0504969J5753376o968292k3014854j8953981
1742d9518252o587597j031753j959167j281479K227488K242263n383671j4647760
1734g5939928j2038897P428257K6509693J9901019j2158340l8276019l4410682
1727a18984897j3342971k53899N515361K0037321L6833143L1291307L855287j2626095
$$ y = [17075675, 29595541, 23441626, 23576390, 29637904, 22965368, 5950642, 923054, 11055884, 15023705, 6643650, 8154452, 30081258, 46854553, 34985122, 13479564, 18146632, 49035758, 72880925, 71141975, 55461687, 36300393, 8565577, -22769890, -32785559, -11106231, 14844579, 12647864, -13233637, -33757876, -38117058, -39475930, -43231995, -36839470, -16334501, -581125, -7549417, -30564271, -49518252, -56105849, -57137602, -59096769, -60378248, -58150760, -55908497, -61292168, -75939928, -87978825, -80550568, -54040875, -34139856, -46298196, -84574215, -118984897, -132327868, -132581767, -127066406, -107029085, -70195942, -38904635, -35049348, -47675443]
1719d7675443J000568K3241752K6361906J5164092J0987966J4061022P227161
1712E0369024j0419778j9513900j2367955p618564k3068216m7536526n3270753
1705a23426668l1214623r14774J5531390J7104803J4823758J0597142J11167q989925
1697a06377730k600837J3936451J7693614L799665n480184j376192r017375m1043436
1689a30466024o1018209l6174385l684926k3643711p0956800m7073284P5831053
1682b97186286J89554040J79284189P1439190j0016419p298958K0681978O791634
1675A53249368l4720728n0355352k8987221m231452k77996r442116j5636453j4857755
1667e259705j0278655j572825J3948150L1929520L7573420J9102195j2230266
$$ y = [-47675443, -46674875, -23433123, 2928783, 18092875, 29080841, 43141863, 50369024, 39949246, 20435346, 8067391, 448827, -22619389, -70155915, -123426668, -154641291, -155556065, -140024675, -122919872, -108096114, -97498972, -97387805, -106377730, -108978567, -95042116, -77348502, -73548837, -79029021, -80405213, -89422588, -130466024, -191484233, -227658618, -231343544, -254987255, -325944055, -373017339, -297186286, -107632246, 71651943, 143091133, 133074714, 125775756, 146457734, 153249368, 118528640, 68173288, 39186067, 34954615, 34676619, 25234503, 9598050, -5259705, -15538360, -17111185, -3163035, 28766485, 66339905, 85442100, 73211834]
1660G3211834k5669275n197427K6888580L3986745Q185831k4481603l7744699
1653D9179986k8654280r693908N977737R814830K344784n199528l725014Q22463
1645B0867070j687188o658571j954525J0008351J5435408J2240919J0067919P887595
1637F6206978n683721k6323409l1995951j5536654K135467K754887m260702r29341
1629a3632446J1321874J7896892J3408130M078367l221590l606890N081906J5378955
1621D6705198J4207267J354266q476756r456992j3981160k7054514l0103264q639713
1613c5445668J9159587K3908288N245602j1800799j3746634q823341m400502J180954
1605b4722513L687141o096977k1536615k1982378l387254J2564673J0148413J845612
$$ y = [73211834, 47542559, 42345132, 69233712, 103220457, 111406288, 86924685, 49179986, 20525706, 10831798, 16809535, 26624365, 28969149, 23769621, 20044607, 20867070, 19179882, 12521311, 10566786, 20575137, 36010545, 48251464, 58319383, 66206978, 60523257, 34199848, 2203897, -13332757, -11197290, -8442403, -12703105, -13632446, -2310572, 15586320, 28994450, 33072817, 29851227, 26244337, 31326243, 46705198, 60912465, 62266731, 53789975, 44332983, 30351823, 3297309, -26805955, -35445668, -16286081, 7622207, 12867809, 1067010, -12679624, -21502965, -25903467, -24722513, -21035372, -27132349, -48668964, -70651342, -74038596, -61473923, -51325510, -49479898]
1597d9479898M973129J2578663O882521q925690j4521155m846789L286345O49765
1589d9403109J362211J8144542L7068268L3783804P897891j6116739k1055801
1582A1681067j3218900l657196Q669937K4261877K8731809R425605k0154920l1861724
1574A3877555j8948948k950537q03249l053668N211589J7224243J5265436Q19182
1566B6641603n363478N249864J4493341L712553j6846480j9475052K808142K5013651
1558C6234144K2819384L417820q390255n507849j932496m727250n325324k779471
1550C3808703j1084070l0653303l5572048r534440K4278067L3603958K1582677
1543B6429544J2721861Q785020n791183k2840027j6474458Q322061J5410994m517031
$$ y = [-49479898, -44506769, -31928106, -25045585, -33971275, -48492430, -53339219, -50052874, -49403109, -48040898, -29896356, 7171912, 40955716, 48853607, 32736868, 11681067, -1537833, -5195029, 3474908, 27736785, 56468594, 65894199, 45739279, 13877555, -5071393, -8021930, -8825179, -11878847, -6667258, 10556985, 25822421, 26641603, 21278125, 26527989, 41021330, 44733883, 27887403, 8412351, 11220493, 36234144, 59053528, 62471348, 54081093, 48573244, 46640748, 41913498, 36588174, 33808703, 22724633, -7928670, -43500718, -53035158, -28757091, 4846867, 26429544, 39151405, 47936425, 42145242, 19305215, 2830757, 11152818, 26563812, 22046781]
1535B2046781j6919193p31937J7603386J1451229k210975K014582J1125119J20721
1527D4499713j9397187j8784594m209049n982026k3902015k5026904L031909L2435273
1519a7334880L4361302J0252711j9654385l4649517j9967900J9546982N0883171
1512B3437484M2647403N004983k2754773k2642359j0709369l004014L80227k492486
1504I867096j5588996k3813874o387878K2772214K5423910n23225j2159311R535064
1496I125000K5566569K694083k8902557k2759908R367922J8957014o84109r336930
1488D027084R208281K1142381J59743k9245725k8741375l42992K1122359J6070301
1480A3400057j272969p908827R93984J1984389J0646401m411475k0986512k4358795
$$ y = [22046781, 5127588, 4395651, 21999037, 33450266, 31239291, 33253873, 44378992, 44499713, 25102526, 6317932, 2108883, -3873143, -27775158, -52802062, -49770153, -17334880, 17026422, 27279133, 7624748, -27024769, -46992669, -27445687, 23437484, 66084887, 71089870, 48335097, 25692738, 14983369, 11979355, 12359582, 9867096, -5721900, -29535774, -35923652, -13151438, 12272472, 11749247, -410064, 9125000, 34691569, 37385652, 8483095, -14276813, -4908891, 14048123, 13364014, 4027084, 13235365, 34377746, 34537489, 5291764, -23449611, -23792603, -2670244, 13400057, 12127088, 4218261, 5212245, 17196634, 27843035, 23431560, 2445048, -21913747]
1472b1913747j0585750R158883J8039663J0170175k125400k644543O152469M934295
1464A1186045j2014034k1982368n259716K0745185K3260778L440218o692637L166967
1456A5850438P533840o899624j6647342m779965O179014o431856k3557959j7245709
1448d5999163J72275R04024m649222J2902487M1257081L8530224N302906j0606915
1440C7813697P507980J6066319j5934521n3224338m8630039j3357874Q572452
1433f1186324R050066J3702661K6672594K4393375K769838j0717034j40322J5822094
1425B0366948J5634191M539156q70597J622811L606228J911227j777819p481323
1417C7550822j2971908j1393540j545000O562347M089952n253828j2802367j6237986
$$ y = [-21913747, -32499497, -23340614, -5300951, 4869224, 2743824, 99281, 6251750, 11186045, -827989, -22810357, -28070073, -7324888, 15935890, 19376108, 12683471, 15850438, 23384278, 16484654, -162688, -4942653, 1236361, -5195495, -28753454, -45999163, -45826888, -44922864, -49572086, -36669599, 4587482, 43117706, 48420612, 37813697, 45321677, 61387996, 45453475, -7770863, -56400902, -69758776, -61186324, -52136258, -38433597, -11761003, 12632372, 15402210, 4685176, 4544854, 20366948, 36001139, 40540295, 39669698, 41292509, 44898737, 46809964, 45032145, 37550822, 24578914, 13185374, 11640374, 18202721, 22292673, 17038845, 4236478, -12001508]
1409a2001508j5746201p496603P794287J6148037M628288j6699685k1424568M15558
1401d4382395K7302433L0852372Q001656j8689150k7616024j7100656p01059Q220138
1393c4112685O735243K660726N516317J4213624J5888712K089406j6502929j9977183
1385b3488769m224126J3111725J5023194M546276m427611p438390r866232j1300516
1377b8064449l414513J3043788K1002344P287356j5106994j8419643L558192K3525203
1369C411284J5419158q570054j3798157O437817J9848102L376440k0860735j8279925
1361a3016070O627008J9207728O286533j1766400j8539509j8650549j3119947
1354d2971206P890933L5356802L7866412P810040j8912916j4169360k71645r993091
$$ y = [-12001508, -27747709, -35244312, -27450025, -11301988, -6673700, -23373385, -44797953, -44382395, -17079962, 13772410, 21774066, 3084916, -24531108, -41631764, -42332823, -34112685, -27377442, -24716716, -19200399, -4986775, 10901937, 12991343, -3511586, -23488769, -27712895, -14601170, 422024, 4968300, 540689, -6897701, -16763933, -28064449, -31478962, -18435174, 2567170, 9854526, -5252468, -23672111, -20113919, 3411284, 18830442, 10260388, -3537769, 2900048, 22748150, 26124590, 5263855, -13016070, -6389062, 12818666, 19105199, 7338799, -11200710, -29851259, -42971206, -35080273, 276529, 38142941, 45952981, 27040065, 12870705, 12599060, 2605969]
1346B605969k9413012k1636795Q153652J7205857q090931l2815720k6777981j24546
1338i0893507K4175840M0154157M7300121L7942084J3774112n702969o899885
1331E9849953P64657J795712n738893j4177921j5225790k324305J8895507K4232198
1323F8071118j193338l0621481k3129582J3957069K8243900j739111l4904029
1316A8684546l1644380q608470o5130j446554J0001893K5951271K0753329k473847
1308C1152658j7959774j7277400r959576J940968J6485666J4366697j4445049
1301D304190m0254621k8866595M866458J9850646J3062606J4266765K5416422
1294A2645871J9109639l325808r425229J065181j0302059m6203531n2648589l780742
$$ y = [2605969, -26807043, -48443838, -40290186, -23084329, -31175260, -63990980, -90768961, -90893507, -66717667, -26563510, 20736611, 58678695, 72452807, 66749838, 59849953, 60614610, 62410322, 56671429, 42493508, 27267718, 24943413, 43838920, 68071118, 66877780, 36256299, 13126717, 27083786, 55327686, 53588575, 18684546, -12959834, -21568304, -21633434, -23079988, -13078095, 12873176, 33626505, 31152658, 13192884, -4084516, -14044092, -12103124, 4382542, 18749239, 4304190, -35950431, -64817026, -59950568, -40099922, -27037316, -12770551, 12645871, 31755510, 28429702, 19004473, 20069654, 9767595, -36435936, -89084525, -92865267]
1286i2865267M6737095M2009475N580075j590584K4285276L3771754O467002k3873985
1278D0520841k5203039n790135Q571164N620953j0076831k3221029j6583616Q861107
1270a7300585K7397219J9047461k738456j2655321r597255p326508l331566J2148172
1262E643161K5982786J6010992q731107j6785126l653283K930930q726762j6970558
1254d298967p683143K350282j511027o617690o9667O770510K527652k3069J1429335
1245B874216K1017295R061596j1917205j4560214N64343Q396472k80443r873431
1237E282629r663346n908057k292815O682800J7110771J3412049n881611j9193583
1229d51163r986764J1482920K5097447K5209897J6862164K400447j3546832j8574369
$$ y = [-92865267, -46128172, -4118697, 1461378, -129206, 24156070, 57927824, 64394826, 40520841, 15317802, 9527667, 18098831, 23719784, 13642953, -9578076, -26161692, -17300585, 10096634, 29144095, 26405639, 13750318, 4153063, -3173445, -6505011, 5643161, 31625947, 47636939, 38905832, 22120706, 18467423, 21398353, 12671591, -4298967, -11982110, -9631828, -11142855, -17760545, -17830212, -11059702, -8532050, -8555119, 2874216, 23891511, 32953107, 21035902, 6475688, 7040031, 15436503, 15156060, 5282629, -4380717, -10288774, -12581589, -5898789, 11211982, 24624031, 18742420, -451163, -10437927, 1044993, 26142440, 51352337, 68214501, 70614948, 57068116, 38493747]
1221C8493747r705546o053354k3708900m4750393l5708217L481428L4596193L1503640
1213a1851402J0853673M85293R11210k306924p608474m852132p11387p724898
1205b2805041j5072594j504727K3919170K7595944L700827j3507177l015979J1294381
1197A0604804M392851o188988P085412K9276634K3130021j0119350l1101692k1707788
1189E371904n542558l558579n126596M152445J6441839K0126732J9342204J7558361
1181F8765752M101790k2481901l6537159j5407120K3374319L8637429J5653533
1174G6106643j9070453l2206771j7872220L811905J1520532K571836q321703q901393
1166G638376m712396q027230j5988575j4580645l560423K114639o83593K508450
$$ y = [38493747, 28788201, 22734847, -974053, -45724446, -81432663, -77951235, -43355042, -11851402, -997729, -512436, 398774, -1908150, -9516624, -14368756, -15080143, -22805041, -37877635, -39382362, -15463192, 12132752, 15833579, 2326402, -689577, 10604804, 14997655, 8808667, 15894079, 45170713, 68300734, 58181384, 27079692, 5371904, -170654, -3729233, -8855829, -4703384, 11738455, 31865187, 51207391, 68765752, 72867542, 50385641, 13848482, -1558638, 21815681, 60453110, 76106643, 57036190, 24829419, 6957199, 10769104, 22289636, 24861472, 16539769, 7638376, 2925980, -5101250, -21089825, -35670470, -39230893, -37116254, -37799847, -35291397]
1158c5291397J4246845J5390636n48062r622956M097827J7382291M495734j6408235
1150f257317j0154589J6718066K5381236O809325q446946m615124j968360j3187070
1142D279221j8519729k820120J6505247K0201188J6770430J8208091J2931211
1135F7555539r601241k8991607j9364380R021482K2225179P969952j5833115k9506493
1127C475316k5670018l894882K4624360L4660434J3703612j5204989k1343410
1120A0350423q870267l755353o593178N245869K8745631K9114666n536237l9492619
1112I208935l8692901j4533410M040940J4629670K8541372L5289541J5317404
1105E3801551k0669811l7927170k3170119K057245J4832482J4171123P903441
$$ y = [-35291397, -21044552, -5653916, -6201978, -15824934, -11727107, 5655184, 10150918, -6257317, -16411906, 306160, 25687396, 32496721, 24049775, 19434651, 17466291, 4279221, -14240508, -17060628, -555381, 19645807, 36416237, 54624328, 67555539, 57954298, 28962691, 9598311, 18619793, 40844972, 48814924, 32981809, 3475316, -22194702, -26089584, -1465224, 33195210, 46898822, 31693833, 10350423, 1480156, -2275197, -8868375, -3622506, 25123125, 54237791, 48701554, 9208935, -29483966, -44017376, -39976436, -25346766, 3194606, 38484147, 53801551, 33131740, -4795430, -27965549, -25908304, -11075822, 3095301, 10998742]
1098A0998742q76720p164687l512879M525438r63364k3411451l9747451k7997800
1090h8150172L309791K6100719K5834664J1551249j249724m521885K783845J5453522
1082h887991K0579542P008934j8435078l2052524j7749439J2900203L1287676
1075e348677K1953636k486130j7180288j1310925M461241J3572801J0790546L216890
1067A7669094m33379K286322P447904Q493763J805045q034871j0636227j493459
1059A7104192J0869799J4351544P965344J212956R9546P36752k782352j0464891
1051C9092890j7073705j5605256j943542J6560139K0413048j600922l1683147
1044H159505l8531115j7829039j41513r177996k9228051k9177608m865582K1402652
$$ y = [10998742, 10122022, 2957335, -555544, 3969894, 3006530, -20404921, -60152372, -88150172, -84840381, -58739662, -32904998, -21353749, -22603473, -27125358, -24341513, -8887991, 11691551, 18700485, 265407, -31787117, -49536556, -36636353, -5348677, 16604959, 14118829, -3061459, -14372384, -9911143, 3661658, 14452204, 17669094, 17235715, 19522037, 26969941, 35463704, 37268749, 29233878, 18597651, 17104192, 27973991, 42325535, 50290879, 51503835, 51603381, 52340133, 49557781, 39092890, 22019185, 6413929, 4470387, 21030526, 41443574, 39842652, 8159505, -30371610, -48200649, -48342162, -57520158, -86748209, -115925817, -120791399, -99388747]
1036i9388747L3238276L1027075J7813377k104066j3486278l292289J5916077
1029b0276575J9434275Q412524O945576J6756556Q509494k6179251m7824061k2570617
1021e6792079K2874885L5575316J0149170j0630916k967830J0689215O742910
1014A5640671m520090m548929J828547Q88574l800746k93158R611007J5125788
1006B9931664J4156798J1307443O366034j968650q663882j0840330j5263109k4933351
998I2617k7632280j2888345P562474J3194130L329784m691908k482163J750689
990b1765002J035300k249803o192452j0156008n292302J6446774M0373705L7275026
982D9475238K998250k8750876k6574901K80718J8482451J3326953j901466j0720799
$$ y = [-99388747, -66150471, -35123396, -17310019, -19414085, -32900363, -36192652, -20276575, -842300, 7570224, 14515800, 31272356, 39781850, 13602599, -34221462, -56792079, -33917194, 1658122, 11807292, 1176376, -1791454, 8897761, 15640671, 11120581, 6571652, 8400199, 9288773, 5488027, 5194869, 14805876, 29931664, 44088462, 55395905, 61761939, 59793289, 51129407, 40289077, 25025968, 92617, -27539663, -40428008, -32865534, -19671404, -16341620, -21033528, -23515691, -21765002, -20729702, -22979505, -29171957, -39327965, -44620267, -28173493, 12200212, 49475238, 52473488, 23722612, -2852289, -2571571, 15910880, 29237833, 27336367, 16615568]
974A6615568r427992j750515O189212N977028m653099j3670231p438195Q428122
966B69898J3549692k14394j7899788k0275052l737491K0048575L4157347K5791224
958E1690011j233156k1608531j1664951J7707287K8126915K497471l0821080l6449273
950a755307j7837154m663554p486538j0706283m887457J744443N717925J5502033
942b4371892K8820575K7173423N187716j5407762j5556875m106302K438168O531671
934A0708722J5542659J8084633Q22620k1818911k3350199n895858K988886o810639
926i728087j6730028j3821428p302486l880557M505588J6858664J5509650j498489
918a6087173p883025R608996K3254771N678002k2629886k1811013N286109J8107434
$$ y = [16615568, 7187576, 5437061, 11626273, 17603301, 12950202, -720029, -8158224, 269898, 13819590, 13605196, -4294592, -24569644, -28307135, -8258560, 25898787, 51690011, 50456855, 28848324, 17183373, 34890660, 63017575, 65515046, 34693966, -1755307, -19592461, -24256015, -31742553, -42448836, -47336293, -45591850, -39873925, -24371892, 4448683, 31622106, 36809822, 21402060, 5845185, 1738883, 4177051, 10708722, 26251381, 44336014, 45158634, 23339723, -10476, -5906334, -2917448, -9728087, -26458115, -40279543, -47582029, -51462586, -46956998, -30098334, -14588684, -16087173, -23970198, -14361202, 8893569, 14571571, -8058315, -29869328, -24583219, -6475785]
910f475785J266898j6077779r166380Q535858J3492042O637863K868894N292266
902F373877O470190L191443j907965m568085N84126J2490056J5672951k688016
894C5618577k6166293k3460470M142563J7527444m019402k9869956k3880410K333602
886d7774345J2414914K782446J043315J5683380K3996296J1579063p481041j6027370
878c783342j3812918n417994Q634085K0898724J8128048K251330p803191k941091
870A6153651M929725N166503K454755L41545q360501k2414468k3411819k659837
862b7800446J9543951J9716760L578289n382497R06088J1535376J7387315J6877748
854E6362584P783170p907943j5719801l824195J6141575K0814248O050765j0409827
$$ y = [-6475785, -5208887, -21286666, -30453046, -21917188, -8425146, -1787283, 1081611, 6373877, 12844067, 16035510, 14127545, 9559460, 10143586, 22633642, 38306593, 35618577, 9452284, -14008186, -9865623, 7661821, 3642419, -26227537, -50107947, -47774345, -35359431, -32576985, -31533670, -15850290, 8146006, 19725069, 12244028, -3783342, -17596260, -23014254, -14380169, 6518555, 24646603, 26897933, 19094742, 16153651, 21083376, 26249879, 28704634, 29046179, 20685678, -1728790, -25140609, -27800446, -8256495, 11460265, 15038554, 9656057, 10562145, 22097521, 39484836, 56362584, 64145754, 56237811, 40518010, 36693815, 52835390, 73649638, 79700403, 69290576]
846F9290576j5396330j1757551m192353O784609J4038684O472889j0916997j6619891
838C7703636q87278J9450091K2827798P025765j6361936l7672709m8725108l9546628
830e6186369j0471368J9374940K9079397J8362199M022702j286378J968000P002074
822A1865197O850289j855777j2300714r945698Q560912K4826442J9547379m69293
814D7078737j0629957k078847R101791Q132149P03737r33939K511711K159611
806E6044993l711530j0194487j6518028k5521429l3735754l1241037j3912054
799g8789326R014610K2554727K0191183R253803J574890j31147k576615p571028
791b6478903n748084P343400J7077947P542842r692192n911891K0843794L5582854
$$ y = [69290576, 53894246, 42136695, 37944342, 44728951, 58767635, 65240524, 54323527, 37703636, 36816358, 56266449, 79094247, 86120012, 69758076, 32085367, -16639741, -56186369, -66657737, -47282797, -18203400, 158799, 4181501, 2895123, 4863123, 11865197, 18715486, 16859709, 4558995, -5386703, 3174209, 28000651, 47548030, 47078737, 36448780, 34369933, 43471724, 51603873, 52307610, 51373671, 53885382, 56044993, 52333463, 42138976, 25620948, 99519, -33636235, -64877272, -78789326, -69774716, -47219989, -27028806, -17775003, -16200113, -16331260, -18907875, -26478903, -32226987, -24883587, -7805640, -262798, -9954990, -15866881, 4976913, 40559767]
783D0559767J4333645j8752477k4897907n347671P065978K427351M125969K1300513
775D0815168K7196322K281290k9289786l0972211l694329K0406698K2301130R894805
767E8939087m509554j5921184j8901678j0953074l545869r351004j8839718j1162774
759c4245768J0801544K0411603P301555p237643m450733O450900J1035185J4533335
751B4599978K4019093K5351698L496282k6276581l4002669j6241284K615117P640468
743A1202102P968257J2579689J4435574N813744p868975j7412478k0464736j7600400
735a1347223r366354r33694J778609K923063J1155269K2012347K1259250Q517987
727D5999254j74918J132596j341346j4709929k3267176j3981127q27726l559790
$$ y = [40559767, 54893412, 36140935, 11243028, 5895357, 12961335, 15388686, 19514655, 40815168, 68011490, 70292780, 41002994, 10030783, 6336454, 26743152, 49044282, 58939087, 54429533, 38508349, 19606671, 8653597, 5107728, -4243276, -23082994, -34245768, -23444224, -3032621, 4268934, -2968709, -7419442, -968542, 10066643, 24599978, 48619071, 73970769, 77467051, 51190470, 17187801, 946517, 3561634, 11202102, 19170359, 31750048, 46185622, 51999366, 44130391, 26717913, 6253177, -11347223, -20713577, -21647271, -19868662, -16945599, -5790330, 16222017, 37481267, 45999254, 45824336, 46956932, 45615586, 30905657, 7638481, -6342646, -7170372, -10730162]
719a0730162j4682057j0979417P981158J7109178L395619j4532678j2449260P874323
711b7013296K3091882J7383694j264021j2498835o671119N886120R449568L280697
703A1644690L07722O448990J2926268J2806237J1618027J3189532Q734798p085305
695G0590959k1692588k2555258j8816476k5081415l2110554j8033374J3989291
688e3709415L4901862K9758544J5076604R736129J0558951O605274j786815j0060208
680D1080926j8783089k4041291j4476823Q827236K4311100J6496892k419999j2447995
672A8546957j3970024j8296788k2057103j3093950M302519J2300258O669592J479771
664b4118768N169366R393677N564535j972818m208217J633118J2214938J9961339
$$ y = [-10730162, -25412219, -36391636, -28410478, -11301300, -7905681, -22438359, -34887619, -27013296, -3921414, 13462280, 12198259, -300576, -6971695, -1085575, 8363993, 11644690, 11952412, 18401402, 31327670, 44133907, 55751934, 68941466, 77676264, 70590959, 48898371, 26343113, 7526637, -17554778, -49665332, -67698706, -53709415, -18807553, 10950991, 26027595, 35763724, 46322675, 52927949, 51141134, 41080926, 22297837, -1743454, -16220277, -7393041, 16918059, 33414951, 30994952, 18546957, 4576933, -13719855, -35776958, -48870908, -44568389, -32268131, -25598539, -24118768, -18949402, -9555725, -3991190, -5964008, -10172225, -8539107, 3675831, 23637170]
656B3637170J4983843l831364k0293568j6494532K647510J4495454R380674j9370
648B4505817k853067m411237q291446m179458J1704364K0569645N681676j7779122
640B4947172k0214261K203J5397264J1243364L712616P955161J1345283l943392
632E0445410k7637857l3065768j5571815K404484M174634l140214o693364m946566
624c4031056N46030J2084828K3452472J8085711m712934j7863631j850601K1577828
616A7288647J8234149m887395q681262J5590226L0901316J3069367j2414058j4974815
608E4126175p604132j7641019l3525277k2715908Q705162J8832269n304639k6160304
600c1287673j1690490J9877421L0499138J3520590p406458j5283425j3939286
$$ y = [23637170, 38621013, 34789649, 14496081, -1998451, 649059, 15144513, 24525187, 24505817, 21652750, 17241513, 8950067, 4770609, 16474973, 37044618, 42726294, 24947172, 4732911, 4735114, 20132378, 31375742, 35088358, 43043519, 54388802, 50445410, 22807553, -10258215, -25830030, -23425546, -19250912, -22391126, -29084490, -34031056, -33485026, -21400198, 2052274, 20137985, 15425051, -2438580, -4289181, 17288647, 35522796, 30635401, 21954139, 37544365, 68445681, 81515048, 69100990, 54126175, 46522043, 28881024, -4644253, -27360161, -18654999, 177270, -5127369, -31287673, -42978163, -23100742, 7398396, 20918986, 13512528, -1770897, -15710183]
593a5710183j1548357p277585M173616K1481574L1432404J8311220j4129560l5886406
585i153277k1750936J2906588K7290229P841473j6876276j9755864q243601j162537
577b8904201K824971J3079373K1894640J5391383j282247j0782205q397431k653716
569A170567J375166L184858q47571j0573726j5437236r215617j735322j734318
561c3813199j219321O307280Q204356m523276j3334512N56506J9204080J2265349
553f352737j1491823j5305239P004448K4136892K0423724J3663219J2906329K253819
545D7238632j9075262k3942865n500790L568083j3240069k2429689K683559K9799893
537h98508J7134629j5870220j9573422N412784J5524159P95891n478220O514567
$$ y = [-15710183, -27258540, -34536125, -30362509, -8880935, 22551469, 40862689, 26733129, -9153277, -30904213, -17997625, 9292604, 17134077, 257801, -19498063, -27741664, -28904201, -26079230, -12999857, 8894783, 24286166, 23003919, 12221714, 3824283, 1170567, 2545733, 5730591, 4883020, -5690706, -21127942, -30343559, -32078881, -33813199, -35032520, -28725240, -20520884, -25044160, -38378672, -37822166, -18618086, -6352737, -17844560, -33149799, -26145351, -2008459, 18415265, 32078484, 44984813, 47238632, 28163370, 4220505, -1280285, 2287798, -10952271, -33381960, -30698401, -898508, 16236121, 365901, -19207521, -13794737, 1729422, 2525313, -2952907, 3561660]
529C561660P057302j0792915j1429278J7263648L2280163N089211k4117191q179169
521A0733431K7043182K0489072k6294244m9473771j9899131J6829656J2827394
514g744411j6079442k4283135l694418J5868811J5721905O013269N22393N2734
506a3622294K054255P249623J2718659J2082841N887821R69380k008741q544045
498A6787499j5631740j1035699O152705J7242966P608516j0572909j3184685L019128
490C85781J7180279J3132169k819897j5168357j6627017p534426Q723092K1633349
482A8904973J7089000l884292j9813879j4809120r16458O87260p592037o390383
474a6724936N331387O795632q659295j9681962j1302518m91194p800049k1033876
$$ y = [3561660, 10618962, -173953, -11603231, 5660417, 37940580, 43029791, 18912600, 10733431, 37776613, 58265685, 31971441, -17502330, -37401461, -20571805, -7744411, -23823853, -48106988, -51801406, -35932595, -20210690, -14197421, -13675028, -13622294, -11568039, -4318416, 8400243, 20483084, 26370905, 27340285, 25331544, 16787499, 1155759, -9879940, -3727235, 13515731, 21124247, 10551338, -2633347, 385781, 17566060, 30698229, 27878332, 12709975, -3917042, -11451468, -2728376, 18904973, 35993973, 32109681, 12295802, -2513318, -3429776, -2742516, -10334553, -16724936, -11393549, -4597917, -13257212, -32939174, -44241692, -44732886, -52532935, -73566811]
466g3566811j2819695J4694614L0260632J8437561r63353m319828O002182J3163958
458i110740J0537000L129929l543828n113834J221940Q521732K998127j4698457
450f058131k2965285p815312J2978818J2600725n159179j0986621N836494K1268079
442c00412J2122972j0784988j8733011l527894J4637697J4655272j051439j1440248
434d422051j899767J7883265K3298253M109405k0634405k4604550o768178J0222921
426b815107J2236270P857905P316190N574944l206294r510358j695049J3743004
418B9501505J9477447R720082n920348j5804305j4243816k928964O743365J758176
410B8303142j2627568j3561998O019184K0383637P146607j5124923j3559874N905212
$$ y = [-73566811, -86386506, -71691892, -41431260, -22993699, -23957052, -28276880, -22274698, -9110740, 1426260, 4556189, 1012361, -4101473, -2879533, 5642199, 8640326, -6058131, -29023416, -36838728, -23859910, -11259185, -16418364, -27404985, -21568491, -300412, 11822560, 1037572, -17695439, -21223333, -6585636, 8069636, 7018197, -4422051, -6321818, 11561447, 34859700, 38969105, 18334700, -6269850, -13038028, -2815107, 9421163, 17279068, 24595258, 30170202, 26963908, 17453550, 15758501, 29501505, 48978952, 58699034, 52778686, 36974381, 22730565, 19801601, 26544966, 28303142, 15675574, 2113576, 8132760, 28516397, 35663004, 20538081, 6978207, 12883419]
402A2883419P527721j4957471k7697949j3063478K724698m100179j6771184j2030812
394f5485235j614819o740268j4462866J992021L2749068M0901398J8461208m765533
386A034974r803394r405690j2779920o036685J4848196K3235060j27821l0500683
378b9535963l0060745k215356J5323665O400332n512109J076755J4769283J5573429
370a4180709P759765P858591J3382857P541452r019220j5092553j707021J2727060
362I270222R890421k877449p863320l754275n73693J116070O561421R903344K158018
353B3830759q241252n412401N628827N542030l863558M56808K1004071K8836958
345F7782242Q756989j3959853j3020693j461681o137950k2741554k6495884j3361399
$$ y = [12883419, 20411140, 5453669, -22244280, -35307758, -32583060, -36683239, -53454423, -65485235, -67100054, -73840322, -88303188, -86311167, -53562099, -12660701, 5800507, 1034974, -8768420, -18174110, -30954030, -36990715, -22142519, 1092541, 964720, -29535963, -59596708, -61812064, -46488399, -40088067, -45600176, -44523421, -29754138, -14180709, -6420944, 1437647, 14820504, 22361956, 13342736, -1749817, -3456838, 9270222, 19160643, 16283194, 8419874, 4665599, 4091906, 5207976, 11769397, 21672741, 23830759, 15589507, 10177106, 15805933, 21347963, 17484405, 17941213, 38945284, 67782242, 76539231, 62579378, 49558685, 48097004, 41959054, 19217500, -7278384, -20639783]
337b0639783L2374Q091415J8210260K7022129K2833199Q503289k889581j0487378
329E0675924j9528676k0620469l550535J5304042J1722390m944051m495498J2347973
321C6911100J4648730l727926j3116411k041475J948156j6571743l1052878j9290803
313c2293250j371244j138666m197351J0010929K3633522R229989j7564658j7555384
305c1246113J0704986K9633471J8923955k354746j0287923k666250J0708992J9097791
297D2514163J1455471j2059973l0732612k6101038r682977n856434j3518960j1095247
289e5077607M709994J4483630J0332880N563125P053643N852075O93329L777521
281b611410J4987048J5679805j426930j8721787k0892466j4898964j1549566o989116
$$ y = [-20639783, -20607409, -12515994, 5694266, 32716395, 55549594, 64052883, 61163302, 50675924, 31147248, 10526779, 6976244, 22280286, 34002676, 29058625, 24563127, 36911100, 51559830, 47831904, 34715493, 32674018, 34622174, 18050431, -13002447, -32293250, -33664494, -34803160, -39000511, -28989582, -5356060, 3873929, -13690729, -31246113, -20541127, 9092344, 28016299, 25661553, 15373630, 12707380, 23416372, 42514163, 53969634, 41909661, 11177049, -14923989, -24606966, -30463400, -43982360, -55077607, -50367613, -35883983, -25551103, -19987978, -12934335, -7082260, -6388931, -2611410, 12375638, 28055443, 26628513, 7906726, -12985740, -27884704, -39434270, -46423386]
273d6423386M238063J4478891J4980466R773209O589769N326882L585385J639306
265A4188585m031376j7888057l0552124k3987277J008902K0553570K0318126J3576822
257f812829J4985027J6602325P208339k436937L886945J7488735J4608025p538681
249E7990949k5446095k1038401k551772R999420R230290N136221R672157J9579857
241F2572626J7071888p667779l7481826m3153469j8797937J0894143K2893733
234F331379K0311209J7093890J4232108M587475r867828j9925696k1558402j6036310
226d832175n127707N012491M792627m556937q617077j686307K428562n442332
218a8028855j0148495M460895K5416441K7220390J0431655j506343j00548J34337
$$ y = [-46423386, -42185323, -27706432, -12725966, -2952757, 3637012, 8963894, 12549279, 14188585, 10157209, -7730848, -38282972, -62270249, -61261347, -40707777, -20389651, -6812829, 8172198, 24774523, 31982862, 29545925, 33432870, 50921605, 65529630, 57990949, 32544854, 11506453, 8954681, 18954101, 28184391, 33320612, 42992769, 62572626, 79644514, 71976735, 34494909, -8658560, -27456497, -16562354, 6331379, 26642588, 43736478, 57968586, 62556061, 52688233, 32762537, 11204135, -4832175, -9959882, -4947391, -154764, -4711701, -13328778, -15015085, -12586523, -18028855, -28177350, -23716455, 1699986, 28920376, 39352031, 37845688, 37745140, 37879477]
210C7879477p411533r684961r45521L335424o536513j3768376k09219K1077097
202B3735875K0023539p827015l2771889k8550439l497281J4278093J3055898O349197
194D795978Q048060J2908571Q881268j208963l887092K020524K158538r758976
186B3957908j9450262j2711578K030786M855210p123980j5703382o340554J3379778
178a7106074K3610952J4985145k478321j1973417q605920k414657k395733m293771
170a0671796m39432N560969N709807L483290O689362Q314594m342394k1533534
162g229134j7965431O073015J8840951N278441q342716J652022J6483180Q359195
154B3149523j0601872j0033983N192785N669260o731400L9341K8170981L6793442
$$ y = [37879477, 30467944, 20782983, 19837462, 23172886, 16636373, 2867997, 2658778, 23735875, 43759414, 35932399, 3160510, -25389929, -28887210, -14609117, -1553219, 4795978, 12844038, 25752609, 34633877, 33424914, 29537822, 31558346, 33716884, 23957908, 4507646, -8203932, -6173146, -1317936, -8441916, -24145298, -30485852, -17106074, 6504878, 21490023, 19011702, 7038285, -1567635, -3982292, -6378025, -10671796, -11111228, -5550259, 159548, 3642838, 10332200, 18646794, 14304400, -7229134, -25194565, -19121550, -280599, 4997842, -3344874, -1692852, 14790328, 23149523, 12547651, 2513668, 7706453, 13375713, 6644313, 6683654, 34854635, 71648077]
146G1648077M622852l2678814l2128237k381759J4346083J262316j9408366k3444351
138a8162199j1682181J315K175495q92370J71791O676892R878374N264357J938754
129d629772P458894J0813163k075245k0460098j9209626J848551J3907323J441883
121a0904927j5702980j4286706J31121Q314865O218733J703549k301747l830931
113c0659023N758508K6931107L9741436K5309812o917018k9818424l1093005k0186606
105b0933213q517410Q54511O338370N731101J852283j39756o07058k331880k101834
96a9854886N451986J7059406K2020422J4162915k054619j5577745j6369729l899779
88I37971R151224Q243995m935530j3728834q641575K270701Q927393J1752754
$$ y = [71648077, 76270929, 43592115, 11463878, 9082119, 23428202, 24690518, 5282152, -18162199, -29844380, -29843065, -27667570, -28559940, -28388149, -21711257, -11832883, -6568526, -4629772, 2829122, 13642285, 11567040, -8893058, -28102684, -26254133, -12346810, -10904927, -26607907, -40894613, -40763492, -32448627, -26229894, -24526345, -26828092, -30659023, -24900515, 2030592, 41772028, 67081840, 60164822, 30346398, -746607, -20933213, -29450623, -28596112, -22257742, -16526641, -14674358, -14814114, -15421172, -17753052, -19854886, -14402900, 2656506, 24676928, 38839843, 36785224, 21207479, 4837750, 937971, 10089195, 18333190, 13397660, -331174, -8972749, -6702048, 2225345, 13978099]
80A3978099J1826802L303466j3010615k1512841j1204914O775928J4745571J2155338
72A7056834R114114N509638n604345j9043451k0206920o508330Q429887J3031904
64A779331Q876488K953406j362053m115520n914590n824243j57912J2160182K1589906
55B9984995J4836734n932312k1872431k1425670j2843860n986623K016627J1980689
47i241851J1756312l073138j3783762m166130J2088035J1980986r43672o206213
39a589433j721710j636590n299093J506660J5440713J5493713j997291j5024090
31E172879r418195K729827N824347J048937m071892p942067r374366n968579k873517
22b4872626p131774j1229952j134715J7516458K3117033J1289958O71262O84572
$$ y = [13978099, 25804901, 29108367, 16097752, -5415089, -16620003, -9844075, 4901496, 17056834, 26170948, 31680586, 26076241, 7032790, -13174130, -19682460, -11252573, 1779331, 10655819, 13609225, 12247172, 8131652, 2217062, -3607181, -3765093, 8395089, 29984995, 44821729, 38889417, 17016986, -4408684, -17252544, -23239167, -21222540, -9241851, 2514461, -558677, -14342439, -18508569, -6420534, 5560452, 4616780, -1589433, -3311143, -4947733, -10246826, -8740166, 6700547, 22194260, 20196969, 5172879, -4245316, -1515489, 4308858, 5357795, 1285903, -6656164, -16030530, -21999109, -24872626, -32004400, -43234352, -44369067, -26852609, -3735576, 7554382, 8225644, 8910216]
14H910216k18547o308469l314826J1235670J4825472l907898k1274973j3547149
6a3600504O203155J1681582M652505L960574Q131984P58562
0B1787858
$$ y = [8910216, 8691669, 2383200, -931626, 10304044, 25129516, 21221618, -53355, -13600504, -7397349, 4284233, 8936738, 12897312, 21029296, 21787858]
##END NTUPLES=NMR SPECTRUM
##END=
