##TITLE=31Pdec_MTMA2309
 CDCl3, 24 sc
 23.9.2020
##JCAMPDX= 6.0         $$ Bruker NMR JCAMP-DX V2.0
##DATA TYPE= NMR SPECTRUM
##DATA CLASS= NTUPLES
##ORIGIN= UXNMR, Bruker Analytische Messtechnik GmbH
##OWNER= root
$$ XWIN-NMR		Version 3.5
$$ Wed Sep 23 13:05:53 2020 Russian Standard Time (UT+4h)  she@DPX200
##.OBSERVE FREQUENCY= 81.013821
##.OBSERVE NUCLEUS= ^31P
##.ACQUISITION MODE= SIMULTANEOUS
##.ACQUISITION SCHEME= undefined
##.AVERAGES= 24
##.DIGITISER RES= 17
##SPECTROMETER/DATA SYSTEM= spect
##.PULSE SEQUENCE= zgpg30
##.SOLVENT NAME= CDCl3
##.SHIFT REFERENCE= (INTERNAL, CDCl3, 0, 182.463)
##AUDIT TRAIL= $$ (NUMBER, WHEN, WHO, WHERE, WHAT)
$$ ##TITLE= Audit trail, XWIN-NMR		Version 3.5
$$ ##JCAMPDX= 5.01
$$ ##ORIGIN= Bruker BioSpin GmbH
$$ ##OWNER= she
$$ F:/spectra/data/she/nmr/P31/1/pdata/1/auditp.txt
$$ ##AUDIT TRAIL=  $$ (NUMBER, WHEN, WHO, WHERE, WHAT)
(   1,<2020-09-23 13:04:51.10 +0400>,<she>,<DPX200>,
      <created by zg, POWCHK disabled, PULCHK disabled
       configuration hash MD5:
       00 E9 B6 7A A2 85 ED C7 34 08 36 98 17 FE 4E 26
       data hash MD5: 32K
       9B 36 4F 53 1E 7E 40 7A 18 2B 27 45 9F 23 F5 9F>)
(   2,<2020-09-23 13:04:53.95 +0400>,<she>,<DPX200>,
      <Start of raw data processing
       efp BC_mod = 2 LB = 1 FT_mod = 6 PKNL = 1 PHC0 = -2746.448 PHC1 = 80.00166 SI = 64K 
       data hash MD5: 64K
       43 39 E7 91 52 D5 B0 34 35 64 38 22 8C 07 78 88>)
(   3,<2020-09-23 13:05:23.17 +0400>,<she>,<DPX200>,
      <pk PHC0 = -40.59646 PHC1 = 69.59999 
       data hash MD5: 64K
       BA A0 F7 A0 87 00 A5 E7 64 48 3E B4 FE F8 25 85>)
(   4,<2020-09-23 13:05:26.64 +0400>,<she>,<DPX200>,
      <abs ABSG = 5 
       data hash MD5: 64K
       CD 4F B5 66 5A AA 6F 15 11 33 83 1C 86 5B 94 34>)
$$ ##END=
$$ 
$$ hash MD5
$$ EB A4 FF A9 1D 5C F0 33 99 C4 7F 4F 93 6B 53 2D
##$RELAX= 
##$RELAX= 
##$RELAX= 
##$RELAX= 
##$RELAX= 
##$RELAX= 
##$RELAX= 
##$RELAX= 
$$ Bruker specific parameters
$$ --------------------------
##$DU= <F:/spectra>
##$EXPNO= 1
##$NAME= <P31>
##$PROCNO= 1
##$TYPE= <nmr>
##$USER= <she>
##$AMP= (0..31)
100 100 100 100 100 100 100 100 100 100 100 100 100 100 100 100 100 100 
100 100 100 100 100 100 100 100 100 100 100 100 100 100 
##$AQSEQ= 0
##$AQ_mod= 1
##$AUNM= <au_zg>
##$AUTOPOS= <>
##$BF1= 81.014009
##$BF2= 200.13
##$BF3= 200.13
##$BF4= 200.13
##$BF5= 200.13
##$BF6= 200.13
##$BF7= 200.13
##$BF8= 200.13
##$BYTORDA= 1
##$CFDGTYP= 0
##$CFRGTYP= 5
##$CHEMSTR= <none>
##$CNST= (0..31)
1 1 145 1 1 1 1 1 1 1 1 1 1 1 1 1 1 1 1 1 1 1 1 1 1 1 1 1 1 1 1 1 
##$CPDPRG= <waltz16>
##$CPDPRG1= <>
##$CPDPRG2= <waltz16>
##$CPDPRG3= <>
##$CPDPRG4= <mlev>
##$CPDPRG5= <mlev>
##$CPDPRG6= <mlev>
##$CPDPRG7= <mlev>
##$CPDPRG8= <mlev>
##$CPDPRGB= <>
##$CPDPRGT= <>
##$D= (0..31)
0 1 0 0 0 0 0 0 0 0 0 0.03 2e-05 3e-06 0 0 0 0 0 0 0 0 0 0 0 0 0 0 0 0 
0 0 
##$DATE= 1600851890
##$DBL= (0..7)
120 120 120 11 120 120 24 19 
##$DBP= (0..7)
150 150 150 150 150 150 150 150 
##$DBP07= 0
##$DBPNAM0= <>
##$DBPNAM1= <>
##$DBPNAM2= <>
$$ [...]
##$SUBNAM3= <"">
##$SUBNAM4= <"">
##$SUBNAM5= <"">
##$SUBNAM6= <"">
##$SUBNAM7= <"">
##$SUBNAM8= <"">
##$SUBNAM9= <"">
##$SW= 369.568048894756
##$SWIBOX= (0..15)
0 1 3 0 0 0 0 0 0 0 0 0 0 0 0 0 
##$SW_h= 29940.119760479
##$TD= 32768
##$TD0= 1
##$TE= 0
##$TE2= 300
##$TE3= 300
##$TEG= 300
##$TL= (0..7)
0 120 53 12 22 120 120 120 
##$TP= (0..7)
150 150 150 150 150 150 150 150 
##$TP07= 0
##$TPNAME0= <>
##$TPNAME1= <>
##$TPNAME2= <>
##$TPNAME3= <>
##$TPNAME4= <>
##$TPNAME5= <>
##$TPNAME6= <>
##$TPNAME7= <>
##$TPOAL= (0..7)
0.5 0.5 0.5 0.5 0.5 0.5 0.5 0.5 
##$TPOFFS= (0..7)
0 0 0 0 0 0 0 0 
##$TUNHIN= 0
##$TUNHOUT= 0
##$TUNXOUT= 0
##$USERA1= <user>
##$USERA2= <user>
##$USERA3= <user>
##$USERA4= <user>
##$USERA5= <user>
##$V9= 5
##$VALIST= <valist>
##$VCLIST= <CCCCCCCCCCCCCCC>
##$VD= 0
##$VDLIST= <DDDDDDDDDDDDDDD>
##$VPLIST= <PPPPPPPPPPPPPPP>
##$VTLIST= <TTTTTTTTTTTTTTT>
##$WBST= 1024
##$WBSW= 4
##$XGAIN= (0..3)
0 0 0 0 
##$XL= 0
##$YL= 0
##$YMAX_a= 30082
##$YMIN_a= -21794
##$ZGOPTNS= <>
##$ZL1= 120
##$ZL2= 120
##$ZL3= 120
##$ZL4= 120
##$ABSF1= 182.463
##$ABSF2= -187.1042
##$ABSG= 5
##$ABSL= 3
##$ALPHA= 0
##$AQORDER= 0
##$ASSFAC= 0
##$ASSFACI= 0
##$ASSFACX= 0
##$ASSWID= 0
##$AUNMP= <proc_1d>
##$AZFE= 0.1
##$AZFW= 0.5
##$BCFW= 0
##$BC_mod= 2
##$BYTORDP= 0
##$COROFFS= 0
##$CY= -3
##$DATMOD= 1
##$DC= 0
##$DFILT= <>
##$DTYPP= 0
##$F1P= 0
##$F2P= 0
##$FCOR= 1
##$FTSIZE= 65536
##$FT_mod= 6
##$GAMMA= 0
##$GB= 0
##$INTBC= 1
##$INTSCL= 5.30512e-09
##$ISEN= 30
##$LB= 1
##$LEV0= 0
##$LPBIN= 0
##$MAXI= 10000
##$MC2= 0
##$MEAN= 0
##$ME_mod= 0
##$MI= 50
##$NCOEF= 0
##$NC_proc= -7
##$NLEV= 6
##$NOISF1= 182.463
##$NOISF2= 159.3651
##$NSP= 0
##$NTH_PI= 0
##$NZP= 0
##$OFFSET= 182.463
##$PC= 4
##$PHC0= -2787.044
##$PHC1= 149.6017
##$PH_mod= 1
##$PKNL= yes
##$PPARMOD= 0
##$PSCAL= 0
##$PSIGN= 0
##$REVERSE= no
##$SF= 81.0140089999434
##$SI= 65536
##$SIGF1= 159.3651
##$SIGF2= -187.1042
##$SINO= 113.3802
##$SIOLD= 16384
##$SREGLST= <1H.CDCl3>
##$SSB= 0
##$STSI= 65536
##$STSR= 0
##$SW_p= 29940.119760479
##$SYMM= 0
##$S_DEV= 0
##$TDeff= 32768
##$TDoff= 0
##$TI= <>
##$TILT= no
##$TM1= 0
##$TM2= 0
##$TOPLEV= 0
##$USERP1= <user>
##$USERP2= <user>
##$USERP3= <user>
##$USERP4= <user>
##$USERP5= <user>
##$WDW= 1
##$XDIM= 65536
##$YMAX_p= 415704279
##$YMIN_p= -38541663
$$ End of Bruker specific parameters
$$ ---------------------------------
##NTUPLES= NMR SPECTRUM
##VAR_NAME=  FREQUENCY,     SPECTRUM/REAL,   SPECTRUM/IMAG
##SYMBOL=    X,             R,               I
##VAR_TYPE=  INDEPENDENT,   DEPENDENT,       DEPENDENT
##VAR_FORM=  AFFN,          ASDF,            ASDF
##VAR_DIM=   65536,         65536,           65536
##UNITS=     HZ,            ARBITRARY UNITS, ARBITRARY UNITS
##FACTOR=    0.456856943014862, 1,           1
##FIRST=     14782.0589164792, 0,            0
##LAST=      -15158.0608439998, 0,           0
##MIN=       -15158.0608439998, -38541663,   0
##MAX=       14782.0589164792, 415704279,    0
$$ Real data points
##PAGE= N=1
##DATA TABLE= (X++(R..R)), XYDATA
$$ [...]
45434a343231K071658O8732j36383K251307L537462J344617j398903j147269O52685
45425E900675N03791j198164j760059j614466k891641m075556j939135J861446
45417e213109K336520n10613j308006J659469L567285J385598j156771k40402
45409E19971J960509J934006Q65125J413142K211569M72088k588346l584124k348220
45400H55720j325844j171865q43402o40399j274696j122221J597614M676947M007341
45391D759195l10790l708817l327876r91251O82591J764692L101127L616379J807150
45382G392400j313327k772975j088919J864919K723932J89998l427768m507594
45374i39334j959615J776910L666559L082011J467655J36349o04954q57018p79770
$$ plain form
45434 -1343231 728427 797159 660776 2912083 6449545 7794162 6395259 5247990 5900675
45425 5900675 6404466 5206302 3446243 1831777 -1059864 -5135420 -7074555 -5213109
45417 -5213109 -2876589 -3387202 -4695208 -3035739 531546 1917144 760373 519971
45409 519971 2480480 4414486 5279611 6692753 8904322 9376410 6788064 3203940 855720
45400 855720 -470124 -1641989 -2485391 -3125790 -4400486 -5522707 -3925093 751854 4759195
45391 4759195 4448405 739588 -2588288 -3579539 -2896948 -1132256 1968871 5585250 7392400
45382 7392400 6079073 3306098 2217179 4082098 6806030 6996028 3568260 -939334
45374 -939334 -2898949 -1122039 2544520 5626531 7094186 7230535 6625581 5768563 4988793
45365D988793o56758o57125p00531p92345j021477j109299p01458k26357n00595
45356a377152j273741j251232J27585J984706L213582L161672J209559k440680
45348C354299n339488m549795p56406J788965Q43229p81733J63752K143441J448097
45339a685639j530855k660216o35254Q38531j051421l457391j927089K612484
45331i496850M612649J723614j684912p10485L060701M071005J055683j489884
45323A141521n83615J048260L17862q96950K93184J830066k3629l449718l195709
45314c518728N94556K109318o79030k804572q74270J499865P18375q6821L127325
45305H6018P098047N526122p27123m454801k586714L78053K02814j454635j366734
$$ plain form
45365 4988793 4332035 3674910 2974379 2182034 1160557 51258 -650200 -876557 -1377152
45356 -1377152 -2650893 -3902125 -3774540 -1789834 1423748 4585420 5794979 3354299
45348 3354299 -1985189 -6534984 -7291390 -5502425 -4659196 -5440929 -5277177 -3133736 -1685639
45339 -1685639 -3216494 -5876710 -6511964 -5673433 -6724854 -10182245 -12109334 -9496850
45331 -9496850 -4884201 -3160587 -4845499 -5555984 -2495283 1575722 2631405 1141521
45323 1141521 557906 1606166 1924028 1027078 1320262 3150328 3126699 -323019 -3518728
45314 -3518728 -2924172 -814854 -1493884 -4298456 -5172726 -3672861 -2954486 -3041307 86018
45305 86018 7184065 12710187 11983064 7528263 4941549 5319602 5522416 4067781 2701047
45296B701047k10784n92755k348607k991116j634087N8767N65931L71843P99477
45287c280284J888775K111082L78437j969294k084829R45553M361785M464862
45279F816087Q37621l106609l890814j652629L04258m81552k611263k660392Q1191
45270f364102K476200K065200M72664J32236J8479j682695k695036K15020M127730
45261a234304K691996l125419m437016K272703Q518321N828392j847474m802531
45253C864668j888400J49354j209710j788828K38469J397268K05791r1385J733584
45244B610811J978478j287317m200694l075171J57763J703622J254663N35597
45236c22248j25116q83352r53182n08411j101365k223243r99457K441138L450564
$$ plain form
45296 2701047 2490263 1897508 -451099 -3442215 -5076302 -5017535 -4451604 -4079761 -3280284
45287 -3280284 -1391509 719573 1098010 -871284 -2956113 -2010560 2351225 6816087
45279 6816087 7653708 4547099 656285 -996344 -692086 -1173638 -3784901 -6445293 -6364102
45270 -6364102 -3887902 -1822702 -1350038 -1217802 -1199323 -2882018 -5577054 -5362034 -1234304
45261 -1234304 1457692 -1667727 -6104743 -3832040 4686281 10514673 8667199 3864668
45253 3864668 1976268 2125622 915912 -872916 -634447 762821 968612 877227 2610811
45244 2610811 4589289 3301972 -898722 -3973893 -3816130 -2112508 -857845 -322248
45236 -322248 -447364 -1330716 -2283898 -2792309 -3893674 -6116917 -7116374 -4675236 -1224672
45227a224672q8839l363725j569585K412236K608879m78601j132800J913712L626293
45218B702898J209392j530872p76602J181864O0987l305787m156217r26820K574245
45209b966912K509716k04113j705786j89333K456360L452518K157399J09392q97076
45200D722165k29475J346367K150995Q77395j820448l508092k621976m69580M73273
45191I20624j93799o30489L35471J661887J746976M16368j120326j447236l8430
45182A651046J944501K228399j7151k568213k599904m30802J024475L85302p89990
45173H27663r40605n05581k94851m7347L84307L16938k75508l28559L37450M90954
45163c5139j04172J29324J716408K602980J157128j257995k525945k686429k560492
$$ plain form
45227 -1224672 -1313511 -4677236 -6246821 -3834585 -1225706 -1704307 -2837107 -923395 2702898
45218 2702898 3912290 2381418 1604816 2786680 2847667 -458120 -4614337 -5541157 -2966912
45209 -2966912 -457196 -661309 -2367095 -2556428 -100068 3352450 5509849 5619241 4722165
45200 4722165 4492690 5839057 7990052 8867447 7046999 3538907 916931 447351 920624
45191 920624 726825 96336 431807 2093694 3840670 4257038 3136712 1689476 1651046
45182 1651046 3595547 5823946 5806795 3238582 638678 207876 1232351 1617653 827663
45173 827663 -112942 -618523 -913374 -960721 -576414 -259476 -534984 -863543 -526093 -35139
45163 -35139 -139311 -9987 1706421 4309401 5466529 4208534 1682589 -1003840 -3564332
45154c564332j410884J362808L630724K663199p41258k970029k207957M1088J804382
45145a392259K525878K022483Q6294k174773k659544r11977J021309J180720p2597
45136c74466j101315j111735l94861O67540J869395K759294K640220J197981q04257
45127E347796j620871j09878K343232K534675p99403m755719n315861k092846
45119d468875J702969L595862L832106K963798L97970l206063m696244k217478
45111b095955J241286J096055k525992m773086k685948J195930L034389K654181
45103b859140K153951J869238P49779n64110m20149N00933j08953j933069j970331
45094b581851L82705J775900K12818j489211k47248K155804J949325o35466k035310
$$ plain form
45154 -3564332 -4975216 -3612408 18316 2681515 1940257 -1029772 -3237729 -3196641 -1392259
45145 -1392259 1133619 3156102 3242396 1067623 -1591921 -2503898 -1482589 -301869 -374466
45136 -374466 -1475781 -2587516 -2982377 -2314837 -445442 2313852 4954072 6152053 5347796
45127 5347796 3726925 3617047 5960279 8494954 7695551 2939832 -2376029 -4468875
45119 -4468875 -2765906 829956 4662062 7625860 8023830 4817767 121523 -2095955
45111 -2095955 -854669 241386 -2284606 -7057692 -9743640 -8547710 -5513321 -2859140
45103 -2859140 -705189 1164049 1913828 1349718 929569 1430502 1321549 -611520 -2581851
45094 -2581851 -2199146 -423246 -210428 -1699639 -1946887 208917 2158242 1522776 -512534
45085e12534q49078J026578K115408K638642K347879N92665j360945j403347j67219
45076D428049k36984j565653j318034J092920K633040J507452k88987q58447j214695
45067D178661k187048k056270K4716J330599n31045l367665l330152l85143K246186
45058d077161K816175K252243J553647P63171P2950k76699q00729j766941k130325
45049a593669j060391M42509J064712J187828J723814K184019J661957M77546
45041F088325q45262k667098m414233l642316M39374M234002L765112K71207j604481
45032A624630n01545M74405o92320j937197q92247J274672J712681j7220j455261
45023d09402m01342K415449L991087K371196r31507k691538k057044j233437j674278
$$ plain form
45085 -512534 -1361612 -335034 1780374 4419016 6766895 7359560 5998615 4595268 4428049
45076 4428049 4191065 2625412 1307378 2400298 5033338 6540790 6251803 5393356 4178661
45067 4178661 1991613 -64657 -39941 1290658 759613 -2608052 -5938204 -6323347 -4077161
45058 -4077161 -1260986 991257 2544904 3308075 3381025 3104326 2303597 536656 -1593669
45049 -1593669 -2654060 -2211551 -1146839 40989 1764803 3948822 5610779 6088325
45041 6088325 5243063 2575965 -1838268 -5480584 -5041210 -807208 2957904 3229111 1624630
45032 1624630 1123085 1597490 905170 -1032027 -1924274 -649602 1063079 1045859 -409402
45023 -409402 -810744 1604705 5595792 7966988 7035481 4343943 2286899 1053462 -620816
45014f20816j899570m74733J159663J008495j88686m44010J94133L35637r2616
45005a022503l68302q20173j567802q71592K267611N141700M310985O74341j812694
44996E931571j814202j462301j874179j550224L47107K306244K716734J393222
44988E993972j234723m064603m787452k170997J359964K190160K57494j400196
44980c856381j200870o8916J234335K299576J446007k001717m512628k128484
44972h789078K836910M082596N81570k085586o69492J481288J174528M25115J463165
44963E01016K041615n6200k160773r71884J661950J782957m27394j810238j614352
44954a053303j507334j673525q50415O27605J192078Q07768O64337Q91215R02182
$$ plain form
45014 -620816 -2520386 -2995119 -1835456 -826961 -1015647 -1459657 -1265524 -929887 -1022503
45005 -1022503 -1390805 -2210978 -3778780 -4650372 -2382761 2758939 7069924 7744265 5931571
44996 5931571 4117369 2655068 780889 -769335 -422228 1884016 4600750 5993972
44988 5993972 4759249 694646 -4092806 -6263803 -4903839 -2713679 -2456185 -3856381
44980 -3856381 -5057251 -5126167 -3891832 -1592256 -146249 -2147966 -6660594 -8789078
44972 -8789078 -5952168 -1869572 -1288002 -3373588 -4043080 -2561792 -1387264 -962149 501016
44963 501016 2542631 2486431 325658 -646226 1015724 2798681 2371287 561049 -1053303
44954 -1053303 -2560637 -4234162 -5084577 -4456972 -3264894 -2457126 -1792789 -901574 608
44945F08R71303J297192P75386j116509k585973j877003J5487J064970J142127
44936c12412J169548J028158M90453N56243J634814K075237O76207j094751j446985
44927D776512q41816k41258P62495J863280J006978j840769l075802r29754P78959
44918B258825j519219m814291m038351j82752J768201R50856O01282J351286R53850
44909b670313o704J258119L439018K246567j489873j885069K148666M192674M23921
44900G657006m211839m078392j302989j006000k687242k235103M75855J859567
44892e529137R59186K36605N50701j2433j935644k681952l96329L267039N117849
44883d24115L937155J403979M9362L43877N2002k515091n117776l891702P12350
$$ plain form
44945 608 971911 2269103 3044489 1927980 -657993 -2534996 -2519509 -1454539 -312412
44936 -312412 857136 1885294 2375747 2931990 4566804 6642041 7318248 6223497 4776512
44927 4776512 3934696 3693438 4455933 6319213 7326191 5485422 2409620 1479866 2258825
44918 2258825 739606 -4074685 -8113036 -8295788 -6527587 -5576731 -4975449 -3624163 -2670313
44909 -2670313 -2677017 -1418898 2020120 4266687 2776814 891745 3040411 7233085 7657006
44900 7657006 3445167 -633225 -1936214 -2942214 -5629456 -7864559 -7388704 -5529137
44892 -5529137 -4569951 -4333346 -3782645 -3795078 -5730722 -8412674 -8809003 -5541964 -424115
44883 -424115 3513040 4917019 4966381 5310258 5362260 2847169 -2270607 -6162309 -5449959
44874e449959L536527J652529j644404k061382k75036N38247K72232Q67620J712012
44865h51614O45527j435730j514054L71243J318613R25254J711179L520265K602412
44856G293095j793501m742518k648697J160600J686249l18182p82912M48510K94192
44847E96836j054218l07184K154186J862579j754233l024821R88955M577412J524371
44838E563883m881393o290552j458360K944586L114931K481778L884133M313995
44830I673001R67884k982704l259491j122540l99158j024336n54552L62828n17593
44821A143339j736155j03795K767505J995230k163209l685399l09249K352396
44813B60663m46001m876893m339847O01364L674663K644964J798306M104904N974181
$$ plain form
44874 -5449959 -1913432 -260903 -1905307 -3966689 -4241725 -3703478 -3431246 -2563626 -851614
44865 -851614 -206087 -1641817 -3155871 -2784628 -1466015 -540761 1170418 4690683 7293095
44856 7293095 5499594 757076 -1891621 -731021 955228 637046 -145866 302644 596836
44847 596836 -457382 -764566 1389620 3252199 1497966 -1526855 -537900 4039512 5563883
44838 5563883 682490 -5608062 -7066422 -4121836 -1006905 1474873 5359006 9673001
44830 9673001 10640885 7658181 4398690 3276150 2876992 1852656 1298104 1660932 1143339
44821 1143339 -592816 -696611 2070894 4066124 1902915 -1782484 -2091733 260663
44813 260663 -185338 -5062231 -9402078 -8800714 -5126051 -2481087 -682781 3422123 9396304
44804I396304K632072m192005p651181m416018J224885L138390R16306r34542
44796A14211k27392L48115j202505k143582L62808L674809L185073k80041j676012
44787B155484J01804P88307j591410l194114r93428J948774J568445o14706l86504
44778b17348K245957L624869K502425J073823M44463p15510k514824k544891L02906
44769D201870L281660K851806r97215m886044n879431m124686j782021k33767
44761g567828Q03647J485721P52894j533851k712080l16496L459973L782650L18378
44752a526992j486824J761187N950198N097773k74795m331844l894842j223973
44744F9888N25097Q13480L88811m50946j385853j830014j730734j424814r24038
$$ plain form
44804 9396304 12028376 7836371 185190 -4230828 -3005943 132447 1048753 114211
44796 114211 -113181 234934 -967571 -3111153 -2748345 926464 4111537 3831496 2155484
44787 2155484 2257288 3045595 1454185 -1739929 -2733357 -784583 783862 169156 -217348
44778 -217348 2028609 5653478 8155903 9229726 9674189 8958679 6443855 3898964 4201870
44769 4201870 7483530 10335336 9338121 4452077 -1427354 -5552040 -7334061 -7567828
44761 -7567828 -6764181 -5278460 -4525566 -6059417 -8771497 -9087993 -5628020 -1845370 -1526992
44752 -1526992 -3013816 -1252629 4697569 9795342 9520547 5188703 1293861 69888
44744 69888 594985 1408465 1797276 1346330 -39523 -1869537 -3600271 -5025085 -5949123
44735e949123m29844o38504j185891k43597K463510M010122K241679l48298o1343
44726a41289K089783J947843j022770k988413j938935j97887J68006J89224O80531
44717a213907Q4246k118473l256286j395388J341827K133350J717479K254373
44709d52779K900582J101415k542112m181463j858855J856802L254477J768563
44701A846630j86476o49598j00191r206m54074k59437O29541N21798j313219k821465
44691b795697j873078K99312P55891o57569j215740L18551K063670K204095J113013
44682B12448k97407j598793j574196R41156L904565L260153r27104l143327N4397
44673H31892M519856M182183l48607l189355j742943O70826N10579j700105l388719
$$ plain form
44735 -5949123 -6378967 -7017471 -8203362 -8446959 -5983449 -1973327 268352 -79946 -141289
44726 -141289 1948494 3896337 2873567 -114846 -2053781 -2251668 -2083662 -1894438 -1213907
44717 -1213907 -1129661 -3248134 -6504420 -7899808 -6557981 -4424631 -2707152 -452779
44709 -452779 2447803 3549218 1007106 -3174357 -5033212 -3176410 78067 1846630
44701 1846630 1660154 1010556 910365 901159 447085 187648 817189 1338987 25768 -2795697
44691 -2795697 -4668775 -4369463 -3613572 -4271141 -5486881 -5168330 -3104660 -900565 212448
44682 212448 -84959 -1683752 -3257948 -2316792 1587773 4847926 3920822 777495 831892
44673 831892 5351748 9533931 9185324 5995969 4253026 4923852 5434431 3734326 345607
44664C45607l062023o81394K491461L857689J759636j644397k260915M61703K462334
44655C729701O10009l049821m274299k061953Q20369J696139N69381o98786m20166
44646c079426J579605L714660L829557J317605j964909l286184j561701J660075
44638B209282L455450K019954j404332l270381j410868K000316K532086r76201
44630E155306m541805l969888l26042J678912K58510j322334j14388J825537P94257
44621e61935k179553k262989J605336M209331J383073l523261m235533n16432
44613f081963K088195Q33229r17537N0264J995732K065792J011965Q60422R32347
44604B838446j91676j107662J03003J797638J193560m09400N38261L256760K922863
$$ plain form
44664 345607 -2716416 -3397810 -906349 2951340 4710976 3066579 805664 1267367 3729701
44655 3729701 4339710 1289889 -2984410 -5046363 -4225994 -2529855 -1960474 -2659260 -3079426
44646 -3079426 -1499821 2214839 6044396 7362001 5397092 2110908 549207 2209282
44638 2209282 5664732 7684686 6280354 3009973 1599105 3599421 6131507 5155306
44630 5155306 613501 -3356387 -3682429 -2003517 -1745007 -3067341 -3181729 -1356192 -561935
44621 -561935 -2741488 -5004477 -3399141 810190 2193263 -1329998 -5565531 -6081963
44613 -6081963 -3993768 -3160539 -4078076 -4027812 -2032080 33712 1045677 1906099 2838446
44604 2838446 2646770 1539108 1642111 3439749 4633309 4223909 4762170 8018930 10941793
44595A0941793j676407n584204m720051j368064J11432l19997K55347K184525
44587a75626K901001J326128o57831j261085q63879n97437o98951r23995j296829
44578b248504j699509j432531J15258K443088L896950K990906Q8505k517119k882910
44569a245866j594116p51314r90242r28622K69099J528942J790221J553767J339076
44560I70945K95671j897634l184825j569998J340802J935510j57917j132027J605296
44551a794177N334992N278234P85077l773227m073419k02827M131699N360665
44543A1047017K673983j805928m692051m052605j297187K27396r14648k693682
44535a507705k670172j311007o60906q03274r5994J393284J550918q3013j061615
$$ plain form
44595 10941793 9265386 3681182 -1038869 -2406933 -2295501 -2615498 -2360151 -175626
44587 -175626 2725375 4051503 3393672 2132587 1268708 671271 -27680 -951675 -2248504
44578 -2248504 -3948013 -5380544 -5265286 -2822198 1074752 4065658 4154163 1637044 -1245866
44569 -1245866 -2839982 -3591296 -4581538 -5510160 -5241061 -3712119 -1921898 -368131 970945
44560 970945 1266616 -631018 -3815843 -5385841 -4045039 -2109529 -2267446 -3399473 -1794177
44551 -1794177 3540815 8819049 9604126 5830899 1757480 1554653 5686352 11047017
44543 11047017 13721000 11915072 7223021 3170416 1873229 2100625 1185977 -1507705
44535 -1507705 -4177877 -5488884 -6149790 -6953064 -7049058 -5655774 -4104856 -4187869 -5249484
44526e249484J92679J849634J710995N63024K79268M98049k23909j426625j613401
44517c419770r41682m04162N13923K492595L801014K317882o25406j768811p05804
44508A259779K97460O10366J446392K199531R76376j214684j485314m98127j634925
44499A956854m118433l085891J753133M144472J084388j995318k85414K465052
44491A918843R48668k355832k035521M67347K6929k257267j011483L111805L923153
44482B736642L57793j943465o77602j10378k186595k525560J297642M730180L764067
44473E442724J170889N59713J4190k924696m988503k204700K455024K958827n28623
44464A954845k474984p61355J270642J214730O09846R02111R10468l71290j685394
$$ plain form
44526 -5249484 -5056805 -3207171 -1496176 -933152 -653884 -155835 -379744 -1806369 -3419770
44517 -3419770 -4361452 -4765614 -4251691 -1759096 2041918 4359800 3734394 1965583 1259779
44508 1259779 1557239 2167605 3613997 5813528 6789904 5575220 4089906 3591779 1956854
44499 1956854 -2161579 -5247470 -3494337 650135 1734523 -260795 -546209 1918843
44491 1918843 2867511 511679 -1523842 -1056495 -1029566 -3286833 -4298316 -1186511 2736642
44482 2736642 3094435 1150970 473368 362990 -1823605 -4349165 -3051523 1678657 5442724
44473 5442724 6613613 7173326 7187516 4262820 -725683 -2930383 -475359 2483468 1954845
44464 1954845 -520139 -1281494 -10852 1203878 1813724 2715835 3626303 3255013 1569619
44455A569619j468598K05716K136635K771779Q45442k732127m255726r91208M705183
44446B786715P404477M655320r47675n248139n949846l250047L94621J512915
44438A358341q52411l177384j560605K626348M191739J224228k513692l024655
44430a728091q75883Q53867J029601R97431J935408L163062K807194p4763l592224
44421D515602m038377k14670M168066M580453J493442o55038k7156N37562j207412
44412I152472l090957k103250P01653J605613n85196l091450k748376M33999L480972
44403C755480L570682P89218k232045l366778k859616j732440K2295K074055K354979
44394B375830j52412k462986j084936K097647J873595j941287l308490Q09626
$$ plain form
44455 1569619 101021 306737 2443372 5215151 6060593 3328466 -927260 -1918468 2786715
44446 2786715 10191192 14846512 13898837 8650698 2700852 -549195 -154574 1358341
44438 1358341 505930 -2671454 -4232059 -1605711 2586028 3810256 1296564 -1728091
44430 -1728091 -2603974 -1750107 -720506 276925 2212333 5375395 8182589 8107826 4515602
44421 4515602 477225 262555 4430621 9011074 10504516 9849478 9822322 10359884 9152472
44412 9152472 6061515 3958265 4659918 6265531 5680335 2588885 -159491 274508 3755480
44403 3755480 7326162 8115380 5883335 2516557 -343059 -2075499 -2053204 20851 2375830
44394 2375830 2223418 -239568 -1324504 773143 2646738 705451 -2603039 -1793413
44386a793413N020293L148976k529485m713072j490526K030439J863511k64659
44378A272064j274085j183724j158288m19070K086490M669134M270619N14322
44370H777462l456466m402385k205740N69861J601617Q24156j51880K1021J347461
44361B925107K862676L438033K465691N75221m72586K82252J141769o43323m799887
44352G774953p225190m709613O23915L451385J492469k137770l095916q06256
44344d632023J621724J577695k63484j438659q85007K87027P56753M35966k23238
44335b763246r29135q81382J002877L889291M688493J987350j056182m97115K644782
44326H085733L755851J447299q50361p45255l04907j827230l730931l285935q64156
$$ plain form
44386 -1793413 3226880 6375856 3846371 -866701 -2357227 -326788 1536723 1272064
44378 1272064 -2021 -1185745 -2344033 -2763103 -676613 3992521 8263140 8777462
44370 8777462 5320996 918611 -1287129 -717268 884349 1708505 1556625 1577646 2925107
44361 2925107 5787783 9225816 11691507 12266728 11794142 12076394 13218163 12574840 7774953
44352 7774953 549763 -4159850 -3535935 -84550 1407919 -729851 -3825767 -4632023
44344 -4632023 -3010299 -1432604 -1696088 -3134747 -4019754 -3732727 -2975974 -2540008 -2763246
44335 -2763246 -3692381 -4573763 -3570886 318405 5006898 6994248 5938066 5440951 8085733
44326 8085733 11841584 13288883 12438522 11693267 11388360 9561130 5830199 2544264 1680108
44317A680108J154166J717555J065603o21280k274875j787322P24183J724937
44309C383075q31931l652709k593296R41644K146867J08596j447990l37547J476147
44300h07144J879793J279590K93234j697519m188612m637903j735896K370699
44292g243758M638062M439831L212475K136863J283529K73713r08316j499721
44284F332678o55465R59417J364868J35819m56387J047196K433646J131170j316459
44275A0976483j656227n42215j320747l603870l089366J257857M704236L508893
44267A0235044K3917j668309j695009k676217m595341m862242k254023J834338
44259e657842N161953N819421K958218j719077m426854l210267m34055L22700
$$ plain form
44317 1680108 2834274 4551829 5617432 4996152 2721277 933955 1658138 3383075
44309 3383075 2551144 -1101565 -3694861 -2753217 -606350 -497754 -1945744 -2283291 -807144
44300 -807144 1072649 2352239 2645473 947954 -3240658 -7878561 -9614457 -7243758
44292 -7243758 -2605696 1834135 5046610 7183473 8467002 8740715 7832399 6332678
44284 6332678 5677213 6636630 8001498 8137317 7680930 8728126 11161772 12292942 10976483
44275 10976483 9320256 8778041 7457294 3853424 764058 2021915 6726151 10235044
44267 10235044 10258961 8590652 6895643 4219426 -375915 -5238157 -7492180 -5657842
44259 -5657842 -495889 5323532 8281750 6562673 2135819 -1074448 -1508503 -1185803
44251a185803j178217k184497j080691P17881R62497n47071j647541l27521K433503
44242d037460L276387Q69532j730258j231162Q91091R15853p03365r8202K833871
44233I86287L438441j7098l092591k295631l43038o43710j274145P81179L263677
44224H03371K036363j779029l509367j960886L55069K349410M399742M621398
44216G316071Q55190m088931m849593j417846P28332r89784l006840j950946P84469
44207f619878K585308L288821L310134K056338K21770Q629J154901M46701k775488
44198C677236m512942k097349J426283K057029O77092M86254J344862Q59783o17471
44189C300777l60125J895704L126029J279632k252049m678730m416026j736947
$$ plain form
44251 -1185803 -2364020 -4548517 -5629208 -4911327 -3948830 -4495901 -6143442 -6470963 -4037460
44242 -4037460 -761073 108459 -1621799 -2852961 -1961870 -1046017 -1749382 -1847584 986287
44233 986287 4424728 4407630 1315039 -980592 -1323630 -1967340 -3241485 -2460306 803371
44224 803371 2839734 1060705 -2448662 -4409548 -4054479 -1705069 2694673 7316071
44216 7316071 8171261 4082330 -767263 -2185109 -1456777 -2446561 -5453401 -7404347 -6619878
44207 -6619878 -4034570 -745749 2564385 4620723 4842493 4851122 6006023 6452724 3677236
44198 3677236 -835706 -2933055 -1506772 550257 1227349 1713603 3058465 3918248 3300777
44189 3300777 2940652 4836356 7962385 9242017 6989968 2311238 -2104788 -3841735
44181c841735J445474K620832J062258j043279j105844P47193K339550K456236
44173D680685J607482M65444o78004j252628q76319k61032j78483J03574J677588
44164E288307L581694L544691J410994j33480Q87366L010577L390656J571773
44156B2552578k46467l31186O58582J141814P62772K14739k42820q34399j196151
44147B2479462p07169R7855O2542m22941J64474J260483Q5464l624585n679577
44138A3716008l121540P71734J151746q96746p16449J359403L51212l945665n019522
44129C650181P3023N001622L345049j803899l139232j11202J837920N31319j151137
44120H233644j733129k901145m515272l704481j40435K666313K680328J653956
$$ plain form
44181 -3841735 -2396261 224571 1286829 243550 -862294 -115101 2224449 4680685
44173 4680685 6288167 6753611 6075607 4822979 3946660 3685628 3507145 3610719 5288307
44164 5288307 8870001 12414692 13825686 13692206 14579572 17590149 20980805 22552578
44156 22552578 22306111 21974925 22633507 23775321 24538093 24752832 24510012 23675613 22479462
44147 22479462 21772293 21870148 21932690 21509749 21674223 22934706 23020170 19395585 13716008
44138 13716008 10594468 11366202 12517948 11621202 10904753 12264156 12615368 8669703 3650181
44129 3650181 3723204 8724826 12069875 10265976 7126744 7015542 8853462 9384781 8233644
44120 8233644 6500515 3599370 -915902 -4620383 -4760818 -2094505 585823 2239779
44112B239779J024671l2128j112617P3278K799124K553776j845963m899476k194553
44103a394109K318353J880097k855949m884576j268185L101167L044846k01552
44095b59908j916179m08393J897744K380640J144960L08222J300252K953039K596976
44086I997353m06520l138866k630151j51252K96880k258770m209757k522887J059861
44077c964109K848368K351627K046804K890835K914506P29008j908191k421837
44069E487011r61879N0630n84541j516342j307155o84953j135040k120658j501182
44060d274109J115485L196474K532739L74961l23738R30204J827944J047141O1445
44051F488546K30270K18120j746986m375361m521458j586400J573765K479107
$$ plain form
44112 2239779 3264450 3232322 2119705 2192983 4992107 7545883 5699920 800444 -1394109
44103 -1394109 924244 2804341 -51608 -4936184 -6204369 -3103202 -58356 -259908
44095 -259908 -2176087 -2584480 -686736 1693904 2838864 3147086 4447338 7400377 9997353
44086 9997353 9590833 6451967 3821816 3670564 3967444 1708674 -2501083 -5023970 -3964109
44077 -3964109 -1115741 1235886 3282690 6173525 9088031 9817039 7908848 5487011
44069 5487011 4525132 4575762 3991221 2474879 1167724 482771 -652269 -2772927 -4274109
44060 -4274109 -3158624 37850 2570589 2945550 2621812 3552016 5379960 6427101 6488546
44051 6488546 6718816 6936936 5189950 814589 -3706869 -5293269 -3719504 -1240397
44043a240397J711194J000754N70587k18819j052065j287752j505614k493567
44035d515679l145016j505519J889191L863360K730116P32100P24872J743061
44027B516486K96462m000052o664909l731069K613310O066015L790486l21850
44019E64879j045684J439377K511459j9282l026346k826789q6722K018839K543257
44010B072988K848391K992349J379178j712488l353864j998518J11698K32610
44002B572344j100681j485298l37601R50957J472472J236375o1090k372037l890409
43993c014968k837897n68177j66445j551048j000976L060932O704819N455418
43985F081658O73465k164234p63558J628379J415698p90483k120530j707122j003125
$$ plain form
44043 -1240397 470797 1471551 2042138 1823319 771254 -516498 -2022112 -4515679
44035 -4515679 -7660695 -9166214 -7277023 -3413663 -683547 48553 773425 2516486
44027 2516486 2812948 -1187104 -7852013 -11583082 -8969772 -2903757 886729 564879
44019 564879 -480805 958572 3470031 3450749 424403 -2402386 -2489108 -470269 2072988
44010 2072988 4921379 7913728 9292906 7580418 4226554 2228036 2339734 2572344
44002 2572344 1471663 -13635 -351236 599721 2072193 3308568 3247478 875441 -3014968
43993 -3014968 -5852865 -6421042 -6587487 -8138535 -9139511 -6078579 626240 6081658
43985 6081658 6755123 4590889 3827331 5455710 6871408 6080925 3960395 2253273 1250148
43976A250148r78219r92998k91131Q31820J584597J585035J041280M77613K27696
43967D735841m9813r42586k066337k085615o83639M42883j21814r95624K99072
43958a467632L301648M537536K134372j549363l182421k633596k127452k461521
43950c448429k279585p92066Q56380J395030J146795J185334J590355J316988
43942I70802l42544k555535l456189k047940O44370K824594L901202M151455K988044
43933G078259k24450l425931k944294J110955L520207Q13200l094605k069123
43925G64218L096013N559609K232832k361173l211866j099385N85438J238883
43917F804569J947902J987674K22705j734263j372743O08849J235911j88714j430637
$$ plain form
43976 1250148 271929 -721069 -1012200 -180380 1404217 2989252 4030532 4508145 4735841
43967 4735841 4686028 3743442 1677105 -408510 -1092149 -649266 -771080 -1766704 -1467632
43958 -1467632 1834016 6371552 8505924 6956561 3774140 1140544 -986908 -3448429
43950 -3448429 -5728014 -6520080 -5663700 -4268670 -3121875 -1936541 -346186 970802
43942 970802 628258 -1927277 -5383466 -7431406 -6787036 -3962442 -61240 4090215 7078259
43933 7078259 6853809 3427878 483584 1594539 5114746 5927946 2833341 764218
43925 764218 3860231 9419840 11652672 9291499 6079633 4980248 5565686 6804569
43917 6804569 8752471 10740145 10962850 9228587 7855844 8464693 9700604 9511890 8081253
43908H081253j171584p48533j477592k385546j570240J298906M353085M844758
43900A1224507J463816l752527o443794m206952N00269L000066J532672j537781
43892A780276l070137j997156Q25781L598767M157608J502163k452088m122668
43884B22546k275519L00024K84487j819989k408327J93757L154308K781734l32269
43875A00752j929932M3979K629363K308447N6669o34093P48192J580747Q06190
43866E710314M6590j33853j128418k560781j739566J481413L296558J723338j52500
43857F543095L33059O85832j942228m731520l122031J528618L619275J446156
43849D360256j436781k327494j865579o48451J678649L562976K391841j019047
$$ plain form
43908 8081253 6909669 6161136 4683544 2297998 727758 2026664 6379749 11224507
43900 11224507 12688323 8935796 2492002 -1714950 -1214681 1785385 3318057 1780276
43892 1780276 -1289861 -3287017 -2461236 1137531 5295139 6797302 4345214 222546
43884 222546 -2052973 -1752949 -1468462 -3288451 -5696778 -5503021 -2348713 433021 100752
43875 100752 -1829180 -1785201 844162 3152609 3209278 2575185 3323377 4904124 5710314
43866 5710314 5756904 5623051 4494633 1933852 194286 1675699 4972257 6695595 6543095
43857 6543095 6876154 7561986 5619758 888238 -2233793 -705175 2914100 4360256
43849 4360256 2923475 595981 -1269598 -1918049 -239400 3323576 5715417 4696370
43841D696370k854798j829230k99448N15577J952104L764064L303858L20090j834362
43832G734225j474438p60968q47075M77342L775461N220481K351644j264299j005849
43823A4206524K208745M157053L571912K221846P88553j276454l012014k763942
43815B0102223j160419l60352q82899j536118j690004j448549n31440R09306J391724
43806A4793472M5380j635171j885093j279547j314093j709288j234617j05707
43798E675336M09648j43616j391727k747700k955567r15090J882969K259370J40272
43789B213895o50960J596564L313830J467009j215349r23227O92651k53141k650308
43780C590964k143985J251472L083058J663153m2573j8002K26222o16124j650745
$$ plain form
43841 4696370 1841572 12342 -287106 228471 2180575 5944639 9248497 9568587 7734225
43832 7734225 6259787 5498819 4651744 5129086 8904547 14125028 16476672 15212373 14206524
43823 14206524 16415269 20572322 24144234 26366080 27154633 25878179 22866165 20102223
43815 20102223 18941804 18581452 17698553 16162435 14472431 13023882 12492442 13401748 14793472
43806 14793472 14838852 13203681 11318588 10039041 8724948 7015660 5781043 5675336
43798 5675336 6084984 5941368 4549641 1801941 -1153626 -2068716 -185747 2073623 2213895
43789 2213895 1562935 3159499 6473329 7940338 6724989 5801762 6494413 6241272 3590964
43780 3590964 1446979 2698451 5781509 7444662 7402089 7384087 7610309 6994185 5343440
43771E343440k275773k886927k694537n68116J857709J920949P08470J601090
43763C006305M000151L711620L34443j368514P24581K455324L92978k522908k106014
43754H627966L41146P01872j311488k397625r94320J152340J963943J064900n52951
43745H595783j335693n12411N19069l74221k714445l625325j957658L51757J642249
43736E89105K222851K001634O0970k226886j672862J416999K578386k680k441748
43727B525769j633981o8038n66203r49291J360678L667697K475077Q6362O27970
43718G526040K368629P40264k980243l264759J54863J628680j124672l889676
43710A159126l371084j437590j38975J580647L744930L357304l81317l433871
$$ plain form
43771 5343440 3067667 180740 -2513797 -3081913 -1224204 696745 1405215 3006305
43763 3006305 7006456 10718076 11052519 9684005 10408586 12863910 13256888 10733980 8627966
43754 8627966 8969112 9670984 8359496 5961871 4967551 6119891 8083834 9148734 8595783
43745 8595783 7260090 6747679 7266748 6892527 4178082 552757 -1404901 -1053144 589105
43736 589105 2811956 4813590 4874560 2647674 974812 2391811 4970197 4967517 2525769
43727 2525769 891788 823750 257547 -691744 668934 4336631 6811708 6898070 7526040
43718 7526040 9894669 10634933 7654690 4389931 4544794 6173474 5048802 1159126
43710 1159126 -2211958 -3649548 -3788523 -2207876 1537054 4894358 4513041 1079170
43702A079170k655021k29357N65442K31121N75786R50434L20884n0743O86020
43693A473736O06680j250683j883808J038243M367823L715005J83821j830416
43685F420401j687278k154563l218232j939490J462469K920867J005351q96462
43677A913063n48676k97230k116779l572096k074235L12958K59012j142030l11547
43668g577560K670721M173036K791411R77289N84056N24318j33269j00262J399479
43659E309219K522674J473676p09315j984507k163406j939482q48741J287783
43651B947901K348905L91683k625834k824843K3824K128045J232538o92164j191733
43642A738322n45941J55250J068639J907996J199382n86994l11764K579846L413068
$$ plain form
43702 1079170 -1575851 -1805208 -1239766 -1008645 -432859 517575 838459 787716 1473736
43693 1473736 2080416 829733 -1054075 -15832 4351991 8066996 8250817 6420401
43685 6420401 4733123 2578560 -639672 -2579162 -1116693 1804174 2809525 1913063
43677 1913063 1364387 1067157 -1049622 -4621718 -6695953 -6382995 -6123983 -7266013 -7577560
43668 -7577560 -4906839 -733803 2057608 3034897 3618953 4143271 4010002 3909740 5309219
43659 5309219 7831893 9305569 8596254 6611747 4448341 2508859 1660118 2947901
43651 2947901 5296806 5688489 3062655 237812 261636 2389681 3622219 2930055 1738322
43642 1738322 1192381 1347631 2416270 4324266 5523648 4936654 4624890 7204736 10617804
43633A0617804j036604o143882n131585O03952L205815J49569k503488k57447
43625d95866L062818K291554q57539j513598K74301O72855r94701j812965p61522
43616a34663K24659M19131J148148K237819J617431q14600k382033j563190K31929
43607I84631J472541K103199J719722n12124l060113k636577O77579K287744m95752
43598B540850l888141k703685K141560M875755K643283j467287l151938j684776
43590f94379O76632J863119J536766P09473O24820J499330K245262J858628O78745
43581A0998396l73999j145335j854331k023319j086681L12862Q86752L26926p03244
43572E338027j799224k794627k896571j354644R99946K266740J788745Q91517
$$ plain form
43633 10617804 9581200 3437318 -1694267 -1090315 2115500 2265069 -238419 -495866
43625 -495866 2566952 4858506 4000967 2487369 2761670 3434525 2439824 626859 -134663
43616 -134663 89996 509127 1657275 3895094 5512525 4697925 2315892 752702 984631
43607 984631 2457172 4560371 6280093 5767969 2707856 71279 748858 3036602 2540850
43598 2540850 -1347291 -4050976 -1909416 2966339 5609622 4142335 990397 -694379
43590 -694379 -17747 1845372 3382138 4091611 4716431 6215761 8461023 10319651 10998396
43581 10998396 10624397 9479062 7624731 5601412 4514731 4827593 5714345 6041271 5338027
43572 5338027 3538803 744176 -2152395 -3507039 -2507093 -240353 1548392 2439909
43564B439909J073417K303839L282835K756837O28224j709997k477680j514213
43556F783171n88043j026754j933575j732395m17412J049370K415050L496928
43548H046340L058415N77838j748101j351978Q80032J821793P53107k22529k96342
43539A1518575j032602k708945l044352r73318J248589J342319l8643j118941
43531E192682j452918j248462n88697m57485j890427l081595p22370M236177O126529
43522F113434K406420k060943k113420J20552n57178l607494l876143r1368L430607
43513b35533L495851J547836k2904q38679r72038J8002J542040K149301J595746
43504H279622N05042j343974l641480l793859l03112L361986K845434j27480k11105
$$ plain form
43564 2439909 3513326 5817165 9100000 11856837 12485061 10775064 8297384 6783171
43556 6783171 6195128 5168374 3234799 1502404 1084992 2134362 4549412 8046340
43548 8046340 11104755 11682593 9934492 8582514 9462546 11284339 12037446 11814917 11518575
43539 11518575 10485973 7777028 4732676 3759358 5007947 6350266 6311623 5192682
43531 5192682 3739764 2491302 1902605 1445120 -445307 -3526902 -4249272 -13095 6113434
43522 6113434 8519854 6458911 4345491 4466043 3908865 301371 -3574772 -3666140 -235533
43513 -235533 3260318 4808154 4785250 3946571 2974533 2992535 4534575 6683876 8279622
43504 8279622 8784664 7440690 3799210 5351 -297761 3064225 5909659 5782179 5571074
43495E571074K700303L412462O53697p41532J204555J745991j892328m753024
43487G901198k194638K045660J982750r49863j193794J193950J384592j281762
43479H888093k371067k16297J784120J558906J304051K456712K718528L74281
43471A6497327k270528k198220L00305K819433L775349K708218m6382k553728
43463A9031774k337994K78274J934118Q14172o35263N16082L050194L264689L01976
43454B6218022k759029l110931j373301K8116k9777r20872j821223k296230j751482
43445A2183293J74522K407849L023227J714707L68144J93155j78903k064685l727894
43436A4093415k617388L09059J607093M23417p62968o37620o49656j379952j172265
$$ plain form
43495 5571074 8271377 11683839 12337536 11596004 12800559 14546550 12654222 7901198
43487 7901198 5706560 7752220 9734970 8785107 7591313 8785263 10169855 8888093
43479 8888093 6517026 6300729 8084849 9643755 10947806 13404518 16123046 16497327
43471 16497327 14226799 12028579 12328884 15148317 18923666 21631884 21585502 19031774
43463 19031774 16693780 16972054 18906172 19720344 19085081 19601163 22651357 25916046 26218022
43454 26218022 23458993 20348062 18974761 19002877 18973100 18052228 16231005 13934775 12183293
43445 12183293 12357815 14765664 17788891 19503598 19871742 20064897 19885994 17821309 14093415
43436 14093415 11476027 11785086 13392179 13815596 13052628 12415008 11765352 10385400 9213135
43427I213135K11261M47925r19362q85839J667627L085565P17280k309872k212197
43418I015523q40661j850598l620302j952190K013837K959400l6603k172002o74544
43409B841860J692474K067120J426430J372806J282668O25638N65664J388663
43401A3263323J387303p1851j145180n54128N91005J130449J341415J064095p97959
43392A6208472l575525m258969j226201L298911N595700L881174o41363m431890
43384A4850309l986744P7645K495246L7999l027380q41412M249246M335798j624685
43375A6566022n542533k424825K467961K545007n08626j223541O73640J595115
43367A4148220Q18292K37156j26654j326095k171507j144284K82638K64218K85051
$$ plain form
43427 9213135 9424396 9872321 8952959 8067120 9734747 12820312 13537592 11227720 9015523
43418 9015523 8174862 6324264 2703962 751772 2765609 5725009 5688406 3516404 2841860
43409 2841860 4534334 6601454 8027884 9400690 10683358 11308996 11874660 13263323
43401 13263323 14650626 14578775 13433595 12879467 13470472 14600921 15942336 17006431 16208472
43392 16208472 12632947 8373978 7147777 10446688 16042388 19923562 19282199 14850309
43384 14850309 10863565 10941210 13436456 13474455 10447075 9605663 13854909 18190707 16566022
43375 16566022 11023489 8598664 11066625 13611632 13103006 11879465 12553105 14148220
43367 14148220 14966512 15203668 15077014 13750919 11579412 10435128 10717766 10981984 11267035
43358A1267035K070143L261300R75275k430130k394410N45693J921824Q59210
43350A6075940P68756K571698K849231j40228l380581l714112j776370K83801
43342A3538135J791446K616375J972582p9124j765258j605408r1921J258478J424010
43333A9059315L05307j242561j932781j536755j218036j505569j289296q8903
43325A0550721N32181l60116j029997P650J197112P83818Q0107N82995L40193
43316A2684664k572763n140687l090701J874652L958471J728922q03176j301214
43308G338168j432488j681373j6338K830663K751039q01656k855613p24670J631520
43299G039252O01553r14866R24122L461424J508741l768237n932638k558342J823841
$$ plain form
43358 11267035 13337178 16598478 17573753 15143623 12749213 13294906 15216730 16075940
43350 16075940 16844696 19416394 22265625 22125397 18744816 15030704 13254334 13538135
43342 13538135 15329581 17945956 19918538 19839414 18074156 16468748 16376827 17635305 19059315
43333 19059315 19364622 18122061 16189280 14652525 13434489 11928920 10639624 10550721
43325 10550721 11082902 10722786 9692789 9700439 10897551 11681369 11761476 12344471 12684664
43316 12684664 10111901 4971214 1880513 3755165 7713636 9442558 8639382 7338168
43308 7338168 5905680 4224307 4207969 7038632 9789671 8988015 6132402 5407732 7039252
43299 7039252 7640805 6725939 7650061 11111485 12620226 8851989 2919351 361009 2184850
43290B184850K643496R08432L78740K063313L604075K863735M07323j535685j626069
43281A1892210l42877J281640K638489K853043Q46793k458874l774572j660600
43273A1275252N25529q44203l624442k763538J452607L385773R62730j117372
43265I252336O90104L091891J856309j170412j676754k78979j025294m109734
43257F629467n161161j860377K638749L840893J126926k058300k214857M11143
43249C352483K160998P38460j266108R4528L825693N009736K297821l06748l99782
43240A5507081o02247k501440k764832N49922K919422L0248m619093m900515j491291
43231B127255M80396M78408J844730L754505J971544k458172l264176R53068M065622
$$ plain form
43290 2184850 4828346 5736778 6115518 8178831 11782906 14646641 15053964 13518279 11892210
43281 11892210 11549333 12830973 15469462 18322505 19169298 16710424 12935852 11275252
43273 11275252 11800781 10956578 7332136 4568598 6021205 9406978 10369708 9252336
43265 9252336 9942440 13034331 14890640 13720228 12043474 11764495 10739201 6629467
43257 6629467 1468306 -392071 2246678 6087571 7214497 5156197 2941340 3352483
43249 3352483 5513481 6251941 4985833 5080361 8906054 13915790 16213611 15906863 15507081
43240 15507081 14904834 12403394 9638562 10188484 13107906 13138154 8519061 3618546 2127255
43231 2127255 2607651 3086059 4930789 8685294 10656838 8198666 4934490 5887558 9953180
43222I953180K176918p44612j94118J964980J956943M41634r3087m05305k348291
43213A2708242m417965l836941j298564J39612l68779j162406j269711j047690
43205e54202l96845J162492K971308L567469K338286J2279j830501j552707Q14929
43196F532508K685898J855867P5839O12290K409278J152089k989060m146542J41522
43187H329689M152348K530470j405986j593274P08311p7530l338670k938716J897977
43178H264619M419241R62461l244533k331343J645773K721528r9106k477182j333980
43169H527478J920196L972233K920185m77656l409111l640985k195282j867739
43161E749319k757795j960242J280315L419710J808860r98622j157431P38483
$$ plain form
43222 9953180 12130098 11385486 11191368 13156348 15113291 15554925 15461838 15056533 12708242
43213 12708242 8290277 4453336 3154772 3294384 2925605 1763199 493488 -554202
43205 -554202 -951047 211445 3182753 6750222 9088508 9100787 7270286 5717579 6532508
43196 6532508 9218406 11074273 11150112 11762402 14171680 15323769 12334709 8188167 8329689
43187 8329689 12482037 15012507 13606521 12013247 12721558 12644028 9305358 6366642 8264619
43178 8264619 12683860 13646321 10401788 8070445 9716218 12437746 12338640 9861458 8527478
43169 8527478 10447674 14419907 17340092 16862436 13453325 9812340 7617058 5749319
43161 5749319 2991524 1031282 2311597 5731307 7540167 6541545 5384114 6122597
43153F122597J438167P07357J088909K788376K984164O05635j752093j701928
43145A2281184j47285O29739p6132j318806j844167r13889R26396J831630Q14165
43136A2182835m86936o4188J097106N63248j111888r45977J252805K167398N94737
43127A5249140l80459R87053J431530j858627n507670m307581P16524L516652
43119I846562J543517j662273k532292j574502l52281J418140L583337L656281
43111A3926489J23548m207301m944931j489236K403038L164392R32503j561056
43103H347446k368283j874276j300561o51984Q09359K374734K152428L20607j95054
43094G614416J763511K744393l74340m442345l606139J767810M991164K745067
$$ plain form
43153 6122597 7560764 8268121 9357030 12145406 15129570 15735205 13983112 12281184
43145 12281184 12133899 12763638 12687506 11368700 9524533 8610644 9537040 11368670 12182835
43136 12182835 11695899 11631711 12728817 13292065 12180177 11234200 12487005 14654403 15249140
43127 15249140 14868681 15855734 17287264 15428637 9920967 5613386 6329910 9846562
43119 9846562 11390079 9727806 7195514 5621012 5268731 6686871 10270208 13926489
43111 13926489 14050037 9842736 4897805 3408569 5811607 8975999 9908502 8347446
43103 8347446 5979163 4104887 2804326 2152342 2961701 5336435 7488863 7809470 7614416
43094 7614416 9377927 12122320 11747980 7305635 3699496 5467306 10458470 13203537
43086A3203537n17086j73055J725931J092720r67522o94606J302667J188058j119178
43077A5041466j592160J157451L724165L483534J966885J070030j92410k743799
43069B1915162m342456k413879J830454M833424N125900L933269K321201M61641
43061C3664716m93183J279220N133462P483547O230537L998055M598439P377153
43053F9271946Q387697P281581Q912270J6079732K4832718L1038496L7706995
43046B03511435M8452691N4956652M0914623L104402l8726777o0224629n6910307
43039A95078090m3707924l3697775k6631623j8325375j1090249r402274j1266064
43032D0956806j0562862n912133j930297j975033l714906k960357O35292L468131
$$ plain form
43086 13203537 12686451 12513396 14239327 15332047 14364525 13669919 14972586 16160644 15041466
43077 15041466 13449306 14606757 18330922 21814456 23781341 24851371 24658961 21915162
43069 21915162 17572706 15158827 16989281 21822705 26948605 30881874 33203075 33664716
43061 33664716 33171533 34450753 39584215 47067762 53298299 57296354 61894793 69271946
43053 69271946 77659643 84941224 93853494 109933226 134765944 165804440 203511435
43046 203511435 251964126 306920778 347835401 350939803 312213026 251988397 195078090
43039 195078090 151370166 117672391 91040768 72715393 61625144 52222870 40956806
43032 40956806 30393944 24481811 22551514 20576481 16861575 13901218 14536510 18004641
43024A8004641K843207L14192p03953K28737L11776j486919k157131K90109K325526
43015A9970185l05349m931948m607100J357800N294962J822098m466280n586966
43007H547402p26853M079236M491584J718968j092229k323172j710466K32408
42999A3216878K093694K740403K688239K880244K657072P44838k104549l371305
42991B1545514j856552P73003J739679j45750l233099m150989j097883L546545
42983A7120468N269683K755823n51992j194349J05798O21148r5797m40368K68870
42974B3859284J462292K755353L435522J876535j940086m594448k911855J387244
42966B5329841L731193K635982M01679j396807l244821m518320l139668N26137
$$ plain form
43024 18004641 20847848 21162040 20458087 20686824 20998600 19511681 17354550 17644659 19970185
43015 19970185 19664836 14732888 10125788 11483588 16778550 18600648 14134368 8547402
43007 8547402 7820549 11899785 16391369 18110337 17018108 14694936 12984470 13216878
42999 13216878 15310572 18050975 20739214 23619458 26276530 27021368 24916819 21545514
42991 21545514 19688962 20461965 22201644 22055894 18822795 14671806 13573923 17120468
42983 17120468 22390151 25145974 24593982 23399633 23505431 24126579 24030782 23590414 23859284
42974 23859284 25321576 28076929 31512451 33388986 31448900 26854452 23942597 25329841
42966 25329841 29061034 31697016 32098695 30701888 27457067 22938747 19799079 20325216
42958B0325216L046253K666286J494593J396657J016177q73291k066648o6504
42950B6938739L439424M425944J870340j484399l135092l141513k635262k145826
42942B4132355j672802j012170J11262J343431J577850N57033j42524Q65298K424242
42933B8183975K214337R0123j827432k306664k239496k351882j717513L82342
42925B0427790K664516L340053K538698J914134K278836K765094K178271L95501
42917C8502893j375169j210186J971429O603920R231807Q772301R182294J4895703
42909H6574992K3027631K3633826J0644638r380580k2994513k3869030j7675950
42902F9961014j2988892j1582418r802720n923043k171076p01633j112709k023985
$$ plain form
42958 20325216 23371469 26037755 27532348 28929005 29945182 29071891 27005243 26938739
42950 26938739 30378163 34804107 36674447 35190048 32054956 28913443 26278181 24132355
42942 24132355 22459553 21447383 21558645 22902076 24479926 25036959 24894435 25759733 28183975
42933 28183975 30398312 30488435 28661003 26354339 24114843 21762961 20045448 20427790
42925 20427790 23092306 26432359 28971057 30885191 33164027 35929121 38107392 38502893
42917 38502893 37127724 35917538 37888967 44492887 53724694 62496995 71679289 86574992
42909 86574992 109602623 133236449 143881087 134500507 111505994 87636964 69961014
42902 69961014 56972122 45389704 35586984 29663941 27492865 26791232 25678523 23654538
42894B3654538k556899k013178k17018J520606J629073O65172O15410J667332
42886B4965036J836994L09296j148183j085764m53737l37546K86242K458367M528464
42877C1359169M094619J801981O26369J658171L148744L882901M749364O028170
42869E7349488N828145L272845J282378L356956Q382841J1621305J1129034J0387192
42861A12610184J3431940J9980207K7465432L5612014M5308775N3383976N2588025
42854C60380553L8842323J6481403n650964k1995666l2448256l8353401l9576401
42847B77679591l6123157l0222532k4927431k1274091j8155016j4877773j2518051
42840A19581540j2000065j1804240r340846m860409k043427l252877n878628n886576
$$ plain form
42894 23654538 21097639 19084461 18867443 20388049 22017122 22682294 23297704 24965036
42886 24965036 26802030 27111326 25963143 24877379 24423642 24086096 24372338 26830705 31359169
42877 31359169 35453788 37255769 37882138 39540309 42689053 46571954 51321318 57349488
42869 57349488 63177633 66450478 67732856 71089812 79472653 91093958 102222992 112610184
42861 112610184 126042124 146022331 173487763 209099777 254408552 307792528 360380553
42854 360380553 399222876 415704279 410053315 388057649 355609393 317255992 277679591
42847 277679591 241556434 211333902 186406471 165132380 146977364 132099591 119581540
42840 119581540 107581475 95777235 86436389 81575980 79532553 76279676 70401048 64514472
42832F4514472l866631m027052p232041r240224p303216m361187l910849m431324
42824B0141948k843835m96874p49328k503585j687909J529658K725459P20943
42816A6836477o76663K93346M34448j812472k585220O39268L452241R39187l915314
42807A3605298m298462jK557754L18471k489492j681360Q62661J068054j176309
42798H766614k826956k487605j496632j087000p24676N85277K460729L109970
42790F299721J360109j249808j500495J341878L651179J749172k795806m889226
42782C966724k724718J78922L49584j297919j906715p62316J083842L120446M880505
42773F888355M626339J210099l290838n143326l296285m69111L65528p19246j324345
$$ plain form
42832 64514472 60647841 56620789 49388748 40148524 32845308 28484121 24573272 20141948
42824 20141948 17298113 16801239 16051911 13548326 11860417 13390075 16115534 16836477
42816 16836477 16159814 16453160 16887608 15075136 12489916 13129184 16581425 17520612 13605298
42807 13605298 9306836 9306835 11864589 12183060 9693568 8012208 8874869 9942923 8766614
42798 8766614 5939658 3452053 1955421 868421 143745 729022 3189751 6299721
42790 6299721 7659830 6410022 4909527 6251405 9902584 11651756 8855950 3966724
42782 3966724 1242006 1420928 1770512 472593 -1434122 -2196438 -1112596 2007850 6888355
42773 6888355 11514694 12724793 9433955 4290629 994344 525233 890761 171515 -1152830
42764a152830M2483K154242K631580J078365k23064N54542K044951J856914O90245
42755I677428J463051M179394N015119J866500k342033l989577l491815l039168
42747I338899k405994n53236Q39185l45163k249140j283202K055001M041792L836976
42738A3275118L844574M068643J704314k595884l871424o44305J895076p4492
42730A7601620k738014r34463L323630M015057K20561l327328l418167j212665
42722A3530231J262962K992622K751098O6941k738153k903319j145176o210O14477
42713A4425473K528362N061088O127163O499953Q266710R913180Q337547N299877
42705F6459353N992981J1213882J7127325K2502301K8175616K8511781J3758770
$$ plain form
42764 -1152830 -1110347 1043895 3675475 4753840 4530776 5085318 7130269 8987183 9677428
42755 9677428 11140479 15319873 20334992 22201492 19859459 15869882 12378067 9338899
42747 9338899 6932905 6379669 7218854 6873691 4624551 3341349 5396350 9438142 13275118
42738 13275118 17119692 21188335 22892649 20296765 16425341 15781036 17676112 17601620
42730 17601620 14863606 13929143 17252773 21267830 21488391 18161063 14742896 13530231
42722 13530231 14793193 17785815 20536913 20603854 17865701 14962382 13817206 13810996 14425473
42713 14425473 16953835 22014923 28142086 34642039 42908749 52821929 61159476 66459353
42705 66459353 72452334 83666216 100793541 123295842 151471458 179983239 193742009
42698A93742009j4139128l7168977m0293512k8520281j7448042j2887683r289373
42691C3995013m012106j661863m302993p097900n904117k308168P09440K336515
42683A1753821J908233j111490l995701l005991K85121N70360k375946k858986
42675A169421J005263L553927P65177l178786k873265J68955J373545O67873P51211
42666C403321J198223r9160j887119j297733Q37041J340602L04320N88200K274422
42657F662117K296163j89956k291337k053705j064503j202902j722395j035459
42649f01977P13457K241767K853045K494435J162447p98770k346249k331747n07282
42640B879126J925177K893870J406758r43860j623544o14274n40130k541903m057758
$$ plain form
42698 193742009 179602881 142433904 102140392 73620111 56172069 43284386 33995013
42691 33995013 29982907 28321044 24018051 16920151 11016034 8707866 9417306 11753821
42683 11753821 13662054 12550564 8554863 5548872 5833993 6404353 4028407 1169421
42675 1169421 2174684 5728611 6493788 3315002 441737 610692 1984237 2652110 3403321
42666 3403321 4601544 4502384 2615265 1317532 2154573 3495175 3799495 4387695 6662117
42657 6662117 8958280 8768324 6476987 4423282 3358779 2155877 433482 -601977
42649 -601977 111480 2353247 5206292 7700727 8863174 8064404 5718155 3386408 2879126
42640 2879126 4804303 7698173 9104931 8161071 6537527 5923253 5383123 2841220 -1216538
42631a216538k385263J217147L170182K280745N96571R5474O24174J096617R95943
42622F475052L50026o24563j426474j351038J3353K180477L500402K281331q36197
42613A0562369k574994q50789K009637K309905L18386p34601k30032l51480q67576
42604I590825R08456M202755N021880M030574O815246J2648917J1222556k545107
42596E1896102j7457059j9094589r159126j393950j194251j096586L496790O393647
42588A2390978K208731m144949n380544k171661K01173K59301O979J34620J95455
42579C700083O11743J093934Q0533j786094j469243Q93058J034888j995935l004386
42570h41419P86858M117145J962245j958065j559985J269205M70706l258040l777357
$$ plain form
42631 -1216538 -3601801 -2384654 785528 3066273 3662844 3758318 4382492 5479109 6475052
42622 6475052 6825078 6200515 4774041 3423003 3436356 5616833 9117235 11398566 10562369
42613 10562369 7987375 7136586 9146223 11456128 11774514 11039913 10809881 10458401 9590825
42604 9590825 10499281 14702036 19723916 23754490 30569736 43218653 54441209 51896102
42596 51896102 34439043 15344454 6185328 4791378 3597127 2500541 5997331 12390978
42588 12390978 14599709 10454760 5074216 2902555 3103728 3363029 3370008 3504628 3700083
42579 3700083 4311826 5405760 5486293 3700199 2230956 3124014 4158902 2162967 -841419
42570 -841419 -54561 4062584 6024829 4066764 2506779 3775984 4246690 988650 -2788707
42561b788707j88417K210135J419753J015796K050880P47143l419896m816067
42553c769380n41207M064992L361838k56934j115373O30095N02247j905265k109418
42544a138405J731563N490628M785813O88069k334419k303605j335768j781554
42536C802322k786475j876469R45537K773757J987609O66393J086545J794366
42528H393585J01664k762756k857930J15774J726004o94346m103294m383582j923777
42519f388658Q430J96294j375M40410J288831K003971J678915o56584l803402
42510e233168m232520o15281L214523K916709j44523j061609J088124K312119
42502a755626O56056n78826J471816M233484L476497m70678l597497l730031j996295
$$ plain form
42561 -2788707 -2977124 -766989 652764 1668560 3719440 4466583 1046687 -3769380
42553 -3769380 -4310587 -245595 3116243 2859309 1743936 2374031 2876278 971013 -1138405
42544 -1138405 593158 6083786 10869599 11557668 9223249 6919644 5583876 3802322
42536 3802322 1015847 -860622 84915 2858672 4846281 5512674 6599219 8393585
42528 8393585 8495249 5732493 2874563 2990337 4716341 4021995 -81299 -4464881 -6388658
42519 -6388658 -6380228 -6183934 -6185309 -5744899 -4456068 -2452097 -773182 -1429766 -5233168
42510 -5233168 -9465688 -10080969 -6866446 -3949737 -4094260 -5155869 -4067745 -1755626
42502 -1755626 -1099570 -1678396 -206580 4026904 7503401 7032723 3435226 -294805 -2291100
42493b291100J95432K312890L121657J321101j593737k090200M61349K145390
42485C582782k81544m516884n532465k120548K062371L638459K956029J927588
42477A715788J045760l945p20028p58816j301687l272871m874640l335234Q35862
42468a0669811L796717L352085J691846J706959K668486J969422j75044q91298
42460C449362N65774J347810m77431k554200j530771J882131L700304J969936
42452H352915j122125k630825k210325j304075p28254l84925l24149o32252o59584
42443a643599L89611K093300K995617K345468R27900j10644o21307j130148j619184
42434C627014j485660p84384n60094j219391j320496O15403L268326L404386L44522
$$ plain form
42493 -2291100 -2095668 217222 3338879 4659980 3066243 976043 1437392 3582782
42485 3582782 3301238 -1215646 -6748111 -8868659 -6806288 -3167829 -211800 1715788
42477 1715788 2761548 2757603 2037575 1278759 -22928 -3295799 -8170439 -11505673 -10669811
42468 -10669811 -6873094 -3521009 -1829163 -122204 2546282 4515704 4340660 3449362
42460 3449362 4015136 5362946 4885515 2331315 800544 2682675 6382979 8352915
42452 8352915 7230790 4599965 2389640 1085565 357311 -27614 -351763 -984015 -1643599
42443 -1643599 -1253988 839312 3834929 6180397 7108297 6997653 6376346 5246198 3627014
42434 3627014 2141354 1356970 796876 -422515 -1743011 -1127608 2140718 5545104 5889626
42425E889626k403954j666028R10879J425435l46172j049590K12390m9329l859755
42416i36498p425811n762029K88510N009416M981708K229543L17725J85584O10704
42407e01148O58567M37262M58395J041344J856487J955672Q63935n43366j002914
42398E224234m17720L24846O26426L64448o06913j998975k613043j546539M01516
42389b41720J499111R02797q97357k574181k335693N98020L893062L640754l06800
42380D177993l053968j248613J800562J274465j541367j904042j0183l29453k910534
42371c745140k484828K218769N252330K746627q47558k82338K135195J318016
42363F311073j654402j803931J061491K455579R57314k86248J28323k97815k644516
$$ plain form
42425 5889626 3485672 1819644 2730523 4155958 3809786 2760196 2972586 2923257 -936498
42416 -936498 -8362309 -14124338 -13835828 -8826412 -3844704 -1615161 -1297436 -1111852 -501148
42407 -501148 157419 594681 1053076 2094420 3950907 5906579 6770514 6227148 5224234
42398 5224234 4806514 5131360 5757786 6122234 5515321 3516346 903303 -643236 -241720
42389 -241720 1257391 2160188 1262831 -1311350 -3647043 -3049023 844039 4484793 4177993
42380 4177993 1124025 -124588 1675974 2950439 1409072 -494970 -505153 -834606 -3745140
42371 -3745140 -6229968 -4011199 1241131 3987758 3140200 2857862 4993057 6311073
42363 6311073 4656671 2852740 3914231 6369810 7327124 7040876 7169199 6871384 4226868
42354D226868l921008j804874J512592K519005J041351l90456l23496L68578M29327
42345C657887j6327n2824J04302j075977l582152m012866M56261O422706O829699
42336H730709O88657m475048l022558P43978q2327l869279l698977O89089K473660
42327a822096p49031l185883o04066L365405M072758K846450K838052K903644
42319I665233O39570k140135k136827l86536m63922k335898k518319K84974L585076
42310D193216M941232M163485J869257j139484k973753j883188J135958L026332
42302A3333055K282695J66847j682055k927461l549212l023698j293453N57428
42294C864146J324534R04552K38598K86788R52733R60952o14314k629657k802913
$$ plain form
42354 4226868 305860 -1499014 13578 2532583 3573934 3183478 2859982 3228560 3657887
42345 3657887 3641560 3588736 3693038 2617061 -965091 -4977957 -4521696 1901010 8730709
42336 8730709 9419366 4944318 1921760 2665738 2583411 -1285868 -4984845 -4295756 -1822096
42327 -1822096 -2571127 -5757010 -6361076 -2995671 1077087 3923537 6761589 9665233
42319 9665233 10304803 8164668 6027841 5641305 5177383 2841485 323166 608140 4193216
42310 4193216 9134448 13297933 15167190 14027706 11053953 9170765 10306723 13333055
42302 13333055 15615750 15782597 14100542 11173081 7623869 4600171 3306718 3864146
42294 3864146 5188680 6093232 6331830 6618618 7571351 8532303 7917989 5288332 2485419
42285B485419p78059J146455J175178L57394M76694J112372O72476p24397j517133
42276D406399j254054q11013l93019N94917J709421J564221R2378j129379j264246
42267C515625j129005j150394l94810J227877J702570k31602k268334j086523
42259A85404K596716M179518J212960k963987l407772N2419K973353K382470J44340
42250G355421m58687O46025P79807j461188m350565n116843k929318K41727J472193
42241c821428m6153j829458r67755J872381L029477R43258j468810q75499J997551
42232a166436L827801L001705M77977k087922k961569p76649L120683M479998
42224G915588J229983k910482l262825q91823l00661j865505j745013J050726
$$ plain form
42285 2485419 1707360 2853815 4028993 4386387 4863081 5975453 6647929 5923532 4406399
42276 4406399 3152345 2341332 1948313 2543230 4252651 5816872 5909250 4779871 3515625
42267 3515625 2386620 1236226 841416 2069293 3771863 3540261 1271927 185404
42259 185404 2782120 6961638 8174598 5210611 1802839 1855258 4828611 7211081 7355421
42250 7355421 6896734 7542759 8322566 6861378 2510813 -2606030 -5535348 -5293621 -3821428
42241 -3821428 -3867581 -5697039 -6664794 -4792413 -1762936 -819678 -2288488 -3163987 -1166436
42232 -1166436 2661365 5663070 6141047 4053125 1091556 314907 3435590 7915588
42224 7915588 9145571 6235089 2972264 2080441 1779780 -85725 -1830738 -780012
42216g80012L017469K266011J017021P53891J4832j303379n98085K225550L199990
42207I813288O54253j758784j411831r91092k698340l344804j29190L275060K151988
42198E560548j464518k553789j502013k020723l109229o16926M129179M919761
42190C342290N31843l011400j804057N47237m23857l176379l369211l58725K737379
42181d984880L287981J218960j525756k327596k98793K225446K503061J361087
42173A459510J581473K842710K143695o41513k136714j338207j378275l510046
42165i77367m023223k74430M111695L972077j26598l237285k920356j146438k93608
42156d915533m93210p39995k74754J069298K389457K100775K3691j808528j619740
$$ plain form
42216 -780012 2237457 4503468 5520489 6274380 6289212 4985833 4387748 6613298 9813288
42207 9813288 10467541 8708757 7296926 6305834 3607494 262690 133500 3408560 5560548
42198 5560548 4096030 1542241 40228 -1980495 -5089724 -5706650 -1577471 3342290
42190 3342290 3874133 862733 -941324 -394087 -817944 -3994323 -7363534 -7722259 -4984880
42181 -4984880 -1696899 -477939 -2003695 -4331291 -4630084 -2404638 98423 1459510
42173 1459510 3040983 5883693 8027388 7385875 5249161 3910954 2532679 -977367
42165 -977367 -5000590 -5275020 -1163325 2808752 2682154 -555131 -3475487 -4621925 -4915533
42156 -4915533 -5408743 -6148738 -6423492 -5354194 -2964737 -863962 -840271 -2648799 -4268539
42147d268539n6856J268993J963952K161906J252168q33204k380266j972706p68134
42138c632686o58538j104697j31678K000845K588817L18149k563378k765565K61477
42129e687254L690769M195667J309166k135061l189412k066351j228702j496671
42121f607849r58407J620423M287646M305104J734741r73112k066016j671628
42113c29098o47435K18855K83577l74189p38554k12783L03125k82268j434637
42104c213407j671723o45533O63656J537721K014155J864307N04238j550130k279301
42095b776017l82334K377022K405006j332613n092521m247003O67287M038920
42087d342253K337110j227219j469595J387183K681513P98788n85253J396464
$$ plain form
42147 -4268539 -4325395 -3056402 -1092450 1069456 2321624 1488420 -891846 -2864552 -3632686
42138 -3632686 -4291224 -5395921 -5527599 -3526754 -937937 -619788 -3183166 -5948731 -5687254
42129 -5687254 -1996485 2199182 3508348 1373287 -1816125 -3882476 -5111178 -6607849
42121 -6607849 -7566256 -5945833 -1658187 2646917 4381658 3408546 1342530 -329098
42113 -329098 -976533 -757678 -474101 -848290 -1586844 -1799627 -1496502 -1778770 -3213407
42104 -3213407 -4885130 -5530663 -4867007 -3329286 -1315131 549176 1053414 -496716 -2776017
42095 -2776017 -3158351 -781329 1623677 291064 -4801457 -9048460 -8381173 -4342253
42087 -4342253 -2005143 -3232362 -4701957 -3314774 -633261 165527 -419726 976738
42079I76738M215857L562060q27099n012763n222414j167258L762121N061793
42071E349035J465298l098801l949052j751115r70545k340705j650175K468201
42063d477859M882347J652629l160091l301786L42215J862450k12026j577506
42055c989627K01487K445411K574455J674020J314575Q29310l71690j001392l31890
42046C344659J39614p77673j928906j884756j105130n23306K24814J530440K263959
42037A283715J221952q06293j855068j090209P07422K404706L372327L411426
42029H649978K503580P26399j492543k999310k625685r98259n91287k580007m567155
42020c974289l400670L04595K760617K049458K03865j07301J321801L116216M088332
$$ plain form
42079 976738 5192595 8754655 7927556 2914793 -2307621 -3474879 287242 5349035
42071 5349035 6814333 3715532 -233520 -1984635 -2955180 -5295885 -6946060 -4477859
42063 -4477859 404488 2057117 -1102974 -4404760 -4062545 -2200095 -2412121 -3989627
42055 -3989627 -3788140 -1342729 1231726 2905746 4220321 5049631 4677941 3676549 3344659
42046 3344659 3484273 2706600 777694 -1107062 -2212192 -2735498 -2510684 -980244 1283715
42037 1283715 2505667 1699374 -155694 -1245903 -538481 1866225 5238552 8649978
42029 8649978 11153558 11879957 10387414 7388104 4762419 3764160 3172873 592866 -3974289
42020 -3974289 -7374959 -7070364 -4309747 -2260289 -2056424 -2163725 -841924 2274292 6362624
42011F362624L146716m25939n102028p149749m342310J129269M731646M084066
42003B434295O55747k239516k347746o4108K107106K055158K87065r25379n30567
41994A432055K88344J74729p13730j488116j635356p99287J131444K942785K482973
41985C815841p24580m172533m751099j943437J924244L978228L038282N24716
41977A689662n71922J195288L405801K251603k070499m644368k074404K560347
41969A741508L507488p2222l365421k747370k93205o3810k150012k913143n05493
41960f861680K452121K656521P41033L5520J365354J824087l46625k326692p24424
41951a184785K700191L006981m54540k644825l16973K905707J904949k229889
$$ plain form
42011 6362624 9509340 9083401 3981373 -3168376 -7510686 -6381417 -1649771 2434295
42003 2434295 3090042 850526 -1497220 -1561328 545778 2600936 2888001 1962622 1432055
41994 1432055 1720399 1895128 1181398 -306718 -1942074 -2741361 -1609917 1332868 3815841
41985 3815841 3091261 -1081272 -5832371 -7775808 -5851564 -1873336 1164946 1689662
41977 1689662 1117740 2313028 5718829 7970432 5899933 1255565 -818839 1741508
41969 1741508 5248996 5176774 1811353 -936017 -1229222 -1293032 -3443044 -6356187 -6861680
41960 -6861680 -4409559 -1753038 -1012005 -976485 388869 2212956 1866331 -460361 -1184785
41951 -1184785 1515406 4522387 4067847 1423022 1106049 4011756 5916705 3686816
41943C686816l879349j070236K216100K147234k82476j892367j558416o065K171391
41934A532632M003765L449609j60802l943183m274417j430416R29074P98414j02309
41925H02367L38442J698210K463506K280203J387935l81146k462708l075462j716371
41916A334976o25853j589735k653933p40103L346335N567267M060546Q84326j704062
41907G879764l466740m071078k198136J596712L907435K436609r57758k869209
41899B257599k319139p31073K96925j70612k046083l475034k274353R14381L037138
41890d510251K906245K268069J904467N16590j168696N0176L662759M010333j067142
41881H572550n360833l338635R03325M79461k837381k332410J524356K207357
$$ plain form
41943 3686816 -192533 -1262769 953331 3100565 2818089 925722 -632694 -638759 1532632
41934 1532632 5536397 8986006 8825204 4882021 607604 -822812 106262 904676 802367
41925 802367 1140809 2839019 5302525 7582728 8970663 8589517 6126809 3051347 1334976
41916 1334976 709123 -880612 -3534545 -4274648 -928313 4638954 8699500 9583826 7879764
41907 7879764 4413024 341946 -1856190 -259478 3647957 6084566 5126808 2257599
41899 2257599 -61540 -792613 -495688 -666300 -2712383 -6187417 -8461770 -7547389 -4510251
41890 -4510251 -1604006 664063 2568530 3085120 1916424 1966600 5629359 9639692 8572550
41881 8572550 3211717 -126918 776407 1255868 -1581513 -3913923 -2389567 -182210
41873a82210q34434j321168K117368L407742M12094j024307J864301L113344j177867
41864F374863m960379j999219L593510M284133R14163n41684L39077n95751l250971
41855D157742l642920j617706q15295j707332j361199L64514O74751m42301l39078
41846d728824P27784J16926j313404o7242L038427L282705K87625p69437K035891
41837B610451L902636J515687j322890k65493K394599J863240j453568l293797
41829E950865k259704n88427M15112J415071K002529N45260k387507l578171j408593
41820A06435J576733J999899K73907j83030J795866L075103R09427k310841k062075
41811E181424J411845L231068J380912n22604K04800R39898o71776j635129Q79808
$$ plain form
41873 -182210 -1016644 -2337812 -220444 3187298 3599392 2575085 4439386 7552730 6374863
41864 6374863 1414484 -584735 3008775 7292908 8207071 7665387 8004464 7408713 4157742
41855 4157742 514822 -1102884 -1918179 -3625511 -4986710 -4622196 -3947445 -4389746 -4728824
41846 -4728824 -4001040 -3884114 -5197518 -5264760 -2226333 1056372 1343997 574560 2610451
41837 2610451 6513087 8028774 6705884 6440391 8834990 10698230 9244662 5950865
41829 5950865 3691161 3102734 3517846 4932917 6935446 7480706 5093199 1515028 106435
41820 106435 1683168 3683067 3956974 3773944 5569810 8644913 9554340 7243499 5181424
41811 5181424 6593269 9824337 11205249 10682645 10887445 11827343 11155567 9520438 10400246
41802A0400246L198378P64364l131202j802530L572090N387690J786685j113160
41794A9062561J17772J972529K339131M307971Q205041Q216339J963875l830820
41786D2354399l034643Q02007J166682j222415j671666k83231m28939k005474
41778C5676720k867791l901899o347512p247890m108471q76443k213700m929553
41770C183461l026623J420652J444794k381112k581213K063786M094451Q8131
41762D306327l712773k018135J674853K350957J303116J594166J827880j37345
41754G189046k180863j768704o11712q05728m96035J824666K867704j85312l579386
41745B253676k082439K487122L884345Q69634j892694j565762k58901l35524j280513
$$ plain form
41802 10400246 13598624 14362988 11231786 9429256 13001346 18389036 20175721 19062561
41794 19062561 19180333 21152862 23491993 27799964 36005005 44221344 46185219 42354399
41786 42354399 39319756 40121763 41288445 40066030 38394364 38111133 37682194 35676720
41778 35676720 32808929 28907030 22559518 15311628 11203157 10326714 8113014 3183461
41770 3183461 156838 1577490 3022284 641172 -1940041 123745 4218196 4306327
41762 4306327 593554 -1424581 250272 2601229 3904345 5498511 7326391 7189046
41754 7189046 5008183 3239479 2627767 1822039 1326004 3150670 6018374 5833062 2253676
41745 2253676 171237 2658359 6542704 7412338 5519644 3953882 3694981 3359457 2078944
41736B078944j827319j641364n45433J125672J713716M14144o62638N00561K042355
41727C198638Q72732k081145l114201j382805O30352J629396K382004K518425
41719D653396P89103j438974j219598J037232J745807k00103j968068j671843
41711A726952p20590l70835K07598J325534J768969J286581P29950n14011l278849
41702B161299m959843k202149K517219L092999m73896j614957J501868K345789
41694B368329k256668n245350p53778N147380L828273j730665k358887J769297
41686G67931K390369j751934k940270J412017M070607P10456k840127j109204
41678G09845K016402J067740j476859o74110J437576k75145m347558m722133o07816
$$ plain form
41736 2078944 251625 -1389739 -1935172 -809500 904216 1318360 655722 1156283 3198638
41727 3198638 4071370 1990225 -1123976 -2506781 -1876429 -247033 2134971 4653396
41719 4653396 5442499 4003525 2783927 3821159 5566966 5366863 3398795 1726952
41711 1726952 1006362 635527 843125 2168659 3937628 5224209 5954159 5440148 2161299
41702 2161299 -2798544 -5000693 -2483474 609525 135629 -1479328 22540 2368329
41694 2368329 111661 -5133689 -5887467 -740087 3088186 1357521 -1001366 767931
41686 767931 3158300 1406366 -1533904 -121887 3948720 4659176 1819049 709845
41678 709845 2726247 3793987 2317128 1643018 3080594 2805449 -1542109 -6264242 -6872058
41669f872058K783850K705238J671278J574240Q16051j427700k823293j641532
41661c213926M65945J188541O41833L82124J121747K342449K893117J723981p18418
41652F827393k114625q24942J627883K323729O24511j744118l506796m463695
41644a250660l965703j463821J541347K682843J982114J531546J890022J439785
41636D387473k90006j377689n10165J040238J483037O82139o36173k080893l084319
41627c86358k761305j183523M23861J285493J704529J977234K074994K244697
41619E379622K244268N39667l261473n714082k845123L452332O371585L019663
41611I186459j712183k501344q44664j233947l357071l185330l01028J222701
$$ plain form
41669 -6872058 -4088208 -1382970 288308 1862548 2678599 1250899 -1572394 -3213926
41661 -3213926 -2747981 -1559440 -917607 -535483 586264 2928713 5821830 7545811 6827393
41652 6827393 4712768 3887826 5515709 7839438 8463949 6719831 3213035 -1250660
41644 -1250660 -5216363 -6680184 -5138837 -2455994 -473880 1057666 2947688 4387473
41636 4387473 4097467 2719778 2209613 3249851 4732888 5415027 4778854 2697961 -386358
41627 -386358 -3147663 -4331186 -3907325 -2621832 -917303 1059931 3134925 5379622
41619 5379622 7623890 8163557 4902084 -811998 -3657121 -204789 6166796 9186459
41611 9186459 7474276 4972932 4128268 2894321 -462750 -3648080 -3949108 -2726407
41603b726407n11317k406124j606012L31172O80115J1638O04540K142303K009950
41594a470142m56865k507780j454745J851807M033199L101792M54219j111955
41586B439530o41504L84456M56902k5202J50956P79976M01261j260480k298394
41577C87501r04784K023849L652007K487459j32524k065655k693290k409862r99611
41568f54910J678863L874845L150597p5194k418545k057671j104951j717206k247208
41559a571380k37041K546348K094287j317207k916506n73921J972971J008936
41551A006487j598905j724131O36979J828823J76342k192327k968060k257721
41543g092513j074739M98469K547985M060445L685150J535434n00388o06284Q71166
$$ plain form
41603 -2726407 -3237724 -5643848 -7249860 -6918688 -6238573 -6226935 -5622395 -3480092 -1470142
41594 -1470142 -1927007 -4434787 -5889532 -4037725 -4526 3097266 3551485 2439530
41586 2439530 1798026 2182482 2639384 2614182 2765138 3545114 3946375 2685895 387501
41577 387501 -517283 1506566 5158573 7646032 7513508 5447853 2754563 344701 -654910
41568 -654910 1023953 4898798 8049395 7974201 5555656 3497985 2393034 675828 -1571380
41559 -1571380 -1808421 737927 2832214 1515007 -1401499 -1975420 -2449 1006487
41551 1006487 -592418 -2316549 -1679570 149253 325595 -1866732 -4834792 -7092513
41543 -7092513 -8167252 -7668783 -5120798 -1060353 2624797 4160231 3659843 3053559 3924725
41534C924725J708806N65819j258978j727936q85575k18718O3828Q25863J404722
41525D402556J26663k163492k258794N10109K614928J398673j091951j702932
41517A835760r64720j378179k961172l574276k246521M54386L736276N745356
41509F46910L734465j567049m191855p5743N878119N353765j578866o360066m168433
41500b328753J90427Q64650o74463K4439K338919K188686q15177k996021k454126
41491c661419q96794K18078J477549K840868K466406l62764l292935l448530q60691
41482e520232J741549J995917J21951j561520j027152J307354K906157K002960
41474A966984j84224r62172L36928J668496J460149R62363J987134L308915J791962
$$ plain form
41534 3924725 5633531 6199350 4940372 3212436 2326861 2108143 2171971 2997834 4402556
41525 4402556 4529219 2365727 106933 617042 3231970 4630643 3538692 1835760
41517 1835760 871040 -507139 -3468311 -7042587 -9289108 -8834722 -5098446 646910
41509 646910 4381375 2814326 -1377529 -1453272 4424847 9778612 8199746 1839680 -2328753
41500 -2328753 -2138326 -1273676 -1948139 -1923700 415219 2603905 1788728 -1207293 -3661419
41491 -3661419 -4558213 -4340135 -2862586 -21718 2444688 2081924 -1211011 -4659541 -5520232
41482 -5520232 -3778683 -1782766 -1660815 -3222335 -4249487 -2942133 -35976 1966984
41474 1966984 1782760 820588 1157516 2826012 4286161 5248524 7235658 10544573 12336535
41465A2336535k510319n087533k763768J355618J910838r22620j902895P96084
41457C211940K491944l82209m127368l309581Q69452K767308R10173j016968r90168
41448D24523q31006j199883K3500K774612L304704J77352k560250j279709J774479
41439B608322K384777P57067K02236J485763K351966J599805K48192q59656j847146
41430H931326k485826k280056j574062r22045L331J433446K465907K474052K228120
41421A0274193K059794O76425k159583l745932k034048N40970J83348k380115
41413C415052k854581N7488K793306K290378m7771j092649k70939N58464J44096
41404D992844o52444o2006K288484M262830L137522q76139m330519m720485l264123
$$ plain form
41465 12336535 9826216 4738683 1974915 3330533 5241371 4318751 2415856 3211940
41457 3211940 5703884 5321675 1194307 -2115274 -1245822 1521486 2431659 1414691 424523
41448 424523 -406483 -1606366 -1582866 1191746 4496450 4673802 2113552 833843 2608322
41439 2608322 4993099 5750166 5952402 7438165 9790131 11389936 11638128 10778472 8931326
41430 8931326 6445500 4165444 2591382 1669337 1672668 3106114 5572021 8046073 10274193
41421 10274193 12333987 13010412 10850829 7104897 5070849 5611819 5795167 3415052
41413 3415052 560471 617959 3411265 5701643 5653872 4561223 4290284 4848748 4992844
41404 4992844 4340400 4278394 6566878 10829708 13967230 13091091 8760572 4040087 775964
41395G75964k091352q94837J198163K620885J636940k2844L38335J474138J39687
41386E175079k801574l104400o9016K248100J536109J5415n02096j236970k250530
41377i89883q61912K941655M466466J240530k538666k522593q28536j325554k349829
41368b768322j05248L593112L615447P2186j924544n71952P66901K47239M4742
41359B969561J167091J415805J43867j00544J441988K014833O74260L62116K027453
41350A2116430J742217k644597o510384m699675P17437L755747K900035J234942
41342H612152K86487r54366j919295o21345K049190K716702O54809j368480j756456
41333G699398j743184j828958n64074J836579K331722n46225l927667m269917
$$ plain form
41395 775964 -1315388 -2210225 -1012062 1608823 3245763 3222919 3561254 5035392 5175079
41386 5175079 2373505 -730895 -799911 1448189 2984298 2999713 2497617 1260647 -989883
41377 -989883 -1851795 1089860 5556326 6796856 4258190 1735597 907061 -418493 -2768322
41368 -2768322 -2873570 719542 4334989 4407175 2482631 1910679 2677580 2924819 2969561
41359 2969561 4136652 5552457 5696324 5595780 7037768 9052601 9726861 10088977 12116430
41350 12116430 13858647 11214050 4703666 3991 721428 4477175 7377210 8612152
41342 8612152 8898639 7944273 6024978 5403633 7452823 10169525 10824334 9455854 7699398
41333 7699398 5956214 4127256 3563182 5399761 7731483 7185258 3257591 -1012326
41325a012326j778714N27432O37786q48026j766899m27225K298045L237132J029821
41316A897026j036115O59500L860518L061195j604591l677095k96256K987215
41308E851397Q64003l439562l562999J66385K192328O69437j028260p21963K01874
41299A192640P06495J453740J937808O59655j433315j734226m85443m18485j664947
41290B13922j484116L93521R90367k05041J79422L097011M390690J427238k115366
41281F887648j956192J16823j53984k127743j697765J357588K671940J10454l047476
41272B161293l002092m32149J162190L97701n42154P70291L367131L753419Q62180
41263H497810j488527O05517M856798M999739l47298n284537m863892j502068
$$ plain form
41325 -1012326 -2791040 -2263608 -1625822 -2473848 -4240747 -4667972 -2369927 867205 1897026
41316 1897026 860911 1520411 5380929 8442124 6837533 3160438 2864182 5851397
41308 5851397 6715400 3275838 -287161 -120776 2071552 2740989 1712729 990766 1192640
41299 1192640 1899135 3352875 5290683 5950338 4517023 2782797 2297354 1878869 213922
41290 213922 -1270194 -876673 113694 -91347 88075 3185086 7575776 9003014 6887648
41281 6887648 4931456 5048279 4894295 2766552 1068787 2426375 5098315 5208769 2161293
41272 2161293 -840799 -1272948 -110758 286943 -255211 515080 3882211 7635630 8497810
41263 8497810 7009283 7614800 12471598 17471337 17124039 11839502 6975610 5473542
41255E473542j58416r45598p57832O18385R42983L96573J076297K378510J614419
41246A0638863q59938j620534K16815J465553p9888k584954l294806j760803R31781
41237C052089L380081L660998Q26967k704141l202251p23614J004557M76087M12881
41228F183654K438206L684108J325903k655491m358068l339867k008978j317404
41220d7937k48041J294324K009390J489863Q09482P44199R28237P95149K96377
41211H071043k22583k78178K04494L85466n07245j582652j216969J41736K24418
41202E219530j214816j333459J370451L971902K943401p01114k951882k422136
41194D881877j422756j736705k212617j174718Q90585K068964J361928l63537
$$ plain form
41255 5473542 5315126 4369528 3611696 4230081 5173064 5569637 6645934 9024444 10638863
41246 10638863 9778925 8158391 8375206 9840759 9760871 7175917 3881111 2120308 3052089
41237 3052089 6432170 10093168 10920135 8215994 5013743 4290129 5294686 5770773 6183654
41228 6183654 8621860 12305968 13631871 10976380 6618312 3278445 1269467 -47937
41220 -47937 -295978 998346 3007736 4497599 5307081 6051280 6979517 7774666 8071043
41211 8071043 7848460 7570282 7774776 8160242 7652997 6070345 4853376 4995112 5219530
41202 5219530 4004714 2671255 4041706 8013608 10957009 10255895 7304013 4881877
41194 4881877 3459121 1722416 -490201 -1664919 -774334 1294630 2656558 2293021
41186B293021j331168o98247M04866K93311o69597l25698J711404K705878P29351
41177E113121j848555j372427J703034L397133J864358n00742r96903P5794R91581
41168H426394J212188J117463P93086M16162O96648J850073L037705L602808L882439
41159B5034966M101920L598962K034929L39339n41467r12147j320228j242506
41151C1093768j38322Q56555r1500k898516n277535n288152l154681m28748J495755
41142A6168624J667938l45860l660094o015509n601292k816111L49161K280960
41134B027817K473293J037010j216006k547822j763215m7294K52451j010686j504735
41125b299187j92258Q62038j3790r98681L64599K893786L466514K014843J303702
$$ plain form
41186 2293021 961853 263606 668472 961783 292186 -33512 1677892 4383770 5113121
41177 5113121 3264566 1892139 3595173 6992306 8856664 8355922 7359019 7434813 8426394
41168 8426394 9638582 10756045 11549131 11965293 12661941 14512014 17549719 21152527 25034966
41159 25034966 29136886 32735848 34770777 35110116 34568649 33656502 32336274 31093768
41151 31093768 30955446 31812001 31720501 28821985 23544450 18256298 15101617 14672869 16168624
41142 16168624 17836562 17490702 13830608 7815099 2213807 -602304 -253143 2027817
41134 2027817 4501110 5538120 4322114 1774292 11077 -36217 216234 -794452 -2299187
41125 -2299187 -2491445 -1629407 -1643197 -2641878 -2277279 616507 4083021 6097864 7401566
41116G401566J967314J580184o53511k094854j171762k73781j782419l977305
41108I95432l716926j181791R30040J466582J298314Q74927O3660l46149M48727
41099H32816J455048J345141R64129J785711K617921R65831k489386m048654k193501
41090A235056L33633O31897p85583j782735j678277r84269J57359J653884K728083
41081A509048K736769J854944L41790j604800k794241j676761J024735K231738
41073C623222M64997j887900j990835n57397j66184r23131o95276Q10582J312227
41064i695j43672j325638k53824J705508K108447J167361P68246P03918j024627
41055C696024l844075l831431P28688N484898M887713k29046l582787k029147
$$ plain form
41116 7401566 9368880 10949064 10295553 8200699 7028937 6755156 4972737 995432
41108 995432 -2721494 -3903285 -2973245 -1506663 -208349 666578 730238 384089 832816
41099 832816 2287864 3633005 4597134 6382845 9000766 9966597 7477211 3428557 1235056
41090 1235056 1568689 2200586 1415003 -367732 -2046009 -3030278 -2872919 -1219035 1509048
41081 1509048 4245817 6100761 6442551 4837751 2043510 366749 1391484 3623222
41073 3623222 4088219 2200319 209484 -347913 -514097 -1437228 -2132504 -1321922 -9695
41064 -9695 -153367 -1479005 -1732829 -27321 2081126 3248487 4016733 4720651 3696024
41055 3696024 -148051 -3979482 -3250794 2234104 7121817 6892771 3309984 1280837
41047A280837P11623M14979j354629n17261K597499L873709J995439Q7997L75943
41038I466136J079361L3657j751309k121692j070101R73N52918O21834j51184
41029F660593j380802j376037L15480J348786q6604j792942m04920L079361M010230
41020A0373145N60918l703658m723958k675338l81109O35621O65104J98688j83155
41011G66258L92193J579693J379157q65764k430877o88504K476732K836825l2262
41002E413451k216764j398833K80645M50679L9283N24577Q62971q1311p48898
40993C125800K68124R47708r18923l257051k772644q40137j250115l019381j404608
40984i121227L559747N907761K978793l86932o066J213016n44846k742925j356938
$$ plain form
41047 1280837 1992460 2407439 1052810 535549 3133048 7006757 9002196 9090193 9466136
41038 9466136 10545497 10579154 8827845 6706153 5636052 5637025 6189943 6811777 6660593
41029 6660593 5279791 3903754 4219234 5568020 5481416 3688474 3283554 6362915 10373145
41020 10373145 10934063 7230405 2506447 -168891 -550000 85621 750725 949413 766258
41011 766258 1158451 2738144 4117301 3251537 820660 132156 2608888 5445713 5413451
41002 5413451 3196687 1797854 2078499 2529178 2568461 3093038 3956009 3874698 3125800
40993 3125800 3393924 4341632 3422709 165658 -2606986 -3447123 -4697238 -7716619 -9121227
40984 -9121227 -5561480 346281 3325074 2938142 2932076 4145092 3600246 857321 -499617
40975d99617J145802k96322l998004l595132J382261M484365K642347M41310J855633
40966C562643L913418K203208j920157l720364j752711J390937L049053K398953
40958I124980Q610k255702k307860n18348L36474q43039j638170j5823K299425
40949D190547K514333P24648j147961k451346l309885k786849m26277J584884
40941a107906P70631j715701k276335J54480K732325K599754L05437j214706j2539
40932B35440K833455M177081K124066j505721l090289j776637l99109j150255
40924A448031k488780j814462P31436K996645L731348K912389P48342j651035
40916F613914k165117l36772J353348J015432L78487J740803L744625L410074
$$ plain form
40975 -499617 646185 349863 -3648141 -7243273 -5861012 -1376647 1265700 1707010 3562643
40966 3562643 7476061 9679269 7759112 4038748 2286037 3676974 6726027 9124980
40958 9124980 9133590 6877888 4570028 4051680 4388154 3545115 1906945 1891122 4190547
40949 4190547 6704880 7429528 6281567 3830221 520336 -2266513 -2692790 -1107906
40941 -1107906 -337275 -2052976 -4329311 -4174831 -1442506 1157248 1462685 247979 235440
40932 235440 3068895 7245976 9370042 7864321 4774032 2997395 2598286 1448031
40924 1448031 -1040749 -2855211 -2123775 872870 4604218 7516607 8264949 6613914
40916 6613914 4448797 4112025 5465373 6480805 6859292 8600095 12344720 15754794
40908A5754794R37541j095929k264322m076002n775942m642644q50974J974640
40900c8838K025999J493895K199268K491569M12501k796597m441898l698606j558999
40891c911706P96637K243210K061380J231140J638060L023787K809804J24148
40883A0016460k304821j922389J12456J112467P00504K25004j30269j141181k326103
40874D342128k318639j167308l50035n55773r30416n38812M98081J303011J082324
40865A364561J9645l79870J236782L817974M426891J817773j777308l328570k164198
40856E033680M03846K952679M260853L501505J647958J043511K050136K106580
40848B3000748k0469j505789J80153K533085J550005j611194k161136P33731K870969
$$ plain form
40908 15754794 16692335 15596406 13332084 9256082 3480140 -1162504 -2013478 -38838
40900 -38838 1987161 3481056 5680324 8171893 8584394 5787797 1345899 -2352707 -3911706
40891 -3911706 -3115069 -871859 1189521 2420661 4058721 7082508 9892312 10016460
40883 10016460 7711639 5789250 5901706 7014173 7714677 7939681 7809412 6668231 4342128
40874 4342128 2023489 856181 506146 -49627 -980043 -1518855 -1020774 282237 1364561
40865 1364561 1384206 1004336 2241118 6059092 10485983 12303756 10526448 7197878 5033680
40856 5033680 5437526 8390205 12651058 16152563 17800521 18844032 20894168 23000748
40848 23000748 22980279 21474490 21654643 24187728 25737733 24126539 21965403 22699134 25570103
40839B5570103J927103L78891J00589q96351l694636n059694k597332L45026n27031
40830A5546668l387024l030757Q17588L207198J736642m47081l52141P09171N75028
40821A5375292J21242J144692K951766L565978K562519O72224j710335l626978
40813B1056400k972907O90837M030521L355747m35139k813038j408126J347793
40805B2852088J656488j237349m520811m781454j515434J864233J452327k031385
40797A3738703l416047j9110L942694L051839j124432k187831J319532L727732
40789A9033080J067537l188369m050910k150820r22766k16180K196869M770436
40781A6538877L379041j811130n508575m268058m49204J997528K271032J587768
$$ plain form
40839 25570103 27497206 27876097 27976686 27080335 23385699 18326005 15728673 16073699 15546668
40830 15546668 12159644 9128887 9946475 13153673 14890315 14443234 14091093 14800264 15375292
40821 15375292 15496534 16641226 19592992 23158970 25721489 26393713 24683378 21056400
40813 21056400 18083493 18774330 22804851 26160598 25725459 22912421 21504295 22852088
40805 22852088 24508576 23271227 18750416 13968962 12453528 14317761 15770088 13738703
40797 13738703 10322656 10303546 14246240 17298079 16173647 13985816 15305348 19033080
40789 19033080 20100617 16912248 12861338 10710518 9787752 9571572 11768441 16538877
40781 16538877 19917918 18106788 12598213 8330155 7880951 9878479 12149511 13737279
40773A3737279L02650j514749k572388j744887L5300J010329R44962Q07501Q18348
40764A1824345L21908o47064r66661J12933J719197J960219l4414k636577k943381
40755H710505k12946K590761K033850j385747l831615l135698j103395j89547
40747C476168j64429L26227P63436k35061j742428j062794K122208M347254K514985
40738A0345566j723661l575609j112792K042866J262650k861879n005452k148516
40730b776827K272856L079317L97061j024326J032305L331592K377872o72572
40722H017278k415443k135462j561916j188090j402J598180J759838M56585p4112
40713D455456Q28532P20996j768458l656390j494986K778820L557109p14845n136030
$$ plain form
40773 13737279 14039929 12525180 9952792 8207905 8243205 9253534 10198496 11005997 11824345
40764 11824345 12146253 11499189 10532528 10645461 12364658 14324877 14290463 11653886 8710505
40755 8710505 8497559 11088320 13122170 11736423 7904808 4769110 3665715 3476168
40747 3476168 3311739 3637966 4401402 4166341 2423913 1361119 3483327 7830581 10345566
40738 10345566 8621905 5046296 3933504 5976370 7239020 4377141 -628311 -2776827
40730 -2776827 -503971 2575346 2972407 1948081 2980386 6311978 8689850 8017278
40722 8017278 5601835 3466373 1904457 716367 714965 2313145 4072983 4529568 4455456
40713 4455456 5283988 6004984 4236526 580136 -914850 1863970 5421079 4706234 -429796
40704d29796n080847k038240j46239K87350J819470M023988L599125N60286p28145
40695A866952J436607K709524m38370m436154l734985N31390K348664m6793k458318
40686b221483k160736j441083k294851k633349l77077K615294L670827L252889
40678a589569K841793J643100j284368l827147l327995q71294L66162O3078O46512
40669e339728K708898L885232K576473K5391j848359k457700j945130n57913R02529
40660b050307J636367K016979K631809K469714L04488k244789j972617Q91250
40652C682894K073940n72942l237850j426817L026553M196297O98932k288682
40644F152325q55063J838426O44368l432207m577691q67164L053869L037509R20202
$$ plain form
40704 -429796 -5510643 -7548883 -7695122 -7407772 -5588302 -1564314 2034811 2595097 1866952
40695 1866952 3303559 6013083 5574713 1138559 -2596426 -2065036 283628 236835 -2221483
40686 -2221483 -4382219 -5823302 -8118153 -10751502 -11128579 -8513285 -4842458 -1589569
40678 -1589569 1252224 2895324 1610956 -2216191 -5544186 -6415480 -6049318 -5986240 -5339728
40669 -5339728 -2630830 1254402 3830875 3856266 2007907 -449793 -2394923 -2952836 -2050307
40660 -2050307 -413940 1603039 4234848 6704562 7009050 4764261 2791644 3682894
40652 3682894 5756834 5183892 1946042 519225 3545778 7742075 8441007 6152325
40644 6152325 5297262 7135688 7780056 4347849 -229842 -1097006 1956863 4994372 5914574
40635E914574M20531J082522J07452k083003k595943j367821j131255k112997
40627a765940j372866J651007L392798J738037o94348j176429r76313j913924
40619a117978k395320o69076Q93551p50055l541009k752769J720968N118319M727652
40610A234283K727554J589444O90336j158201l061961l625929k923702j554882
40602f083058L95877K387049L055861J803185m08463k203817k624886j145196
40594d823448J460252K737140J220779r36337n72506J644673K207271O03384K60704
40585C801912K615398M230323K067457j668634k829451j019956R95865J732749
40577I925663J714789J009597p67166k360602j622596J313051L646079L205426
$$ plain form
40635 5914574 6335105 7417627 7525079 5442076 2846133 1478312 347057 -1765940
40627 -1765940 -3138806 -1487799 1904999 3643036 2948688 1772259 795946 -1117978
40619 -1117978 -3513298 -4182374 -3288823 -4038878 -7579887 -10332656 -8611688 -3493369 1234283
40610 1234283 3961837 5551281 6241617 5083416 2021455 -1604474 -4528176 -6083058
40602 -6083058 -5687181 -3300132 -244271 1558914 1150451 -1053366 -3678252 -4823448
40594 -4823448 -3363196 -626056 594723 -341614 -914120 730553 2937824 3541208 3801912
40585 3801912 6417310 10647633 12715090 11046456 8217005 7197049 8192914 9925663
40577 9925663 11640452 12650049 11882883 9522281 7899685 9212736 12858815 16064241
40569A6064241P62262j306622j670733j047367j066386k232349l053767j802143
40561D647136R12254K535142J831115K50988n77629r66672j632526j798200n98039
40552D603569Q59768P79793o46262j514315o76914J382768L492396M338939K919295
40543A5539037j16829k383976k471130j788279k128398k646709j509628N06785
40535C000873R41512k50503o21727N57584J210322L83258K9401J280243J996675
40526H527638M53850j165287k03270J486008N9682l569734m098423K34336M464504
40517F189304L931177P15745m56843K25267q94913l399558k622356K120378M876536
40508A0684737J626875l179826l104880O61613J718779j298926l193750j204181
$$ plain form
40569 16064241 16826503 15519881 13849148 12801781 11735395 9503046 6449279 4647136
40561 4647136 5559390 8094532 9925647 10176635 9599006 8632334 6999808 5201608 4603569
40552 4603569 5463337 6243130 5596868 4082553 3405639 4788407 8280803 12619742 15539037
40543 15539037 15422208 13038232 10567102 8778823 6650425 4003716 2494088 3000873
40535 3000873 3942385 3691882 3070155 3627739 4838061 5221319 5250720 6530963 8527638
40526 8527638 8981488 7816201 7612931 9098939 9158621 5588887 1490464 1724800 6189304
40517 6189304 10120481 10836226 10379383 10604650 9709737 6310179 3687823 5808201 10684737
40508 10684737 12311612 9131786 6026906 6688519 8407298 7108372 3914622 2710441
40500B710441O57810j326105m207928k962926J721905M521491K935054o2799o17531
40491C369412J554047L659601L064485k11199l330248l297617l76686K077972
40483F509767J838430L65213J15783J094365J747982J633324J114992j60990k149497
40474A2109369k978090j235058J221875J485636l6075m28877Q93420J394827k21851
40465A2205176k015607k115846j256330p23308k40616M95368L09141j420293k747358
40456B490327j390085J743939L267809J540411j337465k217029o54775Q76486
40448D319618L98873r73119q41309O58135Q61990j131259k652490j605636J6214
40439i48983m41137j420215L58505L722379M078901O53453k177240j779324n78300
$$ plain form
40500 2710441 3368251 2042146 -2165782 -5128708 -3406803 1114688 4049742 3986943 3369412
40491 3369412 4923459 8583060 11647545 11436346 8106098 4808481 4431795 6509767
40483 6509767 8348197 8713410 8829193 9923558 11671540 13304864 14419856 14258866 12109369
40474 12109369 9131279 7896221 9118096 10603732 10567657 10138780 11032200 12427027 12205176
40465 12205176 10189569 8073723 6817393 6094085 5853469 6348837 6657978 5237685 2490327
40456 2490327 1100242 2844181 6111990 7652401 6314936 4097907 3443132 4319618
40448 4319618 4718491 3745372 2904063 3562198 4424188 3292929 640439 -965197 -948983
40439 -948983 -1390120 -2810335 -2451830 1270549 5349450 6002903 3825663 2046339 1468039
40430A468039o41411L934K572373L757629J017239k243045j676273R44854J093015
40421F296354o52072k86328J744169J224386j691085k221598K88978P22347k442612
40412B982539l467368R01578M751998J864971m027488m724088L09830M553062
40404C145034M932365M156309L433092O84894l066564k929313J744690M811000
40396A6911507K290053j558346j236386J489723J064366l016845o028695n078141
40388D837236j804737J205211K883991K927148J698033O45840N20376N1721j458654
40379A1506165k002342k13860J202874o45508l241798j895872K236650L073233
40371A0019542q82951l773914j263402L004162L193295m68309l184529k638305
$$ plain form
40430 1468039 826628 830562 3402935 7160564 8177803 5934758 4258485 5203339 6296354
40421 6296354 5644282 5357954 7102123 8326509 6635424 4413826 4702804 5425151 2982539
40412 2982539 -484829 416749 5168747 7033718 3006230 -1717858 -1408028 3145034
40404 3145034 8077399 12233708 15666800 16351694 13285130 10355817 12100507 16911507
40396 16911507 19201560 17643214 16406828 17896551 18960917 15944072 9915377 4837236
40388 4837236 3032499 4237710 7121701 10048849 11746882 12392722 12913098 12964819 11506165
40379 11506165 9503823 9289963 10492837 9847329 6605531 4709659 6946309 10019542
40371 10019542 9136591 5362677 4099275 7103437 10296732 9828423 6643894 4005589
40363D005589o03166Q53592J215340M33021j065033j790085q76817L10114K08635
40354B691190k75091O80495K448056K540592K18859k574637l714346k621357R0463
40345e15776K877630L531448J155404k107068l085720j460412L6756m46951j532247
40336a546936j085198L59982L22484j706520k841539n41021L242305M033225J254335
40327A491117l95269K019272M435100J655056l837710m729649j1659L422362J669260
40318E717880p16950M89504J773521j189414m830610l117598K098197L949343
40310D173873J524742j2289P62103n9455k972841k997294J398193M678016K850503
40301I345551p00811j777185j819444l215376l513800o8040L536989K041419k858497
$$ plain form
40363 4005589 3402423 4256015 5471355 5904376 4839343 3049258 2172441 2482555 2691190
40354 2691190 2416099 3096594 5544650 8085242 8304101 5729464 2015118 -606239 -515776
40345 -515776 2361854 5893302 7048706 4941638 1855918 395506 432262 -14689 -1546936
40336 -1546936 -2632134 -2272152 -1949668 -3656188 -6497727 -7038748 -3796443 236782 1491117
40327 1491117 1095848 3115120 7550220 9205276 5367566 637917 626258 4048620 5717880
40318 5717880 5000930 5490434 7263955 6074541 1243931 -1873667 224530 4173873
40310 4173873 5698615 5686326 6448429 6388974 3416133 418839 1817032 6495048 9345551
40301 9345551 8644740 6867555 5048111 1832735 -1681065 -1749105 1787884 3829303 970806
40292I70806m630258j615787J212215L53806j607130q30044K398377M976220M932763
40283F160968K441517j042856l292785k668217k37938Q91921m49462j619587J87695
40274C71256L562561M381574J543093j259423o65493J513280R96334k503576m805994
40265C133612l541775j352812j157346j596876j46501J988004J981931N34720
$$ plain form
40292 970806 -3659452 -5275239 -4063024 -3709218 -5316348 -6146392 -3748015 1228205 6160968
40283 6160968 8602485 7559629 4266844 1598627 1360689 2252610 1803148 183561 371256
40274 371256 3933817 8315391 9858484 8599061 7933568 9446848 10443182 7939606 3133612
40265 3133612 -408163 -1760975 -2918321 -4515197 -4661698 -2673694 -691763 -157043
$$ [...]
##END NTUPLES=NMR SPECTRUM
##END=
