##TITLE=31Pdec_MTBPA2610-3
 d2O, 124 sc
 27.10.2021
##JCAMPDX= 6.0         $$ Bruker NMR JCAMP-DX V2.0
##DATA TYPE= NMR SPECTRUM
##DATA CLASS= NTUPLES
##ORIGIN= UXNMR, Bruker Analytische Messtechnik GmbH
##OWNER= root
$$ XWIN-NMR		Version 3.5
$$ Wed Oct 27 11:05:02 2021 Russian Standard Time (UT+4h)  she@DPX200
##.OBSERVE FREQUENCY= 81.013821
##.OBSERVE NUCLEUS= ^31P
##.ACQUISITION MODE= SIMULTANEOUS
##.ACQUISITION SCHEME= undefined
##.AVERAGES= 124
##.DIGITISER RES= 16
##SPECTROMETER/DATA SYSTEM= spect
##.PULSE SEQUENCE= zgpg30
##.SOLVENT NAME= CDCl3
##.SHIFT REFERENCE= (INTERNAL, CDCl3, 0, 248.564)
##AUDIT TRAIL= $$ (NUMBER, WHEN, WHO, WHERE, WHAT)
$$ ##TITLE= Audit trail, XWIN-NMR		Version 3.5
$$ ##JCAMPDX= 5.01
$$ ##ORIGIN= Bruker BioSpin GmbH
$$ ##OWNER= she
$$ F:/spectra/data/she/nmr/P31/1/pdata/1/auditp.txt
$$ ##AUDIT TRAIL=  $$ (NUMBER, WHEN, WHO, WHERE, WHAT)
(   1,<2021-10-27 11:04:04.28 +0400>,<she>,<DPX200>,
      <continue with go, POWCHK disabled, PULCHK disabled
       configuration hash MD5:
       00 E9 B6 7A A2 85 ED C7 34 08 36 98 17 FE 4E 26
       data hash MD5: 32K
       68 63 6A 6B BC 30 89 E3 DF 48 83 B1 F5 F9 07 3F>)
(   2,<2021-10-27 11:04:06.26 +0400>,<she>,<DPX200>,
      <Start of raw data processing
       efp BC_mod = 2 LB = 1 FT_mod = 6 PKNL = 1 PHC0 = -9047.155 PHC1 = 536.4695 SI = 64K 
       data hash MD5: 64K
       D7 FF 06 35 F1 2E 66 90 40 F9 74 6A EA A8 24 E4>)
(   3,<2021-10-27 11:04:24.06 +0400>,<she>,<DPX200>,
      <pk PHC0 = 3.628331 PHC1 = 0 
       data hash MD5: 64K
       10 72 E9 7C 12 1F 02 AE 5D 2F 12 4D BC F1 FC 56>)
$$ ##END=
$$ 
$$ hash MD5
$$ 4B 07 75 23 1A 54 2E 98 16 CC B2 45 B5 1D 71 D7
##$RELAX= 
##$RELAX= 
##$RELAX= 
##$RELAX= 
##$RELAX= 
##$RELAX= 
##$RELAX= 
##$RELAX= 
$$ Bruker specific parameters
$$ --------------------------
##$DU= <F:/spectra>
##$EXPNO= 1
##$NAME= <P31>
##$PROCNO= 1
##$TYPE= <nmr>
##$USER= <she>
##$AMP= (0..31)
100 100 100 100 100 100 100 100 100 100 100 100 100 100 100 100 100 100 
100 100 100 100 100 100 100 100 100 100 100 100 100 100 
##$AQSEQ= 0
##$AQ_mod= 1
##$AUNM= <au_zg>
##$AUTOPOS= <>
##$BF1= 81.014009
##$BF2= 200.13
##$BF3= 200.13
##$BF4= 200.13
##$BF5= 200.13
##$BF6= 200.13
##$BF7= 200.13
##$BF8= 200.13
##$BYTORDA= 1
##$CFDGTYP= 0
##$CFRGTYP= 5
##$CHEMSTR= <none>
##$CNST= (0..31)
1 1 145 1 1 1 1 1 1 1 1 1 1 1 1 1 1 1 1 1 1 1 1 1 1 1 1 1 1 1 1 1 
##$CPDPRG= <waltz16>
##$CPDPRG1= <>
##$CPDPRG2= <waltz16>
##$CPDPRG3= <>
##$CPDPRG4= <mlev>
##$CPDPRG5= <mlev>
##$CPDPRG6= <mlev>
##$CPDPRG7= <mlev>
##$CPDPRG8= <mlev>
##$CPDPRGB= <>
##$CPDPRGT= <>
##$D= (0..31)
0 1 0 0 0 0 0 0 0 0 0 0.03 2e-05 3e-06 0 0 0 0 0 0 0 0 0 0 0 0 0 0 0 0 
0 0 
##$DATE= 1635318062
##$DBL= (0..7)
120 120 120 11 120 120 24 19 
##$DBP= (0..7)
150 150 150 150 150 150 150 150 
##$DBP07= 0
##$DBPNAM0= <>
##$DBPNAM1= <>
##$DBPNAM2= <>
##$DBPNAM3= <>
##$DBPNAM4= <>
##$DBPNAM5= <>
##$DBPNAM6= <>
##$DBPNAM7= <>
##$DBPOAL= (0..7)
0.5 0.5 0.5 0.5 0.5 0.5 0.5 0.5 
##$DBPOFFS= (0..7)
$$ [...]
##$SUBNAM2= <"">
##$SUBNAM3= <"">
##$SUBNAM4= <"">
##$SUBNAM5= <"">
##$SUBNAM6= <"">
##$SUBNAM7= <"">
##$SUBNAM8= <"">
##$SUBNAM9= <"">
##$SW= 501.771253377433
##$SWIBOX= (0..15)
0 1 3 0 0 0 0 0 0 0 0 0 0 0 0 0 
##$SW_h= 40650.406504065
##$TD= 32768
##$TD0= 1
##$TE= 0
##$TE2= 300
##$TE3= 300
##$TEG= 300
##$TL= (0..7)
0 120 53 12 22 120 120 120 
##$TP= (0..7)
150 150 150 150 150 150 150 150 
##$TP07= 0
##$TPNAME0= <>
##$TPNAME1= <>
##$TPNAME2= <>
##$TPNAME3= <>
##$TPNAME4= <>
##$TPNAME5= <>
##$TPNAME6= <>
##$TPNAME7= <>
##$TPOAL= (0..7)
0.5 0.5 0.5 0.5 0.5 0.5 0.5 0.5 
##$TPOFFS= (0..7)
0 0 0 0 0 0 0 0 
##$TUNHIN= 0
##$TUNHOUT= 0
##$TUNXOUT= 0
##$USERA1= <user>
##$USERA2= <user>
##$USERA3= <user>
##$USERA4= <user>
##$USERA5= <user>
##$V9= 5
##$VALIST= <valist>
##$VCLIST= <CCCCCCCCCCCCCCC>
##$VD= 0
##$VDLIST= <DDDDDDDDDDDDDDD>
##$VPLIST= <PPPPPPPPPPPPPPP>
##$VTLIST= <TTTTTTTTTTTTTTT>
##$WBST= 1024
##$WBSW= 4
##$XGAIN= (0..3)
0 0 0 0 
##$XL= 0
##$YL= 0
##$YMAX_a= 7131
##$YMIN_a= -8946
##$ZGOPTNS= <>
##$ZL1= 120
##$ZL2= 120
##$ZL3= 120
##$ZL4= 120
##$ABSF1= 0
##$ABSF2= 0
##$ABSG= 0
##$ABSL= 0
##$ALPHA= 0
##$AQORDER= 0
##$ASSFAC= 0
##$ASSFACI= 0
##$ASSFACX= 0
##$ASSWID= 0
##$AUNMP= <proc_1d>
##$AZFE= 0.1
##$AZFW= 0.5
##$BCFW= 0
##$BC_mod= 2
##$BYTORDP= 0
##$COROFFS= 0
##$CY= -3
##$DATMOD= 1
##$DC= 0
##$DFILT= <>
##$DTYPP= 0
##$F1P= 0
##$F2P= 0
##$FCOR= 1
##$FTSIZE= 65536
##$FT_mod= 6
##$GAMMA= 0
##$GB= 0
##$INTBC= 1
##$INTSCL= 5.30512e-09
##$ISEN= 30
##$LB= 1
##$LEV0= 0
##$LPBIN= 0
##$MAXI= 10000
##$MC2= 0
##$MEAN= 0
##$ME_mod= 0
##$MI= 50
##$NCOEF= 0
##$NC_proc= -8
##$NLEV= 6
##$NOISF1= 182.463
##$NOISF2= 159.3651
##$NSP= 0
##$NTH_PI= 0
##$NZP= 0
##$OFFSET= 248.5645
##$PC= 4
##$PHC0= -9043.527
##$PHC1= 536.4695
##$PH_mod= 1
##$PKNL= yes
##$PPARMOD= 0
##$PSCAL= 0
##$PSIGN= 0
##$REVERSE= no
##$SF= 81.014009
##$SI= 65536
##$SIGF1= 159.3651
##$SIGF2= -187.1042
##$SINO= 113.3802
##$SIOLD= 16384
##$SREGLST= <1H.CDCl3>
##$SSB= 0
##$STSI= 65536
##$STSR= 0
##$SW_p= 40650.406504065
##$SYMM= 0
##$S_DEV= 0
##$TDeff= 32768
##$TDoff= 0
##$TI= <>
##$TILT= no
##$TM1= 0
##$TM2= 0
##$TOPLEV= 0
##$USERP1= <user>
##$USERP2= <user>
##$USERP3= <user>
##$USERP4= <user>
##$USERP5= <user>
##$WDW= 1
##$XDIM= 65536
##$YMAX_p= 435895288
##$YMIN_p= -235322378
$$ End of Bruker specific parameters
$$ ---------------------------------
##NTUPLES= NMR SPECTRUM
##VAR_NAME=  FREQUENCY,     SPECTRUM/REAL,   SPECTRUM/IMAG
##SYMBOL=    X,             R,               I
##VAR_TYPE=  INDEPENDENT,   DEPENDENT,       DEPENDENT
##VAR_FORM=  AFFN,          ASDF,            ASDF
##VAR_DIM=   65536,         65536,           65536
##UNITS=     HZ,            ARBITRARY UNITS, ARBITRARY UNITS
##FACTOR=    0.620285442955139, 1,           1
##FIRST=     20137.2065510759, 0,            0
##LAST=      -20513.1999529892, 0,           0
##MIN=       -20513.1999529892, -235322378,  0
##MAX=       20137.2065510759, 435895288,    0
$$ Real data points
##PAGE= N=1
##DATA TABLE= (X++(R..R)), XYDATA
$$ [...]
12924B8659444m035463j0532071q753649l542830j148443Q12165M633080L954127
12916A0046360m863912j1654935o193527L872594L864051m173376n364958K730683
12908a1737020P121729K962990J322031P699269J0346511o1318j3190296j3486478
12900i022582j754278R238597J2702899J0312297L751629m723702q501051m362428
12892G641381J98268k322679o113670j085401Q597111Q749335k601242j0894102
12884B169001n858837N007359Q793225L815230k327392m984654o010682p705675
12876g102425q291802m066402M862500J1899095J0152762K580450L29900O668097
12868A7032175R659073o25853j4186009j3380438L69046Q177222K786649j670263
$$ plain form
12924 28659444 24623981 14091910 5338261 1795431 646988 1459153 6092233 10046360
12916 10046360 5182448 -6472487 -12666014 -8793420 -4929369 -9102745 -14467703 -11737020
12908 -11737020 -4615291 -1652301 -330270 7368999 17715510 17654192 4463896 -9022582
12900 -9022582 -10776860 -1538263 11164636 21476933 25228562 20504860 12003809 7641381
12892 7641381 7839649 5516970 -596700 -1682101 6915010 15664345 13063103 2169001
12884 2169001 -3689836 1317523 10110748 13925978 11598586 6613932 603250 -7102425
12876 -7102425 -15394227 -19460629 -14598129 -2699034 7453728 10034178 10364078 17032175
12868 17032175 26691248 26065395 11879386 -1501052 -1132006 7045216 9831865 8161602
12860H161602M629423R175941k060783j8862625j9595033l643708P661100K847295
12852a1686788m503533J108815J2880154J2736771r06079j0792166o095871L226959
12844d031738L489739j590364J574355J2526811J5143731K342320j1509994j0860755
12836G084105m78541M637849K201325J077805K124399k482300j1254306j1828764
12828h918428j472978N968798M31699r860992j2303316p189673k048774J595252
12820c3798412N661719P405555M206601P16376J847810L890688J558013j556459
12812a0068109P88987N661685N678835J764887O32326K273876P07419m266988
12804C172918o485978m169957j448888Q42366N950571J1634634R647978j936656
$$ plain form
12860 8161602 12791025 21966966 19906183 1043558 -18551475 -22195183 -14534083 -11686788
12852 -11686788 -16190321 -15081506 -2201352 10535419 9629340 -1162826 -7258697 -4031738
12844 -4031738 -541999 -2132363 -558008 11968803 27112534 29454854 17944860 7084105
12836 7084105 6605564 11243413 13444738 14522543 16646942 14164642 2910336 -8918428
12828 -8918428 -10391406 -4422608 -3990909 -13851901 -26155217 -33344890 -35393664 -33798412
12820 -33798412 -28136693 -20731138 -16524537 -15808161 -13960351 -10069663 -8511650 -10068109
12812 -10068109 -9279122 -3617437 2061398 3826285 4458611 6732487 7439906 3172918
12804 3172918 -3313060 -7483017 -8931905 -8089539 -2138968 9495666 19143644 17206988
12796A7206988j3645008j5670687q473003N44956O024190P495782O954810O150591
12788F588619M709348Q36565m648712p164722m187625O00391K790216L436584
12780B960664N011791N243890J405595k868575k579768l57815k423003p714125
12772a321346r368268n569100q16817K196555M000886L570249N30331l39953M041753
12763c075710P125435K568002k202986L332320J1737944N835227j1329017j5996181
12755b004966J81458J4483969O146691j2793543j6504868k068943J1684024J3717494
12747A2841316R850274N939185L45051n974878o995508k335097R50710j62438
12739A4458615j292479p70062l061487q650962r796188j858666P845291Q706394
$$ plain form
12796 17206988 3561980 -12108707 -20581710 -20036754 -14012564 -6516782 438028 6588619
12788 6588619 11297967 12134532 7485820 321098 -3866527 -3266136 -475920 2960664
12780 2960664 7972455 13216345 14621940 11753365 9173597 8815782 6392779 -1321346
12772 -1321346 -10689614 -16258714 -17075531 -14878976 -10878090 -7307841 -6777510 -7117463 -3075710
12763 -3075710 4049725 6617727 4414741 7747061 19485005 25320232 13991215 -2004966
12755 -2004966 -1823508 12660461 18807152 6013609 -10491259 -12560202 -876178 12841316
12747 12841316 22691590 28630775 28975826 23000948 16005440 13670343 14621053 14458615
12739 14458615 13166136 12396074 9334587 683625 -9112563 -10971229 -3125938 5580456
12731E580456O72854n948423l361370M828286Q352601K595329n585005o233917
12723I00811M78595M171476j065804p921978o526860J410395O197191M272581
12715A916407K80015l076705p430362j0127839l641188J1317986K0404080J1770715
12707B1413109o427756j3812998l080842J0936102J1062537n37369q014330n079423
12699F459030j464140m621175p119234m94576P845559M750398o412619r095223
12691a0151980P36508Q218404L516481l089812R40568J0065920J0204935J00796
12683B0541820r077146r954373m012574M642160J0396526O177077o757066j3896542
12675a940118m136149J2727160J7674259Q162351j656701l990906m894430q095527
$$ plain form
12731 5580456 6253310 304887 -3056483 1771803 10124404 12719733 7134728 900811
12723 900811 1379406 5550882 4485078 -3436900 -9963760 -8553365 -2356174 1916407
12715 1916407 2196422 -880283 -8310645 -18438484 -22079672 -10761686 9642394 21413109
12707 21413109 14985353 1172355 -1908487 9027615 20090152 19552783 11538453 6459030
12699 6459030 4994890 373715 -6745519 -7240095 605464 5355862 -1056757 -10151980
12691 -10151980 -9415472 -1197068 2319413 -770399 170169 10236089 20441024 20541820
12683 20541820 11464674 1510301 -2502273 2139887 12536413 18713490 11956424 -1940118
12675 -1940118 -6076267 6650893 24325152 32487503 30830802 26839896 21945466 13849939
12667A3849939p615764j030188L959408K451674J38102J736160K277324k850527
12659A2916128q308268o905070k61683N089239O025905K295438n272028j1236930
12651e657269q217472J551693N920486L17688l955543K656571J1494404Q420361
12643A2530919l998883j0548063o035690j49997J55133L1067M943576R948372
12635F876434P070981k445320r329320p556794l26498M957755N197177L618193
12627H062608L552318L103146o54639m401271k030375M411809N260437k453271
12619A4850762r456998p917065k510385r92697j654637O22346K696078q91780
12611e254376m915415O43618J3291721J9202063J2249535L94205q017759j2501759
$$ plain form
12667 13849939 6234175 5203987 9163395 11615069 11753171 13489331 15766655 12916128
12659 12916128 4607860 -2297210 -2558893 2530346 8556251 10851689 5579661 -5657269
12651 -5657269 -13874741 -12323048 -6402562 -6084874 -10040417 -7383846 4110558 12530919
12643 12530919 8532036 -2016027 -8051717 -8201714 -8046581 -8015514 -3071938 6876434
12635 6876434 13947415 11502095 2172775 -5384019 -5710517 -752762 4444415 8062608
12627 8062608 11614926 14718072 14063433 9662162 7631787 12043596 17304033 14850762
12619 14850762 5393764 -2523301 -5033686 -6026383 -7681020 -7058674 -4362596 -5254376
12611 -5254376 -10169791 -9526173 3765548 22967611 35217146 35611351 27593592 15091833
12603A5091833j2739120n416592N854393R062232J75780q207592l643753P925473
12595H102654J0798955J688547p259031o065799J832991O820561M323127l159826
12587A7082179j0022675j1275144n779208K052913N561316K180192m090600o516643
12579a0807670j585817P657505J3392730R779943p40115r342203r938875m410212
12571e994714J969224O803855R928659R920550N278905k406302r628046j4029016
12563A843115j4012402q004019K121958R334905Q291054K813791J316698N149819
12555H854919P276891L410285j642884j574835K581720N254719M239973J259132
12547B9659920k641365p008303q618282l815888N093135J0418783P722553M15763
$$ plain form
12603 15091833 2352713 -3063879 2790514 11852746 12028526 3820934 177181 8102654
12595 8102654 18901609 20590156 13331125 7265326 9098317 15918878 20242005 17082179
12587 17082179 7059504 -4215640 -9994848 -7941935 -2380619 -200427 -4291027 -10807670
12579 -10807670 -12393487 -4735982 8656748 18436691 17696576 8354373 -1584502 -5994714
12571 -5994714 -4025490 2778365 12707024 22627574 27906479 25500177 15872131 1843115
12563 1843115 -12169287 -20173306 -18051348 -8716443 -425389 2388402 3705100 8854919
12555 8854919 16131810 19542095 17899211 16324376 18906096 24160815 28400788 29659920
12547 29659920 27018555 20010252 11391970 7576082 12669217 23088000 30810553 31226316
12539C1226316n676675q578694q892098o374053j659995J495707L19077k306178
12531d46593j769415J106326J928069N75711R13562K887813K222551r46918j458100
12522E013006L07633l032911j1474647j2450080M96589J3516731J0508465j637506
12514A247280k808510Q462071J2501339K18776j2669111j1176473k741746q73174
12506g839548k229901L752445J3046564J2675648K191362p096308j0424964j1287161
12498g211863q348819K026177J1611185P201570o666445j0316054J565235J1447431
12490A308417O884885j542702q22772L274928J90827m676938r15172N743793K547837
12481A1993103o424398n451334O103182J1597024L187787p420422q587456l768130
$$ plain form
12539 31226316 25549641 16970947 8078849 1704796 44801 1540508 1859585 -446593
12531 -446593 -2216008 -1109682 818387 1394098 2307660 5195473 7418024 6471106 5013006
12522 5013006 5320639 2287728 -9186919 -21636999 -21140410 -7623679 2884786 1247280
12514 1247280 -1561230 6900841 19402180 19620956 6951845 -4224628 -6966374 -7839548
12506 -7839548 -10069449 -6317004 6729560 19405208 21596570 14500262 4075298 -7211863
12498 -7211863 -15560682 -13534505 -1923320 5278250 -1388195 -11704249 -10139014 1308417
12490 1308417 8193302 6650600 5827828 9102756 9293583 4616645 3701473 9445266 11993103
12481 11993103 5568705 117371 6220553 17817577 21005364 13584942 4997486 1229356
12473A229356q87076O1039J439720J019387j665015j316699L241273M098337k528971
12464D691351o794810N29395J1126328R153596m935049j3732650p012412N299419
12456a674832Q773101L732409J345079N774244R149989M175690n563214j1294336
12448A4418130j0658663q490800p614318m923906J690138P807659P972895L465871
12440C667006R3420L99149K448504M263273M613503J451584m816039q318805m438128
12431f36533K000184K706719j097097p84478M487804N372512k060255q844131
12423A144725o467315J370410O378959O869079M909383K49564n645324o803382
12415B006099j636957K324959J62636j861621J784069M348293j178053o811885
$$ plain form
12473 1229356 342280 403319 1843039 2862426 1197411 -119288 3121985 7220322 4691351
12464 4691351 -2103459 -1574064 9552264 18705860 13770811 38161 -6974251 -1674832
12456 -1674832 7098269 10830678 12175757 17950001 27099990 31275680 25712466 14418130
12448 14418130 3759467 -4731333 -12345651 -17269557 -15579419 -7771760 201135 3667006
12440 3667006 3760426 4159575 6608079 10871352 15484855 16936439 12120400 3801595 -636533
12431 -636533 1363651 4070370 2973273 2188795 6676599 12049111 9988856 1144725
12423 1144725 -5322590 -3952180 2426779 9295858 14205241 14454805 8809481 2006099
12415 2006099 369142 2694101 2856737 995116 2779185 7127478 5949425 -862460
12407h62460j171627R647254R706892j113912o891915j284351M619318L194168
12399A5843367J142855L056953J128257q645768j4523994o225352O773616Q246218
12391F796152p88969n499102p88546K913714k064994q687336o023605N158350
12383h984336J3036701Q935777k519633q707731l984200L876900N160024J872085
12375H685587K464252N862135K581379p123576r966538m55315P925436K230734
12367A2204094r814111j1477628j233435P785083P623022K013329l810411p605957
12359d316014o367992N00984N775361K961637j856650J584078R755449R583963
12351A7620816J41560n230151q26532K907520j788379p061045l522154M710527
$$ plain form
12407 -862460 -2034087 7613167 17320059 16206147 9314232 8029881 12649199 15843367
12399 15843367 16986222 20043175 21171432 12525664 -1998330 -8223682 -1450066 6796152
12391 6796152 6007183 508081 -280465 2633249 568255 -8119081 -14142686 -8984336
12383 -8984336 4052365 12988142 10468509 1760778 -2223422 1653478 6813502 8685587
12375 8685587 11149839 17011974 19593353 12469777 2503239 2047924 9973360 12204094
12367 12204094 2389983 -9087645 -10321080 -2535997 5087025 7100354 3289943 -4316014
12359 -4316014 -10684006 -10183022 -4407661 -1446024 -3302674 -1718596 8036853 17620816
12351 17620816 17762376 12532225 11705693 14613213 12824834 5763789 2241635 6952162
12343F952162Q367019O795265M150236K44448n354838p448194l123863O56265
12335A1238500l030082r115030q182378j034033M349678N788415O217639M209068
12327A0441777k787253q318393l086447Q933650J3253186N366275l620583m534538
12319A5647674j027577J406011M626281Q808393O101726n983823j4140255n504814
12311I933616J1053858J4209576m90539j4509703j2292625r29096K810009l985458
12303E799638r183236m105918N701380Q923284K117201p410932j0155483m148981
12295a2463047L651642N300493K57057n361793o650752l890814Q33213O094864
12287a2229137Q745057M688903l935068p279692L34258J0440913J0020847l51583
$$ plain form
12343 6952162 15319181 22114446 26264682 26509130 21154292 13706098 10582235 11238500
12335 11238500 8208418 -906612 -9088990 -10123023 -5773345 15070 6232709 10441777
12327 10441777 7654524 -663869 -3750316 5183334 18436520 23802795 20182212 15647674
12319 15647674 14620097 16026108 20652389 29460782 35562508 29578685 15438430 9933616
12311 9933616 20987474 35197050 34706511 20196808 7904183 6975087 9785096 5799638
12303 5799638 -3383598 -7489516 -1788136 7135148 9252349 1841417 -8314066 -12463047
12295 -12463047 -8811405 -3510912 -3253855 -8615648 -15266400 -19157214 -18324001 -12229137
12287 -12229137 -3484080 1204823 -2730245 -10009937 -9675679 765234 10786081 10434498
12279A0434498o814229j899311N414991M069076k751262l837685K162983M969486
12271A1748547j366546r547644r564003k166128L310844J698249k694438l308546
12263a1889665N10811M404351N208832L420082P87307j265005j041180J935019
12255B070552M162905J224965m572287m912399K304493P296910J760784p352964
12247A982959p354556K90075K432325l588845n206101L551716J0527416M756270
12239G391259n709352p389271k071040K73614M61789N379646J0396598N233249
12231A3966492n004391m405470O642563Q892983n408010j8496000j3573173P15462
12223a6669544N581323l85056m011899J55717N446411O895756O088997L860796
$$ plain form
12279 10434498 3620269 1720958 7135949 11205025 8453763 4616078 6779061 11748547
12271 11748547 10382001 834357 -8729646 -10895774 -7584930 -5886681 -8581119 -11889665
12263 -11889665 -11378854 -6974503 -1765671 1654411 2441718 1176713 135533 2070552
12255 2070552 6233457 7458422 2886135 -2026264 278229 7575139 9335923 1982959
12247 1982959 -5371597 -5081522 -2649197 -6238042 -11444143 -7892427 2634989 7391259
12239 7391259 1681907 -5707364 -7778404 -7504790 -7043001 -1663355 8733243 13966492
12231 13966492 8962101 4556631 11199194 20092177 14684167 -3811833 -17385006 -16669544
12223 -16669544 -11088221 -11473277 -15485176 -15329459 -9883048 -2987292 3101705 6962501
12215F962501m53411l156258M03989O611159O718338l94856o667028o596976k850789
12206E76669O78948L531259M386790j35365q218345j0422252n26771J3902017
12198C772950J7773188O044645r142972j2006803k031240N514576m82921j2052887
12190b611464j3022401j191382R440338Q551111J595614j361433L93096J491640
12182C285119L43131j454665m123214p215995o654360p13344N273974O172108
12174e087246M347684L886845L220641K69608j460343o4916j698395r762445j4346609
12165b0695176n249428R428325J2494902L124380k690685K243236O396495j97963
12157D854086r858796r188573K561194J4284377J5866861N820044q013240j3102015
$$ plain form
12215 6962501 6509090 3352832 3756821 10367980 17086318 16691462 10024434 3427458 576669
12206 576669 1255617 4786876 9173666 9038301 819956 -9602296 -10129067 3772950
12198 3772950 21546138 27590783 18447811 6441008 4409768 9924344 9441423 -2611464
12190 -2611464 -15633865 -16825247 -7384909 1166202 2761816 1400383 1793479 3285119
12182 3285119 3628250 2173585 -1949629 -9165624 -15819984 -16533328 -11259354 -5087246
12174 -5087246 -739562 3147283 6367924 6637532 5177189 5112273 3413878 -6348567 -20695176
12165 -20695176 -25944604 -16516279 -4021377 -896997 -3587682 -1344446 5052049 4854086
12157 4854086 -5004710 -14193283 -11632089 2652288 18519149 24339193 16325953 3223938
12149C223938m409621P118061O757283l092269n829731L601889J0140144K011771
12141A9521465j1018910j2980078m427732K169313K135000J184424K800472M600915
12133C984869N274651N500504L245950l304870q926302n695035M966983J1392750
12125A6439500N335611p366947j2522365l317322J1021493J4333758K495187j0519075
12117A5899840j0101838r0677M288033o61147l817036P84986N011615K098922
12109A3412698k501397k617421j373951j943747m22474L372598P26810r796408
12101a143292j4015626l008581J0092717R492227J239033N08575M944984J798507
12093I908544o112110n139812K522871J522382p738226p945596M079257J0205946
$$ plain form
12149 3223938 -1185683 5932378 12689661 9597392 3767661 7369550 17509694 19521465
12141 19521465 8502555 -4477523 -8905255 -6735942 -4600942 -3416518 -616046 3984869
12133 3984869 9259520 14760024 18005974 14701104 5774802 79767 5046750 16439500
12125 16439500 21775111 14408164 1885799 -1431523 9589970 23923728 26418915 15899840
12117 15899840 5798002 5707325 9995358 9334211 5517175 6302161 11313776 13412698
12109 13412698 10911301 8293880 6919929 4976182 4553708 7926306 8653116 -1143292
12101 -1143292 -15158918 -18167499 -8074782 1417445 2656478 3165053 8110037 9908544
12093 9908544 3796434 -1343378 1179493 2701875 -5036351 -12981947 -8902690 1303256
12085A303256K182635m000540L655498J2322106O844641m993466p031413o81044
12077I601673J503225k066633l678270k649156l641573m140899J037337O958388
12069B924092N023651j041175l34014O059004N990153l425583j0798651q357989
12061c960512k006446P31325J585813M597077P260890N358660O45195k290656
12053A1921346k797435l043298l366039k774172j647262p85102J55063J027207
12045a309692N12865p44671P16182N793995R059313M517961n686342j2410319
12037D49292j0006496k263912L613917N536244N735341M111233j743584r271587
12029c839552j0054176m89186J0764984J1788895K011550p766379r050135l527549
$$ plain form
12085 1303256 3485891 -514649 3140849 15462955 22307596 17314130 10282717 9601673
12077 9601673 11104898 9038265 5359995 2710839 -930734 -5071633 -4034296 2924092
12069 2924092 7947743 6906568 6572554 12631558 18621711 15196128 4397477 -3960512
12061 -3960512 -5966958 -5235633 -3649820 947257 8208147 13566807 14212002 11921346
12053 11921346 9123911 6080613 2714574 -59598 -1706860 -2491962 -2336899 -1309692
12045 -1309692 -796827 -1541498 -825316 4968679 14027992 18545953 12859611 449292
12037 449292 -9557204 -11821116 -8207199 -2670955 3064386 7175619 5432035 -3839552
12029 -3839552 -13893728 -14382914 -3617930 8170965 10182515 2416136 -6633999 -10161548
12021a0161548K686747O243887O156717J976109m157345p352762n068383q6030
12013i762608L464685M481317L692524R08332m198386r799448j1759347o129788
12005b9102719O257067J6757678J4936490J605252q948906o141155K392205K489717
11997B45629m872738o380794J031167N730384J786648j839502J454815M013987
11989A169596j718671r208343q608272j643836M274784P573627Q453320L288646
11981C580851o009210p371821L827606J2584532M769653r344063r835643J760827
11973f037268O465699p47345n319415N05855O865869O161111M249027M944401
11965A7087934J283087q426255j1711080q00381J2134573J1145626j247277r964444
$$ plain form
12021 -10161548 -7474801 -1230914 4925803 6901912 2744567 -4608195 -9676578 -9762608
12013 -9762608 -6297923 -1816606 1875918 2784250 -1414136 -11213584 -22972931 -29102719
12005 -29102719 -22845652 -6087974 8848516 10453768 1504862 -4636293 -2244088 245629
11997 245629 -4627109 -11007903 -9976736 -4246352 -2459704 -4299206 -2844391 1169596
11989 1169596 -549075 -9757418 -18365690 -20009526 -15734742 -8161115 292205 3580851
11981 3580851 -2428359 -9800180 -5972574 6611958 11381611 2037548 -7798095 -6037268
11973 -6037268 428431 -318914 -5638329 -5132474 1733395 7894506 12143533 17087934
11965 17087934 18371021 9944766 -1766314 -2566695 9567878 20713504 19466227 9501783
11957I501783q657417l626741j019918o18699l72188Q10661L660460O798010O469244
11948A2945195J765998l068006m634460m505673m552625l408452p59695O43389
11940e574329O02873K569567N595731L221871m426778o344759L479790J3694882
11932A2818848R678309n001382j2764472n984533M095769L881848n668913j2249551
11924a1194077p562423L958098J0691846P009085j49455k60572O360934R095731
11916A7949167L019547l649742k530063K289138J843754l529614o394839m709961
11908D287387k977986k750498p02589L728986O027763L091013k891811p506711
11900C05554p530710k333401M612428P444077M564815R53780O34064J175452j47333
$$ plain form
11957 9501783 844366 -2782375 -3802293 -4420992 -4793180 -3982519 -322059 6475951 12945195
11948 12945195 14711193 11643187 7008727 2503054 -2049571 -5458023 -6217718 -5574329
11940 -5574329 -4971456 -2401889 3193842 6415713 1988935 -4355824 -876034 12818848
11932 12818848 22497157 17495775 4731303 -1253230 2842539 6724387 1055474 -11194077
11924 -11194077 -18756500 -14798402 -4106556 2902529 2753074 2492502 8853436 17949167
11916 17949167 20968714 17318972 14788909 17078047 18921801 15392187 8997348 4287387
11908 4287387 1309401 -1441097 -2143686 1585300 7613063 10704076 7812265 305554
11900 305554 -7225156 -9558557 -4946129 2497948 7062763 8016543 8650607 9826059 9678726
11891I678726o27902J189788l54260q292409j3405678n988502O931856R814225
11883a054156K285472o87824O229325R982796J558929p993106m955174M911771
11875A0278033N452528m706018j0303633k045901J0912257J4082921N032677o665769
11867B2037095j1890163r669029m304915Q51814M976705O680545L119635n010189
11859F791498r979455m222667Q139462J3053389L590340r632956j1054178m04631
11851c719198P178524J777600q282198q724532O89186O505726J313366n687184
11843h948710k648488O890224Q827326n90646q842119m897817N860590J0340031
11835E990391M920788l188858p246335n954612k71307O723225Q537154J862378
$$ plain form
11891 9678726 9050824 10240612 9886352 1593943 -11811735 -17800237 -10868381 -1054156
11883 -1054156 1231316 543492 6772817 16755613 18314542 10321436 5366262 10278033
11875 10278033 15730561 11024543 720910 -1324991 9587266 23670187 28702864 22037095
11867 22037095 10146932 477903 -3827012 -2975198 2001507 8682052 11801687 6791498
11859 6791498 -3187957 -7410624 728838 13782227 17372567 7739611 -3314567 -3719198
11851 -3719198 3459326 5236926 -3045272 -11769804 -11080618 -4574892 -3261526 -8948710
11843 -8948710 -11597198 -4706974 4120352 3529706 -5312413 -10210230 -4349640 5990391
11835 5990391 10911179 7722321 475986 -5478626 -5749933 973292 9510446 11372824
11827A1372824o254098n564974L243280R290893O531977q6214m261782n384902
11819H887004l946805J057793O392840M612705m958411j2098346q109039K925714
11811e236545J0054461P738833j583877j1532535j4477200o589619N326130Q748069
11803g552283J758325l597013Q7273L749126k005107r042582m010123Q334656
11795a2277728J0822110M94008p592314m545844J047874Q63537K92951N551732
11787e343674J0106746N215730m655465q286917l924998J229326L393502M036952
11779A771202K546941k696783p368458n113981J674630M241381J357478J300335
11771b287255P402871J1118276M973527n106280p933405k931783K64579l527863
$$ plain form
11827 11372824 5118726 -446248 2797032 12087925 18619902 18533688 14271906 8887004
11819 8887004 4940199 5997992 12390832 17003537 12045126 -53220 -8162259 -5236545
11811 -5236545 4817916 12556749 10972872 -559663 -15036863 -21626482 -16300352 -7552283
11803 -7552283 -5793958 -9390971 -9303698 -5554572 -7559679 -16602261 -20612384 -12277728
11795 -12277728 -1455618 -961610 -8553924 -13099768 -12051894 -11188357 -10895406 -5343674
11787 -5343674 4763072 9978802 5323337 -2963580 -6888578 -5659252 -2265750 1771202
11779 1771202 4318143 1621360 -5747098 -10861079 -9186449 -4945068 -3587590 -2287255
11771 -2287255 5115616 16233892 21207419 16101139 8167734 5235951 5500530 1972667
11763A972667q564565p592510j466668L975681O462080Q018263Q809159N577682
11755A7191789k070431p805404n206019K924739O587922J115578o632093p607358
11747a501277k526072M30810k028301m500264k292904J315365P18844l095027
11739a3478826m041106P7305M542629M336731O37811j178928J351899M981562
11731b770923N548487L579025K678756L268355K150934n60695L95778O133328
11723B0423045Q013034p32646j1371497q742251N879307J3400673L026211j1806655
11715A8089221j2028285J575279J2100100R649786o12337r947820j4248659j1978524
11707g401239m117581L494992N606786M546856M781000L831720k030216p012473
$$ plain form
11763 1972667 -6591898 -14184408 -15651076 -11675395 -5213315 2804948 11614107 17191789
11755 17191789 15121358 7315954 2109935 5034674 11622596 12738174 6106081 -1501277
11747 -1501277 -4027349 -3596539 -5624840 -10125104 -12418008 -11102643 -10383799 -13478826
11739 -13478826 -17519932 -17442627 -12899998 -8563267 -7925456 -9104384 -7752485 -2770923
11731 -2770923 2777564 6356589 9035345 12303700 14454634 13893939 14289717 20423045
11723 20423045 28436079 27703433 16331936 7589685 13468992 26869665 29895876 18089221
11715 18089221 6060936 7636215 19736315 29386101 28773764 18825944 4577285 -7401239
11707 -7401239 -11518820 -8023828 -2417042 2129814 6910814 10742534 8712318 1699845
11699A699845l238093L584400Q07007r186479j0453023L89638P538469K019689
11691f838547l676733K295091J0749020P703712j994484l938328K053554M378358
11683A0731643L9861l650838m319983o287156q646708n348098K965888Q764718
11675e750673R028316P055237M468984R42255o66893J379500J668769m033699
11667A4091796r082384n901725n343o55076l478974J343891Q607374M921260o577518
11658C263301r049257M66348P460412N795650N028309P917337L870489p943828
11650A6808761j2133047l779439J135641n462763p377838O921896K0348076J2813546
11642B9274833o541275j4859964r365360l315356o0075N605996R301002L540869
$$ plain form
11699 1699845 -1538248 2046152 2853159 -6333320 -16786343 -16396705 -8858236 -6838547
11691 -6838547 -10515280 -8220189 2528831 10232543 8238059 4299731 6353285 10731643
11683 10731643 10771504 7120666 2800683 -3486473 -12133181 -17481279 -14515391 -5750673
11675 -5750673 3277643 10332880 14801864 15744119 15077226 16456726 18125495 14091796
11667 14091796 5009412 -892313 -897656 -1552732 -5031706 -3687815 4919559 9840819 3263301
11658 3263301 -5785956 -5319608 2140804 7936454 12964763 20882100 24752589 16808761
11650 16808761 4675714 896275 2031916 -3430847 -10808685 -3886789 16461287 29274833
11642 29274833 22733558 7873594 -1491766 -4807122 -4867197 738799 10039801 13580670
11634A3580670m211073k015783M058269M6182r129116o844189N104465Q600766
11626I190191K93152m559383m70568J190933l107299k416394M763622M689305
11618I573559n065993p512573M050994J1526872J581098j1678449j0705004k219077
11610a0448573j385261m449550Q33525R482235P216375l144082n631728J995601
11602e531458O200079J664383k192602l69330J94172l509090l395121M254450
11594b684517R640367M221219n523366q130804l679725j023051k886064l021984
11586a3087925K352291P830533O132589j845159p761235n793961R24268M893893
11578f354706L167143q50638l278242l592606k333895P02723M107812M446521
$$ plain form
11634 13580670 9369597 7353814 11412083 11458265 2329149 -4515040 589425 9190191
11626 9190191 9483343 4923960 4453392 5644325 2537026 120632 4884254 9573559
11618 9573559 4507566 -3005007 1045987 12572859 14153957 2475508 -8229496 -10448573
11610 -10448573 -11833834 -16283384 -15449859 -5967624 1248751 -1895331 -7527059 -5531458
11602 -5531458 668621 2333004 140402 -228928 -34756 -3543846 -6938967 -2684517
11594 -2684517 6955850 11177069 5653703 -2477101 -6156826 -7179877 -10065941 -13087925
11586 -13087925 -10735634 -2905101 3227488 1382329 -6378906 -12172867 -11248599 -6354706
11578 -6354706 -3187563 -4038201 -7316443 -10909049 -13242944 -12540221 -8432409 -3985888
11570c985888J013720j820381k3850M407708O107910L304850n37784j434015P64155
11561G796425K743609J501774k651906p047735r669785r038933k258187J1003318
11553g621420K1387058J5549826n001085j9610526j3158985K524951N517592l990747
11545d403336o269700N060842J3435120O956857l998259n680496q17181J387172
11537E671019J108977K060164J589908k022921k958002J226009L097757n76839
11529I196072j156051M840890N924883l867012j0693216l756596L886483k161867
11521B213586j0309313l448382P364184M33399j5067465j0325748J3250143K2460183
11513F570587N299083j0564735l794992R284192O645880m533653o139363n9289
$$ plain form
11570 -3985888 -2972168 -4792549 -4816399 -408691 5699219 9004069 8466285 7032270 7796425
11561 7796425 10540034 12041808 9389902 2342167 -7327618 -16366551 -18624738 -7621420
11553 -7621420 13765638 29315464 24314379 4703853 -8455132 -5930181 -412589 -4403336
11545 -4403336 -10673036 -5612194 7822926 14779783 10781524 5101028 4283847 5671019
11537 5671019 6779996 8840160 10430068 8407147 5449145 6675154 9772911 9196072
11529 9196072 8040021 12880911 18805794 14938782 4245566 488970 4375453 2213586
11521 2213586 -8095727 -11544109 -4179925 -3746526 -18813991 -29139739 -15889596 6570587
11513 6570587 11869670 1304935 -2490057 6794135 13440015 8906362 2766999 2707710
11505B707710J197639j939353k293612k035859m536926l017887N914122J0672460
11497F668294L439531l402841K255592R514418L028362q537712o319307O116130
11489A2762467Q971536r85578q625438q039431p493447q055734j679863P969589
11481e175899O644291m526763o990981N043473J4066317P551301l516893n606564
11473G488282l755065p602632j1355021m295429Q404939J1875281M023750k310677
11465B473428J043807O888555M125329o342729j1508128k354350J2257408J3714990
11457B0298310j401708j3003088l466298J5689417J8100671l58573j6950619j5164994
11449C743118l337116M551119P795587R940472P780318Q97411j775398L237925
$$ plain form
11505 2707710 3905349 1965996 -327616 -2363475 -6900401 -9918288 -4004166 6668294
11497 6668294 10107825 6704984 8960576 18474994 21503356 12965644 6646337 12762467
11489 12762467 21734003 20748425 12122987 4083556 -3409891 -11465625 -13145488 -5175899
11481 -5175899 1468392 -3058371 -10049352 -5005879 9060438 16611739 13094846 7488282
11473 7488282 3733217 -3869415 -15224436 -19519865 -11114926 760355 4784105 2473428
11465 2473428 3517235 10405790 14531119 8188390 -3319738 -5674088 6583320 20298310
11457 20298310 18896602 5893514 2427216 18116633 36217304 35858731 18908112 3743118
11449 3743118 406002 4957121 12752708 22693180 30473498 31370909 29595511 32833436
11441C2833436N145985l213018j1264774p969391j139874l643617j0424916p277549
11433f953718M101638Q217879O8933r187794j0105359m466436K560105P457152
11425h307600O544687L63492k327724L892358R510231L194148p884851p129217
11417b144476M517776R165249M94898p302705l661776L264018L194753n11357
11409G016380j192875j372275m290336m356640K678126R125331O087816k416636
11401A1278891o456158m950626l218497j522224K976729O850913M105751k560554
11393F504225m299119L46165L372087k00751n474421n751380j854995l7544l253464
11384a0649197p280507n689016J881119P971169N937444j213453m928728l102829
$$ plain form
11441 32833436 37979421 34766403 23501629 15532238 14392364 10748747 323831 -6953718
11433 -6953718 -2852080 5365799 5434732 -3753062 -13858421 -18324857 -15764752 -8307600
11425 -8307600 -1762913 -1399421 -3727145 165213 9675444 12869592 4984741 -2144476
11417 -2144476 2373300 11538549 12033447 4730742 1068966 4332984 7527737 7016380
11409 7016380 5823505 4451230 160894 -4195746 -1517620 7607711 13695527 11278891
11401 11278891 4822733 -127893 -3346390 -4868614 -1891885 4959028 9064779 6504225
11393 6504225 2205106 2551271 5923358 5722607 248186 -5503194 -7358189 -7395733 -10649197
11384 -10649197 -17929704 -23618720 -21737601 -13766432 -7828988 -9042441 -13971169 -17073998
11376a7073998j547396k876487k007240L836119Q493999O010319J22382j920432
11368f962734J34371K081523L640277O430821P068359J137634p169932p963852
11360a603533Q08292R770627J0267200M622626J085567K115221J956855m125621
11352B4897234j1421431j0276998L08210Q483371L966572p055700r750461j781960
11344b631163M224234R20927l394168k49628M937384L327249k446419m568429
11336A19987l501356l758896l009761K112947N251351n08206p218578j816464
11328a2328976J0782284J1818112k526792j3985665r107203K863261P237991M658812
11320e88176L508570L152818j645228o806251l448364O442247J0962983M841144
$$ plain form
11376 -17073998 -18621394 -21497881 -23505121 -19669002 -11175003 -5164684 -5042302 -6962734
11368 -6962734 -6828363 -4746840 -1106563 5324258 12392617 13530251 6360319 -1603533
11360 -1603533 -795241 8975386 19242586 23865212 24950779 27066000 29022855 24897234
11352 24897234 13475803 3198805 3507015 11990386 15956958 8901258 -849203 -2631163
11344 -2631163 1593071 2513998 -880170 -1129798 3807586 7134835 4688416 119987
11336 119987 -3381369 -7140265 -10150026 -8037079 -2785728 -3293934 -10512512 -12328976
11328 -12328976 -1546692 10271420 7744628 -6241037 -15348240 -12484979 -5246988 -588176
11320 -588176 2920394 6073212 4427984 -2378267 -5826631 615616 11578599 16419743
11312A6419743m643796r104316q057515m771994o23990L051125L255293q5655
11304d561105j583051K729696Q125452O370311j877870o189177j029743M707780
11296F692293q9946j0787214j1732659N62040J0860176O999241l022892m995429
11288e514390Q6611J484140j009536J930516R802002J0162343j325553j2651949
11280B964184j2447777m084878K617944M137763K297810p93747j697041K661736
11272d344006Q167446O748238k65630k280286L027499M737338k263484o998882
11264F528233j412115L798456l134415j2616855p162386R419830J6155257O347795
11256A7923800m625728n121665k226540m675700p244453k369006N049822O351340
$$ plain form
11312 16419743 11775947 2671631 -5385884 -10157878 -10781868 -7730743 -4475450 -4561105
11304 -4561105 -6144156 -3414460 4710992 11081303 9203433 3014256 1984513 6692293
11296 6692293 6602347 -4184867 -15917526 -15355486 -4495310 2503931 -518961 -5514390
11288 -5514390 -5427779 -3943639 -4953175 -3022659 6779343 16941686 15616133 2964184
11280 2964184 -9483593 -13568471 -10950527 -6812764 -4514954 -5308701 -7005742 -4344006
11272 -4344006 3823440 10571678 10306048 8025762 11053261 15790599 13527115 6528233
11264 6528233 5116118 8914574 5780159 -6836696 -13999082 -4579252 11576005 17923800
11256 17923800 13298072 8176407 5949867 1274167 -5970286 -8339292 -3289470 3061870
11248C061870M103105O051311R516980M871498o864124j2533622n820794K816497
11240E202721J608273m639885j768941J1269798J8238148P437886j1196051j8734418
11232G417531j1692154l499704l083528m018041J258724P404328M858818m167021
11224e521047q250324k698960N510470P993756L296965m636541j0125553p992810
11216b2424044J878027J1708309J2806075N899580m25892j716679k148590n691343
11208a14557q949621o499289O91958O354135O564877L171343N76252J458953N074689
11199H328740P852775N925449j068504q177119q837366k177627M286555K356452
11191H489355n896669r147976j723675P226023N719149l253853n291008M007898
$$ plain form
11248 3061870 7164975 13216286 22733266 27604764 20740640 8207018 2386224 5202721
11240 5202721 6810994 2171109 402168 11671966 29910114 37348000 26151949 7417531
11232 7417531 -4274623 -7774327 -10857855 -14875896 -13617172 -6212844 -1354026 -5521047
11224 -5521047 -13771371 -16470331 -10959861 -2966105 330860 -4305681 -14431234 -22424044
11216 -22424044 -20546017 -8837708 3968367 9867947 9442055 7725376 5576786 -114557
11208 -114557 -9064178 -15563467 -14871509 -8517374 -1952497 1218846 1795098 3254051 8328740
11199 8328740 16181515 22106964 21038460 12861341 4023975 1846348 6132903 8489355
11191 8489355 2592686 -6555290 -8278965 -1052942 4666207 1412354 -3878654 129244
11183A29244J1807808O502475n856694j0939085n418547J815437M153652M045050
11175F239340N473729O929980M559420j074888m400382j707332K451543m39185
11167A8032225r826773j3109859k629412J0151406R273617j031706k860749M970753
11159A2969502M343760r029793j3821291J999469J7076338Q540047j0449693j1618988
11151I351K800276N989734p515234j3915006p43166J4278340J3679958M497155
11143A9081408K94635l35406l850731o660417l395462J833771L370763K760297
11135A3098858J588730k912344q200765n513365M038568O845529j354488o550064
11127A040659L59137P673662L151256n549683o090910k485189l349457k712129
$$ plain form
11183 129244 11937052 18439527 12582833 1643748 -3774799 -1959362 2194290 6239340
11175 6239340 11713069 18643049 23202469 22127581 17727199 16019867 18471410 18032225
11167 18032225 8205452 -4904407 -7533819 2617587 11891204 10859498 7998749 12969502
11159 12969502 17313262 8283469 -5537822 -3538353 13537985 22078032 11628339 9351
11151 9351 2809627 8799361 1284127 -12630879 -13374045 904295 14584253 19081408
11143 19081408 19376043 19040637 15189906 8529489 5134027 6967798 10338561 13098858
11135 13098858 14687588 11775244 3574479 -1938886 2099682 8945211 7590723 1040659
11127 1040659 1399796 9073458 12224714 6675031 584121 -1901068 -5250525 -7962654
11119g962654P089094J4776392N457191j1387857j3708865k105683K378650n182512
11111a0646244o302377O693089J5430396O082014o912600m029852Q665595J0637464
11103A9617485j280860j0865841q291393j047190J699076J684653L870695O026073
11095A1412698K919474l929265p270141l749444K386254N695419N536550L773806
11087A6775351L54869m717258p500258l929593K959215N594536K293164j065335
11079A0764691r40587m96330j667203r33271K677100L421799j333976m734137
11071F758086j196338L499748J495431m084879n146170k347596j871811k496855
11063e390384K035622R488586J0034010J370358p496525r157633n503102q96824
$$ plain form
11119 -7962654 -873560 13902832 19360023 7972166 -5736699 -7842382 -5463732 -10646244
11111 -10646244 -16948621 -10255532 5174864 11256878 4344278 314426 8980021 19617485
11103 19617485 18336625 7470784 -820609 -1867799 -168723 1515930 5386625 11412698
11095 11412698 14332172 10402907 3132766 -616678 1769576 7464995 13001545 16775351
11087 16775351 17130220 12412962 4912704 983111 3942326 9536862 11830026 10764691
11079 10764691 9824104 9327774 7660571 6727300 9404400 12826199 11492223 6758086
11071 6758086 5561748 9061496 10556927 6472048 1325878 -1021718 -2893529 -5390384
11063 -5390384 -3354762 6133824 16167834 17538192 10041667 884034 -4619068 -5515892
11055e515892L971318Q925823J1565540J0031586M483600l800482j0900618j0898183
11047G862692l715052J770481m63382l816999k83059M621404Q89260o774368m771750
11038d680773N918830R533471R02675o128525r81967Q563740J0942854O851569
11030C0921874K468634j473213n389145o165966m647299p425176j3691562j1827808
11022a7229661J926776J3306026R932923P28290J861535J1603751J4155567L905883
11014D0191090q327875j1810225p203548j711905j242360o360380j0389312n289288
11006a2143803N694865Q695613n48118p113700J434793J3830368J0966109m503628
10998A6312499j2733011p119278p07779k039254l924914l28458L144896K299666
$$ plain form
11055 -5515892 -1544574 7381249 18946789 28978375 33461975 29661493 18760875 7862692
11047 7862692 4147640 5918121 5454739 1637740 1354681 5976085 6865345 90977 -4680773
11038 -4680773 1238057 10771528 11674203 5545678 4563711 13127451 24070305 30921874
11030 30921874 33390508 31917295 26528150 20362184 15714885 8289709 -5401853 -17229661
11022 -17229661 -15302885 -1996859 7936064 8664354 10525889 22129640 36285207 40191090
11014 40191090 31863215 20052990 12849442 11137537 9895177 3534797 -6854515 -12143803
11006 -12143803 -6448938 2246675 1698557 -5415143 -3980350 9850018 20816127 16312499
10998 16312499 3579488 -3539790 -4247569 -6286823 -10211737 -10540195 -7395299 -5095633
10990e095633K676804O894281P067695j054958p951062m290800M335725O709039
10982I291091K338241j393206k218955l264343m762669m446179l014967j816252
10974i287239J406522P391704R982606L860497n372943p189678o37224M993064
10966E147309L499759j424416l386159j339350J114949O80090k399689m127722
10958b235229p01239N643774P439017J356582o511529q367251m357914l57502
10950h091291M56255r74088l281541m570748j693451N004070R323771P028917
10942C201894K342757P52854J8781m036365p683286n161592o06535k458394q048053
10933b1677939o532205K959031R425543P823547N128546N339033K700764m368730
$$ plain form
10990 -5095633 -2418829 4475452 11543147 10488189 2537127 -1753673 2582052 9291091
10982 9291091 11629332 10236126 8017171 4752828 -9841 -4456020 -7470987 -9287239
10974 -9287239 -7880717 -489013 9493593 13354090 7981147 791469 154245 5147309
10966 5147309 8647068 7222652 3836493 2497143 3612092 4292182 1892493 -2235229
10958 -2235229 -2936468 2707306 10146323 11502905 4991376 -3375875 -7733789 -8091291
10950 -8091291 -7635036 -8609124 -11890665 -16461413 -18154864 -13150794 -3827023 3201894
10942 3201894 5544651 6297505 6316286 2279921 -5403365 -10564957 -11171492 -13629886 -21677939
10933 -21677939 -28210144 -25251113 -15825570 -8002023 -2873477 2465556 5166320 797590
10925G97590o751954n20483L610654k574058r616910n121031N594721P988353
10917f593118J175749k593066J795637O721208N996331K296439n97913k825774
10909E375493m281172l478353j365410O1611J849265M709503M705644l63969m513249
10900B699363k395395L30658l582687q285176l410271O404930P018186j318410
10892b538802l573610M416790Q467921M3888r704158q731107j664527J905387
10884a1378218L404292P699972J0420064N301192l571122p708185n941067j664106
10876c437178L992864Q104783M150210o461324j0592837j682783P786278M288648
10868F148661n657473o735769Q78700M821498K564607K661490O348904N174951
$$ plain form
10925 797590 -5954364 -6474847 -2864193 -5438251 -15055161 -20176192 -14581471 -6593118
10917 -6593118 -5417369 -8010435 -6214798 506410 6502741 8799180 8201267 5375493
10909 5375493 1094321 -2384032 -3749442 -3687831 -1838566 2870937 7576581 7212612 2699363
10900 2699363 303968 634626 -2948061 -11233237 -14643508 -8238578 -1220392 -2538802
10892 -2538802 -6112412 -1695622 6772299 6816187 -2887971 -11619078 -13283605 -11378218
10884 -11378218 -7973926 -273954 10146110 15447302 11876180 4167995 -1773072 -3437178
10876 -3437178 555686 8660469 12810679 6349355 -4243482 -5926265 1860013 6148661
10868 6148661 491188 -6244581 -5365881 -544383 2020224 4681714 11030618 16205569
10860A6205569k139818n963704j802788K993423K249038m11723P797J978685K086452
10851A5202931P62899K20493J241143K943736K383947l385493j0838378j0465090
10843a933812K06666J0158572R205298J775027k884516n521951r388247p482686
10835e865649N364022J5233277N308715j4411734j7186730J26228J1388516J123957
10827A080602j3916904j3184657q17741P721233R542731R772735P444660J244607
10819H887266j792605K715870O471361J910094m269389l288359M40788m70134
10811A0604892j403440L932474P898166Q91811q808008o115185M947341O499779
10803A8447830l673050q493259j09384P632931K384568p707223q675096j934755
$$ plain form
10860 16205569 14065751 8102047 6299259 9292682 11541720 11129997 11137794 13116479 15202931
10851 15202931 15965830 16186323 17427466 20371202 22755149 19369656 8531278 -1933812
10843 -1933812 -1727146 8431426 17636724 19411751 16527235 11005284 1617037 -5865649
10835 -5865649 -501627 14731650 20040365 5628631 -11558099 -11431871 -43355 1080602
10827 1080602 -12836302 -26020959 -26838700 -19117467 -9574736 197999 7642659 8887266
10819 8887266 7094661 9810531 16281892 18191986 13922597 10634238 11075026 10604892
10811 10604892 9201452 13133926 21032092 21923903 13115895 7000710 11948051 18447830
10803 18447830 14774780 6281521 6172137 13805068 16189636 8482413 -192683 -2127438
10795b127438J412443n15885J01474N578798Q482818L650733l902772o374472
10787F305699l246046Q6069P47343O12517P98539p36985m111708m801169p9730
10778d425471N523495O482929M818288N690271P114100K788013n806220j0118897
10770A2066508q182922o832611p880728m079860N824734J0296773K236878p476734
10762d027962n215825M677339P688149K205719k48125L671548L406343o021598
10754F135588j2552715m154955J1214426J4143687m4723j4366957j2393591R90038
10746a1029202Q211382L373044k758452k045002n48854m659910p389969k83801
10738a7130764R214367P381586k836350m760125O404298J6730631J4600731L761245
$$ plain form
10795 -2127438 -714995 -1230880 -1129406 4449392 12932210 16582943 12680171 6305699
10787 6305699 3059653 3145722 3893065 4505582 5304121 4567136 455428 -4345741 -4425471
10778 -4425471 1098024 7580953 12399241 18089512 25203612 27991625 22185405 12066508
10770 12066508 3883586 -2949025 -10829753 -14909613 -9084879 1211894 3448772 -4027962
10762 -4027962 -9243787 -4566448 3121701 5327420 5079295 8750843 12157186 6135588
10754 6135588 -6417127 -10572082 642344 14786031 14741308 374351 -12019240 -11029202
10746 -11029202 -2817820 555224 -2203228 -4248230 -4797084 -9456994 -16846963 -17130764
10738 -17130764 -7916397 -534811 -3371161 -8131286 -1726988 15003643 29604374 33365619
10730C3365619p674127j6238614j7165716n522895J0453461J3053756O9268r535317
10722H05435l900710M441263J389851n435571k284558N989875N548624k262613
10714D291596n415631k765366k741645n523494m119440J54583o5987k755940Q35773
10705a8105551R356729J2086053O103572q37612m258523o916488q910450o024877
10697a7507147J310790P461791R728739Q730466L609762m165536o904526r30159
10689A334180M836263J939476k875425K58534N109014l95861j0602558r075602
10681i471979L557264R817531L695291k263476p33220M60580k740295k106698
10673B14998M666471N900799l917913j2213938p707593K195213N059941K524054
$$ plain form
10730 33365619 25691492 9452878 -7712838 -13235733 -2782272 10271484 10340752 805435
10722 805435 -3095275 1345988 2735839 -2699732 -4984290 1005585 6554209 4291596
10714 4291596 -1124035 -3889401 -6631046 -12154540 -16273980 -16119397 -16185384 -18941324 -18105551
10705 -18105551 -8748822 3337231 9440803 8603191 4344668 -2571820 -11482270 -17507147
10697 -17507147 -16196357 -8734566 994173 9724639 13334401 9168865 2264339 1334180
10689 1334180 6170443 8109919 5234494 5493028 10602042 10206181 -396377 -9471979
10681 -9471979 -5914715 3902816 7598107 5334631 4601411 5061991 2321696 214998
10673 214998 4881469 10782268 6864355 -5349583 -13057176 -10861963 -5802022 -3277968
10665c277968L407639P044245N922726p95767o657878p202889k996049K703417
10657a852524M755101o7967o518680m992326M100196Q419957J317954p302647
10649b140936n006990N493013J1213160O628854k016255p612165r337637q715239
10641a1494195m975919K535053J0106566J1819150O931006J807219J106705N39865
10633A8375450m793778q248787J9232J2788891J0644553p387231j6998569m340540
10625E9221J0298898L148996j5136095j6701609k21060J0407255N452926j046707
10617c738175l15884K35283j863507J865058J0198282R625307j061946o500241
10609H444177j809004m96120p340830p922917L539653J0008299K02291j0361892
$$ plain form
10665 -3277968 129671 7173916 13096642 12300875 5642997 -1559892 -4555941 -1852524
10657 -1852524 2902577 2834610 -3684070 -8676396 -4576200 3843757 5161711 -2140936
10649 -2140936 -7147926 -1654913 9558247 16187101 14170846 6558681 -2778956 -11494195
10641 -11494195 -16470114 -13935061 -3828495 7990655 14921661 16728880 17835585 18375450
10633 18375450 13581672 5332885 5352117 18141008 28785561 21398330 4399761 59221
10625 59221 10358119 13507115 -1628980 -18330589 -18551649 -8144394 -2691468 -3738175
10617 -3738175 -4054059 -3818776 -5682283 -3817225 6381057 16006364 14944418 8444177
10609 8444177 6635173 6139053 -1201777 -9124694 -5585041 4423258 4625549 -5736343
10601e736343m533895Q557359R764859k82951o502588l803952R33441L391240
10593A787170L905959J696907j786263j040328L276239J939540o725614j0226555
10585g172945j225066R051301Q233222J591828N63118L500429J939421k754550
10577A3726758l090109N02787J738164k30490j664738j850421j891203p65859
10569F474889J431692J970767J132613K102983K987760j281175p487381o940522
10561C91626j375841j208659n825635l285033O672080R436111J522374j752766
10553D574257O476616J1736863M276744l740509j280183K170900l540414r392773
10545A1281501m810142K477175K098475J03463M281756O192097l299887j4482382
$$ plain form
10601 -5736343 -10270238 -1712879 8051980 7769029 1266441 -2537511 -1604070 1787170
10593 1787170 5693129 7390036 5603773 4563445 7839684 9779224 3053610 -7172945
10585 -7172945 -8398011 653290 8886512 10478340 11041458 14541887 16481308 13726758
10577 13726758 10636649 11139436 12877600 12647110 10982372 9131951 7240748 6474889
10569 6474889 7906581 9877348 11009961 13112944 16100704 14819529 7332148 391626
10561 391626 -984215 -2192874 -8018509 -11303542 -4631462 4804649 6327023 4574257
10553 4574257 11050873 22787736 27064480 23323971 22043788 24214688 20674274 11281501
10545 11281501 6471359 8948534 11047009 11150472 15432228 21624325 18324438 3842056
10537C842056j3076897j769822Q427156J5117834J7985894J0261043p457870j9297205
10529A4032189j5116412n016771j39986L434946Q688399O391512m807662q728770
10521a262555J191741P588003n22761p317482O58820J0075923O654897N1949J272781
10512A8391316J576006m350098k849109Q874635R629230n476868q481697J1005869
10504B8319284K0665959K507023j1120726L445559J6056568J571452j0042084
10497E1403035M892388J1447062j1771189j4591092L1240126N4329805N076691
10490A32026826k1180864P1195434J67783140O8625744j83516088l06577058j63679512
10483b35322378M9353937R7548266J4160443k3101364J8030326L3011128n214691
$$ plain form
10537 3842056 -9234841 -11004663 -2577507 12540327 30526221 40787264 33329394 14032189
10529 14032189 -1084223 -6100994 -6240980 -2806034 5882365 12273877 7466215 -1262555
10521 -1262555 -70814 7517189 6994428 -323054 335766 10411689 17066586 17118535 18391316
10512 18391316 19967322 15617224 12768115 21642750 31271980 25795112 17313415 28319284
10504 28319284 48985243 51492266 40371540 43817099 59873667 61445119 51403035
10497 51403035 56295423 67742485 55971296 41380204 72620330 126950135 132026826
10490 132026826 110845962 182041396 349824536 418450280 234934192 -71642866 -235322378
10483 -235322378 -185968441 -88420175 -74259732 -97361096 -79330770 -46319642 -51534333
10476e1534333k0258137R067155J9791821o276958j3941564J4015084K6862521
10469b2274411M287536j0671568L116604J1133163l672674r942911O544054J4398951
10461g081256k129381j4190935m074080N411050m30037j894927J0719273J4846685
10453A176392j33824j1102717m513716Q04747o297064q039749L860758R292480
10445a4952693n79664m594714O883815J1554700j608672q636194M816809J4059747
10437F943134l84941j5463894n531757J2256672Q442614q822548j1420448P53899
10429a3227269N530862j473464n678216l109706j942497j450077M976332J1716977
10421d657058Q527836N25393j5432M189028J240187p634097j0804585o723775
$$ plain form
10476 -51534333 -71792470 -62725315 -42933494 -49210452 -63152016 -49136932 -22274411
10469 -22274411 -17986875 -28658443 -25541839 -14408676 -18081350 -28024261 -21480207 -7081256
10461 -7081256 -9210637 -23401572 -27475652 -22064602 -22494639 -24389566 -13670293 1176392
10453 1176392 1042568 -10060149 -14573865 -13769118 -20066182 -28105931 -24245173 -14952693
10445 -14952693 -15532357 -20127071 -13243256 -1688556 -3297228 -11933422 -7116613 6943134
10437 6943134 6558193 -8905701 -14437458 -2180786 6261828 -2560720 -13981168 -13227269
10429 -13227269 -7696407 -9169871 -14848087 -17957793 -19900290 -21350367 -16374035 -4657058
10421 -4657058 3870778 4396171 4380739 8569767 9809954 2175857 -8628728 -15352503
10413a5352503l571609k224209L132382J0083693R966381L487576M0489K124956
10405G687156L028094l65164l506417l051767j008102n5271q72233k660970k395756
10396c200430K274510O378642J654252q418043q311843O892893J9604122J2085997
10388B8960100q131161j8650652j1793813J29713N244368L792780L73512k952314
10380c027467m381072k548152j82419n31749q15492L492203R249285Q801375J937151
10371A1993663l768497m733489m868669o047162l937987L193631R119593Q128592
10363I079675L331337J102252J503637K81559k565225l234456k228572m498396
10355B771811r898385j0775656l223817N444218O586220K780813K846224P703148
$$ plain form
10413 -15352503 -18924112 -21148321 -18015939 -7932246 2034135 5521711 5562200 7687156
10405 7687156 10715250 10350086 6843669 3791902 2783800 2728529 1856296 -804674 -3200430
10396 -3200430 -925920 5452722 7106974 -1311069 -9622912 -2730019 16874103 28960100
10388 28960100 20828939 2178287 -9615526 -9485813 -4241445 -448665 -75153 -3027467
10380 -3027467 -7408539 -9956691 -10139110 -10670859 -11486351 -7994148 1255137 10056512 11993663
10371 11993663 8225166 3491677 -1376992 -7424154 -11362141 -8168510 951083 9079675
10363 9079675 12411012 13513264 15016901 15298460 12733235 9498779 7270207 2771811
10355 2771811 -7126574 -17902230 -21126047 -15681829 -9095609 -6314796 -3468572 4234576
10347D234576J0235312P635637M054322R38878m878061j1896780j3324005q524280
10339a1524401m689189m016052o39607N832291O809167N87794k182234L176737
10331f645494O192370P00522j887782P205737J5150098O509478j0380876j5618532
10323A225521p512239r2119J944354M581271N937703j296905j0985654q963805
10315a5161873K552418O890366M98164k333965M547214R145659L174390m729170
10307D583203n247129k023942j355696j690556m93840j68051j505645j289602
10299i191258J64647r45042k940809n62431M169690M736076K288711J853716l32273
10290g58973r244426j4499252k096482J8486087K2278525N930616p455479n132792
$$ plain form
10347 4234576 14469888 22105525 26159847 27098725 22220664 10323884 -3000121 -11524401
10339 -11524401 -16213590 -20229642 -20869249 -15036958 -8227791 -7639997 -9822231 -6645494
10331 -6645494 -453124 247398 -1640384 5565353 20715451 27224929 16844053 1225521
10323 1225521 -6286718 -6378837 -4434483 146788 6084491 4787586 -6198068 -15161873
10315 -15161873 -12609455 -5719089 -5220925 -7554890 -3007676 6137983 9312373 4583203
10307 4583203 -663926 -2687868 -4043564 -5734120 -6227960 -6396011 -7901656 -9191258
10299 -9191258 -9026611 -9971653 -12912462 -13474893 -9305203 -4569127 -2280416 -426700 -758973
10290 -758973 -10003399 -24502651 -26599133 -8113046 14165479 20096095 12640616 7507824
10282G507824p06596n132889p785076K97330P573324K742458m952323k890901
10274c346849L786641M397639J704886L234448O330818N848563M633736M223816
10266C0813698j442562j1311790j1624692J718399J1354899M147768p536216p306012
10258H813492j297151l127903p045482L65124J2409677J1144527k068358q780634
10250A0413292l632529Q8062m438593p282550o21949Q211170Q283045p00902r695947
10241F23099r774795j2377R906671Q627544j415833n135702L095191R471207K155072
10232A7540077r275813r147744k33338K946439k005488m828481j518731J801320
10224d721759J514461k30396k476503m385836j209863P595731J1709938L520069
$$ plain form
10282 7507824 6801228 1668339 -6116737 -5819407 1753917 4496375 -455948 -3346849
10274 -3346849 439792 4837431 6542317 9776765 16107583 21956146 26589882 30813698
10266 30813698 29371136 18059346 6434654 8153053 19507952 23655720 16119504 8813492
10258 8813492 7516341 4388438 -2657044 -2291920 10117757 21262284 19193926 10413292
10250 10413292 6780763 6868825 2430232 -4852318 -5474267 2736903 11019948 10319046 623099
10241 623099 -9151696 -9164073 742598 9370142 7954309 2818607 5913798 15385005 17540077
10232 17540077 8264264 -883480 -1116818 1829621 -175867 -5004348 -6523079 -4721759
10224 -4721759 -3207298 -3437694 -5914197 -10300033 -11509896 -3914165 7795773 11315842
10216A1315842p527285p330521J863727O925387M764279K510417J461761k666610
10208A1316997o289143j488597P677000Q156654j965609j0380217q904680k418341
10200d295936J758598K158009r8856l063811k620324J984666L630595k538580
10192c085639q681853m894790M347655P037480K737706P59254K437449O00362
10184A257624m372459l415432M896117J0388793O238987k650538p744008n096815
10176d97731L384193R371976L299012j1117081j5132671J11571J6031932J0620724
10168A6071925q136775j3791949j272271Q727564M719479r93640K478802P537807
10160A5340942M914131j031677l345606l702701m223534j602366L289127K772605
$$ plain form
10216 11315842 3788557 -3541964 -1678237 5247150 10011429 12521846 13983607 11316997
10208 11316997 5027854 3539257 11216257 19372911 17407302 7027085 -1877595 -4295936
10200 -4295936 -2537338 -379329 -478185 -3541996 -6162320 -4177654 -547059 -3085639
10192 -3085639 -11767492 -16662282 -12314627 -5277147 -2539441 -1780187 657262 1257624
10184 1257624 -3114835 -6530267 -1634150 8754643 14993630 12343092 4599084 -497731
10176 -497731 2886462 12258438 15557450 4440369 -10692302 -10580731 5451201 16071925
10168 16071925 7935150 -5856799 -7129070 1598494 6317973 5324333 7803135 15340942
10160 15340942 20255073 19223396 15877790 12175089 7951555 6349189 9638316 12410921
10152A2410921m156952q217530n308609k576675l684900k119011M346278O806438
10144b500040Q23384m485805j698431K840080J283352k651492k247556O18064
10136h018444J570984K499789N704586P376478M555131J066570J98368p00362
10128A4253100l050027l350388j585809l325111q218471p452370J140963O962715
10120d625398K900296l689196m121991r94704R50669M653444J1317487J2700447
10112A9091054M377484l772272k531765J343178j840620o253909j070200Q213142
10104A7556092O883037m447884j0255486m613702J431295n03364m131348j490093
10096D28547M095350N259767K560399J731612L693789L929589L05092l179720
$$ plain form
10152 12410921 8253969 36439 -5272170 -7848845 -11533745 -13652756 -9306478 -2500040
10144 -2500040 -1676656 -6162461 -7860892 -5020812 -3737460 -6388952 -8636508 -8018444
10136 -8018444 -6447460 -3947671 1756915 9133393 13688524 14755094 14953462 14253100
10128 14253100 11203073 7852685 6266876 2941765 -5276706 -12729076 -11588113 -4625398
10120 -4625398 -1725102 -5414298 -9536289 -10530993 -9580324 -4926880 6390607 19091054
10112 19091054 23468538 19696266 17164501 18507679 16667059 10413150 9342950 17556092
10104 17556092 24439129 19991245 9735759 5122057 6553352 6049988 1918640 428547
10096 428547 4523897 9783664 12344063 14075675 17769464 21699053 22004145 18824425
10088A8824425j338921N188606R475878O011136k040266o192257l342172Q39059
10080B7425488L07689m120172q062017r427104p984776l505255J998507L985741
10072F18101J196308j423067Q39947N947900Q288937N776339Q91575l155943n107879
10063A3872218o174378q388636j0486589p522096Q50365N231942j661988j0491997
10055b4771159n400822J0604270J6028565K590261r714816j316899J6795112J8843034
10047B3657546J943012j1519525p353835L402202M685069l052704r025477q459572
10039e723284l870473K480294Q557727R483371K656606o107916q256039l317828
10031d097542J591082K227648J133898R51926M64483o11891O49286L874593K594623
$$ plain form
10088 18824425 17485504 22674110 32149988 38161124 36120858 29928601 26586429 27425488
10080 27425488 27733177 23613005 15550988 6123884 -1860892 -5366147 -3367640 618101
10072 618101 1814409 391342 1231289 7179189 15468126 21244465 22136040 18980097 13872218
10063 13872218 7697840 -690796 -11177385 -18699481 -17849116 -12617174 -14279162 -24771159
10055 -24771159 -30171981 -19567711 -3539146 -948885 -10663701 -11980600 4814512 23657546
10047 23657546 25600558 14081033 6727198 10129400 14814469 11761765 2736288 -5723284
10039 -5723284 -9593757 -7113463 1444264 10927635 13584241 7476325 -779714 -4097542
10031 -4097542 -2506460 -278812 855086 1807012 2271495 1659604 2308890 6183483 8778106
10022H778106o019414j3666764j1096771j985172K996834L192215O679101J2408246
10014A286381Q859862n080821j3457601o400868M054439L368983k904345j280880
10006a1554850N281296L776567m438655n559493K513591P349174M207383K562394
9998D137407O842459P847943l17309r021404q076084Q47899R302029J1186259
9990B2749199L668552j0628807j9967580j3577031K033353R017300K688541l806555
9982g823028k187722q1489l381518m434606K286312P492299K250779n896826m699346
9973a6475145L974718R213582P839409M858086K788313P36577j63076J101753
9965A3874217J506376j202870l832873l065559p08615O36461J697415K779691
$$ plain form
10022 8778106 2758692 -10908072 -22004843 -23990015 -20993181 -17800966 -11121865 1286381
10014 1286381 10146243 5065422 -8392179 -14793047 -10738608 -7369625 -10273970 -11554850
10006 -11554850 -6273554 -2496987 -6935642 -12495135 -9981544 -2632370 1575013 4137407
9998 4137407 10979866 18827809 18510500 9489096 1413012 2260911 11562940 22749199
9990 22749199 26417751 15788944 -4178636 -17755667 -15722314 -6705014 -4016473 -7823028
9982 -7823028 -10010750 -10092239 -13473757 -17908363 -15622051 -8129752 -5878973 -11775799 -16475145
9973 -16475145 -12500427 -3286845 4552564 9410650 12198963 12935540 12772464 13874217
9965 13874217 15380593 14177723 10344850 7279291 6570676 7207137 8904552 11684243
9957A1684243K007431O3650k11410n50370m859796q937674l859759P868507J2197644
9948A5402466L782886o407195q669409o466481m915843j347517N054730P462517
9940C896154L611559J431658M611890N383549k99002m096247p80739J611906k830593
9931A2540135o284888k005695K740749K98764l736033k514962r20827m139269
9923d022026n582996Q26407P813215O971852K979667L406611N027702K084002
9915A9504434k043937k128166j84528J036540K638388K058005m971590j1172552
9907D736594m917132O122553K446959j1781206j0736395P668599J4001431j333151
9899F208252q616224Q152424K0083260M182940j5111379j0238215K532808O0822
$$ plain form
9957 11684243 13691674 13755324 13543914 12993544 8133748 -803926 -4663685 3204822 15402466
9948 15402466 19185352 12778157 4108748 -2357733 -7273576 -8621093 -3566363 3896154
9940 3896154 7507713 8939371 13551261 18934810 18635808 14539561 13758822 15370728 12540135
9931 12540135 6255247 4249552 6990301 7289065 3553032 1038070 117243 -4022026
9923 -4022026 -9605022 -8778615 -965400 6006452 8986119 12392730 17420432 19504434
9915 19504434 17460497 15332331 15147803 16184343 18822731 20880736 15909146 4736594
9907 4736594 -180538 5942015 8388974 -3392232 -14128627 -6460028 7541403 6208252
9899 6208252 -2407972 5744452 25827712 30010652 14899273 4661058 7193866 7254688
9891G254688k390555J2269593J9631486j876602k1051030n402162J5335002J787562
9883B5557982j7995621j73441K4458527L011125l0115838n794577M2292948K4816838
9875F6057943k3833668K8007573J67770924J93662561M229955k14258817k25635567
9868c999096o1960874N2128229K3185117l4377034k1641377J6344619J4133603
9861a6186813l888290L691726J4282797k442493k0126590o936150J3876677Q006723
9853i722413q914876l479059J6394988J9629299M336665p025360o453652k423510
9845B342082J738962N811464K896708p919425j3327421o259979J508717O61257
9837a2547635p43514L108047K420701p177329j1694673k707380O836675O508069
$$ plain form
9891 7254688 4864133 17133726 36765212 34888610 13837580 8435418 23770420 25557982
9883 25557982 7562361 7388920 31847447 34858572 4742734 -1051843 41241105 66057943
9875 66057943 42224275 70231848 238002772 431665333 435895288 221636471 -3999096
9868 -3999096 -65959970 -13831741 9353376 -25023658 -46665035 -30320416 -16186813
9861 -16186813 -20075103 -16383377 -2100580 -4543073 -24669663 -31605813 -17729136 -9722413
9853 -9722413 -18637289 -22116348 -5721360 13907939 18244604 11219244 4765592 2342082
9845 2342082 4081044 9892508 12789216 4869791 -8457630 -14717609 -13208892 -12547635
9837 -12547635 -13291149 -10183102 -7762401 -14939730 -26634403 -29341783 -22505108 -15997039
9829a5997039N940952J1669190J0237074n294024j5430240m697518R526914N265881
9821A221190o481895k431780J0739866Q203994q954903j5554562m562379M656025
9813a3164444J575718j501693L930348P877292K435169l827538j740135M396308
9805a8975P061833O500297M511899p20553p347677q146364j817028L321490J524409
9796D869331l019555m381779j978724K964583R079561J0876813K660922j1113217
9788I957935j8765160j6602457j1243006n697558L990474J5095986J6002477M772779
9780b488530l824466M16050P309120L621842n095594m960555K571935M731540
9772B281342J94922m93569L996353L169482m059227m341009O506268J2349253
$$ plain form
9829 -15997039 -10056087 1613103 11850177 6556153 -8874087 -13571605 -4044691 1221190
9821 1221190 -5260705 -7692485 3047381 11251375 2296472 -13258090 -17820469 -13164444
9813 -13164444 -11588726 -13090419 -9160071 -1282779 1152390 -2675148 -4415283 -18975
9805 -18975 7042858 13543155 18055054 17334501 9986824 1840460 23432 3344922 4869331
9796 4869331 1849776 -2532003 -4510727 -1546144 7533417 18410230 21071152 9957935
9788 9957935 -8807225 -25409682 -36652688 -42350246 -38359772 -23263786 -7261309 -2488530
9780 -2488530 -6312996 -5896946 1412174 5034016 -61578 -5022133 -2450198 2281342
9772 2281342 2476264 1982695 5979048 9148530 5089303 748294 7254562 19603815
9764A9603815J369430j2626502r890230M260053P584587m076844j0864388q63595
9756e503674J1417409Q195711m679687p990520J898676R428391L454322q432170
9748G788458j2145263n005519L341944L649004l269591q513184n052725M554046
9740a4652830J1204962R812522L948335p53704l215602m397889l509279j322621
9732b886106k138249o258626n470364N700566J8109590J7522535M261164p392344
9724B1448166r118097o405177n189438l219061R65751K356162o99798j454484
9716a315976L246756O176110L107315K021369Q225116J1349161J709677r802883
9708B4716645o522161N467626N014888r423269j6136113n387504N203315Q09883
$$ plain form
9764 19603815 20973245 8346743 -1543487 2716566 10301153 6224309 -4640079 -5503674
9756 -5503674 5913735 14109446 9429759 1439239 3337915 12766306 16220628 7788458
9748 7788458 -4356805 -9362324 -6020380 -2371376 -5640967 -14154151 -19206876 -14652830
9740 -14652830 -3447868 6364654 10312989 9559285 6343683 1945794 -1563485 -2886106
9732 -2886106 -5024355 -11282981 -16753345 -11052779 7056811 24579346 28840510 21448166
9724 21448166 12330069 5924892 735454 -2483607 -1517856 838306 138508 -1315976
9716 -1315976 1930780 8106890 11214205 13235574 21460690 32809851 34519528 24716645
9708 24716645 18194484 23662110 28676998 19253729 3117616 -2269888 2933427 3743310
9700C743310o707136j078826R943475Q803399j607819m284507K519704M933347
9692A6264947n05348k800669J023817J144768l992684l195190M721449M971250
9684A7632340o839338j3188500k998125P963492K799995p437030k533301J1744335
9676G143868J2632360k323982j2767057q606722q59223K298762O142437J0871876
9668A4532319N943806p883167j2378855j84563R925394J486488j2714082j0706589
9660a1979249M495359J1696218M801468k025363o7612L053363O00383j895296
9652H679271J672219O859989N894980j412064q949062j1535112q042560j559315
9644h391654K067361j85566l914630k306623M433744R091619O784364P4724n197317
$$ plain form
9700 3743310 -2963826 -4042652 5900823 14704222 13096403 8811896 11331600 16264947
9692 16264947 15759599 12958930 13982747 15127515 11134831 7939641 12661090 17632340
9684 17632340 10793002 -2395498 -5393623 2569869 5369864 -2067166 -4600467 7143868
9676 7143868 19776228 17452246 4685189 -3921533 -4780756 -2481994 3660443 14532319
9668 14532319 20476125 12592958 214103 29540 9954934 11441422 -1272660 -11979249
9660 -11979249 -7483890 4212328 9013796 6988433 6920821 9974184 10574567 8679271
9652 8679271 10351490 17211479 23106459 21694395 12745333 1210221 -6832339 -8391654
9644 -8391654 -6324293 -6509859 -10424489 -12731112 -8297368 794251 7578615 7653339 2456022
9635B456022n483417j242058L720902N230820L237800J506376J386348Q5378k556660
9626H341511j883153K486050K614857n475330j2276780p141079N074657J0580013
9618B320746O179839O35233j136559k832904o110437p222784n443625l983613
9610a7594104j637097N299165J1975658Q591310k577798p284547q98420L907296
9602b18537k028736r334417n952978L467375O448763K513154P42508K911678K560040
9593A108850j508807l464036k151575l172129p356649p139730J618823J1698164
9585a0367089J3308635O126707j897897m852888l881831k953947l064717j939200
9577i522227J457045L993352J672501m520750q554095o125403N17628N770376
$$ plain form
9635 2456022 -3027395 -4269453 -548551 4682269 7920069 9426445 10812793 10898171 8341511
9626 8341511 6458358 8944408 11559265 6083935 -6192845 -13333924 -8259267 2320746
9618 2320746 8500585 9135818 7999259 5166355 -944082 -8166866 -13610491 -17594104
9610 -17594104 -19231201 -13932036 -1956378 6634932 4057134 -3227413 -4125833 -218537
9602 -218537 -2247273 -11581690 -17534668 -14067293 -7618530 -5105376 -4362868 -1451190 1108850
9593 1108850 -399957 -3863993 -6015568 -9187697 -16544346 -23684076 -22065253 -10367089
9585 -10367089 2941546 9068253 7170356 2317468 -1564363 -4518310 -7583027 -9522227
9577 -9522227 -8065182 -4071830 -2399329 -6920079 -15474174 -21599577 -21081949 -15311573
9569a5311573O823507N260323M144216M868070N822221L805297j742504o387757
9561G281800n393710m40082K248678P10814p67093K57184K38086k952642m099931
9552b916896J913114J0079552R738822j090346j1828476j1881083l131584L427235
9544e689662J945790j513640J679584R668156J1787731L856822m874706m746563
9536A2113512J38194j072060q246942j0213661k670490M802073L344067k955901
9528d761208m969328j154260L770347O577995N982632R32953n544652o121395
9520e286916J061490P600900O146738R08927m46703M37646k726086p982212p710582
9511g996798j921390J818228J431408K961371Q758164J2348775Q019916j566296
$$ plain form
9569 -15311573 -8488066 -3227743 916473 5784543 11606764 15412061 13669557 7281800
9561 7281800 1888090 1448008 3696686 4407500 3640407 3897591 4135677 1183035 -2916896
9552 -2916896 -1003782 9075770 18814592 17724246 5895770 -5985313 -9116897 -5689662
9544 -5689662 -3743872 -5257512 -3577928 6090228 17877959 21734781 16860075 12113512
9536 12113512 12251706 11179646 2932704 -7280957 -9951447 -5149374 -1805307 -4761208
9528 -4761208 -9730536 -10884796 -7114449 -536454 5446178 6379131 834479 -5286916
9520 -5286916 -4225426 3375474 9522212 10431139 9984436 10422082 7695996 -286216 -7996798
9511 -7996798 -9918188 -8099960 -6668552 -3707181 5050983 17399758 25419674 23853378
9503B3853378r834014j2592590q663103l76790N433376L162784l786535o990594
9495i794088m882732l300237l896167j174005O587730J2641366J1952583P786317
9487A5920767L872014j460730q037673r521298l517742J759395p40412n230693
9479f956372k529562M539238N801985K5798m409990l298969n71904R33648K676030
9470c790098M060191K361506j44088J836245O355777N405412j834343o630863
9462G619739m281035j70424J227378K873129N657919L367242n364500j0172625
9454G56823l480653O641519Q404253L270657l30366k566674p568793r460162J32758
9445d200638J3330658J2950218o28764p732408P83999R762377M464554o996199
$$ plain form
9503 23853378 14019364 1426774 -7236329 -7613119 -2179743 983041 -2803494 -9794088
9495 -9794088 -14676820 -17977057 -21873224 -23047229 -16459499 -3818133 8134450 15920767
9487 15920767 19792781 18332051 10294378 773080 -2744662 -985267 -1725679 -6956372
9479 -6956372 -9485934 -4946696 855289 881087 -3528903 -6827872 -7399776 -6466128 -3790098
9470 -3790098 270093 2631599 2487511 4323756 10679533 16084945 14250602 7619739
9462 7619739 3338704 3168280 4395658 7268787 12926706 16293948 10929448 756823
9454 756823 -2723830 3917689 12321942 15592599 15262233 12695559 5126766 -4333396 -4200638
9445 -4200638 9130020 22080238 21451474 13719066 14503065 24265442 28729996 21733797
9437B1733797q525159r07385L001986j65307k594291r19655J96322j395299k787840
9428G637169l493116n578131o854565l155281K914615M316594O16150j691781
9420e288346J49166K484030L318943M538072N467887K722839k397396m468801
9412F526394k973146k658423m133666l049337L47176Q43211r20752J424725O215396
9403A621578L229808p517755j0699711R42682J1766463N846822o975059o149412
9395g934584N705375O420104q376597j5167361J394576K2245369J9640079l475903
9387B0451058j8599827j1015907M587367R054742K640870k873492l270951k586283
9379a612423k008742P77925M029182L392821J74653l55105J027258k129217r961288
$$ plain form
9437 21733797 13208638 12301253 15303239 15137932 12543641 11623986 11820308 10425009 7637169
9428 7637169 4144053 -1434078 -8288643 -11443924 -8529309 -4212715 -3596565 -5288346
9420 -5288346 -5139180 -2655150 663793 5201865 10669752 13392591 10995195 6526394
9412 6526394 3553248 894825 -3238841 -6288178 -5941002 -5097791 -6018543 -4593818 1621578
9403 1621578 4851386 -2666369 -13366080 -12423398 -656935 5189887 -1785172 -7934584
9395 -7934584 -2229209 4190895 -4185702 -19353063 -17958487 4286882 23926961 20451058
9387 20451058 1851231 -9164676 -4577309 4477433 7118303 4244811 973860 -1612423
9379 -1612423 -3621165 -2843240 1185942 4578763 4753416 4398311 5425569 3296352 -6664936
9370f664936j3402411p016092K899812P894000Q195984Q112096O964908K231702
9362I215063k900387l455985j390395k332248n313377l796677L363698R368765
9354B758457Q690505K990141k849151n819550n787642n158819o310627o341167
9346a7827853J241074J4423259J8844578N731751j1626142j2594039J745532R329063
9338I267223j316315j5505844j4498859k09722J1177888J1128634M634598m72467
9330D205136j688734j282169k331468m387165k941864L354025P296841K081337
9322D305939o690131p849758j790526J486569L63158K399345O340181J494233
9314E9010j0524160j2925024p45930Q883634M754661p2651O762820J2970208L031495
$$ plain form
9370 -6664936 -20067347 -27083439 -24183627 -16289627 -8093643 18453 6983361 9215063
9362 9215063 6314676 2858691 1468296 -863952 -6177329 -9974006 -6610308 2758457
9354 2758457 11448962 14439103 11589952 5770402 -17240 -5176059 -11486686 -17827853
9346 -17827853 -16586779 -2163520 16681058 22412809 10786667 -1807372 -61840 9267223
9338 9267223 7950908 -7554936 -22053795 -22263517 -11085629 43005 4677603 4205136
9330 4205136 2516402 1234233 -1097235 -5484400 -8426264 -5072239 2224602 4305939
9322 4305939 -2384192 -10233950 -12024476 -10537907 -10174749 -7775404 -1435223 59010
9314 59010 -10465150 -23390174 -24136104 -15252470 -10497809 -10570460 -3807640 9162568 12194063
9305A2194063j2335661j1834522K515230J1295013R366272P317374P122717J341422
9297B6981908o398465m840492J851070j258611j1795380j1562147J467905Q243319
9289B689107J014334m917117r0911L487153k883238p787640k076272L329318j595646
9280h830912o644455j230109M163793k921731j1456840l719718J3338218J7596018
9272B94264O151169l233392k124897k61773l658057m725710J260017O959235O186965
9263F847821K864752J267132j068588n268856o153373j183570L696173K602585
9255C604076k106764m514705k827407Q75847L914253L629545q03945n331928m078496
9246g639524K929844Q870849Q035527J415205n653399q193662m810150M02784
$$ plain form
9305 12194063 -141598 -11976120 -9460890 1834123 11200395 18517769 25640486 26981908
9297 26981908 20583443 15742951 17594021 16335410 4540030 -7022117 -5554212 2689107
9289 2689107 3703441 -1213676 -1304587 2182566 -700672 -8488312 -10564584 -7235266 -8830912
9280 -8830912 -15475367 -16705476 -12541683 -15463414 -26920254 -30639972 -17301754 294264
9272 294264 6445433 3212041 1087144 825371 -2832686 -7558396 -6298379 660856 6847821
9263 6847821 9712573 10979705 9911117 4642261 -1511112 -2694682 1001491 3604076
9255 3604076 1497312 -3017393 -5844800 -4968953 -1054700 2574845 1770900 -3561028 -7639524
9246 -7639524 -4709680 4161169 12196696 13611901 7958502 -235160 -5045310 -4642526
9238d642526J049265k842211k990086M822579J1608021P162350k917144m183869
9230G066379M091489P311241j004894q530238l776608O110481P611254J629902
9222B0509006m51606L753394N108825j120645q214550q805853m117288L77378
9214G038661J896272K63926l426588n369002j575400N143806O014147j994783
9206G991039j0389921j0253771m449032j757972k454134Q62142Q704429J1591358
9198a55862M722082l796885n218730k382086j907596j581719L876855R614427
9190C170486O128033l730624o852575m58234L126849l018650q352063j764180
9182a1750958J0275969J3411821N790222k650863o218811p140172o082150p84718
$$ plain form
9238 -4642526 -3593261 -6435472 -9425558 -4602979 7005042 14167392 11250248 7066379
9230 7066379 11157868 18469109 17464215 8933977 5157369 11267850 18879104 20509006
9222 20509006 20057400 23810794 28919619 27798974 19584424 10778571 6661283 7038661
9214 7038661 8934933 9198859 5772271 403269 -1172131 3971675 9985822 7991039
9206 7991039 -2398882 -12652653 -17101685 -18859657 -21313791 -20451649 -11747220 -155862
9198 -155862 4566220 769335 -4449395 -6831481 -8739077 -10320796 -6443941 3170486
9190 3170486 9298519 5567895 -1284680 -1742914 1383935 -1634715 -9986778 -11750958
9182 -11750958 -1474989 11936832 17727054 15076191 8857380 1717208 -4364942 -5149660
9174e149660N863522O638701N52528n378133o352414m616529k901208l02610L240068
9165h405735M888008L875359L068218L351039J791494k158053l846157j33182
9157B430991N123778N777140R02108n146703q080802o763434k503685K553138
9149e707469O371374P057828K999671m802428j0436625p329939K876708J0182764
9141A211884Q580878L650343K899869M268688J692358l087400l998816k177176
9133A3040628l026370m362018M7078O281382L713920o228083r715552k457045
9125b706060L494837Q65738j044723M715751P717998j919872j3313403r619351
9117a1809085N362821J3057848P522474l38578l181666m463286n457956j937242
$$ plain form
9174 -5149660 713862 7352563 7905091 2526958 -3825456 -8441985 -11343193 -11645803 -8405735
9165 -8405735 -3517727 357632 3425850 6776889 8568383 6410330 2564173 2430991
9157 2430991 7554769 13331909 14234017 9087314 1006512 -5756922 -8260607 -5707469
9149 -5707469 663905 7721733 10721404 5918976 -4517649 -11847588 -8970880 1211884
9141 1211884 9792762 13443105 16342974 20611662 22304020 19216620 15217804 13040628
9133 13040628 10014258 5652240 5699318 11980700 15694620 9466537 -249015 -2706060
9125 -2706060 788777 1654515 609792 5325543 13043541 11123669 -2189734 -11809085
9117 -11809085 -6446264 6611584 14134058 13795480 10613814 6150528 692572 -1244670
9109a244670L780613K908551l902781n155985K272731O725080R96692n780949
9101E99282m100287O78351j88541k908652M42891N701429L001106n258823p017647
9092i050891L01139O273743L961668j746085m747914o043764p024322l625237
9084b1701663O099265J4605066J2553600J498509p192052n828306J541160N424825
9076G000404K251652k745325l288485n0575J360121q18008k119186K72520K105264
9067C968382j187244n987050m959550J597964N638610K821055k374445m327450
9059d809728k868902M8089M075846P315829N171918k674952q715538o769487j199317
9050a0426242o06051m785899n354684J022785P511252P193252K130539j003151
$$ plain form
9109 -1244670 2535943 5444494 1541713 -3614272 -1341541 5383539 6380231 599282
9101 599282 -3501005 -2822654 -3011195 -5919847 -5476956 224473 3225579 -2033244 -9050891
9092 -9050891 -8749752 -2476009 1485659 -260426 -5008340 -11052104 -18076426 -21701663
9084 -21701663 -15602398 -997332 11556268 13054777 5862725 34419 1575579 7000404
9076 7000404 9252056 6506731 3218246 3167671 4527792 3709784 1590598 1863118 3968382
9067 3968382 2781138 -3205912 -8165462 -6567498 -928888 1892167 -482278 -4809728
9059 -4809728 -7678630 -7630541 -3554695 3761134 8933052 6258100 -2457438 -9226925 -10426242
9050 -10426242 -11032293 -15818192 -21172876 -20150091 -12638839 -5445587 -3315048 -4318199
9042d318199K44449L519531O441733P502212M404988l431614j1073150j1571612
9034h281662m657833J869706J817555j456482m28398N257233Q077067L815646
9026F012832k052813k677781k41309j992789p552427p806147J155845R723533
9018e431056O497833m944757q752013K456100J6087002J4171552l173787j5945661
9010I65213q467931J0146885J6627278L041846j3433562j3813492j509817N660671
9002g82909J822317j607790L431483R475795P246727R0095l577187l625109m535171
8993G938251n095188k180676K94511k511407n009097J589062J2342138J2426863
8985A9794457o82875j1997810j0039311j272905K354498j90510k628641k696947
$$ plain form
9042 -4318199 -4073750 -554219 5887514 13389726 17794714 14363100 3289950 -8281662
9034 -8281662 -12939495 -11069789 -9252234 -10708716 -11137114 -5879881 2197186 6012832
9026 6012832 3960019 1282238 1040929 -951860 -8504287 -16310434 -15154589 -5431056
9018 -5431056 1066777 -3877980 -12629993 -10173893 5913109 20084661 16910874 965213
9010 965213 -7502718 2644167 19271445 22313291 8879729 -4933763 -6443580 -782909
9002 -782909 1039408 -568382 2863101 12338896 19585623 19675718 16098531 12473422 7938251
8993 7938251 2843063 662387 956898 -1554509 -6563606 -4974544 7367594 19794457
8985 19794457 19111582 7113772 -2925539 -4198444 -1843946 -2034456 -4663097 -7360044
8977g360044j351843K654709Q636587R600738R84973r803079j1310793l293514
8969a1242266M140833N163064L579098L399670K327427k383013p278986o178515
8961h472688J661136R540933R734088J739990o425374o818245r11852L004440
8953C052428J530632l96029P01982R21024k461386l625762K729877J0032644P419705
8944A9905115l251504q258435j278417P279462M583678p109094j3221796n260050
8936f611041Q487820J2505895K667201q321462o652523M533480R340690R07973
8928A6858033r753064r871314j089507O311847P404332L412291m009124j0426677
8920a163183p633279M563185J2159109M695122p024976n564303N789072Q021185
$$ plain form
8977 -7360044 -8711887 -6057178 2579409 12180147 13165120 3362041 -7948752 -11242266
8969 -11242266 -7101433 -1938369 1640729 5040399 7367826 4984813 -2294173 -8472688
8961 -8472688 -6811552 2729381 12463469 14203459 7778085 959840 47988 3052428
8953 3052428 4583060 4187031 4889013 5810037 3348651 -277111 2452766 12485410 19905115
8944 19905115 16653611 8395176 7116759 14396221 18979899 11870805 -1350991 -6611041
8936 -6611041 1876779 14382674 17049875 8728413 2075890 6609370 15950060 16858033
8928 16858033 7104969 -2766345 -3855852 2455995 9860327 13272618 9263494 -1163183
8920 -1163183 -8796462 -4233277 7925832 12620954 5595978 31675 5820747 13841932
8912A3841932l025788j0767314n260230L024179L439149J147592L162754M265568
8904I827842j204819o640003m923761j683524l789955m920253L066973J3030335
8896B762835J2465872M246002J319381M686573L206810n662171j0963302o307577
8888E754423P96482J796515j386563k236131Q10901M489739N034589Q39234m880916
8879A1018273n453779k142K504689l750469r467544l032182Q620180P563997o824096
8870A176927j4561276m615802R231570J0855677M709733L474688N171126q49987
8862A4592656j1903006j3504810k239871P953222N538635m185751r359969p347607
8854b0456501l692011r86070L545369J0374518J3596799P299435n700261j4453170
$$ plain form
8912 13841932 10816144 48830 -5211400 -2187221 1251928 2399520 5562274 9827842
8904 9827842 8623023 1983020 -2940741 -4624265 -8414220 -13334473 -10267500 2762835
8896 2762835 15228707 19474709 20794090 25480663 28687473 23025302 12062000 5754423
8888 5754423 6550905 8347420 6960857 4724726 5535627 10025366 15059955 15899189 11018273
8879 11018273 5564494 5562352 8067041 4316572 -5150972 -8183154 437026 8001023 1176927
8870 1176927 -13384349 -18000151 -8768581 2087096 6796829 10271517 15442643 14592656
8862 14592656 2689650 -10815160 -13055031 -5101809 436826 -3748925 -13108894 -20456501
8854 -20456501 -24148512 -25134582 -21589213 -11214695 2382104 9681539 3981278 -10471892
8846a0471892j0834627J262643J0290617J0390418O715160O212840P647702M900193
8838B6113054k690777q931989r571460p316316o101892m327798K169167J1537631
8830H79620J4796770N825559r455117j7600765j2042817Q2380P183518O152126
8822d178726K856638K404249L948549M570159L263858J89814l847230n982021
8814C225290l187225K921870O506650M155643j655408o228282o414667j028380
8806a704509P371240J0756348K595643j0976447j4393240k145056J1515661R623693
8798A2643333n440564j5659991j0962423K02130M786221J256945k191008q5070
8790a5450427M877467P091830M881973J585055J332716M508186P408472O027168
$$ plain form
8846 -10471892 -21306519 -20043876 -9753259 637159 7352319 13565159 21212861 26113054
8838 26113054 23422277 14490288 4918828 -2397488 -8499380 -12827178 -10658011 879620
8830 879620 15676390 21501949 12046832 -5553933 -17596750 -17514370 -10330852 -4178726
8822 -4178726 -1322088 1082161 5030710 9600869 12864727 13054541 9207311 3225290
8814 3225290 38065 2959935 9466585 13622228 11966820 5738538 -676129 -1704509
8806 -1704509 5666731 16423079 19018722 8042275 -6350965 -8496021 3019640 12643333
8798 12643333 7202769 -8457222 -19419645 -19217515 -14431294 -13174349 -15365357 -15450427
8790 -15450427 -10572960 -3481130 1400843 2985898 4318614 8826800 16235272 22262440
8782B2262440l13968q263810j1975795o932611M238205J0870000M873688p260270
8774G497879j0392262j237779N986839M98536q007160m503486O259339N777788
8766A879694q419934j6593701n772763J0578999J2374562R45856o155351j535339
8758a2697977N583063P165420O191399O195262L426420m335559j0072219o640615
8750e184806J637771M492864J29130l624440j978367Q04780K69093k13951M424056
8741G56130J0808055J0034623M83474q482408p992726l42224N250100M159773
8733A4674797o96950m990310o625398m195321K171462P541031N596669k416990
8725A1058990p518728m721920N65047J925878J618502M247719O085774K92408
$$ plain form
8782 22262440 21948472 13684662 1708867 -5223744 -985539 9884461 14758149 7497879
8774 7497879 -2894383 -4132162 1854677 2353213 -5653947 -10157433 -3898094 1879694
8766 1879694 -6540240 -23133941 -28906704 -18327705 -5953143 -5007287 -11162638 -12697977
8758 -12697977 -7114914 50506 6241905 12437167 15863587 11528028 1455809 -5184806
8750 -5184806 -3547035 945829 1074959 -2549481 -4527848 -3723068 -3453975 -3667926 756130
8741 756130 11564185 21598808 22082282 13599874 5607148 5264924 10515024 14674797
8733 14674797 13977847 8987537 2362139 -1833182 338280 7879311 13475980 11058990
8725 11058990 3540262 -1181658 -616611 1309267 2927769 7175488 13261262 13553670
8717A3553670r630537j2379360n518110R35902M82001q04562L283256P420731
8709b657009M205204k164930k252142K981405L963708j718254n972090l284047
8701f898155K117376M056130J646460l076241p647728p748925o08355Q320047
8693i839391R408031J545968o541410q848124o949268j138956J0913064K2277026
8685A0826940J7748047l840532k0939455j5794905O73477N544835l154826q332437
8677a7268856l429309O09217j821171j736388N510497J0163252N496334J23610
8669b352814K464807N624056j29366r539896j0120458j581051M855990L234239
8661g544493j695695m024643k700495J066523N066455N427764N06344n568150
$$ plain form
8717 13553670 3923133 -8456227 -13974337 -13038435 -12556434 -13360996 -10077740 -2657009
8709 -2657009 1548195 -616735 -2868877 112528 4076236 2357982 -3614108 -6898155
8701 -6898155 -4780779 -724649 921811 -2154430 -9802158 -17551083 -18159438 -9839391
8693 -9839391 -431360 1114608 -5426802 -14274926 -21224194 -22363150 -11450086 10826940
8685 10826940 28574987 24734455 3795000 -11999905 -11326428 -5781593 -8936419 -17268856
8677 -17268856 -20698165 -20088948 -21910119 -23646507 -18136010 -7972758 -2476424 -2352814
8669 -2352814 111993 5736049 5606683 -3933213 -14053671 -15634722 -10778732 -7544493
8661 -7544493 -9240188 -13264831 -15965326 -14898803 -9832348 -4404584 -3898240 -9466390
8653i466390p688833n896947k694331J950474P766217J0499837P404512K950859
8645D825398K540075L820082J217355m034880o156680m681060l808360l469295
8637i747365K32149N828549O452458N57980m811759l904843O99041L451458L013402
8628A771070J336569j84788p50541O41445L293664L771331r32268r072511j3833206
8619a3959235q949739L485134J2357093Q913275j665044n820155R25464R527308
8611D814101J1821858R678939N978575k141101j3424240j6988354p630805K749962
8603e141065J838216l346283J530015J3053904J4698829L319393p069381p788602
8595A1095026m525728k526370M01064L339264J052676l102677O56790R314591
$$ plain form
8653 -9466390 -17155223 -23052170 -25746501 -23796027 -16029810 -5529973 1874539 4825398
8645 4825398 7365473 11185555 12402910 8368030 2211350 -2469710 -6278070 -9747365
8637 -9747365 -9515216 -3686667 2765791 3323771 -1487988 -5392831 -4693790 -1242332 1771070
8628 1771070 3107639 2922851 2172310 2813755 6107419 9878750 8946482 -126029 -13959235
8619 -13959235 -22908974 -19423840 -7066747 1846528 181484 -5638671 -4713207 4814101
8611 4814101 16635959 26314898 32293473 30152372 16728132 -260222 -7891027 -5141065
8603 -5141065 -3302849 -6649132 -5119117 7934787 22633616 25953009 18883628 11095026
8595 11095026 6569298 4042928 4443992 7783256 8835932 5733255 6390045 15704636
8587A5704636P433970o958970j4951979m863071Q965745P860667m927618j3303399
8579e040019j1827157o011139J142496Q629424J0937621N300934o55809r604J630262
8570D097009l117763q628391n585090J751256K357755k279287j025994P087575
8562e342930J0676708L900292n872398r499821n399748K817225R578417R133419
8554I991164J969830k837915M46864M132681j346686j0529926j0033950L73061
8546g834877P545833N331975J491525K350271L172100j791609r265351j1858593
8538a0858726p052624J407487O958172N296152j9681r2246O341681Q433579o45487
8529I768307j0542227q069846K032219M995495l98305k518621J721256L763082
$$ plain form
8587 15704636 23138606 16179636 1227657 -3635414 5330331 13190998 8263380 -5040019
8579 -5040019 -16867176 -22878315 -21735819 -13106395 -2168774 3132160 2476351 2466747 4097009
8570 4097009 979246 -7649145 -13234235 -11482979 -9125224 -11404511 -12430505 -5342930
8562 -5342930 5333778 9234070 3361672 -6138149 -11537897 -8720672 857745 9991164
8554 9991164 11960994 9123079 9569943 13702624 12355938 1826012 -8207938 -7834877
8546 -7834877 -289044 5042931 6534456 8884727 12056827 10265218 999867 -10858726
8538 -10858726 -17911350 -16503863 -9545691 -4249539 -4269220 -4361466 1980215 10413794 9768307
8529 9768307 -773920 -8843766 -6811547 -1816052 -2214357 -4732978 -3011722 751360
8521G51360J206034R57298L263721K01034p254986q154364j139865K534199k77166
8512g912735M86471O966146P217039j644131m689896N002152J1787133L260810
8504B0472989q046726o269280J206658j059182q729845p400505M27349J652390
8496g746152j324906M710751J6244680J4799928k295611j5498762j2196989k464980
8488e772041P85475n44554l23933n72275l004799j278625P060238J1450416L183249
8479A0983151q713551r375591n99560K407971m674568q502625L82488J1381984
8471f710301Q783319m113693q630673J907367J1718271N785902p650770r854556
8463h765134P5427N517881l47451m959174J233398R047806O659998j703182m812086
$$ plain form
8521 751360 1957394 2914692 6178413 6379447 -875539 -9029903 -10169768 -7635569 -7912735
8512 -7912735 -7426264 -460118 6756921 5112790 422894 5425046 17212179 20472989
8504 20472989 12426263 6156983 7363641 6304459 -2425386 -9825891 -9398542 -7746152
8496 -7746152 -9071058 -4360307 11884373 26684301 24388690 8889928 -3307061 -5772041
8488 -5772041 -4986566 -5531120 -5855053 -6427328 -9432127 -10710752 -3650514 7799902 10983151
8479 10983151 2269600 -7105991 -7705551 -5297580 -9972148 -18474773 -18092285 -6710301
8471 -6710301 2073018 -2040675 -10671348 -8763981 2954290 8740192 1089422 -8765134
8463 -8765134 -8689707 -3171826 -3519277 -8478451 -7245053 1802753 8462751 6759569 1947483
8454A947483j907758J069621L836994P365405N169008o452400j5960646j0298234
8446a5230527L376416O383316l497205j0143020n065985K524427M383815M759537
8438a2509226P636865P859722K596654j280203N94587J752827k895967o746929
8430b991670k543773M729484N501847p4052m078938k449851K316277N812086L708976
8421I930386n690100j5857125j5206489j662267J2098185J4049959P033331R39587
8413E635467k018702n118029o187910k14358R343240J2251459M962484n381923
8405A3271728j0883666j0337054o414424j434345K891351N677025P424865P824289
8397H019769M647359j885065o379543m584087J6977J156141j019258j685197k06623
$$ plain form
8454 1947483 39725 1109346 4946340 12311745 17480753 11028353 -4932293 -15230527
8446 -15230527 -11854111 -5470795 -8968000 -19111020 -24177005 -21652578 -17268763 -12509226
8438 -12509226 -4872361 2987361 5584015 4303812 4898399 6651226 3755259 -2991670
8430 -2991670 -5535443 -805959 4695888 4621836 542898 -1906953 409324 6221410 9930386
8421 9930386 4240286 -11616839 -26823328 -28485595 -16387410 -2337451 4695880 5635467
8413 5635467 3616765 -1501264 -7689174 -7903532 1439708 13691167 18653651 13271728
8405 13271728 2388062 -7948992 -14363416 -15797761 -12906410 -7229385 195480 8019769
8397 8019769 12667128 10782063 4402520 -181567 -164590 991551 -27707 -1712904 -1919527
8388a919527j63002j378136M18466N166492O979059L195493j390936k058319k37311
8379H612279J030183K226180L822218K486706l656021r217430p305967p4323K619133
8370E42958l687794j1272977r616599J276638J0757322J0206862K348349l573313
8362c018554l357254j159300j608037l070659j730653Q88876M2191l147313j415999
8353a7576702P014365J2737718P047887m648835r230159l831515J823565J679009
8345d984667J349886N600356Q407252L905432j497132O05572M638269n32619j0541753
8336F950596r399996M347064J2380428L544115r612109j0928478l671665o10989
8328g001034j911520J396532Q373034Q905847J320567n330898o546819o785230
$$ plain form
8388 -1919527 -2082529 -3460665 -3042199 2124293 9103352 12298845 10907909 8849590 8612279
8379 8612279 9642462 11868642 15690860 18177566 14521545 5304115 -2001852 -2076175 542958
8370 542958 -3144836 -14417813 -24034412 -22757774 -12000452 -1793590 554759 -3018554
8362 -3018554 -6375808 -7535108 -9143145 -12213804 -13944457 -13055581 -13013390 -16160703 -17576702
8353 -17576702 -10562337 2175381 9223268 4574433 -4655726 -8487241 -6663676 -4984667
8345 -4984667 -3634781 1965575 10372827 14278259 12781127 13386699 18024968 17492349 6950596
8336 6950596 -2449400 1897664 14278092 17822207 8210098 -2718380 -6390045 -7001034
8328 -7001034 -8912554 -7516022 857012 9762859 11083426 5752528 -794291 -7579521
8320g579521p435578l057326O900061J3334767R423288k80238o802729o889141
8312b386417l212186L61307J395389P21562K119113O389426P635160J076540p874262
8303F225632r621334l424927L425119P079024Q641036O681797o51891p139393
8295A1215063m226014M221712N191703l708865j0058497n213665M499040Q884522
8287A0804999N727739j504808p703102o180575M136930J1140428K848963j1395332
8279G875242j0448380N490835J2110487j716785j6175378j2446658r81598j14674
8271a6406909m824065Q62416J3151883J4254097K375746o079677k011137O985603
8263H307957J1618913R898333K396387q023998j3495052r655198l303235j209255
$$ plain form
8320 -7579521 -15015099 -18072425 -11172364 2162403 11585691 11305453 4502724 -2386417
8312 -2386417 -5598603 -5237296 -3841907 -3120345 -1001232 5388194 13023354 14099894 6225632
8303 6225632 -3395702 -6820629 -3395510 3683514 12324550 19006347 18354456 11215063
8295 11215063 6989049 11210761 16402464 12693599 2635102 -2578563 1920477 10804999
8287 10804999 16532738 15027930 7324828 1144253 5281183 16421611 19270574 7875242
8279 7875242 -2573138 2917697 15028184 13311399 -2863979 -15310637 -16292235 -16406909
8271 -16406909 -21230974 -20368558 -7216675 7037422 9413168 3333491 1322354 8307957
8263 8307957 19926870 29825203 32221590 24197592 10702540 1047342 -2255893 -3465148
8255c465148J475105R102914J1615645P3622j2585879p626339Q174721J0782815
8247A7547456l473680j3235420p172381J091797k34739k639983L338433R788282
8239E009765O174794k046394l122579K967428P555487O161059n46442j0518989
8231A1634129j7465576j2956116Q76067R367494M138121m396799k104778Q641956
8223b265502J3652110O865703l896623q886202o560642k240295j364820m064481
8215h760752m886884M96371Q293497R817522K214774p495998r617126r71005J1504618
8206E95017J4997103L686436j0364758q253376Q650488J5588040q00069j9377374
8198D721507j4348210N098042J0113817j765799o572770K428081M840172p317578
$$ plain form
8255 -3465148 -1990043 7112871 18728516 18802138 6216259 -1410080 6764641 17547456
8247 17547456 14073776 838356 -6334025 -5242228 -5476967 -8116950 -4778517 5009765
8239 5009765 11184559 9138165 6015586 8983014 16538501 22699560 22153118 11634129
8231 11634129 -5831447 -18787563 -17911496 -8544002 -4405881 -8802680 -10907458 -2265502
8223 -2265502 11386608 18252311 14355688 5469486 -1091156 -3331451 -4696271 -8760752
8215 -8760752 -13647636 -13151265 -4857768 4959754 7174528 -321470 -9938596 -10909601 595017
8206 595017 15592120 19278556 8913798 660422 9310910 24898950 24098881 4721507
8198 4721507 -9626703 -4528661 5585156 3819357 -2753413 -325332 4514840 -2802738
8190b802738j3501311j109713J1906023Q436505j44842J896577O303895l02118
8182A0682278r066497n397213L129530Q63148o702350l516814P114267Q912482
8174F018831J946923M74455N832200N582981k219803o317303l431503j844756
8166F042025l822633l430826j703557n343183j0231082m934071Q353146J4579939
8158d90242R193176L062742K131676N6128n560042p063876j810533K324200J485832
8149C329061J383121L711909J597574o066965r654294m268551K424408L770734
8141c773003L575491N912268O843741L013106j252398j822320j584179m075129
8133F837577p264719p448625l357421M562383J2175151J0827498j695379j1997144
$$ plain form
8190 -2802738 -16304049 -17413762 -5507739 2928766 2783924 4680501 10984396 10682278
8182 10682278 1615781 -3781432 -651902 211246 -6491104 -10007918 -2893651 6018831
8174 6018831 7965754 8440209 14272409 19855390 17635587 11318284 7886781 6042025
8166 6042025 2219392 -1211434 -2914991 -8258174 -18489256 -23423327 -15070181 -490242
8158 -490242 8702934 11765676 13897352 13953480 8393438 1329562 -480971 1843229 3329061
8149 3329061 4712182 8424091 10021665 3954700 -5699594 -9968145 -7543737 -3773003
8141 -3773003 -197512 5714756 12558497 15571603 14319205 12496885 10912706 6837577
8133 6837577 -427142 -7875767 -11233188 -6670805 5504346 16331844 14636465 2639321
8125B639321o035754Q252821R282148o231749j7348731r613993N682179J1128802
8117b244956O878774M060132N933922O631932J846302o862327j3437828j0232897
8109g426946L243812J4231307R905857l470166q000490q52701L332883j264189
8101I699367k899765M124827P789882M10130o972540m699633r61246m218824o633137
8092d360939q77965L359324k146634n097128O772463J9789751J3040639o913868
8084B3565643j5311878p146415k13846k648840l358136K759471M545496l251568
8076a060073q243498j119674P999272N609858m195366o755159J507421Q946920
8068B689701M839079o939527j2272047l699506R456324J1984670K995344l245432
$$ plain form
8125 2639321 -3396433 4856388 14138536 7906787 -9441944 -19055937 -13373758 -2244956
8117 -2244956 4633818 8693950 14627872 21259804 23106106 16243779 2805951 -7426946
8109 -7426946 -4183134 10048173 19954030 16483864 8483374 7630673 10963556 9699367
8101 9699367 6799602 10924429 18714311 19124441 12151901 7452268 6491022 2272198 -4360939
8092 -4360939 -5238904 -1879580 -4026214 -9123342 -2350879 17438872 30479511 23565643
8084 23565643 8253765 1107350 893504 -1755336 -5113472 -2354001 2191495 -1060073
8076 -1060073 -9303571 -10423245 -2423973 3185885 -1009481 -7764640 -6257219 2689701
8068 2689701 7528780 589253 -11682794 -15382300 -5925976 6058694 9054038 5808606
8060E808606R41054N762278J839312l825817j733537K101559j865119o465178
8052B563158P93595J2571635J0028288o005886j4983226r065739k578839m203335
8044a0880349l023876P664902J3896948L422991j1635621j1692783J553835J0166499
8036e27454P057030J843790K148628L476996k80193o330692p296451j672928L560438
8027A979164J269445n466088n060124O612139J6668740J0432479o746876j5079502
8019D609377p789614J092499k71201n708535n421863k032075j621651o17656N770081
8010a1990638J1350211Q509169K434278K043273L330675k820405j0967859o891265
8002e002561P535577J3005909M33767j5290742j6214464l990979O549542P285900
$$ plain form
8060 5808606 6749660 12511938 14351250 10525433 8791896 10893455 9028336 2563158
8052 2563158 3356753 15928388 25956676 19950790 4967564 -4098175 -6677014 -10880349
8044 -10880349 -13904225 -6239323 7657625 11080616 -555005 -12247788 -10693953 -527454
8036 -527454 6529576 8373366 10521994 13998990 13718797 7388105 91654 -1581274 1979164
8027 1979164 3248609 -2217479 -7277603 -665464 16003276 26435755 19688879 4609377
8019 4609377 -3180237 -2087738 -2358939 -8067474 -13489337 -15521412 -17143063 -17760719 -11990638
8010 -11990638 -640427 7868742 10303020 12346293 15676968 12856563 1888704 -5002561
8002 -5002561 2533016 15538925 15972692 681950 -15532514 -19523493 -12973951 -5688051
$$ [...]
##END NTUPLES=NMR SPECTRUM
##END=
