##TITLE=31Pdec_MTBPA2610-2
 d2O, 24 sc
 27.10.2021
##JCAMPDX= 6.0         $$ Bruker NMR JCAMP-DX V2.0
##DATA TYPE= NMR SPECTRUM
##DATA CLASS= NTUPLES
##ORIGIN= UXNMR, Bruker Analytische Messtechnik GmbH
##OWNER= root
$$ XWIN-NMR		Version 3.5
$$ Wed Oct 27 10:53:25 2021 Russian Standard Time (UT+4h)  she@DPX200
##.OBSERVE FREQUENCY= 81.013821
##.OBSERVE NUCLEUS= ^31P
##.ACQUISITION MODE= SIMULTANEOUS
##.ACQUISITION SCHEME= undefined
##.AVERAGES= 24
##.DIGITISER RES= 16
##SPECTROMETER/DATA SYSTEM= spect
##.PULSE SEQUENCE= zgpg30
##.SOLVENT NAME= CDCl3
##.SHIFT REFERENCE= (INTERNAL, CDCl3, 0, 248.564)
##AUDIT TRAIL= $$ (NUMBER, WHEN, WHO, WHERE, WHAT)
$$ ##TITLE= Audit trail, XWIN-NMR		Version 3.5
$$ ##JCAMPDX= 5.01
$$ ##ORIGIN= Bruker BioSpin GmbH
$$ ##OWNER= she
$$ F:/spectra/data/she/nmr/P31/1/pdata/1/auditp.txt
$$ ##AUDIT TRAIL=  $$ (NUMBER, WHEN, WHO, WHERE, WHAT)
(   1,<2021-10-27 10:52:10.45 +0400>,<she>,<DPX200>,
      <created by zg, POWCHK disabled, PULCHK disabled
       configuration hash MD5:
       00 E9 B6 7A A2 85 ED C7 34 08 36 98 17 FE 4E 26
       data hash MD5: 32K
       30 8A 23 A9 9B A3 F6 70 DB 92 56 B7 CC 3E C5 45>)
(   2,<2021-10-27 10:52:15.85 +0400>,<she>,<DPX200>,
      <Start of raw data processing
       efp BC_mod = 2 LB = 1 FT_mod = 6 PKNL = 1 PHC0 = -9025.234 PHC1 = 536.4695 SI = 64K 
       data hash MD5: 64K
       93 08 8A 63 C6 32 0B 2C C4 3B AF 8D 11 AB 32 B0>)
(   3,<2021-10-27 10:52:45.35 +0400>,<she>,<DPX200>,
      <pk PHC0 = -1.796637 PHC1 = 0 
       data hash MD5: 64K
       85 73 88 76 39 57 69 9A 89 91 1F 64 AB 19 09 91>)
(   4,<2021-10-27 10:52:53.01 +0400>,<she>,<DPX200>,
      <abs ABSG = 5 
       data hash MD5: 64K
       E6 C8 FC 5F 5C 76 DE 1E 00 54 6F C9 9C 3F F4 E9>)
$$ ##END=
$$ 
$$ hash MD5
$$ E5 13 9E 5E 72 FF 97 25 7D 53 99 01 A6 E9 D1 90
##$RELAX= 
##$RELAX= 
##$RELAX= 
##$RELAX= 
##$RELAX= 
##$RELAX= 
##$RELAX= 
##$RELAX= 
$$ Bruker specific parameters
$$ --------------------------
##$DU= <F:/spectra>
##$EXPNO= 1
##$NAME= <P31>
##$PROCNO= 1
##$TYPE= <nmr>
##$USER= <she>
##$AMP= (0..31)
100 100 100 100 100 100 100 100 100 100 100 100 100 100 100 100 100 100 
100 100 100 100 100 100 100 100 100 100 100 100 100 100 
##$AQSEQ= 0
##$AQ_mod= 1
##$AUNM= <au_zg>
##$AUTOPOS= <>
##$BF1= 81.014009
##$BF2= 200.13
##$BF3= 200.13
##$BF4= 200.13
##$BF5= 200.13
##$BF6= 200.13
##$BF7= 200.13
##$BF8= 200.13
##$BYTORDA= 1
##$CFDGTYP= 0
##$CFRGTYP= 5
##$CHEMSTR= <none>
##$CNST= (0..31)
1 1 145 1 1 1 1 1 1 1 1 1 1 1 1 1 1 1 1 1 1 1 1 1 1 1 1 1 1 1 1 1 
##$CPDPRG= <waltz16>
##$CPDPRG1= <>
##$CPDPRG2= <waltz16>
##$CPDPRG3= <>
##$CPDPRG4= <mlev>
##$CPDPRG5= <mlev>
##$CPDPRG6= <mlev>
##$CPDPRG7= <mlev>
##$CPDPRG8= <mlev>
##$CPDPRGB= <>
##$CPDPRGT= <>
##$D= (0..31)
0 1 0 0 0 0 0 0 0 0 0 0.03 2e-05 3e-06 0 0 0 0 0 0 0 0 0 0 0 0 0 0 0 0 
0 0 
##$DATE= 1635317529
##$DBL= (0..7)
120 120 120 11 120 120 24 19 
##$DBP= (0..7)
150 150 150 150 150 150 150 150 
##$DBP07= 0
##$DBPNAM0= <>
##$DBPNAM1= <>
##$DBPNAM2= <>
$$ [...]
##$SUBNAM3= <"">
##$SUBNAM4= <"">
##$SUBNAM5= <"">
##$SUBNAM6= <"">
##$SUBNAM7= <"">
##$SUBNAM8= <"">
##$SUBNAM9= <"">
##$SW= 501.771253377433
##$SWIBOX= (0..15)
0 1 3 0 0 0 0 0 0 0 0 0 0 0 0 0 
##$SW_h= 40650.406504065
##$TD= 32768
##$TD0= 1
##$TE= 0
##$TE2= 300
##$TE3= 300
##$TEG= 300
##$TL= (0..7)
0 120 53 12 22 120 120 120 
##$TP= (0..7)
150 150 150 150 150 150 150 150 
##$TP07= 0
##$TPNAME0= <>
##$TPNAME1= <>
##$TPNAME2= <>
##$TPNAME3= <>
##$TPNAME4= <>
##$TPNAME5= <>
##$TPNAME6= <>
##$TPNAME7= <>
##$TPOAL= (0..7)
0.5 0.5 0.5 0.5 0.5 0.5 0.5 0.5 
##$TPOFFS= (0..7)
0 0 0 0 0 0 0 0 
##$TUNHIN= 0
##$TUNHOUT= 0
##$TUNXOUT= 0
##$USERA1= <user>
##$USERA2= <user>
##$USERA3= <user>
##$USERA4= <user>
##$USERA5= <user>
##$V9= 5
##$VALIST= <valist>
##$VCLIST= <CCCCCCCCCCCCCCC>
##$VD= 0
##$VDLIST= <DDDDDDDDDDDDDDD>
##$VPLIST= <PPPPPPPPPPPPPPP>
##$VTLIST= <TTTTTTTTTTTTTTT>
##$WBST= 1024
##$WBSW= 4
##$XGAIN= (0..3)
0 0 0 0 
##$XL= 0
##$YL= 0
##$YMAX_a= 2122
##$YMIN_a= -3309
##$ZGOPTNS= <>
##$ZL1= 120
##$ZL2= 120
##$ZL3= 120
##$ZL4= 120
##$ABSF1= 248.5645
##$ABSF2= -253.2056
##$ABSG= 5
##$ABSL= 3
##$ALPHA= 0
##$AQORDER= 0
##$ASSFAC= 0
##$ASSFACI= 0
##$ASSFACX= 0
##$ASSWID= 0
##$AUNMP= <proc_1d>
##$AZFE= 0.1
##$AZFW= 0.5
##$BCFW= 0
##$BC_mod= 2
##$BYTORDP= 0
##$COROFFS= 0
##$CY= -3
##$DATMOD= 1
##$DC= 0
##$DFILT= <>
##$DTYPP= 0
##$F1P= 0
##$F2P= 0
##$FCOR= 1
##$FTSIZE= 65536
##$FT_mod= 6
##$GAMMA= 0
##$GB= 0
##$INTBC= 1
##$INTSCL= 5.30512e-09
##$ISEN= 30
##$LB= 1
##$LEV0= 0
##$LPBIN= 0
##$MAXI= 10000
##$MC2= 0
##$MEAN= 0
##$ME_mod= 0
##$MI= 50
##$NCOEF= 0
##$NC_proc= -7
##$NLEV= 6
##$NOISF1= 182.463
##$NOISF2= 159.3651
##$NSP= 0
##$NTH_PI= 0
##$NZP= 0
##$OFFSET= 248.5645
##$PC= 4
##$PHC0= -9027.031
##$PHC1= 536.4695
##$PH_mod= 1
##$PKNL= yes
##$PPARMOD= 0
##$PSCAL= 0
##$PSIGN= 0
##$REVERSE= no
##$SF= 81.014009
##$SI= 65536
##$SIGF1= 159.3651
##$SIGF2= -187.1042
##$SINO= 113.3802
##$SIOLD= 16384
##$SREGLST= <1H.CDCl3>
##$SSB= 0
##$STSI= 65536
##$STSR= 0
##$SW_p= 40650.406504065
##$SYMM= 0
##$S_DEV= 0
##$TDeff= 32768
##$TDoff= 0
##$TI= <>
##$TILT= no
##$TM1= 0
##$TM2= 0
##$TOPLEV= 0
##$USERP1= <user>
##$USERP2= <user>
##$USERP3= <user>
##$USERP4= <user>
##$USERP5= <user>
##$WDW= 1
##$XDIM= 65536
##$YMAX_p= 100391241
##$YMIN_p= -310118273
$$ End of Bruker specific parameters
$$ ---------------------------------
##NTUPLES= NMR SPECTRUM
##VAR_NAME=  FREQUENCY,     SPECTRUM/REAL,   SPECTRUM/IMAG
##SYMBOL=    X,             R,               I
##VAR_TYPE=  INDEPENDENT,   DEPENDENT,       DEPENDENT
##VAR_FORM=  AFFN,          ASDF,            ASDF
##VAR_DIM=   65536,         65536,           65536
##UNITS=     HZ,            ARBITRARY UNITS, ARBITRARY UNITS
##FACTOR=    0.620285442955139, 1,           1
##FIRST=     20137.2065510759, 0,            0
##LAST=      -20513.1999529892, 0,           0
##MIN=       -20513.1999529892, -310118273,  0
##MAX=       20137.2065510759, 100391241,    0
$$ Real data points
##PAGE= N=1
##DATA TABLE= (X++(R..R)), XYDATA
$$ [...]
##PAGE= N=2
##DATA TABLE= (X++(I..I)), XYDATA
$$ plain form
13159 1442895 728311 -1478915 -3054831 -2080633 641653 2900339 3680644 3564270 3426324
13150 3426324 3435287 2955188 1423895 -327154 -376549 1774801 3950921 3892624 2152821
13141 2152821 833326 520551 501734 996407 2601804 4093192 3503271 1225455 -546532
13132 -546532 -1288985 -2240771 -3065284 -1651880 2086201 5229506 5689870 4372703 2614859
13123 2614859 385579 -1700295 -1646056 671993 2139428 596222 -1809413 -1944567 -477358
13114 -477358 -502504 -2618461 -4289180 -3695136 -1751774 -272396 -32014 -770091 -1639413
13105 -1639413 -1605057 -550729 191881 -500488 -1723680 -1633754 -105626 1015048 359896
13096 359896 -1380092 -2522059 -2205036 -905917 288835 719355 710939 1119362 2301522
$$ packed form
13159A442895p14584k207226j575916R74198K722286K258686P80305j16374j37946
13150C426324Q963m80099j531293j751049m9395K151350K176120n8297j739803
13141B152821j319495l12775j8817M94673J605397J491388n89921k277816j771987
13132e46532p42453r51786q24513J413404L738081L143305M60364j317167j757844
13123B614859k229280k085874N4239K318049J467435j543206k405635j35154J467209
13114d77358k5146k115957j670719N94044J943362J479378K40382p38077q69322
13105a639413L4356J054328P42610o92369j223192Q9926J528128J120674o55152
13096C59896j739988j141967L17023J299119J194752M30520q416M08423J182160
$$ plain form
13087 2301522 3793306 4908921 5108992 3949019 1649692 -255607 -150196 1373552
13079 1373552 1791697 -87702 -2454863 -3016324 -1903276 -877464 -778542 -1177966 -1649715
13070 -1649715 -1833355 -939954 1141518 2691954 1835839 -748550 -2399882 -1847991 -507967
13061 -507967 -138840 -712415 -1248799 -1488995 -1705871 -1595318 -508875 1250843 2166592
13052 2166592 963075 -1794479 -3888912 -3541576 -1280967 666094 922931 349941 615928
13043 615928 2080830 3764324 4879074 5421667 5395672 4478157 2764625 1131064 388628
13034 388628 441450 631669 634935 638492 796550 955587 1009434 1157075 1496358 1567656 784014
13023 784014 -616942 -1504663 -983286 722610 2668886 4060176 4535328 4163991 3492893
$$ packed form
13087B301522J491784J115615K00071j159973k299327j905299J05411J523748
13079A373552M18145j879399k367161n61461J113048J025812R8922l99424m71749
13070a649715j83640Q93401K081472J550436q56115k584389j651332N51891J340024
13061e07967L69127n73575n36384k40196k16876J10553J086443J759718R15749
13052B166592j203517k757554k094433L47336K260609J947061K56837n72990K65987
13043F15928J464902J683494J114750N42593k5995r17515j713532j633561p42436
13034C88628N2822J90219L266L557J58058J59037N3847J47641L39283P1298p83642
13023G84014j400956q87721N21377J705896J946276J391290M75152l71337o71098
$$ plain form
13014 3492893 2994342 2172745 136563 -2445775 -3290987 -1547940 414819 42466 -1641073
13005 -1641073 -1626275 339593 1425722 278529 -1049985 -696815 210821 -42634 -821743
12996 -821743 -640983 42638 -338077 -1933956 -3674562 -5063491 -5999723 -5680626 -3567479
12987 -3567479 -871125 639435 850253 868579 1101409 1395490 2277975 4064037 5296571
12978 5296571 4242927 1683411 50625 -66282 -232142 -891522 -402097 1863957 3835057
12969 3835057 3511211 1638400 229366 -110538 43494 559417 1543433 2340009 2206508
12960 2206508 1443896 671409 -334680 -1695846 -1940995 669504 5109958 7522624 5198846
12951 5198846 -82055 -3682876 -3023261 -115059 1216965 66775 -808660 708084
$$ packed form
13014C492893m98551q21597k036182k582338q45212J743047J962759l72353j683539
13005a641073J4798J965868J086129j147193j328514L53170R07636k53455p79109
12996h21743J80760O83621l80715j595879j740606j388929r36232L19097K113147
12987c567479K696354J510560K10818J8326K32830K94081Q82485J786062J232534
12978E296571j053644k559516j632786j16907j65860o59380M89425K266054J971100
12969C835057l23846j872811j409034l39904J54032N15923R84016P96576j33501
12960B206508p62612p72487j006089j361166k45149K610499M440454K412666k323778
12951E198846n280901l600821O59615K908202J332024j150190q75435J516744
$$ plain form
12943 708084 2668808 1787114 -1220546 -1892783 1634222 5343098 4489832 18975 -3011374
12934 -3011374 -2228558 142153 1838206 3283392 4760498 4411899 1373636 -1641625
12926 -1641625 -1677676 250002 1070768 380419 59261 173786 -925439 -2494513 -1494516
12917 -1494516 2145806 4259102 2422396 -250159 -3489 1914717 2000660 511666 516012
12908 516012 2210340 2634042 889503 -520280 -128192 516721 289771 359820 1248099
12899 1248099 1367804 247859 57816 1798905 2977771 1669044 122658 1137427
12891 1137427 3133716 2571785 -247197 -1809013 -1156853 -1003091 -2749349 -4029130 -2439631
12882 -2439631 932377 3113055 2625769 310529 -1820472 -1949065 -8118 1797012
$$ packed form
12943G08084J960724q81694l007660o72237L527005L708876q53266m470857l030349
12934c011374P82816K370711J696053J445186J477106l48599l038263l015261
12926a641625l6051J927678Q20766o90349l21158J14525j099225j569074R99997
12917a494516L640322K113296j836706k672555K46670J918206Q5943j488994M346
12908E16012J694328M23702j744539j409783L92088O44913k26950P0049Q88279
12899A248099J19705j119945j90043J741089J178866j308727j546386J014769
12891A137427J996289n61931k818982j561816O52160J53762j746258j279781J589499
12882b439631L372008K180678m87286k315240k131001j28593J940947J805130
$$ plain form
12874 1797012 1334201 -629211 -1551710 -812043 -91272 -99886 354304 1436765 1332297
12865 1332297 -433539 -1418707 34637 1833855 1292302 -588075 -851129 548687 773671
12856 773671 -1154575 -2592404 -1097223 2111420 3776558 2495775 -137559 -1695595
12848 -1695595 -1326447 -97969 546742 361783 196468 626256 1372787 2057252 2503017
12839 2503017 2031603 -153737 -3068875 -3907063 -1355323 2193713 3472709 2365584
12831 2365584 996724 -256889 -2831981 -6062206 -6626039 -3341558 271565 439737
12823 439737 -1825777 -2682095 -1110999 302947 -136591 -885906 24556 2070101 3326494
12814 3326494 3040524 1910918 743575 -73974 -321188 -86743 127226 26232 -98492
$$ packed form
12874A797012m62811j963412r22499P39667P20771q614M54190J082461j04468
12865A332297j765836r85168J453344J799218n41553j880377k63054J399816K24984
12856G73671j928246j437829J495181L208643J665138j280783k633334j558036
12848a695595L69148J228478O44711j84959j65315M29788P46531O84465M45765
12839B503017m71414k185340k915138q38188K551740L549036J278996j107125
12831B365584j368860j253613k575092l230225n63833L284481L613123J68172
12823D39737k265514q56318J571096J413946m39538p49315R10462K045545J256393
12814C326494k85970j129606j167343q17549k47214K34445K13969j00994j24724
$$ plain form
12805 -98492 -73445 -437564 -1699842 -3308524 -3997379 -3116387 -1272406 278161 729184
12796 729184 422605 478610 1408670 2277921 1961447 1076253 1445750 3377423 4925062
12787 4925062 4657926 3733220 3903486 4671685 4186809 2235698 468675 -15658 473312
12778 473312 1547004 3043053 4047940 3618994 2705746 3284680 5113859 5570220 3622194
12769 3622194 1703961 2112333 3498334 3008133 584138 -1125808 -534594 1224516 2242969
12760 2242969 1842521 651032 -102639 534247 2069475 2586495 949941 -1460801 -2395976
12751 -2395976 -1664713 -1046301 -1552822 -2324116 -2378097 -2033006 -2038342 -2229240 -1679817 145115
12741 145115 2648659 4431953 4545116 3457837 2283725 1103024 -833381 -3031536
$$ packed form
12805i8492K5047l64119j262278j608682o88855Q80992J843981J550567M51023
12796G29184l06579N6005R30060Q69251l16474q85194L69497J931673J547639
12787D925062k67136r24706J70266P68199m84876j951111j767023m84333M88970
12778D73312J073692J496049J004887m28946r13248N78934J829179M56361j948026
12769C622194j918233M08372J386001m90201k423995j709946N91214J759110J018453
12760B242969m00448j191489p53671O36886J535228N17020j636554k410742r35175
12751b395976P31263O18412n06521p71294n3981L45091n336j90898N49423J824932
12741A45115K503544J783294J13163j087279j174112j180701j936405k198155
$$ plain form
12733 -3031536 -3566061 -1855740 102508 656299 898219 2244558 3363679 2202637 -137904
12724 -137904 -691540 727119 1357366 2384 -1432205 -1422381 -920475 -1106216 -1645172
12715 -1645172 -2126303 -2814675 -3063335 -1437886 1523913 3078448 1923986 -216373 -1575276
12706 -1575276 -2240549 -2060729 117747 3405081 4363016 1933234 -212654 942097 3036953
12697 3036953 2405355 87972 -353464 1126265 1769693 1297631 1705588 2646653 1945632
12688 1945632 442229 1223732 3647897 3384472 -363204 -2899687 -1434696 516049
12680 516049 -786127 -3245296 -2968176 -814846 -204790 -774780 677764 3927868 4912588
12671 4912588 1895730 -2021521 -3505715 -2848210 -2032046 -1703740 -1607259 -1942659 -2617487
$$ packed form
12733c031536n34525J710321J958248N53791K41920J346339J119121j161042k340541
12724a37904n53636J418659O30247j354982j434589R824N01906j85741n38956
12715a645172m81131o88372k48660J625449K961799J554535j154462k140359j358903
12706a575276o65273J79820K178476L287334R57935k429782k145888J154751K094856
12697C036953o31598k317383m41436J479729O43428m72062M07957R41065p01021
12688A945632j503403P81503K424165k63425l747676k536483J464991J950745
12680E16049j302176k459169K77120K153330O10056n69990J452544L250104R84720
12671D912588l016858l917251j484194O57505Q16164L28306R6481l35400o74828
$$ plain form
12662 -2617487 -2528476 -1071679 558731 790875 -311394 -1484563 -2112702 -2577073 -3060802
12653 -3060802 -3016932 -1978611 -290085 1253471 2224204 2737328 2895603 2497468 1640288
12644 1640288 1238742 2122609 3589128 3844916 2323176 591112 215472 652829 345128
12635 345128 -825610 -1566771 -1294766 -751433 -485140 -108620 590493 976899 547052
12626 547052 -265776 -760212 -802602 -651538 -541188 -675116 -1039223 -1124468 -582007 -189592
12616 -189592 -1103373 -2866609 -3412709 -1785605 250616 388168 -1263449 -2660459 -2744674
12607 -2744674 -2409153 -2564239 -2701906 -2033789 -1125990 -1464984 -3576135 -6148915 -7145890
12598 -7145890 -5677198 -2859136 -876643 -1062197 -2821639 -4469760 -4932377 -4358503 -3293155
$$ packed form
12662b617487Q9011J456797J630410K32144j102269j173169o28139m64371m83729
12653c060802M3870J038321J688526J543556R70733N13124J58275l98135q57180
12644A640288m01546Q83867J466519K55788j521740j732064l75640M37357l07701
12635C45128j170738p41161K72005N43333K66293L76520O99113L86406m29847
12626E47052q12828m94436m2390J51064J10350j33928l64107q5245N42461L92415
12616a89592r13781j763236n46100J627104K036221J37552j651617j397010q4215
12607b744674L35521j55086j37667O68117R07799l38994k111151k572780r96975
12598g145890J468692K818062J982493j85554j759442j648121m62617N73874J065348
$$ plain form
12589 -3293155 -1937781 -475982 470030 321313 -717112 -1898003 -2757390 -3171401 -2820840
12580 -2820840 -1494731 -6035 310179 -444548 -418561 1313969 2850294 1923685 -408634
12571 -408634 -814726 1501594 3554633 3041707 1555621 1562055 2352400 1646554 -201189
12562 -201189 -718427 498879 1273578 695742 433698 1443225 2251296 1808270 1418415
12553 1418415 2094489 2342126 769622 -1006064 -560872 1595314 3001812 2935061 2512298
12544 2512298 1866018 59323 -2315107 -3152000 -1798606 250315 1904239 3439306
12536 3439306 4525691 3794819 1312508 -731444 -960203 -461781 -337925 285209 2166088
12527 2166088 3808135 3551047 2403108 2489244 3613999 3749110 2451747 1375938 1345180
$$ packed form
12589c293155J355374J461799R46012j48717j038425j180891q59387m14011L50561
12580b820840J326109J488696L16214p54727K5987J732530J536325r26609k332319
12571d08634m06092K316320K053039n12926j486086O434P90345p05846j847743
12562b01189n17238J217306P74699n77836k62044J009527Q08071m43026l89855
12553A418415O76074K47637j572504j775686M45192K156186J406498o6751m22763
12544B512298o46280j806695k374430q36893J353394K048921J653924J535067
12536C439306J086385p30872k482311k043952k28759M98422J23856O23134J880879
12527B166088J642047k57088j147939Q6136J124755J35111j297363j075809l0758
$$ plain form
12518 1345180 1241764 422024 201145 1708255 3602685 3423029 758828 -2141881 -3044792
12509 -3044792 -2160373 -1343378 -1264404 -474093 2102567 4740688 4636184 1869133 -403313
12500 -403313 -322069 299508 -634431 -1957015 -1526440 -399713 -1412467 -4155371 -4901204
12491 -4901204 -2084127 1324968 2112239 727746 -676568 -1580337 -2328098 -2085648 -189111
12482 -189111 1705063 1429016 -371585 -1113531 -138267 676754 244331 -123482 859443
12473 859443 2268232 2288774 578905 -1658249 -3244041 -3881104 -3844332 -3415683 -2626961
12464 -2626961 -1515457 -614554 -686611 -1626848 -2321736 -2179244 -1911084 -1939849 -1232764 784500
12454 784500 2345618 1592659 -93120 239602 2367764 2976908 933178 -929404 -579450
$$ packed form
12518A345180j03416q19740k20879J507110J894430j79656k664201k900709r02911
12509c044792Q84419Q16995P8974P90311K576660K638121j04504k767051k272446
12500d03313Q1244O21577r33939j322584M30575J126727j012754k742904p45833
12491d901204K817077L409095P87271j384493j404314r03769p47761K42450J896537
12482a89111J894174k76047j800601p41946R75264Q15021m32423l67813R82925
12473H59443J408789K0542j709869k237154j585792o37063L6772M28649P88722
12464b626961J111504R00903p2057r40237o94888J42492K68160k8765P07085K017264
12454G84500J561118p52959j685779L32722K128162O09144k043730j862582L49954
$$ plain form
12445 -579450 74180 -948785 -1820542 -119099 2436725 2374662 292831 182876 3183465
12436 3183465 5917188 5615615 3379837 1247062 -750418 -2882520 -3785114 -2442992
12428 -2442992 -282530 818318 1264785 2517638 4193024 4433095 2694288 457975
12420 457975 -700075 -522033 296477 947843 1155039 1527549 2819378 4484771 4933334
12411 4933334 3798497 2725186 3003512 3750717 3662336 3178145 3266155 3339530 2466120 1668299
12401 1668299 2591902 4421426 4712718 3210889 2191584 2678879 3034163 2142292 1336105
12392 1336105 1727745 2054632 1170944 643257 2296181 4514806 3934673 444146 -2322271
12383 -2322271 -1938100 -208979 -175851 -1988915 -3338355 -2884990 -1582400 -931400 -1314509
$$ packed form
12445e79450O53630j022965q71757J701443K555824o2063k081831j09955L000589
12436C183465K733723l01573k235778k132775j997480k132102r02594J342122
12428b442992K160462J100848M46467J252853J675386K40071j738807k236313
12420D57975j158050J78042Q18510O51366K07196L72510J291829J665393M48563
12411D933334j134837j073311K78326P47205q8381m84191Q8010P3375q73410p97821
12401A668299R23603J829524K91292j501829j019305M87295L55284q91871q06187
12392A336105L91640L26887q83688n27687J652924K218625n80133l490527k766417
12383b322271L84171J729121L3128j813064j349440M53365J302590O51000l83109
$$ plain form
12374 -1314509 -2166321 -2774561 -2637912 -1758599 -855602 -692614 -973884 -585453 732815
12365 732815 1758994 1492957 737107 927818 1891672 2144727 1351526 930823 1730820
12356 1730820 2556227 2007776 713804 464130 1708593 3124128 3408004 2476950 1004212
12347 1004212 -334437 -1087311 -1102958 -498386 521147 1438544 1142581 -983306 -3362490
12338 -3362490 -3218486 -317983 1915178 753956 -1814602 -1842840 730863 1947628 -445109
12329 -445109 -4028648 -5299105 -3820700 -1592169 -155960 283496 161893 156851 608048
12320 608048 735071 -485073 -2334765 -2748443 -1146584 816808 1889133 2591393 3091836
12311 3091836 2024063 -951680 -3389871 -2915604 -432151 1455890 1921828 1819666 1391684
$$ packed form
12374a314509q51812o08240J36649Q79313R02997J62988k81270L88431J318268
12365G32815J026179k66037p55850J90711R63854K53055p93201m20703P99997
12356A730820Q25407n48451j293972k49674J244463J415535K83876r31054j472738
12347A004212j338649p52874j5647O04572J019533R17397k95963k125887k379184
12338c362490J44004K900503K233161j161222k568558k8238K573703J216765k392737
12329d45109l583539j270457J478405K228531J436209M39456j21603n042M51197
12320F08048J27023j220144j849692m13678J601859J963392J072325P02260N00443
12311C091836j067773k975743k438191M74267K483453J888041M65938j02162m27982
$$ plain form
12302 1391684 451469 8534 1209365 2968902 2943669 880332 -964209 -821926 899567
12293 899567 2923897 4344268 4440286 2964835 964023 -21552 249041 857924 1395235
12284 1395235 1979393 1928912 407064 -1497426 -1470568 640099 2142225 1202827 -530705
12275 -530705 -384060 1639808 3278333 3376497 3104835 3792078 4897776 4806475 3086220
12266 3086220 1180547 647095 1214710 1310136 419763 -96756 1038837 3239477 4890571
12257 4890571 5043941 3587226 939646 -1406176 -1468023 574885 1726099 122340 -1798388
12248 -1798388 -652914 2658838 4432840 4053158 4261409 5421008 4252789 -79819
12240 -79819 -3144235 -1515902 1730979 1645366 -1121286 -1865701 605027 2610512 1683166
$$ packed form
12302A391684r40215m42935J200831J759537k5233k063337j844541J42283J721493
12293H99567K024330J420371R6018j475451k000812r85575K70593O08883N37311
12284A395235N84158n0481j521848j904490K6858K110667J502126r39398j733532
12275e30705J46645K023868J638525R8164k71662O87243J105698r1301j720255
12266C086220j905673n33452N67615R5426q90373n16519J135593K200640J651094
12257D890571J53370j456715k647580k345822o1847K042908J151214j603759j920728
12248a798388J145474L311752J774002l79682K08251J159599j168219m332608
12240g9819l064416J628333L246881q5613k766652p44415K470728K005485r27346
$$ plain form
12231 1683166 -262875 -851942 -823396 -1925806 -3690933 -4273391 -3079832 -1005777 938644
12222 938644 2010358 1647764 235021 -635261 240332 2118820 3177716 2676613 1492986
12213 1492986 658942 170845 -526634 -1447509 -2005512 -1961245 -1836027 -2004747 -1862484 -723678
12203 -723678 652390 667834 -640176 -1067741 899242 3848860 5357617 5183673 4858987
12194 4858987 4722700 3476282 813881 -1514065 -2007518 -1326064 -1111873 -2044570 -3665421
12185 -3665421 -4951217 -4503495 -1596427 2092175 3266821 821793 -2339682 -2740679
12177 -2740679 -547842 1229615 786444 -1124867 -3132728 -4312506 -3653763 -892407
12169 -892407 1927118 2085247 -69141 -1307530 -194519 974371 201881 -942638 -318642
$$ packed form
12231A683166j946041n89067K8546j102410j765127n82458J193559K074055J944421
12222I38644J071714l62594j412743q70282Q75593J878488J058896n01103j183627
12213A492986q34044m88097o97479r20875n58003M4267J25218j68720J42263J138806
12203g23678J376068J5444j308010m27565J966983K949618J508757j73944l24686
12194D858987j36287j246418k662401k327946m93453O81454K14191r32697j620851
12185c665421j285796M47722K907068L688602J174646k445028l161475m00997
12177b740679K192837J777457m43171j911311k007861j179778O58743K761356
12169h92407K819525J58129k154388j238389J113011J168890p72490j144519O23996
$$ plain form
12160 -318642 817642 -105008 -2373624 -2904530 -1220858 -95364 -989915 -2083228 -1713409
12151 -1713409 -870282 -885120 -1147441 -852128 -944886 -2338945 -3755205 -3391808 -1688273
12142 -1688273 -547362 -558061 -647642 106636 1735849 3805287 5297776 4846434 2417699
12133 2417699 -32817 -882685 -827423 -1109886 -1073263 439308 2309723 2368368 934596
12124 934596 460747 1614315 2369105 1512419 550461 1105650 2497794 3165540 2839713
12115 2839713 1986370 427683 -2005223 -4210590 -4546281 -2701530 -174724 1099313
12107 1099313 527512 -518958 -146647 1618230 2581051 1394199 -271218 -161482 899351
12098 899351 78399 -3070254 -5771688 -5852327 -4123072 -2502978 -1921203 -2576270 -4098695
$$ packed form
12160c18642J136284r22650k268616n30906J683672J125494q94551j093313L69819
12151a713409Q43127j4838k62321K95313r2758j394059j416260L63397J703535
12142a688273J140911j0699q9581P54278J629213K069438J492489m51342k428735
12133B417699k450516q49868N5262k82463L6623J512571J870415N8645j433772
12124I34596m73849J153568P54790q56686r61958N55189J392144O67746l25827
12115B839713q53343j558687k432906k205367l35691J844751K526806J274037
12107A099313n71801j046470L72311J764877R62821j186852j665417J09736J060833
12098H99351q20952l148653k701434q0639J729255J620094N81775o55067j522425
$$ plain form
12089 -4098695 -4878812 -3419880 -890336 37669 -654530 -241171 1914616 2933840 1468313
12080 1468313 554029 2758809 5664618 5580749 3216027 1837109 1746341 841017 -520141
12071 -520141 255599 3017729 4336662 2640696 286496 -550935 -846291 -2128596 -3618741
12062 -3618741 -3792517 -2952818 -2572427 -3286171 -4717015 -6220600 -6896559 -5904332 -3567180
12053 -3567180 -1299642 26358 687947 903600 384903 -505319 -637522 139064 485653
12044 485653 -360901 -1259243 -876266 383122 1327868 1995554 3322003 5151769 5966528
12035 5966528 4906116 3118587 2401652 2890887 2997088 1828196 610854 672472 869017
12026 869017 -1028133 -4489351 -6236485 -4917321 -3187226 -3432238 -3967531 -2214155 418521
$$ packed form
12089d098695p80117J458932K529544R28005o92199M13359K155787J019224j465527
12080A468313r14284K204780K905809q3869k364722j378918r0768r05324j361158
12071e20141P75740K762130J318933j695966k354200q37431k95356j282305j490145
12062c618741j73776Q39699L80391p13744j430844j503585o75959R92227K337152
12053c567180K267538J326000O61589K15653n18697q90222j32203P76586L46589
12044D85653q46554q98342L82977J259388R44746O67686J326449J829766Q14759
12035E966528j060412j787529p16935M89235J06201j168892j217342O1618J96545
12026H69017j897150l461218j747134J319164J730095k45012n35293J753376K632676
$$ plain form
12017 418521 462615 -1881671 -2917945 -1287075 215024 -603274 -2220276 -2380164 -1298793
12008 -1298793 -360448 43527 -33273 -724951 -1253930 -272691 1674867 2312683 1262163
11999 1262163 863291 2057359 2435153 384855 -1723921 -1154983 871924 1464396 591211
11990 591211 123255 82053 -679035 -1362973 -497414 473886 -1315249 -5200359 -7175669
11981 -7175669 -5436605 -2426214 -691771 128701 1109634 1725651 1308522 664824 730571
11972 730571 1183684 1469826 1708713 1771581 1081095 96638 288644 1845275 3178779
11963 3178779 3482983 3749815 4265339 3456109 877485 -869233 463852 3049797 3249138
11954 3249138 635381 -1813816 -2081711 -1118821 -399190 138151 983931 1757758 2062633
$$ packed form
12017D18521M4094k344286j036274J630870J502099q18298j617002j59888J081371
12008a298793R38345M03975p6800o91678n28979R81239J947558O37816j050520
11999A262163l98872J194068L77794k050298k108776N68938K026907N92472q73185
11990E91211m67956m1202p61088o83938Q65559R71300j789135l885110j975310
11981g175669J739064L010391J734443Q20472R80933O16017m17129o43698O5747
11972G30571M53113K86142K38887O2868o90486r84457J92006J556631J333504
11963C178779L04204K66832N15524q09230k578624j746718J333085K585945J99341
11954C249138k613757k449197k67895R62890P19631N37341Q45780P73827L04875
$$ plain form
11945 2062633 2379777 3027828 3069300 1417684 -1254033 -2754466 -1812509 312946 1210235
11936 1210235 139916 -1195147 -947825 563250 1595019 1421598 834922 466698 53770
11927 53770 -498395 -821208 -1242808 -2667857 -4618348 -5031751 -3104762 -868912 -597129
11918 -597129 -1941101 -3113696 -3607849 -3888664 -3463668 -1521333 959954 1906035 968366
11909 968366 -88658 161878 1472787 2849618 3271121 1853545 -875143 -2226568 -106075
11900 -106075 3545505 4557892 2131617 -45002 802108 2744528 2521474 430625 -627765
11891 -627765 260230 987065 -153731 -2037299 -2364934 -806242 288882 -1475665 -5306258
11882 -5306258 -7441619 -5426954 -1297396 1058621 913446 673413 1229380 665853 -1604696
$$ packed form
11945B062633L17144O48051M1472j651616k671717j500433R41957K125455Q97289
11936A210235j070319j335063K47322J511075J031769j73421n86676l68224m12928
11927E3770n52165l22813m21600j425049j950491m13403J926989K235850K71783
11918e97129j343972j172595m94153k80815M24996J942335K481287R46081r37669
11909I68366j057024K50536J310909J376831M21503j417576k728688j351425K120493
11900a06075L651580J012387k426275k176619Q47110J942420k23054k090849j058390
11891f27765Q87995P26835j140796j883568l27635J558692J095124j764547l830593
11882e306258k135361K014665M129558K356017j45175k40033N55967n63527k270549
$$ plain form
11873 -1604696 -2911766 -1491169 389190 47871 -1327910 -1029806 495168 686298 -688724
11864 -688724 -1533342 -1135508 -637972 -231077 927324 2118548 1526390 -518698 -1703262
11855 -1703262 -1449866 -1580125 -2803871 -3472568 -2608932 -1424170 -880680 -331945 481326
11846 481326 745490 925156 2909501 6295711 7420418 4308070 205502 -413184 2300248
11837 2300248 4268285 2944963 -273338 -2495003 -2284556 -462577 808689 159051
11829 159051 -1195206 -889640 966809 1645302 242243 -311154 2330827 5898020 6668965
11820 6668965 4810300 3350101 3140566 2436417 938057 534316 1634920 2054295 504809
11811 504809 -1487660 -2247212 -2193753 -2242756 -2088676 -1533418 -1754927 -3543409 -5437832
$$ packed form
11873a604696j307070J420597J880359l41319j375781K98104J524974J91130j375022
11864f88724q44618L97834M97536M06895J158401J191224n92158k045088j184564
11855a703262K53396j30259j223746o68697Q63636J184762N43490N48735Q13271
11846D81326K64164J79666J984345L386210J124707l112348m102568o18686K713432
11837B300248J968037j323322l218301k221665K10447J821979J271266o49638
11829A59051j354257L05566J856449O78493j403059n53397K641981L567193P70945
11820F668965j858665j460199k09535p04149j498360m03741J100604M19375j549486
11811E04809j992469p59552N3459m9003J54080N55258k21509j788482j894423
$$ plain form
11802 -5437832 -5258664 -2889881 -276288 924993 664771 -203821 -987511 -1453494 -1613144
11793 -1613144 -1419474 -725075 355807 1289349 1682852 1688602 1355781 103786 -2233970
11784 -2233970 -4236770 -4060474 -1851810 172011 327444 -877773 -1984229 -2401917 -2432433
11775 -2432433 -2323076 -2002811 -1340447 -272576 944621 1474600 519321 -1507894 -2998304
11766 -2998304 -2713671 -969499 945031 2090907 2379125 2132905 1519588 457881 -870566
11757 -870566 -1568901 -738367 1056767 1916105 1028530 160813 1395544 3886613 4606510
11748 4606510 2449186 -150132 -410426 1387148 2801610 2642055 2154183 2961915 4851126
11739 4851126 6026577 5288988 3504214 2485172 2468400 1623611 -1200910 -4136163 -4220356
$$ packed form
11802e437832J79168K368783K613593J201281k60222q68592p83690m65983j59650
11793a613144J93670O94399J080882R33542L93503N750l32821j251995k337756
11784b233970k002800J76296K208664K023821J55433j205217j106456m17688l0516
11775b432433J09357L20265O62364J067871J217197N29979r55279k027215j490410
11766b998304K84633J744172J914530J145876K88218k46220o13317j061707j328447
11757h70566o98335Q30534J795134Q59338q87575q67717J234731K491069P19897
11748D606510k157324k599318k60294J797574J414462j59555m87872Q07732J889211
11739D851126J175451p37589j784774j019042j6772q44789k824521k935253q4193
$$ plain form
11730 -4220356 -1421723 1066994 1007089 -127628 371445 2599338 4243322 3905201 2516831
11721 2516831 1513490 1109065 802904 429698 10055 -623622 -1245803 -905829 776998
11712 776998 2289003 1496167 -1490937 -3991275 -4036117 -2817719 -2633351 -3402806 -3154805
11703 -3154805 -1551920 -527579 -933806 -947829 881895 3060921 3496691 2788130 2850677
11694 2850677 3414754 2634287 715640 -9446 1006899 1337412 -626039 -3075940 -3579140
11685 -3579140 -2562125 -2050918 -2305677 -1951196 -703391 409580 1422594 3591613 6529547
11676 6529547 7484767 5059997 1963217 1778578 3834413 4013553 888414 -1850843 -625245
11667 -625245 2779839 3816497 1627662 -311612 244158 1434059 898354 -622300 -1074647
$$ packed form
11730d220356K798633K488717n9905j134717M99073K227893J643984l38121j388370
11721B516831j003341m04425l06161l73206m19643o33677o22181L39974J682827
11712G76998J512005p92836k987104k500338m4842J218398J84368p69455K48001
11703c154805J602885J024341m06227j4023J829724K179026M35770p08561O2547
11694B850677N64077p80467j918647p25086J016345L30513j963451k449901n03200
11685c579140J017015N11207k54759L54481J247805J112971J013014K169019K937934
11676F529547R55220k424770l096780j84639K055835J79140l125139k739257J225598
11667f25245L405084J036658k188835j939274N55770J189901n35705j520654m52347
$$ plain form
11658 -1074647 -413738 -92628 -586938 -1351104 -2256869 -3264032 -3420969 -1967554 37878
11649 37878 765396 -18737 -886518 -633072 872100 3077183 4813382 4712367 2862835
11640 2862835 1311776 1571445 2457678 1910336 94364 -1080007 -852383 -191029 35227
11631 35227 -262512 -1047258 -1835295 -1375207 583997 2005603 1092473 -713830 -638372
11622 -638372 1227131 2354931 1946318 1567312 1593718 335640 -2505426 -4524533 -4047027
11613 -4047027 -2422382 -1569837 -1380162 -894318 -163531 395260 852621 823816 -673422
11604 -673422 -3207318 -4319350 -2284517 1578731 4350012 4340541 1987004 -843101 -1972837
11595 -1972837 -681550 1262343 1678488 1070385 1745242 3829706 4728903 3187148 1184526
$$ packed form
11658a074647O60909L21110m94310p64166r05765j007163j56937J453415K005432
11649C7878P27518p84133q67781K53446J505172K205083J736199j01015j849532
11640B862835j551059K59669Q86233n47342j815972j174371K27624O61354K26256
11631C5227k97739p84746p88037M60088J959204J421606r13130j806303P5458
11622f38372J865503J127800m08613l79006K6406j258078k841066k019107M77506
11613d047027J624645Q52545J89675M85844P30787N58791M57361k8805j497238
11604f73422k533896j112032K034833L863248K771281r471k353537k830105j129736
11595a972837J291287J943893M16145o08103O74857K084464Q99197j541755k002622
$$ plain form
11586 1184526 589358 494266 -475996 -1521170 -1330791 -539221 -446088 -722065 -332055 461202
11576 461202 817328 934722 1203974 780343 -1139772 -3303174 -3446181 -1161927 1548850
11567 1548850 2534509 1562364 285305 446486 1862676 2491147 1180980 -500679 -699355
11558 -699355 -484409 -2096088 -4675830 -5129081 -3294585 -2421093 -3654883 -4072222 -1838336
11549 -1838336 626132 948940 539173 1138992 1127260 -1237078 -3820656 -3683800 -1770982
11540 -1770982 -728137 -227064 1448412 3051853 2118505 -146795 -257613 1856098 2862657
11531 2862657 1582175 382930 765629 1406142 1234441 1073596 1450315 1662634 1562222
11522 1562222 1588615 858199 -1832314 -4873151 -4898948 -1581928 1628934 2246614 1306983
$$ packed form
11586A184526n95168r5092r70262j045174J90379P91570R3133k75977L90010P93257
11576D61202L56126J17394K69252m23631j920115k163402j43007K284254K710777
11567A548850R85659r72145j277059J61181J416190O28471j310167j681659j98676
11558f99355K14946j611679k579742m53251J834496Q73492j233790m17339K233886
11549a838336K464468L22808m09767N99819j1732k364338k583578J36856J912818
11540a770982J042845N01073J675476J603441r33348k265300j10818K113711J006559
11531B862657j280482j199245L82699O40513j71701j60845L76719K12319j00412
11522A562222K6393p30416k690513l040837k5797L317020L210862O17680r39631
$$ plain form
11513 1306983 492371 -228130 -996267 -994655 -343475 -556171 -1785030 -1956718 61414
11504 61414 2673366 4135886 4627223 4489704 2904129 27875 -1798660 -1004536 835963
11495 835963 1510260 1390779 2085712 3322804 3544963 2767033 2524577 3189974 3277876 1674666
11485 1674666 -765038 -2204752 -1653996 354964 2406324 3373463 3157402 2386719 1675083
11476 1675083 1402223 1685784 1965632 1279188 -114238 -199460 2235443 5193758 5588032
11467 5588032 3458971 1864465 2486228 3747556 3835243 3110986 2401955 1195801 -764412
11458 -764412 -1853952 -543894 1980703 2944470 1257310 -1556184 -3237996 -2670235 -431676
11449 -431676 1642866 1947875 830097 303252 1558673 3465887 4037143 2620209 200380
$$ packed form
11513A306983q14612p20501p68137J612O51180k12696j228859j71688K018132
11504F1414K611952J462520M91337j37519j585575k876254j826535P94124J840499
11495H35963O74297j19481O94933J237092K22159p77930k42456O65397Q7902j603210
11485A674666k439704j439714N50756K008960K051360R67139k16061p70683p11636
11476A675083k72860K83561K79848o86444j393426q5222K434903K958315L94274
11467E588032k129061j594506O21763J261328Q7687p24257p09031j206154j960213
11458g64412j089540J310058K524597R63767j687160k813494j681812N67761K238559
11449d31676K074542L05009j117778n26845J255421J907214N71256j416934k419829
$$ plain form
11440 200380 -1621198 -1565790 360604 2348395 2318967 506066 -693356 -31287 869587
11431 869587 67497 -1827662 -2724734 -1994754 -841479 -265566 36151 942963 2905555
11422 2905555 5350622 6631890 5366038 2397041 342316 343715 589345 -643434 -1933391
11413 -1933391 -841225 1827823 2650626 625966 -1124448 166400 2952437 3787324
11405 3787324 2236610 982575 1494272 2144180 1299621 75093 320903 1244088 327171
11396 327171 -2611537 -4506613 -2943091 644451 2777029 1884322 -615119 -2355614
11388 -2355614 -2052670 -111343 1756481 1971096 892243 484393 1461342 1972357 427961
11379 427961 -1644636 -1584084 388681 1533239 724984 -307553 -227549 -57586 -878056
$$ packed form
11440B00380j821578N5408J926394J987791k9428j812901j199422O62069R00874
11431H69587q02090j895159q97072P29980J153275N75913L01717R06812J962592
11422B905555K445067J281268j265852k968997k054725J399K45630j232779j289957
11413a933391J092166K669048Q22803k024660j750414J290848K786037Q34887
11405C787324j550714j254035N11697O49908q44559j224528K45810R23185r16917
11396C27171k938708j895076J563522L587542K132578q92707k499441j740495
11388b355614L02944J941327J867824K14615j078853m07850R76949N11015j544396
11379D27961k072597O0552J972765J144558q08255j032537Q0004J69963q20470
$$ plain form
11370 -878056 -1711077 -1263112 -289191 -512406 -2014640 -3211745 -3038057 -1975753 -1096362
11361 -1096362 -975793 -1473261 -1923674 -1582602 -314074 1215173 2257949 2727406 3016801
11352 3016801 3290036 3203496 2311862 682048 -954263 -1833142 -1940856 -1856289 -1831795 -1560114
11342 -1560114 -910772 -198983 400248 875606 771518 -234286 -995240 173297 2650435
11333 2650435 3528951 1511500 -1207241 -2243858 -1904302 -995855 1444769 5271077 6617983
11324 6617983 2398259 -3973104 -5929042 -2447733 1116308 1139630 -27037 819283 2782117
11315 2782117 3380059 2685552 2353057 2771832 3319704 3693252 3483637 2227596 906068
11306 906068 1180688 2256157 1326989 -1598905 -2581492 524181 4348564 4672023 2108565
$$ packed form
11370h78056q33021M47965R73921k23215j502234j197105J73688J062304Q79391
11361a096362J20569m97468m50413L41072J268528J529247J042776M69457K89395
11352C016801K73235q6540q91634j629814j636311q78879j07714Q4567K4494K71681
11342a560114O49342P11789N99231M75358j04088j005804p60954J168537K477138
11333B650435Q78516k017451k718741j036617L39556R08447K440624L826308J346906
11324F617983m219724o371363j955938L481309L564041K3322j166667Q46320J962834
11315B782117N97942o94507l32495M18775N47872L73548k09615j256041j321528
11306I06068K74620J075469r29168k925894r82587L105673L824383L23459k563458
$$ plain form
11297 2108565 130033 -288057 -740527 -1845645 -2962495 -4249240 -5906921 -6395664 -4443575
11288 -4443575 -1973935 -1963679 -4003900 -5045061 -4141688 -3293932 -3580891 -3612889 -2417514
11279 -2417514 -1131494 -879528 -1084409 -757574 217336 1662909 3335049 4143130 2880564
11270 2880564 312819 -1096043 -219391 1430786 2089896 1973572 2295454 3325972 4411445
11261 4411445 4994942 4707010 3166178 573026 -1921698 -3100941 -2676136 -1111285 1004765
11252 1004765 2946991 3717597 2670986 338721 -1752472 -2312530 -1366121 -77458 531693
11243 531693 585304 889875 1623201 1983423 1299461 75003 -368646 850138 3285472
11234 3285472 5305281 5287064 3125417 444388 -1113567 -1535666 -1863071 -2522051 -3168006
$$ packed form
11297B108565j978532m18090m52470j105118j116850j286745j657681m88743J952089
11288d443575K469640J0256k040221j041161R03373Q47756k86959l1998J195375
11279b417514J286020K51966k04881L26835R74910J445573J672140Q08081j262566
11270B880564k567745j408862Q76652J650177O59110j16324L21882J030518J085473
11261D411445N83497k87932j540832k593152k494724j179243M24805J564851K116050
11252A004765J942226P70606j046611k332265k091193n60058R46409J288663O09151
11243E31693N3611L04571P33326L60222o83962j224458m43649J218784K435334
11234C285472K019809j8217k161647k681029j557955m22099l27405o58980o45955
$$ plain form
11225 -3168006 -3690785 -4121706 -3897606 -2657123 -1471322 -1582797 -2121172 -1126454 1077102
11216 1077102 1885921 328241 -1457622 -1612503 -1028375 -1084824 -1215452 -528173 92610
11207 92610 -486775 -1529259 -1683450 -969276 139899 1949450 3982957 4053487 1336042
11198 1336042 -1229045 -428526 2494164 3569940 1745077 -330366 -753791 -374149 -167658
11189 -167658 282218 926711 558611 -957823 -1969540 -1640891 -1321002 -2113257 -2828693
11180 -2828693 -1826255 350997 1661109 1196829 -46588 -643457 -75850 1212488 2446454
11171 2446454 3124019 3171917 2615559 1471685 240474 -44345 1075665 2668216 3340872
11162 3340872 2636561 965297 -1186658 -3120726 -3672317 -2281659 -11398 1497368
$$ packed form
11225c168006n22779m30921K24100J240483J185801j11475n38375R94718K203556
11216A077102Q08819j557680j785863j54881N84128n6449j30628O87279O20783
11207I2610n79385j042484j54191P14174J109175J809551K033507P0530k717445
11198A336042k565087Q00519K922690J075776j824863k075443m23425L79642K06491
11189a67658M49876O44493l68100j516434j011717L28649L19889p92255p15436
11180b828693J002438K177252J310112m64280j243417n96869N67607J288338J233966
11171B446454O77565M7898n56358j143874j231211k84819J120010J592551O72656
11162C340872p04311j671264k151955j934068n51591J390658K270261J508766
$$ plain form
11154 1497368 1752212 1244465 228120 -1118195 -1882576 -1255923 47772 553131 54523
11145 54523 -348891 -19862 698147 1463688 2043988 1710322 157966 -1047026 215979
11136 215979 3459443 5410250 3757158 -139361 -2982782 -2978452 -920444 1172279 1684847
11127 1684847 299078 -1902638 -3285237 -2940118 -1232277 625554 1366460 661134 -144771
11118 -144771 955936 3990996 6201811 5224931 2432343 1329260 2866832 4396130
11110 4396130 3652889 1735745 1009792 1600102 1589734 55000 -1588657 -1379996 898202
11101 898202 3489363 4358016 2931151 318140 -1891053 -2761123 -2145552 -509682 933317
11092 933317 688800 -1417283 -3390381 -2890459 -52264 2363231 2012973 -394801 -2007323
$$ packed form
11154A497368K54844n07747j016345j346315p64381O26653J303695N05359m98608
11145E4523m03414L29029P18009P65541N80300l33666j552356j204992J263005
11136B15979L243464J950807j653092l896519k843421M330K058008K092723N12568
11127A684847j385769k201716j382599L45119J707841J857831P40906p05326q05905
11118a44771J100707L035060K210815r76880k792588j103083J537572J529298
11110D396130p43241j917144p25953N90310j0368j534734j643657K08661K278198
11101H98202K591161Q68653j426865k613011k209193q70070O15571J635870J442999
11092I33317k44517k106083j973098M99922K838195K415495l50258k407774j612522
$$ plain form
11083 -2007323 -1149548 810860 1242153 -383646 -1744878 -726306 1703789 2851610
11075 2851610 1912046 499014 -291890 -1216513 -2704694 -3507450 -2797042 -1866318 -2187550
11066 -2187550 -3188411 -3531458 -3281302 -3117208 -2707512 -1805437 -1722386 -3390134 -4879992
11057 -4879992 -3486028 78558 2166585 975998 -1546852 -2918896 -2887054 -2216844 -862667
11048 -862667 1259699 2980014 2778225 610036 -1865084 -2735660 -1503516 339574 693668
11039 693668 -682722 -1698912 -694568 1224573 1892269 1254252 1073637 2005708 2947490
11030 2947490 3128312 2865278 2197536 766094 -716634 -905408 -192137 -652778 -2959798
11021 -2959798 -5272277 -6025462 -5841188 -5521909 -4192670 -1265247 1321875 1133160 -1226224
$$ packed form
11083b007323Q57775J960408M31293j625799j361232J018572K430095J147821
11075B851610r39564j413032p90904r24623j488181q02756P10408R30724l21232
11066b187550j000861l43047K50156J64094M09696R02075Q3051j667748j489858
11057d879992J393964L564586K088027j190587k522850j372044L1842O70210J354177
11048h62667K122366J720315k01789k168189k475120q70576J232144J843090L54094
11039F93668j376390j016190J004344J919141O67696o38017j80615R32071R41782
11030B947490J80822k63034o67742j431442j482728j88774P13271m60641k307020
11021b959798k312479p53185J84274L19279J329239K927423K587122j88715k359384
$$ plain form
11012 -1226224 -2819663 -2450516 -1886095 -2598698 -3292397 -1945976 973385 3051215 3245188
11003 3245188 2897860 3128974 2946033 1154732 -1091846 -1544951 -288334 111502 -1702884
10994 -1702884 -3831770 -3721514 -1461389 693660 1144857 125954 -1261144 -2046760 -1783645
10985 -1783645 -823571 -50279 75987 -140963 -348912 -472097 -269234 384088 696971
10976 696971 -205038 -1520438 -1532053 -396526 -118729 -1208787 -1785198 -966467 -453610
10967 -453610 -1212557 -1417840 99842 1086292 -611456 -3136102 -3544601 -2646564 -3224512
10958 -3224512 -4988510 -5378841 -4403957 -4331281 -4844455 -2966911 1567311 4941269 4514525
10949 4514525 2050966 301478 -564373 -1480705 -2108437 -1803789 -998027 -67813 1453970
$$ packed form
11012a226224j593439L69147N64421p12603o93699J346421K919361K077830J93973
11003C245188l47328K31114j82941j791301k246578m53105J256617L99836j814386
10994a702884k128886J10256K260125K155049M51197j018903j387098p85616K63115
10985a783645R60074P73292J26266k16950k07949j23185K02863O53322L12883
10976F96971r02009j315400j1615J135527K77797j090058n76411Q18731N12857
10967d53610p58947k05283J517682R86450j697748k524646m08499Q98037n77948
10958c224512j763998l90331R74884P2676n13174J877544M534222L373958m26744
10949D514525k463559j749488q65851r16332o27732L04648Q05762R30214J521783
$$ plain form
10940 1453970 3300203 3931731 2919680 2119366 2966321 4156664 3721332 2208980 1922355
10931 1922355 3544904 5241065 5182167 3724255 2572506 2427583 2270443 1140838 -170355
10922 -170355 -188875 898806 1542850 1530988 2316317 3931621 3998121 1452670 -980531
10913 -980531 -388323 2038561 2967119 1766121 523924 280843 224062 -30529 -239030
10904 -239030 -1130786 -3446899 -5812195 -6255234 -5351617 -5113860 -5372785 -4294305 -2001957
10895 -2001957 -459988 -61419 379403 551597 -802285 -2324280 -1013881 2641283 4346206
10886 4346206 1891704 -2061353 -4249545 -4585574 -4346720 -3690688 -2614696 -1885073 -1595290
10877 -1595290 -906705 -63237 -350027 -1456111 -1514521 -391141 -78896 -1065770 -1326406
$$ packed form
10940A453970J846233O31528j012051q00314Q46955J190343m35332j512352k86625
10931A922355J622549J696161n8898j457912j151749j44923j57140j129605j311193
10922a70355j8520J087681O44044j1862P85329J615304O6500k545451k433201
10913i80531N92208K426884R28558j200998j242197k43081n6781k54591k08501
10904b39030q91756k316113k365296m43039R03617K37757k58925J078480K292348
10895b001957J541969L98569M40822J72194j353882j521995J310399L655164J704923
10886D346206k454502l953057k188192l36029K38854O56032J075992P29623K89783
10877a595290O88585Q43468k86790j106084n8410J123380L12245r86874k60636
$$ plain form
10868 -1326406 52293 1204246 667723 -461196 -714575 -94767 1116664 2781587 3529313
10859 3529313 1901756 -517062 -370288 2330778 3818706 2211176 -200630 -1417914
10851 -1417914 -2438979 -3898744 -4120033 -2677824 -2072092 -3432617 -4157003 -2365712 -228295
10842 -228295 -147753 -969264 -838229 -650581 -1673188 -2693038 -2506216 -2376754 -3099105
10833 -3099105 -2622765 214115 2544904 1565233 -905427 -1539545 -712253 -911415 -2179080
10824 -2179080 -2906527 -3260530 -4191013 -4815910 -4249893 -4096787 -5550568 -6093826 -3079282
10815 -3079282 1264313 2734969 1583112 1512795 3321826 4265250 3355312 2593204 2570328
10806 2570328 1186586 -2211229 -5027995 -5137998 -3711136 -3092129 -3829402 -4657099 -3985838
$$ packed form
10868a326406J378699J151953n36523j128919k53379O19808J211431J664923P47726
10859C529313j627557k418818J46774K701066J487928j607530k411806j217284
10851a417914j021065j459765k21289J442209O05732j360525p24386J791291K137417
10842b28295Q0542q21511J31035J87648j022607j019850J86822J29462p22351
10833c099105M76340K836880K330789r79671k470660o34118Q27292j99162j267665
10824b179080p27447l54003r30483o24897N66017J53106j453781n43258L014544
10815c079282M343595J470656j151857p0317J809031R43424r09938p62108k2876
10806B570328j383742l397815k816766j10003J426862O19007p37273q27697O71261
$$ plain form
10797 -3985838 -1204659 2177310 3111415 370211 -3290001 -4184126 -2222887 -386222
10789 -386222 -488617 -1795096 -3210227 -4277195 -4222248 -2450028 -116802 777623 -84558
10780 -84558 -1361944 -2250796 -2850720 -2738019 -1221572 966394 1958746 906674 -1279896
10771 -1279896 -3125564 -3616078 -2646187 -1308187 -855054 -739915 743989 3051014 2976636
10762 2976636 -637703 -4263240 -4236583 -1751102 -299906 -121719 1071434 3077137 3080639
10753 3080639 482193 -1854434 -1806408 -465388 372368 655432 1042825 1405996 1417888
10744 1417888 1357925 1569002 1865161 1769339 930740 -375078 -842105 782737 3589385
10735 3589385 4805651 3138840 366946 -1402501 -2201884 -2553559 -1541436 1274307
$$ packed form
10797c985838K781179L381969R34105k741204l660212q94125J961239J836665
10789c86222j02395j306479j415131j066968N4947J772220K333226Q94425q62181
10780h4558j277386q88852n99924J12701J516447K187966R92352j052072k186570
10771a279896j845668m90514R69891J338000M53133J15139J483904K307025p4378
10762B976636l614339l625537K6657K485481J451196J78187J193153K005703L502
10753C080639k598446k336627M8026J341020Q37756K83064L87393L63171J1892
10744A417888n9963K11077K96159r5822q38599j305818m67027J624842K806648
10735C589385J216266j666811k771894j769447p99383l51675J012123K815743
$$ plain form
10727 1274307 3776614 3616415 1392867 -683149 -1965693 -2942772 -3093728 -1892860 -883707
10718 -883707 -1910597 -3855082 -3772889 -1063323 1751343 2353755 964436 -531948 -466778
10709 -466778 1290553 3033631 2963527 1631599 1139660 1650973 1231626 -167053 -20512
10700 -20512 1897876 1875305 -1811413 -5172113 -4360358 -1744983 -1714332 -3521380 -3554232
10691 -3554232 -2361285 -3427060 -6084039 -5767579 -1516506 2347863 3035854 2894181 4628496
10682 4628496 7045167 7556808 5862406 3279756 684752 -1402674 -2368439 -2169158 -1327659
10673 -1327659 -138980 932156 656177 -1433304 -3559643 -3650327 -2122535 -942354 -896789
10664 -896789 -1712531 -3490858 -5632669 -5805393 -2862205 405313 440215 -2178126 -3984991
$$ packed form
10727A274307K502307j60199k223548k076016j282544r77079j50956J200868J009153
10718h83707j026890j944485Q2193K709566K814666O02412j389319j496384O5170
10709d66778J757331J743078p0104j331928m91939N11313m19347j398679J46541
10700b0512J918388k2571l686718l360700Q11755K615375L0651j807048l2852
10691c554232J192947j065775k656979L16460M251073L864369O87991j41673J734315
10682D628496K416671N11641j694402k582650k595004k087426r65765J99281Q41499
10673a327659J188679J071136k75979k089481k126339r0684J527792J180181M5565
10664h96789q15742j778327k141811j72724K943188L267518L4902k618341j806865
$$ plain form
10655 -3984991 -3669194 -2666758 -1803794 -831006 -487482 -1525912 -2447157 -1784070 -1693755
10646 -1693755 -5061226 -9620635 -9859089 -5230851 -1538528 -2562029 -4830184 -3436933
10638 -3436933 475043 1756547 -912764 -3019056 -521063 4394363 5786277 1540704
10630 1540704 -3830125 -5073434 -2748340 -1230510 -1786261 -1903890 -1201673 -2681775 -6594754
10621 -6594754 -8307066 -5164653 -869217 436231 139225 1284591 2856905 2520315
10613 2520315 1466329 1639996 1322661 -1454533 -4007167 -2797722 397147 1435900
10605 1435900 624662 1216579 3198683 3994269 3548477 3466750 2893493 426540 -1768166
10596 -1768166 -977651 923813 599781 -771215 -167039 1141582 184399 -1434878 -407838
$$ packed form
10655c984991L15797J002436Q62964R72788L43524j038430r21245O63087R0315
10646a693755l367471m559409k38454M628238L692323j023501k268155J393251
10638c436933L911976J281504k669311k106292K497993M915426J391914m245573
10630A540704n370829j243309K325094J517830n55751j17629P02217j480102l912979
10621f594754j712312L142413M295436J305448k97006J145366J572314l36590
10613B520315j053986J73667l17335k777194k552634J209445L194869J038753
10605A435900q11238N91917J982104P95586m45792q1727n73257k466953k194706
10596a768166P90515J901464l24032j370996O04176J308621r57183j619277J027040
$$ plain form
10587 -407838 1402206 -54741 -3131860 -2975601 -322385 -137761 -2607760 -3356653 -1961227
10578 -1961227 -2222240 -4138606 -3719858 -1178652 -1261628 -4423268 -5447062 -2414331 220550
10569 220550 -599387 -2329806 -2380137 -1874330 -1950068 -1632400 -972161 -1559221 -2953178 -3014008
10559 -3014008 -1998119 -1992086 -2822667 -2990739 -3370410 -5214356 -6499937 -5452847 -4904076
10550 -4904076 -7229077 -8487099 -4674189 -31343 -869344 -4733500 -4904400 -2318375
10542 -2318375 -2942259 -6186217 -6601270 -4698110 -5165127 -6649085 -4586718 -1726869 -3869582
10533 -3869582 -7712622 -5828035 -1186082 -2666346 -8301790 -8288122 -3258677 -3248223 -8840281
10524 -8840281 -10292477 -6059685 -4913950 -8221329 -7656423 -2617456 -2198543 -7338928
$$ packed form
10587d07838J810044j456947l077119J56259K653216J84624k469999p48893J395426
10578a961227k61013j916366M18748K541206q2976l161640j023794L032731K634881
10569B20550q19937j730419n0331N05807p5738L17668O60239n87060j393957o0830
10559c014008J015889O033q30581j68072l79671j843946j285581J047090N48771
10550d904076k325001j258022L812910M642846q38001l864156j70900K586025
10542b318375o23884l243958m15053J903160m67017j483958K062367K859849k142713
10533c869582l843040J884587M641953j480264n635444J3668N029445J0454n592058
10524h840281j452196M232792J145735l307379N64906N038967M18913n140385
$$ plain form
10516 -7338928 -8829629 -5534531 -6283220 -11383099 -11465283 -6798533 -7379699 -12145914 -10308808
10507 -10308808 -4674010 -8629425 -18303967 -16108722 -4791758 -5953084 -19978018 -23384691
10499 -23384691 -13300103 -14187171 -29504372 -32156141 -18732455 -21693608 -44990510 -47151783
10491 -47151783 -22913755 -32359581 -89860545 -92715254 47127081 243416240 316545257
10484 316545257 223112226 98192501 58969892 73604122 62105421 27935081 20935775
10477 20935775 38023704 38473724 20675904 15623775 25234357 24697990 13081869 12025777
10469 12025777 22194967 23909188 15636329 14019157 19688298 17550197 8374729 8171418
10461 8171418 17280317 19426878 11602130 7910299 12727574 14983509 10962653 9803981
$$ packed form
10516g338928j490701L295098p48689n099879q2184M666750n81166m766215J837106
10507a0308808N634798l955415r674542K195245J1316964j161326j4024934l406673
10499b3384691J0084588q87068j5317201k651769J3423686k961153k3296902k161273
10491d7151783K4238028r445826n7500964k854709J39842335J96289159P3129017
10484C16545257r3433031j24919725l9222609J4634230j1498701l4170340o999306
10477B0935775J7087929M50020j7797820n052129R610582n36367j1616121j056092
10469A2025777J0169190J714221q272859j617172N669141k138101r175468k03311
10461H171418R108899K146561p824748l691831M817275K255935m020856j158672
$$ plain form
10453 9803981 13755365 13875034 8263859 5672013 8381523 8973991 6175939 7099290 11767580
10444 11767580 11759351 6446987 4855850 8940280 10229797 5929220 3678711 6898071
10436 6898071 9213665 7259772 6150811 8239509 8442087 4862830 2966641 5108931
10428 5108931 6174043 3480595 1417603 2637580 3740718 3013824 3655348 6196591
10420 6196591 6352364 3508616 2910431 6230254 8169219 5780340 3258762 3885019 4687378
10411 4687378 2930160 1060673 1339869 1700835 586381 267091 1969569 2951588 1558796
10402 1558796 287363 948555 1474430 291251 -487932 1113156 3719968 5379267 6081546
10393 6081546 5964989 4469200 2452645 1761220 2027995 1417545 654857 2227168 5498561
$$ packed form
10453I803981L951384J19669n611175k591846K709510N92468k798052R23351M668290
10444A1767580q229n312364j591137M084430J289517m300577k250509L219360
10436F898071K315594j953893j108961K088698K02578l579257j896189K142290
10428E108931J065112k693448k062992J219977J103138p26894O41524K541243
10420F196591J55773k843748n98185L319823J938965k388879k521578O26257Q02359
10411D687378j757218j869487K79196L60966j114454l19290J702478R82019j392792
10402A558796j271433O61192N25875j183179p79183J601088K606812J659299P02279
10393F081546j16557j495789k016555o91425K66775o10450p62688J572311L271393
$$ plain form
10384 5498561 7075660 6276999 5696577 6132176 5796097 4936856 6105540 8947290 9740586
10375 9740586 7392936 5254095 5556713 6356999 5495977 3746888 2633151 2453706 3378138
10366 3378138 5361880 6648078 5640577 4148268 5123788 7520775 7527351 4723767 2651589
10357 2651589 3198995 4705092 5694430 6215991 5526060 2851342 389564 1086621 3620728
10348 3620728 4178895 2723826 2380724 3130815 1998826 -508291 -499858 2086241 2811547
10339 2811547 568503 -364528 1959474 3700121 2151411 256329 1009216 2562970
10331 2562970 2346813 1472256 1605558 1541634 207481 -636053 201904 759040 -335688
10322 -335688 -1023671 344745 1763167 1241718 510563 1822806 3897662 4314795 3594842
$$ packed form
10384E498561J577099p98661n80422M35599l36079q59241J168684K841750P93296
10375I740586k347650k138841L02618Q00286q61022j749089j113737j79445R24432
10366C378138J983742J286198j007501j492309R75520K396987O576k803584k072178
10357B651589N47406J506097R89338N21561o89931k674718k461778O97057K534107
10348C620728N58167j455069l43102P50091j131989k507117Q433K586099P25306
10339B811547k243044r33031K324002J740647j548710j895082P52887J553754
10331B562970k16157q74557J33302o3924j334153q43534Q37957N57136j094728
10322c35688o87983J368416J418422n21449p31155J312243K074856M17133p19953
$$ plain form
10313 3594842 3829725 5172262 6312737 6722591 6329880 4804716 2879478 2279748 2884066
10304 2884066 2452100 591499 -11349 1907944 3678758 2913168 1104203 481755 367836
10295 367836 -369083 -111203 2751275 6064999 6501761 4364711 2539733 1972441 1435250
10286 1435250 826360 1437556 3229462 4581718 4789263 4687856 4805474 4644439 3797860
10277 3797860 2440611 837051 -693418 -1764526 -2611541 -3938556 -5308651 -4932005
10269 -4932005 -2212226 757491 1729796 1279122 1563671 2928524 3684072 3025816 2255694
10260 2255694 2617403 3352317 2910026 1440790 927726 2612364 5129982 6013614 4682258
10251 4682258 2920150 2538066 3805441 6104381 8341389 8471761 5002950 -41653
$$ packed form
10313C594842K34883J342537J140475M09854l92711j525164j925238n99730O04318
10304B884066m31966j860601o02848J919293J770814p65590j808965o22448j13919
10295C67836p36919K57880K862478L313724M36762k137050j824978n67292n37191
10286A435250o08890O11196J791906J352256K07545j01407J17618j61035q46579
10277C797860j357249j603560j530469j071108q47015j327015j370095L76646
10269d932005K719779K969717R72305m50674K84549J364853P55548o58256p70122
10260B255694L61709P34914m42291j469236n13064J684638K517618Q83632j331356
10251D682258j762108l82084J267375K298940K237008J30372l468811n044603
$$ plain form
10243 -41653 -2173662 -1147 2814367 3034990 2230439 2860072 3215137 567876 -3039345
10234 -3039345 -3321474 -793344 82390 -1639024 -2247251 -113010 1851316 1703557 1370467
10225 1370467 2207215 2369075 942439 388827 2112120 3455892 2248688 935264 2585082
10216 2585082 5416508 5167636 1421951 -1897645 -1694336 1304177 4343707 5429245
10208 5429245 4500252 3092382 2575295 2345759 810606 -1644595 -2523063 -763866 1534651
10199 1534651 2029506 1030534 314986 581893 1231917 1464096 827327 -179949 88212
10190 88212 2411406 4658362 4091807 1670686 1027325 2727615 3158397 495447 -1916138
10181 -1916138 -646053 2328651 2396989 -1201770 -4694301 -4733800 -1680740 1653158 2869750
$$ packed form
10243d1653k132009K172515K815514K20623q04551O29633L55065k647261l607221
10234c039345k82129K528130Q75734j721414o08227K134241J964326j47759l33090
10225A370467Q36748J61860j426636n53612J723293J343772j207204j313424J649818
10216B585082K831426k48872l745685l319596K03309K998513L039530J085538
10208E429245r28993j407870n17087k29536j535153k455201q78468J759197K298517
10199A534651M94855r98972p15548K66907O50024K32179o36769j007276K68161
10190H8212K323194K246956n66555k421121o43361J700290M30782k662950k411585
10181a916138J270085K974704O8338l598759l492531l9499L053060L333898J216592
$$ plain form
10172 2869750 1883817 872073 1775128 3586870 3426791 555571 -2553269 -3688316 -3285840
10163 -3285840 -2470408 -1046917 1112833 2664423 2441639 1114457 -56023 -760711 -986847
10154 -986847 -360535 907854 1885824 2408928 3134821 3771777 3312390 2406652 3021346
10145 3021346 5080599 6069807 4819199 2984141 1913639 1032143 343024 1201083 3176957
10136 3176957 3632590 2185636 1944154 4080587 5046045 2236221 -1184680 -921606 1963865
10127 1963865 3388046 2745540 2628672 3577475 3559358 2067689 823173 520906 125945
10118 125945 -677146 -1123526 -1260604 -1706000 -1884028 -887372 381405 275012 -908291
10109 -908291 -1551006 -1385580 -1256941 -976029 140602 1278241 1208248 754540 1569984
$$ packed form
10172B869750r85933j011744R03055J811742j60079k871220l108840j135047M02476
10163c285840Q15432J423491K159750J551590k22784j327182j170480p04688k26136
10154i86847O26312J268389R77970N23104P25893O36956m59387r05738O14694
10145C021346K059253R89208j250608j835058j070502q81496o89119Q58059J975874
10136C176957M55633j446954k41482K136433R65458k809824l420901K63074K885471
10127A963865J424181o42506j16868R48803j8117j491669j244516l02267l94961
10118A25945q03091m46380j37078m45396j78028R96656J268777j06393j183303
10109i08291o42715J65426J28639K80912J116631J137639o9993m53708Q15444
$$ plain form
10100 1569984 2988696 2864925 1241054 338777 903321 1357252 885918 657267 1314532
10091 1314532 1716639 1205844 1164481 3077926 6277460 8565677 8368488 5874704 2763782
10082 2763782 991540 1218495 2383802 3104891 2972684 2167526 944498 255990 1481915
10073 1481915 4267861 5944082 4674801 2058065 934966 1726518 2774289 3237827
10065 3237827 3526893 3615228 3087186 2434183 2414052 2562876 2089553 1654278 2400901 3759858
10055 3759858 4094237 3115530 1954160 1337900 1286470 1878892 2712072 2602317 1594658
10046 1594658 1942043 4870604 7805339 7603969 5313363 4455458 5510444 5812696 4542266
10037 4542266 3812446 4425865 4438591 2891685 1376780 636424 -937704 -3776122 -5351284
$$ packed form
10100A569984J418712j23771j623871r02277N64544M53931m71334k28651O57265
10091A314532M02107n10795m1363J913445L199534K288217j97189k493784l110922
10082B763782j772242K26955J165307P21089j32207q05158j223028o88508J225925
10073A481915K785946J676221j269281k616736j123099P91552J047771M63538
10065C237827K89066Q8335n28042o53003k0131J48824m73323m35275P46623J358957
10055C759858L34379r78707j161370o16260n1430N92422Q33180j09755j007659
10046A594658L47385K928561K934735k01370k290606q57905J054986L02252j270430
10037D542266p29820O13419J2726j546906j514905p40356j574128k838418j575162
$$ plain form
10028 -5351284 -3994146 -1671743 -711188 -324110 1060164 2275835 1267735 -1045909
10020 -1045909 -1836938 -572870 581945 317739 -271613 181386 1614422 3310612 4848263
10011 4848263 5860466 5965881 5311606 4463993 3650155 2679537 1504273 322916 -587053
10002 -587053 -627956 951530 3834960 6123862 6096470 4190800 2275366 1312647 884454
9993 884454 672038 839247 850112 -365378 -2340592 -2686175 -35390 3632905 5063797
9984 5063797 3557151 1303300 288658 552099 1525263 3148367 4852791 5126029 3495056
9975 3495056 1841851 2203223 3951312 4705489 3581750 1897898 846513 192718 -523909
9966 -523909 -1070986 -1222236 -1042283 -169134 1712900 3288459 2278666 -1324521 -4247825
$$ packed form
10028e351284J357138K322403R60555L87078J384274J215671j008100k313644
10020a045909p91029J264068J154815k64206n89352M52999J433036J696190J537651
10011D848263J012203J05415o54275q47613q13838r70618j175264j181357r09969
10002e87053m0903J579486K883430K288902k7392j905670j915434r62719m28193
9993H84454k12416J67209J0865j215490j975214l45583K650785L668295J430892
9984E063797j506646k253851j014642K63441R73164J623104J704424K73238j630973
9975C495056j653205L61372J748089P54177j123739j683852j051385o53795p16627
9966e23909n47077j51250J79953Q73149J882034J575559j009793l603187k923304
$$ plain form
9957 -4247825 -3553478 -192802 2454603 2745608 1948924 1751414 2227356 2498040 2265229
9948 2265229 2090096 2439200 2762594 1846259 -480122 -2331508 -1578242 1245703 3255214
9939 3255214 2963422 2139276 2827543 4089949 3618091 1645184 880715 2474492 4178213
9930 4178213 3414706 734802 -1023826 -360074 1282871 1519777 -175607 -2045947 -2110401
9921 -2110401 -210076 2088543 3317937 3486776 3672006 4592510 5804562 6223470 5273861
9912 5273861 3444672 1781493 1076380 1606359 3130976 4682304 4980921 3977406 3396739
9903 3396739 4416705 5438187 4249357 2048614 2302568 5070001 6065585 3195819 465591
9894 465591 2296666 6870681 8989432 7441966 5303974 4367370 3737901 3255115 3966651
$$ packed form
9957d247825O94347L360676K647405K91005p96684j97510M75942K70684k32811
9948B265229j75133L49104L23394r16335k326381j851386P53266K823945K009511
9939C255214k91792q24146O88267J262406m71858j972907p64469J593777J703721
9930D178213p63507k679904j758628O63752J642945K36906j695384j870340o4454
9921b110401J900325K298619J229394J68839J85230R20504J212052M18908r49609
9912E273861j829189j663179p05113N29979J524617J551328K98617j003515n80667
9903C396739J019966J021482j188830k200743K53954K767433R95584k869766k730228
9894D65591J831075M574015K118751j547466k137992r36604o29469m82786P11536
$$ plain form
9885 3966651 5351260 5851026 5842178 6583807 7232498 6787885 7253235 9970728 11238625
9876 11238625 8375310 7556091 15511061 23826727 14580365 -13695034 -38071406 -38135304
9868 -38135304 -21218388 -9858984 -11671226 -15202204 -11870039 -6921712 -6881247 -8934918
9860 -8934918 -8035431 -5533770 -4795238 -4486986 -1950887 1105767 1547789 466015 1171662
9851 1171662 3404197 3766622 1188047 -1506587 -1654239 6132 826757 -295930 -1835374
9842 -1835374 -1863422 -682945 -340520 -1583629 -2825482 -2773446 -2279199 -2314011 -2017648 -607224
9832 -607224 564213 75564 -1048900 -1243654 -1175926 -2048206 -2844846 -2186966 -1256693 -1632587
9822 -1632587 -1855401 169971 2787657 2684418 316351 -1001013 -649918 -924377 -2169286
$$ packed form
9885C966651J384609M99766q848P41629O48691m44613M65350K717493J267897
9876A1238625k863315q19219P954970Q315666r246362k8275399k4376372o3898
9868c8135304J6916916J1359404j812242l530978L332165M948327M0465k053671
9860h934918Q99487K501661P38532L08252K536099L056654M42022j081774P05647
9851A171662K232535L62425k578575k694634j47652J660371Q20625j122687j539444
9842a835374k8048J180477L42425j243109j241853N2036M94247l4812K96363J410424
9832f07224J171437m88649j124464j94754O7728q72280p96640O57880R30273l75894
9822a632587k22814K025372K617686j03239k368067j317364L51095k74459j244909
$$ plain form
9813 -2169286 -2348697 -1439753 -1632588 -2865544 -2733702 -1266487 -1074135 -2097282 -1243870
9804 -1243870 1580019 2294759 -581475 -3031214 -2035923 -300209 -1153774 -2765103 -1410766
9795 -1410766 2350868 4715308 4083266 2166680 775483 103052 -470463 -1477685 -2542740
9786 -2542740 -2008336 923171 3607819 2385243 -1850917 -3981345 -1759768 1170288
9778 1170288 1194276 -268076 -409420 -44277 -1346639 -3273375 -3104325 -889260 999839
9769 999839 1526452 1413039 1180122 1255924 2617531 4904804 5488383 2961533 -69697
9760 -69697 -378855 1344089 2286332 2209533 2858743 3783178 2624841 -517631 -2521725
9751 -2521725 -1634534 349577 1066404 466650 -130347 -70493 464130 1115551 1476888 1301647
$$ packed form
9813b169286j79411R08944j92835j232956J31842J467215J92352j023147Q53412
9804a243870K823889P14740k876234k449739R95291J735714q53565j611329J354337
9795a410766L761634K364440o32042j916586j391197o72431n73515j007222j065055
9786b542740N34404K931507K684648j222576m236160k130428K221577K930056
9778A170288K3988j462352j41344L65143j302362j926736J69050K215065J889099
9769I99839N26613j13413k32917P5802J361607K287273N83579k526850l031230
9760f9697l09158J722944R42243p6799O49210R24435j158337l142472k004094
9751b521725Q87191J984111P16827n99754n96997N9854N34623O51421L61337j75241
$$ plain form
9741 1301647 916035 897369 1323593 1742388 1666169 862338 -304426 -674972 612726 2581966
9731 2581966 3185420 2001698 745705 595640 697256 89945 -687268 -950594 -1050864
9722 -1050864 -1042109 -32114 1758127 2172714 63031 -2581280 -3197796 -1907938 -590290
9713 -590290 -202362 -639810 -1666505 -2312620 -1072583 1510645 2385974 195062 -2135258
9704 -2135258 -1547619 459344 514366 -921470 -396601 2695459 5021536 4280265 1885311
9695 1885311 594 -1150141 -1940886 -1768701 -289751 1345734 1837504 1472746 1591024
9686 1591024 2691702 3611399 2750598 328547 -1053817 597772 3261385 2719307 -1530444
9677 -1530444 -4932831 -4120430 -1622531 -1586186 -3389355 -3345365 -1028720 586124 681287
$$ packed form
9741A301647l85612j8666M26224M18795p6219q03831j166764l70546J287698J969240
9731B581966O03454j183722j255993j50065J01616o07311p77213k63326j00270
9722a050864Q755J009995J790241M14587k109683k644311o16516J289858J317648
9713e90290L87928m37448j026695o46115J240037K583228Q75329k190912k330320
9704b135258N87639K006963N5022j435836N24869L092060K326077p41271k394954
9695A885311j884717j150735p90745J72185J478950J635485M91770l64758J18278
9686A591024J100678R19697q60801k422051j382364J651589K663613n42078m249751
9677a530444l402387Q12401K497899L6345j803169M3990K316645J614844R5163
$$ plain form
9668 681287 1677035 4261379 5609207 3988177 1615470 1059449 1589935 1091735 -602487
9659 -602487 -2238814 -3231563 -3394610 -2073489 602220 2687820 2408184 530231 -664581
9650 -664581 -269495 626396 834909 409065 83628 194260 415762 356203 286331 1026038
9640 1026038 2795013 4485310 4678881 3210167 1128963 -596296 -1616958 -1845815 -1578065
9631 -1578065 -1747865 -2948021 -4246230 -4103574 -2550093 -1323637 -1594516 -2565824 -2704375
9622 -2704375 -1529082 199556 1382644 1349470 331462 -510200 -34161 1577868 2790898
9613 2790898 2245532 203686 -1575418 -1376085 863858 3382986 4250823 3168857 1303610
9604 1303610 -342574 -1512710 -1846439 -865664 769219 1308877 -24292 -2026823 -3156321
$$ packed form
9668F81287R95748K584344J347828j621030k372707n56021N30486m98200j694222
9659f02487j636327r92749j63047J321121K675709K085600k79636j877953j194812
9650f64581L95086Q95891K08513m25844l25437J10632K21502n9559o9872P39707
9640A026038J768975J690297J93571j468714k081204j725259j020662k28857K67750
9631a578065j69800j200156j298209J42656J553481J226456k70879r71308j38551
9622b704375J175293J728638J183088l3174j018008q41662M76039J612029J213030
9613B790898n45366k041846j779104J99333K239943K519128Q67837j081966j865247
9604A303610j646184j170136l33729R80775J634883N39658j333169k002531j129498
$$ plain form
9595 -3156321 -3107837 -2260610 -928391 143146 19627 -831816 -772571 282832 281633 -1561131
9585 -1561131 -2918988 -1808203 122250 153959 -1337698 -2011812 -1468246 -962952 -194478
9576 -194478 2202476 5157411 5502790 2375683 -1447322 -3322107 -3450896 -3040571 -2043087
9567 -2043087 -37371 2164486 3079409 2071481 -179743 -2158145 -2541723 -1533996 -835286
9558 -835286 -1429887 -2101020 -1333482 182626 578925 -339920 -1030608 -515521 868052
9549 868052 2448380 3393006 2746972 1015271 643876 2925102 5627261 6019844 4874053
9540 4874053 4577588 4624739 2617860 -986946 -3031176 -2402588 -927534 378136 2021519
9531 2021519 2959657 1239649 -1598656 -1305388 2518460 5005876 3025594 -566076 -1954932
$$ packed form
9595c156321M8484Q47227J332219J071537j23519q51443N9245J055403j199j842764
9585a561131j357857J110785J930453L1709j491657o74114N43566N05294P68474
9576a94478K396954K954935L45379l127107l823005j874785j28789M10325R97484
9567b043087K005716K201857R14923j007928k251224j978402l83578J007727O98710
9558h35286n94601o71133P67538J516108L96299r18845o90688N15087J383573
9549H68052J580328R44626o46034j731701l71395K281226K702159L92583j145791
9540D874053k96465M7151k006879l604806k044230O28588J475054J305670J643383
9531B021519R38138j720008k838305K93268L823848K487416j980282l591670j388856
$$ plain form
9522 -1954932 -1679401 -2097611 -3023175 -3025107 -2301593 -1349755 691472 3685963 5120169
9513 5120169 3821487 2352326 2776732 2905556 220428 -3173177 -3624361 -1897264 -1670917
9504 -1670917 -3398999 -3973951 -1877754 1205476 3525658 4533470 3534871 627527 -1428828
9495 -1428828 63043 3276443 3769912 942002 -1169421 -48778 2063100 2199923 607893
9486 607893 -835514 -1382127 -1038990 280883 1774388 1825758 277819 -1119268 -1428888
9477 -1428888 -1760992 -2861954 -3605062 -3181260 -2837188 -3835534 -5216238 -5187772 -3593598
9468 -3593598 -1601869 25577 1021956 863091 -702841 -2798661 -4032511 -3708849 -2108315
9459 -2108315 -245393 456243 -664923 -2230095 -1883984 706151 2962513 2265138 -1089180
$$ packed form
9522a954932K75531m18210r25564j932P23514R51838K041227K994491J434206
9513E120169j298682j469161M24406J28824k685128l393605m51184J727097K26347
9504a670917j728082n74952K096197L083230K320182J007812r98599k907344k056355
9495a428828J491871L213400M93469k827910k111423J120643K111878J36823j592030
9486F07893j443407n46613L43137J319873J493505N1370j547939j397087l09620
9477a428888l32104j100962p43108M23802L44072r98346j380704K8466J594174
9468c593598J991729J627446R96379j58865j565932k095820j233850L23662J600534
9459b108315J862922P01636j121166j565172L46111K590135K256362o97375l354318
$$ plain form
9450 -1089180 -4370893 -5113721 -2970009 223009 1860155 923932 -866809 -1181321 -176695
9441 -176695 38436 -1016236 -1295593 413928 2398416 2626870 1752062 1868923 3417376
9432 3417376 4847763 4666875 2740748 262272 -901459 153051 1858696 1727835 -80227
9423 -80227 -744676 775496 1807258 195124 -2070051 -2014189 -327731 273420 -333347
9414 -333347 -251339 374202 -216081 -1358790 -454850 2209507 3167295 1244657 -564512
9405 -564512 -241077 6729 -2038008 -4428257 -4134797 -1843561 -388837 -107352 871009
9396 871009 2685922 3410282 2429332 1298591 1020765 836648 101903 -627495 -823059
9387 -823059 -651570 -103237 1020681 2010791 1693091 324892 -405203 286941 1249529
$$ packed form
9450a089180l281713p42828K143712L193018J637146r36223j790741l14512J004626
9441a76695K15131j054672k79357J709521J984488K28454q74808J16861J548453
9432C417376J430387j80888j926127k478476j163731J054510J705645j30861j808062
9423h0227o64449J520172J031762j612134k265175N5862J686458O01151o06767
9414c33347Q2008O25541n90283j142709R03940K664357R57788j922638j809169
9405e64512L23435K47806k044737k390249K93460K291236J454724K81485R78361
9396H71009J814913P24360r80950j130741k77826j84117p34745p29398j95564
9387h23059J71489N48333J123918R90110l17700j368199p30095O92144R62588
$$ plain form
9378 1249529 1135373 -46788 -1550064 -2850416 -3461937 -2894779 -1437571 -172784 240765
9369 240765 98225 -186871 -505671 -492353 324128 1490298 1891795 1432936 1275500 1941522
9359 1941522 2435109 1869331 672601 -619590 -2421891 -4806182 -6348364 -5762247 -3949396
9350 -3949396 -2932907 -3168492 -3318380 -2485992 -1289233 -599458 -411814 -367175 -558230
9341 -558230 -1294234 -2429514 -3268661 -3117265 -1975451 -684512 -79661 23332 462615
9332 462615 1305843 1675649 1322323 1247974 1963685 2195967 574741 -2128737 -3837280
9323 -3837280 -3757803 -2746644 -1543934 -303469 339574 -321012 -1313963 -602269 1853804
9314 1853804 3488205 2635644 892115 523007 1163461 1108828 561879 960469 1708743
$$ packed form
9378A249529j14156j182161j503276j300352o11521N67158J457208J264787M13549
9369B40765j42540k85096l18800J3318Q16481J166170M01497m58859j57436O66022
9359A941522M93587n65778j196730j292191j802301k384291j542182N86117J812851
9350c949396J016489k35585j49888Q32388J196759O89775J87644M4639j91055
9341e58230p36004j135280q39147J51396J141814J290939O04851J02993M39283
9332D62615Q43228L69806l53326p4349P15711K32282j621226k703478j708543
9323c837280P9477J011159J202710J240465O43043o60586r92951P11694K456073
9314A853804J634401q52561j743529l69108O40454n4633n46949L98590P48274
$$ plain form
9305 1708743 612372 -2122292 -3325418 -1436376 1096173 1763641 1793389 3353409 5023628
9296 5023628 3689062 122542 -1230955 1501175 5062394 5900438 4471162 3059202
9288 3059202 2097564 943398 148559 381386 600756 -242518 -959401 -44500 1304038
9279 1304038 786884 -1166637 -1979871 -966406 -32536 -333552 -783394 -237283 946540
9270 946540 1835788 1778410 526136 -923986 -497532 1880644 2747679 -366221 -4240185
9261 -4240185 -3832832 5794 1594205 -802518 -2770358 -1469970 191919 -430624 -986031
9252 -986031 1064571 3669105 4373465 5036205 7626939 9100575 5961505 1062120 -15878
9243 -15878 2622885 4303046 3866693 4358521 6143999 5847008 2963920 1561542 3650074
$$ packed form
9305A708743j096371k734664j203126J889042K532549O67468K9748J560020J670219
9296E023628j334566l566520j353497K732130L561219Q38044j429276j411960
9288C059202r61638j154166p94839K32827K19370q43274p16883R14901J348538
9279A304038n17154j953521q13234J013465R33870l01016m49842N46111J183823
9270I46540Q89248n7378j252274j450122M26454K378176Q67035l113900l873964
9261d240185M07353L838626J588411k396723j967840J300388J661889o22543n55407
9252i86031K050602K604534P04360O62740K590734J473636l139070m899385j077998
9243a5878K638763J680161m36353M91828J785478k96991k883088j402378K088532
$$ plain form
9234 3650074 6018909 5744697 4214138 3334111 2107606 -121541 -833123 1824325 5221209
9225 5221209 5745259 4033901 3420328 4657180 5380832 4065678 1760548 127414 -166052
9216 -166052 726411 1943214 2065756 611260 -780563 30883 2842393 4980570 4340811
9207 4340811 1888425 593243 1893245 3751352 3018873 -369253 -3022765 -2620025 -1037278
9198 -1037278 -1286501 -2948763 -3247442 -1670141 -408820 -410999 -187493 1007836 1839329
9189 1839329 1600319 1475295 1958867 1606113 -264456 -1957991 -1997861 -1250231 -948214
9180 -948214 -561429 744841 2253053 2883366 2730701 2047436 293234 -2391054 -4327106
9171 -4327106 -4344779 -3235212 -1949067 -68253 2523286 4233745 3706404 1674960 -541686
$$ packed form
9234C650074K368835k74212j530559q80027j226505k229147p11582K657448L396884
9225E221209N24050j711358o13573J236852P23652j315154k305130j633134k93466
9216a66052Q92463J216803J22542j454496j391823Q11446K811510K138177o39759
9207D340811k452386j295182J300002J858107p32479l388126k653512M02740J582747
9198a037278k49223j662262k98679J577301J261321k179K23506J195329Q31493
9189A839329k39010j25024M83572l52754j870569j693535l9870P47630L02017
9180i48214L86785J306270J508212O30313j52665o83265j754202k684288j936052
9171d327106j7673J109567J286145J880814K591539J710459n27341k031444k216646
$$ plain form
9162 -541686 -2654400 -4066678 -3148331 -4152 2066714 556137 -2372256 -2820341 -694902
9153 -694902 799004 368025 -59280 801375 1663261 1392610 1040507 1926150 3491669
9144 3491669 4253558 3729867 2568268 1653387 1699479 2956920 4766937 5867227 5428396
9135 5428396 3571803 1097355 -849806 -1277205 -268257 864413 1030156 610364 558483
9126 558483 776681 425150 -421958 -574194 649269 2369821 3005494 1835724 -314965
9117 -314965 -1739734 -1349604 297777 1654455 1854472 1319793 812556 626227 755153
9108 755153 992998 698632 -626542 -2314836 -3013178 -2379221 -1315470 -411402 624140
9099 624140 1762359 2268380 1960032 1573422 1419838 906723 -239562 -1517217 -2587081
$$ packed form
9162e41686k112714j412278R18347L144179K070866j510577k928393m48085K125439
9153f94902J493906m30979m27305Q60655Q61886k70651l52103Q85643J565519
9144C491669P61889n23691j161599r14881M6092J257441J810017J100290m38831
9135E428396j856593k474448j947161m27399J008948J132670J65743m19792n1881
9126E58483K18198l51531q47108j52236J223463J720552O35673j169770k150689
9117c14965j424769L90130J647381J356678K00017n34679n07237j86329J28926
9108G55153K37845k94366j325174j688294o98342O33957J063751R04068J035542
9099F24140J138219N06021l08348l86610j53584n13115j146285j277655j069864
$$ plain form
9090 -2587081 -3277022 -2768085 -679429 1162997 579591 -1136345 -326106 3277755 5300297
9081 5300297 2866038 -1319316 -3319333 -3282857 -3484445 -3810322 -2790763 -1179569 -764699
9072 -764699 -865330 425449 2404963 2663278 1284581 763250 1884223 2824472 2426976
9063 2426976 1460258 405253 -1276823 -3260613 -4145900 -3553517 -2407885 -1064353 718488
9054 718488 2034208 1531839 97846 376208 3043574 5746213 6410982 5648766 5138825
9045 5138825 5363074 5743328 5682337 4834089 3313118 1834422 813600 -299248 -1744084
9036 -1744084 -2357521 -1338149 -174506 -721956 -2107569 -1961548 -202479 1049381 1048177
9027 1048177 1077680 1531413 1334559 701180 1453852 3678892 4835107 3473273 1474330
$$ packed form
9090b587081o89941N08937K088656J842426n83406j715936Q10239L603861K022542
9081E300297k434259m185354k000017L6476k01588l25877J019559J611194M14870
9072g64699j00631J290779J979514K58315j378697n21331J120973R40249l97496
9063B426976r66718j055005j682076j983790q85287N92383J145632J343532J782841
9054G18488J315720n02369j433993K78362K667366K702639O64769p62216n09941
9045E138825K24249L80254o0991q48248j520971j478696j020822j112848j444836
9036a744084o13437J019372J163643n47450j385613J46021J759069J251860j204
9027A048177K9503M53733j96854o33379P52672K225040J156215j361834j998943
$$ plain form
9018 1474330 1176120 2269651 2975051 2654222 1895798 1236100 813009 324976 -1034174
9009 -1034174 -3323575 -4557626 -2609855 1323617 3417903 2069346 -142751 -276461
9001 -276461 1321008 2396938 1962719 739883 -91572 488856 2548597 4144293 2662757
8992 2662757 -1765931 -5697128 -6191685 -3802325 -1014229 553008 420891 -1424258 -4056144
8983 -4056144 -5762694 -5882566 -5444849 -5297473 -5024237 -4366405 -3936726 -3604368 -2050233
8974 -2050233 860865 3041300 2898612 1518217 763465 727005 521287 180845 246371
8965 246371 619723 1144798 2138136 3162595 2652615 121959 -2510327 -3158708 -2048742
8956 -2048742 -853657 -582619 -1344885 -2816133 -3893657 -3355731 -1782787 -1078018 -1258389
$$ packed form
9018A474330k98210J093531P05400l20829p58424o59698m23091m88033j359150
9009a034174k289401j234051J947771L933472K094286j348557k212097j33710
9001b76461J597469J075930m34219j222836q31455N80428K059741J595696j481536
8992B662757m428688l931197m94557K389360K788096J567237j32117j845149k631886
8983d056144j706550j19872M37717J47376K73236O57832M29679L32358J554135
8974b050233K911098K180435j42688j380395p54752l6460k05718l40442O5526
8965B46371L73352N25075R93338J024459n09980k530656k632286o48381J109966
8956b048742J195085K71038p62266j471248j077524N37926J572944P04769j80371
$$ plain form
8947 -1258389 -124036 2600885 3710995 1355557 -1282367 -210890 3521619 5578465
8939 5578465 4449397 2317623 853241 -172981 -438610 1145655 3772557 4834726
8931 4834726 3378540 1180712 -38450 -368228 -403095 -262262 -254962 -732544 -1162931 -1019023
8921 -1019023 -1259651 -2906044 -4609127 -4131179 -1977740 -727031 -757433 175326 2647627
8912 2647627 4269076 3772453 3029645 3279038 2606429 -356959 -3082814 -2653108 -528315
8903 -528315 -280974 -1869845 -1962468 383945 2157126 1228483 -552621 -654730 368131
8894 368131 548929 104642 740002 2155580 1976770 -475376 -2613661 -1963359 448252
8885 448252 1686083 980249 270851 791328 1126352 -430372 -3027857 -4209425 -3098956
$$ packed form
8947a258389J134353K724921J110110k355438k637924J071477L732509K056846
8939E578465j129068k131774j464382j026222k65629J584265K626902J062169
8931D834726j456186k197828j219162l29778l4867J40833P300m77582m30387J43908
8921a019023k40628j646393j703083M77948K153439J250709l0402R32759K472301
8912B647627J621449m96623p42808K49393o72609k963388k725855M29706K124793
8903e28315K47341j588871r2623K346413J773181r28643j781104j02109J022861
8894C68131J80798m44287O35360J415578j78810k452146k138285O50302K411611
8885D48252J237831p05834p09398N20477L35024j556724k597485j181568J110469
$$ plain form
8876 -3098956 -1263067 -464015 -698233 -787744 -140444 635998 659900 -76938 -702933 -642382
8866 -642382 -417711 -747412 -1151168 -489804 1046703 1838060 1279365 879044 1780122 2509930
8856 2509930 971972 -2063901 -3465644 -1675510 1568128 3636733 3652670 2448953 1297921
8847 1297921 1141947 1935610 2344136 1127350 -942362 -1729125 -546684 1067201 1822723
8838 1822723 2339449 3449737 4319834 3642799 1788493 418077 472107 1542139 2627836
8829 2627836 2570223 555169 -2530599 -3934624 -1817739 2079228 4122736 3134292 1497166
8820 1497166 1668128 3161288 3743216 2416668 248092 -1061200 -641393 997241 2310484
8811 2310484 2092943 850159 124428 216676 -251318 -1840960 -2770121 -1290802 1448271
$$ packed form
8876c098956J835889P99052k34218q9511O47300P76442K3902p36838o25995O0551
8866f42382K24671l29701m03756O61364J536507P91357n58695m00321R01078P29808
8856B509930j537958l035873j401743J790134L243638K068605J5937j203717j151032
8847A297921j55974P93663M08526j216786k069712p86763J182441J613885P55522
8838A822723N16726J110288Q70097o77035j854306j370416N4030J070032J085697
8829B627836n7613k015054l085768j404025K116885L896967K043508r88444j637126
8820A497166J70962J493160N81928j326548k168576j309292M19807J638634J313243
8811B310484k17541j242784p25731R2248m67994j589642r29161J479319K739073
$$ plain form
8802 1448271 2751439 2029452 1073187 810588 41020 -2061806 -4304120 -5391663 -5681749
8793 -5681749 -5664862 -4362144 -1075498 2493064 4007279 3689861 3588819 4043439 3321758
8784 3321758 1053452 -462022 439514 2067281 1653371 -766146 -2558934 -2190489 -1007191
8775 -1007191 -1021570 -2242634 -3116100 -2959704 -2700653 -2941307 -2477864 15438 3311970
8766 3311970 4433924 2618035 729160 1444484 3490780 3570871 1036673 -1690475 -2950800
8757 -2950800 -3517127 -4155891 -4077192 -2812666 -1492369 -935327 -285188 962295 1250923
8748 1250923 -798385 -3614304 -4239048 -2149042 300049 989663 3446 -1370270 -2052161
8739 -2052161 -1498576 32733 1315611 1348412 830520 1319641 2791551 3386673 2106748
$$ packed form
8802A448271J303168p21987r56265k62599p69568k102826k242314j087543k90086
8793e681749J6887J302718L286646L568562J514215l17418j01042M54620p21681
8784C321758k268306j515474R01536J627767m13910k419517j792788L68445J183298
8775a007191j4379j221064q73466J56396K59051k40654M63443K493302L296532
8766C311970J121954j815889j888875P15324K046296Q0091k534198k727148j260325
8757b950800n66327o38764P8699J264526J320297N57042O50139J247483K88628
8748A250923k049308k815919o24744K090006K449091O89614r86217j373716o81891
8739b052161N53585J531309J282878L2801n17892M89121J471910N95122j279925
$$ plain form
8730 2106748 474280 513725 2000893 3016633 2782335 2422504 2716829 2659498 1294633
8721 1294633 -164526 201436 1783948 1738200 -892320 -3238774 -2157271 1666013 4820499
8712 4820499 5349533 3991840 2134117 749143 875999 2669096 3991483 2493665 -622193
8703 -622193 -1593935 511322 2304025 1216666 -796311 -717573 989705 1968566 2059504
8694 2059504 2685493 3451509 2681062 891430 581920 2285078 3504568 2281025 -296390
8685 -296390 -1932272 -1796878 -597000 627935 1024343 331623 -566927 -340978 1051711
8676 1051711 2049343 1295521 -795162 -2508239 -2427569 -550270 1768941 3073551 3249273
8667 3249273 3289766 3462931 2774335 920732 -523854 -143792 1217000 1926940 2037293
$$ packed form
8730B106748j632468L9445J487168J015740k34298l59831K94325n7331j364865
8721A294633j459159L65962J582512m5748k630520k346454J081503L823284L154486
8712D820499N29034j357693j857723j384974J26856J793097J322387j497818l115858
8703f22193r71742K105257J792703j087359k012977P8738J707278R78861R0938
8694B059504O25989P66016p70447j789632l09510J703158J219490j223543k577415
8685b96390j635882J35394J199878J224935L96408o92720q98550K25949J392689
8676A051711R97632p53822k090683j713077Q0670J877299K319211J304610J75722
8667C249273M0493J73165o88596j853603j444586L80062J360792P09940J10353
$$ plain form
8658 2037293 2332212 1912034 -669637 -4184073 -5457406 -3755241 -1873806 -1980975 -2714151
8649 -2714151 -1756695 627149 2293355 2156174 864364 -595745 -1648310 -2075040 -2183241
8640 -2183241 -2417166 -2165133 -40849 3656622 5980473 4496913 817513 -816163 1442157
8631 1442157 4932884 5881789 3706853 1057717 254602 912075 1299161 1025040 1286232
8622 1286232 2625073 3788147 3566211 2763239 3026219 4234049 4658999 3746245 3008281
8613 3008281 3527744 4162940 3454916 2141984 2116599 3391434 3908636 2644456 1336248
8604 1336248 2103082 4242665 4826288 2559759 -184927 -91764 2900318 5375929 4683353
8595 4683353 2244791 1629343 3921412 6395077 6010126 3046054 478766 417179 2136267
$$ packed form
8658B037293K94919m20178k581671l514436j273333J702165J881435j07169p33176
8649b714151R57456K383844J666206j37181j291810j460109j052565m26730j08201
8640b183241k33925K52033K124284L697471K323851j483560l679400j633676K258320
8631A442157L490727R48905k174936k649136q03115O57473L87086k74121K61192
8622A286232J338841J163074k21936q02972K62980J207830M24950r12754p37964
8613C008281N19463O35196p08024j312932k5385J274835N17202j264180j308208
8604A336248P66834K139583N83623k266529k744686R3163K992082K475611o92576
8595D683353k438562o15448K292069K473665l84951k964072k567288o1587J719088
$$ plain form
8586 2136267 3475197 3226528 1852586 589890 475501 1833968 3924201 5177447 4594400
8577 4594400 3035758 2316555 2801042 2911761 1521287 -387496 -1421230 -1883866 -2625934
8568 -2625934 -2836364 -1173820 1341035 2026057 363640 -1206348 -920419 134021 395879
8559 395879 205535 521734 1165999 1736995 2544799 3275155 2569385 493221 -514939
8550 -514939 909752 2499547 1502076 -1236161 -2843735 -2670129 -2184140 -1749543 -552599
8541 -552599 859165 1032251 487799 1304845 3607232 4980811 3782122 962289 -1564169
8532 -1564169 -2466375 -1117018 1692211 3388731 2246623 106568 82126 2028698 3189714
8523 3189714 2966944 3470252 5039326 5087862 2588320 171171 71122 1076652 1348041
$$ packed form
8586B136267J338930k48669j373942j262696j14389J358467K090233J253246n83047
8577D594400j558642p19203M84487J10719j390474j908783j033734m62636p42068
8568b625934k10430J662544K514855O85022j662417j569988K85929J054440K61858
8559C95879j90344L16199O44265N70996Q07804P30356p05770k076164j008160
8550e14939J424691J589795r97471k738237j607574J73606M85989M34597J196944
8541e52599J411764J73086n44452Q17046K302387J373579j198689k819833k526458
8532a564169r02206J349357K809229J696520j142108k140055k4442J946572J161016
8523C189714k22770N03308J569074M8536k499542k417149j00049J005530K71389
$$ plain form
8514 1348041 1343765 1826039 1656621 49879 -1198340 -270163 1685292 2527734 2457417 2946482
8504 2946482 3795547 3808058 3314082 3491735 3862814 2835470 463724 -1305596 -1108781
8495 -1108781 459662 1721231 1263081 -904782 -2754495 -1934146 1033055 2736774 1252176
8486 1252176 -1234625 -1773240 -722086 -285110 -693331 -592383 -52423 -232457 -711404
8477 -711404 -117682 847909 -4292 -2511542 -3678292 -1744711 1552661 3579150 3692601
8468 3692601 2757928 1602374 901850 1131730 1712725 1326463 -291726 -1934715 -2666628
8459 -2666628 -2767139 -2624691 -2117210 -1566586 -1781560 -2429050 -1855253 493762 2802235
8450 2802235 3165595 1972153 758568 -205591 -1594926 -3044914 -3317943 -2269548 -997380
$$ packed form
8514A348041m276M82274j69418j606742j248219R28177J955455Q42442p0317M89065
8504B946482Q49065J2511m93976J77653L71079j027344k371746j769320J96815
8495a108781J568443J261569m58150k167863j849713Q20349K967201J703719j484598
8486A252176k486801n38615J051154M36976m08221J00948N39960j80034m78947
8477g11404N93722R65591q52201k507250j166750J933581L297372K026489J13451
8468C692601r34673j155554p00524K29880N80995l86262j618189j642989p31913
8459b666628j00511J42448N07481N50624k14974o47490N73797K349015K308473
8450B802235L63360j193442j213585r64159j389335j449988k73029J048395J272168
$$ plain form
8441 -997380 17929 1270232 2477116 2384005 1206685 1343578 3904975 6061885 4417133
8432 4417133 270195 -1616007 238076 1969032 531968 -1531824 -465182 2278010
8424 2278010 2200037 -987659 -3026479 -2068028 -1170496 -2521900 -3711229 -2326408 -421821
8415 -421821 -865290 -2062931 -418229 3605763 5977328 4929635 2510803 487044 -1597157
8406 -1597157 -3771416 -4517000 -3532698 -2834764 -3589156 -4130967 -2797346 -775540 -145344
8397 -145344 -509242 188898 2164082 3336482 2526562 1265748 1594971 3215462 3975076
8388 3975076 2755842 742786 -314485 -131020 342580 375154 -156884 -1229267 -2435113
8379 -2435113 -2697829 -1473495 15411 151916 -667670 -679869 277994 547295 -321151
$$ packed form
8441i97380J015309J252303J206884r3111j177320J36893K561397K156910j644752
8432D417133m146938j886202J854083J730956j437064k063792J066642K743192
8424B278010p7973l187696k038820R58451Q97532j351404j189329J384821J904587
8415d21821m43469j197641J644702M023992K371565j047693k418832k023759k084201
8406a597157k174259p45584R84302O97934p54392n41811J333621K021806O30196
8397a45344l63898O98140J975184J172400q09920j260814L29223J620491P59614
8388C975076j219234k013056j057271J83465M73600L2574n32038j072383j205846
8379b435113k62716J224334J488906J36505q19586j2199R57863K69301q68446
$$ plain form
8370 -321151 -725639 -12401 181085 -1107220 -2282733 -1963685 -1269422 -1366295 -1165728 103321
8360 103321 542541 -1057270 -1826402 1275803 5866421 6911181 4111526 1779437 1692271
8351 1692271 1251788 -573177 -805014 2040725 4683703 4140199 2248350 1998321 2582589
8342 2582589 1600170 -400250 -1299928 -1381996 -2123798 -2419068 8409 4009570 5688243
8333 5688243 3853057 1368824 463480 -118767 -2068860 -4350719 -4903571 -3705257 -2330449
8324 -2330449 -1569140 -1058600 -535828 409 967477 2682991 4201663 3860010 1400921
8315 1400921 -1212332 -1729754 -60668 1771053 2023631 970159 65211 89176 771977
8306 771977 1781077 3070763 4263766 4681311 4264397 3600812 2728839 953074 -1497368
$$ packed form
8370c21151m04488P13238J93486j288305j175513L19048O94263r6873K00567J269049
8360A03321M39220j599811p69132L102205M590618J044760k799655k332089q7166
8351A692271m40483j824965k31837K845739K642978n43504j891849k50029N84268
8342B582589r82419k000420q99678q2068p41802k95270K427477M001161J678673
8333E688243j835186k484233r05344n82247j950093k281859n52852J198314J374808
8324b330449P61309N10540N22772N36237R67068J715514J518672l41653k459089
8315A400921k613253n17422J669086J831721K52578j053472r04948K3965O82801
8306G71977J009100J289686J193003M17545m16914o63585q71973j775765k450442
$$ plain form
8297 -1497368 -2690467 -1119356 1872599 3153639 1420376 -1301822 -2196768 -922939
8289 -922939 364065 -46445 -1303106 -1287459 358644 1494531 335702 -1734617 -1582655
8280 -1582655 1410635 4066256 3329165 313674 -1092004 809847 3652183 4320530 2587649
8271 2587649 569811 -325632 -606707 -1269756 -2423136 -3479266 -3864997 -3322575 -2139228
8262 -2139228 -1189602 -1088209 -1290884 -953991 -706766 -2090297 -4621610 -5172745 -1841822
8253 -1841822 2887856 4940861 3705223 1830873 553284 -1542577 -4568026 -5566684
8245 -5566684 -2632599 1724437 3733964 3161525 2515512 2770758 2562541 1102980 -522016
8236 -522016 -1018289 -162018 1458698 2646564 2051247 -173309 -1871927 -1550970 -601053
$$ packed form
8297a497368j193099J571111K991955J281040j733263k722198q94946J273829
8289i22939J287004m10510j256661J5647J646103J135887j158829k070319J51962
8280a582655K993290K655621p37091l015491j405678J901851K842336O68347j732881
8271B587649k017838q95443k81075o63049j153380j056130l85731N42422J183347
8262b139228R49626J01393k02675L36893K47225j383531k531313n51135L330923
8253a841822M729678K053005j235638j874350j277589k095861l025449r98658
8245e566684K934085M357036K009527n72439o46013K55246k08217j459561j624996
8236e22016m96273Q56271J620716J187866n95317k224556j698618L20957R49917
$$ plain form
8227 -601053 -1074152 -2345451 -2312094 -1024162 -405366 -855741 -967996 -392899 -56369 402788
8217 402788 2226897 4355219 4113376 1814851 1077964 3230130 5007278 3856487 2099401
8208 2099401 2953398 5210271 5358865 3185656 1643207 1956032 2172158 632548 -1683149
8199 -1683149 -2694421 -1436164 1390110 3821204 3815974 1266581 -1466640 -2097434 -989463
8190 -989463 -132856 -266567 -379342 364118 1478528 1795161 533134 -1811993 -3267517
8181 -3267517 -2145139 442496 1331619 -525505 -2424430 -1799050 151045 651695 -545256
8172 -545256 -1612022 -1805808 -1580511 -619032 1480817 3304977 3197332 2168724 2382214
8163 2382214 3251695 2288919 -290242 -1370802 110750 1577154 1338053 1258141 2993880
$$ packed form
8227f01053m73099j271299L3357J287932O18796m50375j12255N75097L36530M59157
8217D02788J824109K128322k41843k298525p36887K152166J777148j150791j757086
8208B099401Q53997K256873J48594k173209j542449L12825K16126j539610k315697
8199a683149j011272J258257K826274K431094n230k549393k733221o30794J107971
8190i89463Q56607j33711j12775P43460J114410L16633j262027k345127j455524
8181c267517J122378K587635Q89123j857124j898925O25380J950095N00650j196951
8172e45256j066766j93786K25297R61479K099849J824160j07645j028608K13490
8163B382214Q69481r62776k579161j080560J481552J466404k39101p9912J735739
$$ plain form
8154 2993880 4609886 3579538 973142 -201216 547050 1196835 967128 1381103 3463738
8145 3463738 5953114 6916716 5956512 4348347 3662085 4393695 5515575 5463435 3867533
8136 3867533 1973045 1116544 1427088 2350528 3484684 4187699 3383351 951369 -1318296
8127 -1318296 -1436566 406301 2264993 2932765 2811477 2506560 1996855 1423354 1336767
8118 1336767 1585762 1110443 -387567 -1573591 -1273083 -315394 -340799 -1335285 -1848686
8109 -1848686 -1416428 -982380 -676833 790825 3507324 5053869 3644563 1127873 528579
8100 528579 1534225 1244355 -861990 -1955970 -589973 814389 -14694 -1396068 -466853
8091 -466853 2124023 3212387 1844858 209892 131839 1086987 1845678 2062097 1894714
$$ packed form
8154B993880J616006j030348k606396j174358P48266O49785k29707M13975K082635
8145C463738K489376R63602r60204j608165o86262P31610J121880n2140j595902
8136C867533j894488q56501L10544R23440J134156P03015q04348k431982k269665
8127a318296j18270J842867J858692O67772j21288l04917n09705n73501q6587
8118A336767K48995m75319j498010j186024L00508R57689k5405r94486n13401
8109a848686M32258M34048L05547J467658K716499J546545j409306k516690n99294
8100E28579J005646k89870k106345j093980J365997J404362q29083j381374R29215
8091d66853K590876J088364j367529j634966p8053R55148P58691K16419j67383
$$ plain form
8082 1894714 1581669 1622969 2236708 2804099 2942812 3481805 4918954 5771896 4465134
8073 4465134 2190358 1522005 2523834 2779688 1270148 -448980 -1221418 -1690165 -2055327
8064 -2055327 -1175145 930780 2089987 912317 -1190904 -2124689 -1469870 186111 2213809
8055 2213809 3254936 1908336 -585611 -731928 2522384 5798289 5820577 3589709 1891022
8046 1891022 1084686 156800 -161921 1285126 3000797 2533473 573934 119795 1821989
8037 1821989 3177510 2433421 604641 -648309 -793929 163625 1900297 3136608 2669849
8028 2669849 1139132 81974 -424793 -1210262 -1609537 -100835 2769849 4581841 4280346
8019 4280346 2962074 1509181 -82501 -1099126 -595469 407889 71587 -823315 187706
$$ packed form
8082A894714l13045M1300O13739N67391J38713N38993J437149Q52942j306762
8073D465134k274776o68353J001829K55854j509540j719128p72438m68747l65162
8064b055327Q80182K105925J159207j177670k103221r33785O54819J655981K027698
8055B213809J041127j346600k493947j46317L254312L275905K2288k230868j698687
8046A891022q06336r27886l18721J447047J715671m67324j959539m54139J702194
8037A821989J355521p44089j828780j252950j45620R57554J736672J236311m66759
8028B669849j530717j057158n06767p85469l99275J508702K870684J811992l01495
8019D280346j318272j452893j591682j016625N03657J003358l36302q94902J011021
$$ plain form
8010 187706 2617117 3098118 941020 -447795 729911 1711600 317186 -1031461 192408
8001 192408 1644392 -143352 -3601105 -4299915 -1769132 348421 219581 -303845 434777
7992 434777 1958231 3727655 5632534 6161628 3593165 -401336 -1745665 484867 2659683
7983 2659683 1949479 21538 -260170 965760 1810707 1930778 2229721 2708001 2757428
7974 2757428 2662378 3023935 3448561 3321512 3125819 3539105 3912388 3106629 1312017 -341078
7964 -341078 -1510999 -2565255 -3116215 -2229001 -251059 948281 153620 -1647132 -2512541
7955 -2512541 -1827941 -714187 -372300 -645188 -427271 872747 2665383 3810745 3499606
7946 3499606 1706163 -536976 -1405088 124939 2695853 3766924 2825417 1907545 2141098
$$ packed form
8010A87706K429411M81001k157098j388815J177706R81689j394414j348647J223869
8001A92408J451984j787744l457753o98810K530783K117553j28840n23426P38622
7992D34777J523454J769424J904879N29094k568463l994501j344329K230532K174816
7983B659683p10204j927941k81708J225930Q44947J20071K98943M78280M9427
7974B757428r5050L61557M24626j27049j95693M13286L73283q05759j794612j653095
7964c41078j169921j054256n50960Q87214J977942J199340p94661j800752q65409
7955b512541O84600J113754L41887k72888K17917J300018J792636J145362l11139
7946C499606j793443k243139q68112J530027K570914J071071r41507r17872K33553
$$ plain form
7937 2141098 1774705 -584885 -2680453 -1372378 2372140 4474387 3442593 1799095
7929 1799095 1530485 1511323 537612 -235096 336165 1089144 603958 -438342 -793026 -751830
7919 -751830 -868332 -278578 1723896 3827952 4323692 3414119 2279294 1122916 -261247
7910 -261247 -1391885 -2165327 -3403873 -4679094 -3651431 130562 2874584 1040697 -3385845
7901 -3385845 -5469559 -3996660 -1949217 -1080946 -82964 1656744 2366008 1032614 -831318
7892 -831318 -1700427 -1770413 -1337151 -31809 1422375 1319207 -81765 -350808 1036192
7883 1036192 1100037 -2253944 -6519435 -7562320 -4741211 -866503 1722043 2756967 2453844
7874 2453844 697898 -1874747 -3532000 -2944570 -633789 1410113 1697143 915050 1178845
$$ packed form
7937B141098l66393k359590k095568J308075L744518K102247j031794j643498
7929A799095k68610j9162r73711p72708N71261P52979m85186j042300l54684M1196
7919g51830j16502N89754K002474K104056M95740r09573j134825j156378j384163
7910b61247j130638p73442j238546j275221J027663L781993K744022j833887m426542
7901c385845k083714J472899K047443Q68271R97982J739708P09264j333394j863932
7892h31318q69109o9986M33262J305342J454184j03168j400972k69043J387000
7883A036192O3845l353981m265491j042885K821109L874708K588546J034924l03123
7874B453844j755946k572645j657253N87430K310781K043902K87030p82093K63795
$$ plain form
7865 1178845 3164880 4825660 4009117 1450898 -470924 -1159977 -1825360 -2630774 -2435923
7856 -2435923 -1318520 -624607 -319408 813485 2007742 916887 -1968846 -2942888 -641395
7847 -641395 1662757 1402615 629415 1723000 2790705 1201970 -1213997 -1037875 723562
7838 723562 374006 -1865769 -2031095 933110 3508514 3323191 2171294 1961037 1551931
7829 1551931 -333565 -2123626 -1669887 554109 2524562 3412513 3680759 3747030 3834601
7820 3834601 4043015 3755537 2283399 608576 664709 2198648 2581624 926348 -41080
7811 -41080 1844573 4364524 3998300 1307734 1199 1176496 1902545 127416 -2095725
7802 -2095725 -1972914 -313863 -88637 -1697762 -2319087 -184641 2743500 3532409 2165679
$$ packed form
7865A178845J986035J660780q16543k558219j921822o89053o65383q05414J94851
7856b435923J117403O93913L05199J132893J194257j090855k885733r74042K301493
7847f41395K304152k60142p73200J093585J067705j588735k415967J76122J761437
7838G23562l49556k239775j65326K964205K575404j85323j151897k10257m09106
7829A551931j885496j790061M53739K223996J970453Q87951K68246O6271Q7571
7820C834601K08414k87478j472138j674823N6133J533939L82976j655276r67428
7811d1080J885653K519951l66224k690566j306535J175297P26049j775129k223141
7802b095725J22811J659051K25226j609125o21325K134446K928141P88909j366730
$$ plain form
7793 2165679 975282 1039198 1225431 795078 737451 1614533 1993611 633260 -1132811
7784 -1132811 -1173460 106032 396343 -842872 -1651137 -848386 131318 -369915 -1753988
$$ packed form
7793B165679j190397O3916J86233m30353n7627Q77082L79078j360351j766071
7784a132811m0649J279492K90311j239215q08265Q02751R79704n01233j384073
$$ [...]
##END NTUPLES=NMR SPECTRUM
##END=
