##TITLE=31Pdec_MTBPA2510
 D2O, 124 sc
 25.10.2021
##JCAMPDX= 6.0         $$ Bruker NMR JCAMP-DX V2.0
##DATA TYPE= NMR SPECTRUM
##DATA CLASS= NTUPLES
##ORIGIN= UXNMR, Bruker Analytische Messtechnik GmbH
##OWNER= root
$$ XWIN-NMR		Version 3.5
$$ Mon Oct 25 11:00:50 2021 Russian Standard Time (UT+4h)  she@DPX200
##.OBSERVE FREQUENCY= 81.013821
##.OBSERVE NUCLEUS= ^31P
##.ACQUISITION MODE= SIMULTANEOUS
##.ACQUISITION SCHEME= undefined
##.AVERAGES= 124
##.DIGITISER RES= 16
##SPECTROMETER/DATA SYSTEM= spect
##.PULSE SEQUENCE= zgpg30
##.SOLVENT NAME= D2O
##.SHIFT REFERENCE= (INTERNAL, D2O, 0, 248.564)
##AUDIT TRAIL= $$ (NUMBER, WHEN, WHO, WHERE, WHAT)
$$ ##TITLE= Audit trail, XWIN-NMR		Version 3.5
$$ ##JCAMPDX= 5.01
$$ ##ORIGIN= Bruker BioSpin GmbH
$$ ##OWNER= she
$$ F:/spectra/data/she/nmr/P31/1/pdata/1/auditp.txt
$$ ##AUDIT TRAIL=  $$ (NUMBER, WHEN, WHO, WHERE, WHAT)
(   1,<2021-10-25 10:57:02.81 +0400>,<she>,<DPX200>,
      <continue with go, POWCHK disabled, PULCHK disabled
       configuration hash MD5:
       00 E9 B6 7A A2 85 ED C7 34 08 36 98 17 FE 4E 26
       data hash MD5: 32K
       BC CC 7A 48 E0 62 D1 90 6D 3E 0C 4D FF C8 09 E6>)
(   2,<2021-10-25 10:59:37.93 +0400>,<she>,<DPX200>,
      <Start of raw data processing
       efp BC_mod = 2 LB = 1 FT_mod = 6 PKNL = 1 PHC0 = -8834.566 PHC1 = 115.669 SI = 64K 
       data hash MD5: 64K
       20 28 99 BD F2 99 CB B1 EA 98 CE 4C 54 BA 08 81>)
(   3,<2021-10-25 10:59:57.93 +0400>,<she>,<DPX200>,
      <pk PHC0 = -19.75752 PHC1 = 0 
       data hash MD5: 64K
       8E 2D BC 15 1F 1B CF 45 66 23 E9 FE 2F 08 F3 C0>)
(   4,<2021-10-25 11:00:11.96 +0400>,<she>,<DPX200>,
      <abs ABSG = 5 
       data hash MD5: 64K
       45 CC 5F 52 D6 50 23 15 53 3C 37 C4 FB B7 74 D9>)
$$ ##END=
$$ 
$$ hash MD5
$$ 43 2C 7D B4 B4 DA 3C 8E 38 41 AD 2B 83 B0 27 97
##$RELAX= 
##$RELAX= 
##$RELAX= 
##$RELAX= 
##$RELAX= 
##$RELAX= 
##$RELAX= 
##$RELAX= 
$$ Bruker specific parameters
$$ --------------------------
##$DU= <F:/spectra>
##$EXPNO= 1
##$NAME= <P31>
##$PROCNO= 1
##$TYPE= <nmr>
##$USER= <she>
##$AMP= (0..31)
100 100 100 100 100 100 100 100 100 100 100 100 100 100 100 100 100 100 
100 100 100 100 100 100 100 100 100 100 100 100 100 100 
##$AQSEQ= 0
##$AQ_mod= 1
##$AUNM= <au_zg>
##$AUTOPOS= <>
##$BF1= 81.014009
##$BF2= 200.13
##$BF3= 200.13
##$BF4= 200.13
##$BF5= 200.13
##$BF6= 200.13
##$BF7= 200.13
##$BF8= 200.13
##$BYTORDA= 1
##$CFDGTYP= 0
##$CFRGTYP= 5
##$CHEMSTR= <none>
##$CNST= (0..31)
1 1 145 1 1 1 1 1 1 1 1 1 1 1 1 1 1 1 1 1 1 1 1 1 1 1 1 1 1 1 1 1 
##$CPDPRG= <waltz16>
##$CPDPRG1= <>
##$CPDPRG2= <waltz16>
##$CPDPRG3= <>
##$CPDPRG4= <mlev>
##$CPDPRG5= <mlev>
##$CPDPRG6= <mlev>
##$CPDPRG7= <mlev>
##$CPDPRG8= <mlev>
##$CPDPRGB= <>
##$CPDPRGT= <>
##$D= (0..31)
0 1 0 0 0 0 0 0 0 0 0 0.03 2e-05 3e-06 0 0 0 0 0 0 0 0 0 0 0 0 0 0 0 0 
0 0 
##$DATE= 1635144853
##$DBL= (0..7)
120 120 120 11 120 120 24 19 
##$DBP= (0..7)
150 150 150 150 150 150 150 150 
##$DBP07= 0
##$DBPNAM0= <>
##$DBPNAM1= <>
##$DBPNAM2= <>
$$ [...]
##$SUBNAM3= <"">
##$SUBNAM4= <"">
##$SUBNAM5= <"">
##$SUBNAM6= <"">
##$SUBNAM7= <"">
##$SUBNAM8= <"">
##$SUBNAM9= <"">
##$SW= 501.771253377433
##$SWIBOX= (0..15)
0 1 3 0 0 0 0 0 0 0 0 0 0 0 0 0 
##$SW_h= 40650.406504065
##$TD= 32768
##$TD0= 1
##$TE= 0
##$TE2= 300
##$TE3= 300
##$TEG= 300
##$TL= (0..7)
0 120 53 12 22 120 120 120 
##$TP= (0..7)
150 150 150 150 150 150 150 150 
##$TP07= 0
##$TPNAME0= <>
##$TPNAME1= <>
##$TPNAME2= <>
##$TPNAME3= <>
##$TPNAME4= <>
##$TPNAME5= <>
##$TPNAME6= <>
##$TPNAME7= <>
##$TPOAL= (0..7)
0.5 0.5 0.5 0.5 0.5 0.5 0.5 0.5 
##$TPOFFS= (0..7)
0 0 0 0 0 0 0 0 
##$TUNHIN= 0
##$TUNHOUT= 0
##$TUNXOUT= 0
##$USERA1= <user>
##$USERA2= <user>
##$USERA3= <user>
##$USERA4= <user>
##$USERA5= <user>
##$V9= 5
##$VALIST= <valist>
##$VCLIST= <CCCCCCCCCCCCCCC>
##$VD= 0
##$VDLIST= <DDDDDDDDDDDDDDD>
##$VPLIST= <PPPPPPPPPPPPPPP>
##$VTLIST= <TTTTTTTTTTTTTTT>
##$WBST= 1024
##$WBSW= 4
##$XGAIN= (0..3)
0 0 0 0 
##$XL= 0
##$YL= 0
##$YMAX_a= 8388
##$YMIN_a= -10564
##$ZGOPTNS= <>
##$ZL1= 120
##$ZL2= 120
##$ZL3= 120
##$ZL4= 120
##$ABSF1= 248.5645
##$ABSF2= -253.2056
##$ABSG= 5
##$ABSL= 3
##$ALPHA= 0
##$AQORDER= 0
##$ASSFAC= 0
##$ASSFACI= 0
##$ASSFACX= 0
##$ASSWID= 0
##$AUNMP= <proc_1d>
##$AZFE= 0.1
##$AZFW= 0.5
##$BCFW= 0
##$BC_mod= 2
##$BYTORDP= 0
##$COROFFS= 0
##$CY= -3
##$DATMOD= 1
##$DC= 0
##$DFILT= <>
##$DTYPP= 0
##$F1P= 0
##$F2P= 0
##$FCOR= 1
##$FTSIZE= 65536
##$FT_mod= 6
##$GAMMA= 0
##$GB= 0
##$INTBC= 1
##$INTSCL= 5.30512e-09
##$ISEN= 30
##$LB= 1
##$LEV0= 0
##$LPBIN= 0
##$MAXI= 10000
##$MC2= 0
##$MEAN= 0
##$ME_mod= 0
##$MI= 50
##$NCOEF= 0
##$NC_proc= -8
##$NLEV= 6
##$NOISF1= 182.463
##$NOISF2= 159.3651
##$NSP= 0
##$NTH_PI= 0
##$NZP= 0
##$OFFSET= 248.5645
##$PC= 4
##$PHC0= -8854.324
##$PHC1= 115.669
##$PH_mod= 1
##$PKNL= yes
##$PPARMOD= 0
##$PSCAL= 0
##$PSIGN= 0
##$REVERSE= no
##$SF= 81.014009
##$SI= 65536
##$SIGF1= 159.3651
##$SIGF2= -187.1042
##$SINO= 113.3802
##$SIOLD= 16384
##$SREGLST= <1H.CDCl3>
##$SSB= 0
##$STSI= 65536
##$STSR= 0
##$SW_p= 40650.406504065
##$SYMM= 0
##$S_DEV= 0
##$TDeff= 32768
##$TDoff= 0
##$TI= <>
##$TILT= no
##$TM1= 0
##$TM2= 0
##$TOPLEV= 0
##$USERP1= <user>
##$USERP2= <user>
##$USERP3= <user>
##$USERP4= <user>
##$USERP5= <user>
##$WDW= 1
##$XDIM= 65536
##$YMAX_p= 504799468
##$YMIN_p= -224152989
$$ End of Bruker specific parameters
$$ ---------------------------------
##NTUPLES= NMR SPECTRUM
##VAR_NAME=  FREQUENCY,     SPECTRUM/REAL,   SPECTRUM/IMAG
##SYMBOL=    X,             R,               I
##VAR_TYPE=  INDEPENDENT,   DEPENDENT,       DEPENDENT
##VAR_FORM=  AFFN,          ASDF,            ASDF
##VAR_DIM=   65536,         65536,           65536
##UNITS=     HZ,            ARBITRARY UNITS, ARBITRARY UNITS
##FACTOR=    0.620285442955139, 1,           1
##FIRST=     20137.2065510759, 0,            0
##LAST=      -20513.1999529892, 0,           0
##MIN=       -20513.1999529892, -224152989,  0
##MAX=       20137.2065510759, 504799468,    0
$$ Real data points
##PAGE= N=1
##DATA TABLE= (X++(R..R)), XYDATA
$$ [...]
$$ plain form
40820 10983423 14196674 12748417 4763483 -3635001 -6545717 -5835288 -5481382 -2695653
40812 -2695653 6944673 17684568 17816958 7278807 -184924 2888990 6379613 -658999
40804 -658999 -11489800 -11246138 913643 11236296 10291041 1546326 -7554391 -12646891
40796 -12646891 -10953234 -2822422 4538177 3959389 -560915 1325349 10340824 16765617
40788 16765617 16276273 14810426 15204092 11689284 2622501 -3711313 -2872074 -2032420 -5663311
40779 -5663311 -5328661 5261995 15845954 13965700 5188201 3399956 6981862 2136069
40771 2136069 -12342453 -21625409 -18086385 -11566040 -11646615 -14102133 -11865253 -7228313
40763 -7228313 -4757840 -1779702 5214292 12050063 13187341 10761846 9690018 8952623
$$ packed form
40820A0983423L213251j448257p984934q398484k910716P10429L53906K785729
40812b695653R640326J0739895J32390j0538151p463731L073914L490623p038612
40804f58999j0830801K43662J2159781J0322653r45255q744715r100717n092500
40796a2646891J693657Q130812P360599n78788m520304J886264R015475O424793
40788A6765617m89344j465847L93666l514808r066783o333814Q39239Q39654l630891
40779e663311L34650J0590656J0583959j880254q777499j788245L581906m845793
40771B136069j4478522r282956L539024O520345q0575k455518K236880M636940
40763g228313K470473K978138O993994O835771J137278k425495j071828p37395
$$ plain form
40755 8952623 5241635 598416 -1287497 -2377918 -5835681 -7541626 -1060860 10058884
40747 10058884 13929067 5928866 -4232048 -4140170 7015716 19040994 23410823 21967532
40739 21967532 21959488 24099217 20081000 5572140 -8591138 -7299241 6617120 12365115
40731 12365115 -1391278 -19795081 -21876401 -8585420 2127217 2536508 1689247 5534083
40723 5534083 6924493 381557 -6684276 -5563448 772794 4869502 7111891 11397335
40715 11397335 14412189 9872462 703355 -3141640 1301976 6924365 8132126 7138225
40707 7138225 6561917 3869057 -2315895 -6772646 -4636146 424421 1699871 766343
40699 766343 5809099 18254591 28191041 26190184 14502496 2539412 -4659318 -8603903
$$ packed form
40755H952623l710988m643219j885913j090421l457763j705945O480766J1119744
40747A0058884L870183q000201j0160914R1878J1155886J2025278M369829j443291
40739B1967532q044K139729m018217j4508860j4163278J291897J3916361N747995
40731A2365115j3756393j8403803k081320J3290981J0712637M09291q47261L844836
40723E534083J390410o542936p065833J120828O336242M096708K242389M285444
40715A1397335L014854m539727r169107l844995M443616N622389J207761r93901
40707G138225n76308k692860o184952m456751K136500N060567J275450r33528
40699G66343N042756J2445492R936450k000857j1687688j1963084p198730l944585
$$ plain form
40691 -8603903 -11223880 -12637581 -13682390 -14572207 -11415601 -566423 12919097 18437310
40683 18437310 13985531 9909946 13953380 19161378 13518138 -2758216 -17006836 -18990744
40675 -18990744 -9534963 3726418 12648334 11963889 3117159 -5543524 -7942226 -8305553
40667 -8305553 -13683819 -20545496 -18034559 -5121979 5212690 2322196 -9520535 -18770602
40659 -18770602 -19615260 -13062293 -2411853 6380982 5912125 -4027991 -12876716 -10542924
40651 -10542924 923466 12062521 18254158 20980570 20890964 17642322 14665892 16045561
40643 16045561 19080751 17274377 10658728 5527268 3062671 -3424775 -16758092 -28917160
40635 -28917160 -31004831 -24670026 -17749672 -12814982 -6969991 -489305 2376267 1606234
$$ packed form
40691h603903k619977j413701j044809q89817L156606J0849178J3485520N518213
40683A8437310m451779m075585M043434N207998n643240j6276354j4248620j983908
40675a8990744R455781J3261381Q921916o84445q846730q660683k398702l63327
40667h305553n378266o861677K510937J2912580J0334669k890494j1842731r250067
40659a8770602q44658O552967J0650440Q792835m68857r940116q848725K333792
40651a0542924J1466390J1139055O191637K726412q9606l248642k976430J379669
40643A6045561L035190j806374o615649n131460k464597o487446j3333317j2159068
40635b8917160k087671O334805O920354M934690N844991O480686K865572p70033
$$ plain form
40627 1606234 2870670 7872055 9608829 2461419 -7430485 -8707750 109692 9362587
40619 9362587 12445925 13461608 17419366 20136740 14734150 3846067 -2780102 -1498237
40611 -1498237 2365422 5413781 11772300 24036680 34940229 34192527 21199647 5754894
40603 5754894 -3542671 -7523329 -12222154 -19436156 -24296118 -22184232 -15322920 -9726827
40595 -9726827 -6836032 -2851796 2784056 4417102 -309587 -3963383 532275 7568303
40587 7568303 5942193 -3669370 -8812872 -3642557 3400626 3868014 1592540 4489465
40579 4489465 11132349 12854722 5826427 -4413835 -8792227 -2663016 9493812 16814015
40571 16814015 13669370 7726472 9600378 15747710 12551877 -1319396 -10361287 -5536841
$$ packed form
40627A606234J264436N001385J736774p147410r891904j277265Q817442R252895
40619I362587L083338J015683L957758K717374n402590j0888083o626169J281865
40611a498237L863659L048359O358519J2264380J0903549p47702j2992880j5444753
40603E754894r297565l980658m698825p214002m859962K111886O861312N596093
40595i726827K890795L984236N635852J633046m726689l653796M495658P036028
40587G568303j626110r611563n143502N170315P043183M67388k275474K896925
40579D489465O642884J722373p028295j0240262m378392O129211J2156828P320203
40571A6814015l144645n942898J873906O147332l195833j3871273r041891M824446
$$ plain form
40563 -5536841 2044923 481885 -3087030 4051967 17034395 20470182 12812475 6582806
40555 6582806 6666503 5083848 -1912059 -6993138 -5278804 -1667820 -573557 446346
40547 446346 2641899 1975877 -2283541 -4016761 -21881 4670596 5358510 3774557 1965697
40538 1965697 -1579499 -5393241 -3252913 5407946 11114048 6789062 -2143835 -6498407
40530 -6498407 -5522120 -3087416 1893723 11809385 21101414 21035686 13067908 8164475 11009374
40521 11009374 12656949 2991398 -14721193 -27315993 -27999363 -23499013 -23109456 -24905626
40513 -24905626 -18375364 -377343 17980026 23893520 17314258 7624158 208999 -6010430
40505 -6010430 -10099766 -7946833 -1099213 1906371 -2997447 -9179206 -9097648 -4944228
$$ packed form
40563e536841P581764j563038l568915P138997J2982428L435787p657707o229669
40555F582806Q3697j582655o995907n081079J714334L610984J094263J019903
40547D46346K195553o66022m259418j733220L994880M692477O87914j583953j808860
40538A965697l545196l813742K140328Q660859N706102m324986q932897m354572
40530f498407R76287K434704M981139R915662R292029o5728p967778m903433K844899
40521A1009374J647575r665551j7712591j2594800o83370M500350L89557j796170
40513b4905626O530262J7998021J8357369N913494o579262r690100p415159o219429
40505f010430m089336K152933O847620L005584m903818o181759Q1558M153420
$$ plain form
40497 -4944228 -3960395 -6619935 -5629991 3658344 16228910 22278058 17601588 7748430
40489 7748430 1350741 392185 -202404 -3185200 -4065159 1394526 9425457 12891200 9894971
40480 9894971 2650099 -7533918 -17248182 -18011278 -5946047 8833979 13024151 7951143
40472 7951143 5267125 7223094 5397309 -1063363 -2301317 3487435 4564129 -4042469
40464 -4042469 -10293470 -5166689 1279016 -3286056 -12449669 -12040453 -3609384 -667024
40456 -667024 -6229599 -9881447 -5627927 1360605 5886533 8226597 7895163 3603680
40448 3603680 761560 7439552 20073858 24318483 14744086 3520174 2915232 7993060
40440 7993060 5977898 -3014506 -6186449 1670622 9511245 6604071 -776565 1309760
$$ packed form
40497d944228R83833k659540R89944R288335J2570566O049148m676470r853158
40489G748430o397689r58556n94589k982796q79959N459685Q030931L465743k996229
40480I894971p244872j0184017r714264p63096J2065231J4780026M190172n073008
40472G951143k684018J955969j825785o460672j237954N788752J076694q606598
40464d042469o251001N126781O445705m565072r163613M09216Q431069K942360
40456f67024n562575l651848M253520O988532M525928K340064l31434m291483
40448C603680k842120O677992J2634306M244625r574397j1223912o04942N077828
40440G993060k015162q992404l171943P857071P840623k907174p380636K086325
$$ plain form
40432 1309760 12249419 16231933 6091500 -4664173 -1998202 6788823 4759637 -7387985
40424 -7387985 -12569417 -4664510 3347831 2268501 -75364 3319281 3870475 -6897174
40416 -6897174 -19627079 -19807525 -9328437 -885814 2260442 6238377 11467963 12802976
40408 12802976 12016479 15684500 21645031 20859491 12440052 4369098 -359098 -5564643
40400 -5564643 -9921646 -7010810 816158 2435595 -4306369 -7780267 -873443 7940192
40392 7940192 8882779 5661261 7350856 13596168 16966084 14473496 8453324 186932
40384 186932 -9447220 -15828906 -14660931 -9136991 -6827465 -9461309 -10854741 -5745630
40376 -5745630 3224535 8887190 7605009 2324896 -1389407 -734546 2956981 6303025
$$ packed form
40432A309760J0939659L982514j0140433j0755673K665971Q787025k029186j2147622
40424g387985n181432P904907Q012341j079330k343865L394645N51194j0767649
40416f897174j2729905j80446J0479088Q442623L146256L977935N229586J335013
40408A2802976p86497L668021N960531p85540q419439q070954m728196n205545
40400e564643m357003K910836P826968J619437o741964l473898O906824Q813635
40392G940192R42587l221518J689595O245312L369916k492588o020172q266392
40384A86932r634152o381686J167975N523940K309526k633844j393432N109111
40376e745630Q970165N662655j282181n280113l714303O54861L691527L346044
$$ plain form
40368 6303025 5677350 -1453463 -13612395 -24066061 -26351336 -21217691 -13999854 -6178685
40360 -6178685 3197816 7917209 -1967246 -22058399 -30826311 -15028414 10903907 22723731
40352 22723731 16554734 7827612 5770339 5280775 2687598 2823355 7314701 9770542
40344 9770542 7288438 5377336 7095002 7938233 6160460 7893544 16182693 23540345
40336 23540345 21532430 11402454 676087 -5084405 -4511502 -935471 -2271338 -12806020
40328 -12806020 -24162749 -23736132 -13052747 -6261848 -8384911 -8941828 -1888282 3435315
40320 3435315 -134677 -3844043 933278 5846341 161008 -7866465 -2246056 13891883
40312 13891883 21610479 14918846 7663267 9003890 9739185 930057 -8263202 -3535730
$$ packed form
40368F303025o25675p130813j2158932j0453666k285275N133645P217837P821169
40360f178685R376501M719393r884455k0091153q767912J5797897K5932321J1819824
40352B2723731o168997q727122k057273m89564k593177J35757M491346K455841
40344I770542k482104j911102J717666Q43231j777773J733084Q289149P357652
40336B3540345k007915j0129976j0726367n760492N72903L576031j335867j0534682
40328a2806020j1356729M26617J0683385O790899k123063n56917P053546N323597
40320C435315l569992l709366M777321M913063n685333q027473N620409J6137939
40312A3891883P718596o691633p255579J340623P35295q809128r193259M727472
$$ plain form
40304 -3535730 12285324 23234162 23525380 24017474 32937761 41102362 34432422 15440139
40296 15440139 1597405 2477256 9201620 10708297 9783367 13521956 16511110 8163884
40288 8163884 -6656944 -11170948 -2785108 1196503 -9130018 -18973624 -11006273 7063948
40280 7063948 12824536 1041927 -10769207 -8029757 3385561 8676073 3526706 -3055248
40272 -3055248 -673401 11018046 21319077 19022975 5135130 -7708920 -10632610 -8332374
40264 -8332374 -9005350 -10420515 -4533697 7151803 12890307 6276303 -5459354 -11153207
40256 -11153207 -7843337 -702211 4425275 5419229 3717649 2314822 2874709 4152551
40248 4152551 4271033 3950243 5567780 9328324 12218562 10976917 5493352 -239537
$$ packed form
40304c535730J5821054J0948838K91218M92094Q920287Q164601o669940j8992283
40296A5440139j3842734Q79851O724364J506677r24930L738589K989154q347226
40288H163884j4820828m514004Q385840L981611j0326521r843606P967351J8070221
40280G063948N760588j1782609j1811134K739450J1415318N290512n149367o581954
40272c055248K381847J1691447J0301031k296102j3887845j2844050k923690K300236
40264h332374o72976j415165N886818J1685500N738504o614004j1735657n693853
40256a1153207L309870P141126N127486R93954j701580j402827N59887J277842
40248D152551J18482l20790J617537L760544K890238j241645n483565n732889
$$ plain form
40240 -239537 -812430 5154652 12533634 15326012 14159342 14038971 15188065 12439372 4970039
40231 4970039 -605303 -81085 2466356 3058683 4779767 10149370 13465795 9236015
40223 9236015 3153923 4941006 13019825 16327179 11003989 5861338 9219389 17837666
40215 17837666 22459432 19567477 14106269 12765500 16899728 21730813 22113556 18401825
40207 18401825 14679035 11873625 7028848 110401 -4178968 -3637427 -1532461 616496
40199 616496 5950482 13433278 14404480 5336505 -3464690 -1252420 7435743 11326840
40191 11326840 11301643 17403827 29361638 34539546 27061872 16110400 10862813 7944900
40183 7944900 8409 -11191592 -17126903 -13286425 -2454094 9510262 17168358 17290033
$$ packed form
40240b39537n72893N967082P378982K792378j166670j20371J149094k748693p469333
40231D970039n575342N24218K547441N92327J721084N369603L316425m229780
40223I236015o082092J787083Q078819L307354n323190n142651L358051Q618277
40215A7837666M621766k891955n461208j340769M134228M831085L82743l711731
40207A8401825l722790k805410m844777o918447m289369N41541K104966K148957
40199F16496N333986P482796R71202r067975q801195K212270Q688163L891097
40191A1326840k5197O102184J1957811N177908p477674j0951472n247587k917913
40183G944900p936491j1200001n935311L840478J0832331J1964356P658096J21675
$$ plain form
40175 17290033 10599892 1090509 -7278558 -12252544 -12771815 -9512122 -5287921 -2402068
40167 -2402068 -580329 543655 -484041 -3606971 -5505479 -4796375 -4836895 -6893812 -5708197
40158 -5708197 1766305 8371077 5803629 -2275065 -5284678 -943432 3863723 4970869
40150 4970869 4087634 2320530 591721 4191475 15677550 25204378 20838634 7949650
40142 7949650 4100694 12980307 18172361 7365858 -10866419 -20908501 -19116394 -12095293
40134 -12095293 -5984067 -4309324 -8047995 -12088352 -9455525 -2717373 -1660074 -6805092
40126 -6805092 -7903576 -3313978 -5546904 -18993565 -27609478 -17595579 682668 8410949
40118 8410949 5225067 3890963 6646229 5303983 299362 1162564 8809830 13661185
$$ packed form
40175A7290033o690141r509383q369067m973986n19271L259693M224201K885853
40167b402068J821739J123984j027696l122930j898508P09104m0520k056917J185615
40158e708197P474502O604772k567448q078694l009613M341246M807155J107146
40150D970869q83235j767104j728809L599754J1486075R526828m365744j2888984
40142G949650l848956Q879613N192054j0806503j8232277j0042082J792107P021101
40134a2095293O111226J674743l738671m040357K632827O738152J057299n145018
40126f805092j098484M589598k232926j3446661q615913J0013899J8278247P728281
40118H410949l185882j334104K755266j342246n004621Q63202P647266M851355
$$ plain form
40110 13661185 12190275 10748407 11518816 8660211 1075312 -3897247 -3104069 -2275580
40102 -2275580 -4283029 -3617806 2946514 10087550 12994739 13648203 13624998 9811429 2543163
40093 2543163 -583764 4999907 14193535 21268544 27523707 33607555 32678261 20139012
40085 20139012 3945850 -4288983 -4015781 -2418844 -769327 4767053 10795997 7779788
40077 7779788 -4293230 -12279280 -7044167 4081188 8315813 4402301 957703 2249795
40069 2249795 4641590 6174832 10589671 19059079 24945723 21752672 12002095 2883951
40061 2883951 -4030746 -12441832 -21633310 -24331590 -16948212 -6753308 -4167348 -10101563
40053 -10101563 -15297555 -12031013 -3131582 1867933 -1952493 -9062814 -9752089 -1937529
$$ packed form
40110A3661185j470910j441868P70409k858605p584899m972559P93178Q28489
40102b275580k007449O65223O564320P141036K907189O53464k3205l813569p268266
40093B543163l126927N583671R193628P075009O255163O083848r29294j2539249
40085B0139012j6193162q234833K73202J596937J649517N536380O028944l016209
40077G779788j2073018p986050N235113J1125355M234625l913512l444598J292092
40069B249795K391795J533242M414839Q469408N886644l193051r750577r118144
40061B883951o914697q411086r191478k698280P383378J0194904K585960n934215
40053a0101563n195992L266542Q899431M999515l820426p110321o89275P814560
$$ plain form
40045 -1937529 5522910 3470320 -5517799 -10054445 -4704433 3520051 5450649 1625269
40037 1625269 41633 5292848 13806897 17902787 12102168 -1533829 -12008138 -8338337
40029 -8338337 5705734 11578848 -1911312 -21241760 -23331906 -5971776 9279529
40022 9279529 6438979 -5496395 -8985383 -2647315 1623384 -48176 1671425 12893675
40014 12893675 25394225 26348515 13839906 -1395666 -7681629 -3844199 219612 -5634459
40006 -5634459 -19764179 -29636672 -26736653 -17073588 -12345080 -14178525 -14768071 -11667148
39998 -11667148 -11807898 -18009541 -21238401 -13085264 899152 8546981 7445766 5590717
39990 5590717 8494944 14511971 21735137 30156958 36244255 34633635 27662892 24308280
$$ packed form
40045a937529P460439k052590q988119m536646N350012Q224484J930598l825380
40037A625269j583636N251215Q514049M095890n800619j3635997j0474309L669801
40029h338337J4044071N873114j3490160j9330448k090146J7360130J5251305
40022I279529k840550j1935374l488988O338068M270699j671560J719601J1222250
40014A2893675J2500550R54290j2508609j5235572o285963L837430M063811n854071
40006e634459j4129720r872493K900019R663065M728508j833445n89546L100923
39998a1667148j40750o201643l228860Q153137J3984416P647829j101215j855049
39990E590717K904227O017027P223166Q421821O087297j610620o970743l354612
$$ plain form
39982 24308280 25852880 21802276 6434327 -8982906 -9969898 631115 6776250 1662219
39974 1662219 -5039884 -3324402 4243498 10006736 13328799 18541692 25505505 29262062
39966 29262062 27619939 23241154 17942234 10020384 -580010 -8372893 -8040373 -2863049
39958 -2863049 -2094204 -8050109 -11132737 -2981177 9230974 9998739 -3445919 -16616149
39950 -16616149 -17098209 -9335274 -4913364 -6692137 -10197809 -13281129 -14823879 -10027352
39942 -10027352 1830790 9748634 3822230 -7524435 -7519100 2950652 5771178 -5372959
39934 -5372959 -13691974 -4705766 12159903 18798135 13658329 8463137 7636713 5245412
39926 5245412 -1083344 -6067625 -6366965 -4553627 -3059958 -1557626 -285304 317442
$$ packed form
39982B4308280J544600m050604j5367949j5417233r86992J0601013O145135n114031
39974A662219o702103J715482P567900N763238L322063N212893O963813L756557
39966B9262062j642123m378785n298920p921850j0600394p792883L32520N177324
39958b863049P68845n955905l082628Q151560J2212151P67765j3444658j3170230
39950a6616149m82060P762935M421910j778773l505672l083320j542750M796527
39942a0027352J1858142P917844n926404j1346665N335J0469752K820526j1144137
39934e372959q319015Q986208J6865669O638232n139806n195192q26424k391301
39926E245412o328756m984281k99340J813338J493669J502332J272322O02746
$$ plain form
39918 317442 2595314 8268139 12964040 10250729 673960 -8720215 -13375853 -14491756
39910 -14491756 -13787902 -10436059 -3951463 3790323 10275538 13969003 14565886 12965037
39902 12965037 9867340 4634767 -1213149 -952339 9282380 19304278 13298802 -6103485
39894 -6103485 -15213335 -299244 20764746 21676541 3045268 -12424089 -13777153 -11101120
39886 -11101120 -12285098 -10789519 -1240928 9439394 13473501 12153939 8496610 1679619
39878 1679619 -5717478 -6547885 -1136202 529518 -5566067 -10908814 -9457760 -6847078
39870 -6847078 -7203203 -3766237 7444254 16703092 14905080 7877565 3940402 -1655105
39862 -1655105 -14579627 -23799844 -15265021 2505615 6948559 -5647263 -15637048 -10721468
$$ packed form
39918C17442K277872N672825M695901k713311r576769r394175m655638j115903
39910a4491756P03854L351843O484596P741786O485215L693465N96883j600849
39902A2965037l097697n232573n847916K60810J0234719J0021898o005476j9402287
39894f103485r109850J4914091K1063990R11795j8631273j5469357j353064K676033
39886a1101120j183978J495579R548591J0680322M034107j319562l657329o816991
39878A679619p397097q30407N411683J665720o095585n342747J451054K610682
39870f847078l56125L436966J1210491R258838j798012p027515l937163n595507
39862a655105j2924522r220217Q534823J7770636M442944j2595822r989785M915580
$$ plain form
39854 -10721468 -1901193 -2233523 -6808071 -4735450 1419021 1094388 -6200544 -10248013
39846 -10248013 -5495700 1813991 2611370 -3835623 -9035974 -4308290 9290738 20977288
39838 20977288 21727041 13384322 3320534 -5529391 -12698999 -12852402 -1580135 12424683
39830 12424683 13592062 616150 -10370893 -8137876 5192 3441621 4943474 11578026
39822 11578026 18605453 15998418 6019639 1100324 5856203 12764377 15648954 16936990
39814 16936990 19985989 23134229 23725044 20948803 13117703 -619106 -13896733 -16220010
39806 -16220010 -6365000 3564718 2246941 -7509359 -14666380 -15328060 -15587388 -20063198
39798 -20063198 -24497459 -22817513 -17225991 -15482284 -18434618 -16953005 -5819332 4557525
$$ packed form
39854a0721468Q820275l32330m574548K072621O154471l24633p294932m047469
39846a0248013M752313P309691P97379o446993n200351M727684J3599028J1686550
39838B0977288P49753q342719j0063788q849925p169608j53403J1272267J4004818
39830A2424683J167379j2975912j0987043K233017Q143068L436429J501853O634552
39822A1578026P027427k607035r978779m919315M755879O908174K884577J288036
39814A6936990L048999L148240N90815k776241p831100j3736809j3277627k323277
39806a6220010R855010R929718j317777r756300p157021o61680k59328m475810
39798b0063198m434261J679946N591522J743707k952334J481613J1133673J0376857
$$ plain form
39790 4557525 -662921 -18887297 -30369798 -23872505 -11081827 -7770989 -10688799 -5535411
39782 -5535411 8777299 19264261 20271596 19567549 20515688 13973871 -4342188 -21003226
39774 -21003226 -20385699 -5539964 7045775 8894919 5673332 4338397 4283754 2627634
39766 2627634 834035 2311354 6462901 8014661 2348470 -8908844 -18557749 -21317113
39758 -21317113 -19114486 -16209643 -11589180 -1947151 9253565 13796126 10631628 7107768
39750 7107768 5967870 828378 -10697341 -19306654 -16962935 -9114635 -5166096 -4306363
39742 -4306363 -1142343 1203655 -3786198 -11825292 -12164539 -4973703 -1356553 -5078874
39734 -5078874 -7043090 -1488547 3959067 706751 -7127621 -9064852 -3052836 3168971
$$ packed form
39790D557525n220446j8224376j1482501O497293J2790678L310838k917810N153388
39782e535411J4312710J0486962J007335p04047R48139o541817j8316059j6661038
39774b1003226O17527J4845735J2585739J849144l221587j334935n4643j656120
39766B627634j793599J477319M151547J551760n666191j1257314r648905k759364
39758b1317113K202627K904843M620463R642029J1200716M542561l164498l523860
39750G107768j139898n139492j1525719q609313K343719P848300L948539Q59733
39742d306363L164020K345998m989853q039094l39247P190836L617150l722321
39734e078874j964216N554543N447614l252316p834372j937231O012016O221807
$$ plain form
39726 3168971 3146324 -1371630 -4382216 -3181184 -719800 -766538 -2286560 -1791692 -1134720
39717 -1134720 -6577947 -16636258 -18355228 -3597943 16488717 23444494 14934204 5656030
39709 5656030 6353867 12939297 16616007 13953264 5516364 -5344184 -10709437 -5084951
39701 -5084951 4335245 4849966 -2999277 -5890993 778206 5691090 854401 -6120459
39693 -6120459 -6822711 -5945341 -10196029 -14696065 -12200667 -6808591 -6444542 -9126669 -8664973
39684 -8664973 -7508671 -11563084 -17381818 -16857420 -10914222 -7130584 -7412171 -9266452
39676 -9266452 -15141208 -27604772 -38058326 -34273869 -19109735 -8801115 -11366658 -18601477
39668 -18601477 -21460208 -21653969 -23881517 -26010995 -22054599 -9457481 8417271 22316962
$$ packed form
39726C168971k2647m517954l010586J201032K461384m6738j520022M94868O56972
39717a134720n443227j0058311j718970J4757285K0086660O955777q510290r278174
39709E656030O97837O585430L676710k662743q436900j0860548n365253N624486
39701e084951R420196N14721p849243k891716O669199M912884m836689o974860
39693f120459p02252Q77370m250688m500036K495398N392076L64049k682127M61696
39684h664973J156302m054413n818734N24398N943198L783638k81587j854281
39676i266452n874756j2463564j0453554L784457J5164134J0308620k565543p234819
39668a8601477k858731j93761k227548k129478L956396J2597118J7874752J3899691
$$ plain form
39660 22316962 21565797 6297191 -7294162 -4452771 7150121 6939481 -8114100 -18332764
39652 -18332764 -10758446 2494761 4347442 -2766103 -5233198 -913380 1238072 -1397322
39644 -1397322 -2660413 -1072411 -2524130 -7841178 -8847652 -1322378 6242635 3143250
39636 3143250 -8383360 -14843848 -8208271 3588305 5706613 -5508318 -17713791 -17832770
39628 -17832770 -8101364 -1491670 -3328201 -5607224 -1169707 5081543 4808939 -184135
39620 -184135 -999211 4582482 9519407 8726850 5678886 5556017 7326705 6431431 2120610
39611 2120610 -1929050 -3068962 -2406895 -2504306 -5282508 -11845249 -20331887 -22990844 -10896949
39602 -10896949 13620035 33037370 30471282 9044522 -11299014 -16587437 -10898882
$$ packed form
39660B2316962p51165j5268606j3591353K841391J1602892k10640j5053581j0218664
39652a8332764P574318J3253207J852681p113545k467095M319818K151452k635394
39644a397322j263091J588002j451719n317048j006474P525274P565013l099385
39636C143250j1526610o460488O635577J1796576K118308j1214931j2205473j18979
39628a7832770R731406O609694j836531k279023M437517O251250k72604m993074
39620a84135q15076N581693M936925p92557l047964j22869J770688q95274m310821
39611B120610m049660j139912O62067r7411k778202o562741q486638k658957J2093895
39602a0896949K4516984J9417335k566088k1426760k0343536n288423N688555
$$ plain form
39595 -10898882 -4782566 -1698628 -708699 -2906215 -7226934 -7545332 -2604751 -1447908
39587 -1447908 -8927362 -13510200 -2747307 15113021 20770235 11780689 3488664 2839175
39579 2839175 371252 -8467010 -13539184 -9220927 -5660613 -10217265 -13254378 -5206838
39571 -5206838 5689782 7064559 2368643 1755984 2800935 -2743770 -10459816 -9699667
39563 -9699667 -3804900 -5423530 -13812232 -15409362 -7436327 -2364517 -5480975 -5790004
39555 -5790004 4162444 15033799 15891727 9655007 3995131 -1669026 -9361125 -12234116
39547 -12234116 -3326459 11160639 18602752 16387252 11909959 9341694 6330735 2256169
39539 2256169 -80639 -1506043 -6549426 -14360551 -16756657 -9119359 1337054 2463194
$$ packed form
39595a0898882O116316L083938R89929k197516m320719l18398M940581J156843
39587a447908p479454m582838J0762893J7860328N657214q989546q292025o49489
39579B839175k467923q838262n072174M318257L560314m556652l037113Q047540
39571e206838J0896620J374777m695916o12659J044951n544705p716046P60149
39563i699667N894767j618630q388702j597130P973035N071810l116458l09029
39555e790004R952448J0871355Q57928o236720n659876n664157p692099k872991
39547a2234116Q907657J4487098P442113k215500m477293k568265l010959m074566
39539B256169k336808j425404n043383p811125k396106P637298J0456413J126140
$$ plain form
39531 2463194 -8991706 -23075085 -26698457 -17615220 -7033967 -6233715 -11874474 -9984112
39523 -9984112 4168397 17317017 14671245 -667022 -12777725 -13785574 -9986065 -8178354
39515 -8178354 -6732384 -3208159 -1361166 -4574437 -8620985 -7280831 -1109416 4821255
39507 4821255 8400521 10392788 10046676 6404494 1679455 -1735840 -4918515 -7838339
39499 -7838339 -5175723 5401737 14072416 8845339 -5417557 -9979854 2304857 16238928
39491 16238928 15874577 6319522 3439445 9281601 10950570 1432362 -11131653 -16288987
39483 -16288987 -13171830 -6740649 -500597 3312495 2787515 -530475 -2203612 -1080354
39475 -1080354 -218714 -75577 2985658 8540804 9173691 712628 -9811208 -12312333
$$ packed form
39531B463194j1454900j4083379l623372R083237J0581253Q00252n640759J890362
39523i984112J4152509J3148620k645772j5338267j2110703j007849L799509J807711
39515h178354J445970L524225J846993l213271m046548J340154O171415N930671
39507D821255L579266J992267l46112l642182m725039l415295l182675k919824
39499g838339K662616J0577460Q670679n227077j4262896m562297J2284711J3934071
39491A6238928l64351r555055k880077N842156J668969r518208j2564015n157334
39483a6288987L117157O431181O240052L813092n24980l317990j673137J123258
39475a080354Q61640J43137L061235N555146O32887q461063j0523836k501125
$$ plain form
39467 -12312333 -6268860 509357 3258844 4516107 7630635 10947687 9654032 1567347
39459 1567347 -9076729 -13798862 -8390931 477495 1512974 -6915671 -14342190 -13164646
39451 -13164646 -9437486 -12421675 -18740489 -16125776 -1317068 14718336 20638066 16616732
39443 16616732 10143727 6047073 4375307 4141581 4835825 5385791 4505947 2524996 2034095
39434 2034095 5833462 13014688 17469169 13320216 2995005 -3799266 -1689995 3642413
39426 3642413 4054604 16868 -2631704 -3592458 -7975964 -16043387 -20891883 -18036316
39418 -18036316 -11277817 -6885438 -6526154 -7509806 -5807048 2129177 15764581 27377372
39410 27377372 27437544 15177183 34108 -8508073 -8391071 -2222299 6631716 13305078
$$ packed form
39467a2312333O043473O778217K749487J257263L114528L317052j293655q086685
39459A567347j0644076m722133N407931Q868426J035479q428645p426519J177544
39451a3164646L727160k984189o318814K614713J4808708J6035404N919730m021334
39443A6616732o473005m096654j671766k33726O94244N49966q79844j980951m90901
39434B034095L799367P181226M454481m148953j0325211o794271K109271N332408
39426C642413M12191m037736k648572r60754m383506q067423m848496K855567
39418a8036316O758499M392379L59284r83652J702758P936225J3635404J1612791
39410B7377372O0172j2260361j5143075q542181J17002O168772Q854015O673362
$$ plain form
39402 13305078 13258004 8275360 5199014 5411186 1758454 -9456034 -19875680 -19637881
39394 -19637881 -12066976 -9458191 -15998017 -23027376 -21740099 -13454455 -5144310 -541995
39386 -541995 784176 -653072 -4744000 -9100364 -9629817 -5290338 -550664 -591847 -3904244
39377 -3904244 -2715909 6955816 18485424 22069144 17142134 11701334 9909535 7676228
39369 7676228 2275908 -1368443 1532993 7703286 10936737 10219114 7510538 2544752
39361 2544752 -3888228 -6099268 -309287 8033280 11042897 9563720 10036365 13091604
39353 13091604 13734488 10868224 7776077 4604993 -305780 -2887996 2243028 10120428
39345 10120428 10058747 3314809 3098578 13136426 19847456 13160565 2691473 3036884
$$ packed form
39402A3305078m7074m982644l076346K12172l652732j1214488j0419646K37799
39394a9637881P570905K608785o539826p029359J287277Q285644Q310145M602315
39386e41995J326171j437248m090928m356364n29453M339479M739674m1183l312397
39377c904244J188335R671725J1529608L583720m927010n440800j791799k233307
39369G676228n400320l644351K901436O170293L233451p17623k708576m965786
39361B544752o432980k211040N789981Q342567L009617j479177M72645L055239
39353A3091604O42884k866264l092147l171084m910773k582216N131024P877400
39345A0120428o1681o743938k16231J0037848O711030o686891j0469092L45411
$$ plain form
39337 3036884 12976670 20849084 22674674 22352411 19743752 12164025 4601773 5062069
39329 5062069 10543206 10165477 2812354 -691692 4467511 8744974 3114316 -6958910
39321 -6958910 -9163321 -248672 11477809 16162201 11189179 2688313 143739 6528542
39313 6528542 13576990 11118718 377964 -8434124 -11442323 -15209954 -23446480 -29259272
39305 -29259272 -26088549 -18473561 -14869993 -15423852 -14195364 -9668213 -6131058 -6840364
39297 -6840364 -11144517 -16330198 -18437189 -14534865 -8015559 -7169860 -13891010 -19045416
39289 -19045416 -14989139 -6998159 -4415834 -5843291 -3403109 2051551 2363834 -2158294
39281 -2158294 -1627277 6115380 9699208 1732015 -8610864 -9134293 -2924265 -2932207 -12641738
$$ packed form
39337C036884R939786P872414J825590l22263k608659p579727p562252M60296
39329E062069N481137l77729p353123l504046N159203M277463n630658j0073226
39321f958910k204411Q914649J1726481M684392m973022q500866k544574O384803
39313F528542P048448k458272j0740754q812088l008199l767631q236526n812792
39305b9259272L170723P614988L603568n53859J228488M527151L537155p09306
39297f840364m304153n185681k106991L902324O519306Q45699o721150n154406
39289a9045416M056277P990980K582325j427457K440182N454660L12283m522128
39281b158294N31017P742657L583828p967193j0342879n23429O210028p942r709531
$$ plain form
39272 -12641738 -22354706 -23455492 -17102474 -7872472 2624326 12142748 14515029 6246858
39264 6246858 -6060652 -10597791 -3205297 8080919 12055155 5016687 -8305098 -20447581
39256 -20447581 -24789783 -17284552 -1072933 11199842 7106127 -10411709 -23502112
39249 -23502112 -19689038 -6699405 -800944 -4647683 -5901873 2964699 13635003 14245405
39241 14245405 4810725 -5507906 -11196452 -13229306 -11701919 -3897871 8270633 15009513
39233 15009513 8277834 -6655052 -14300404 -5668354 11040698 19792364 15090721 6271717
39225 6271717 3445441 5414353 5090423 1566363 225152 2827272 4015890 -1557243
39217 -1557243 -12672709 -22405187 -22849773 -10841322 6721494 15296391 6597904 -10379340
$$ packed form
39272a2641738r712968j100786O353018R230002J0496798R518422K372281q268171
39264F246858j2307510m537139P392494J1286216L974236p038468j3321785j2142483
39256b0447581m342202P505231J6211619J2272775m093715j7517836j3090403
39249b3502112L813074J2989633N898461l846739j254190Q866572J0670304O10402
39241A4245405r434680j0318631n688546k032854J527387P804048J2168504O738880
39233A5009513o731679j4932886p645352Q632050J6709052Q751666m701643q819004
39225F271717k826276J968912l23930l524060j341211K602120J188618n573133
39217a557243j1115466r732478m44586J2008451J7562816Q574897q698487j6977244
$$ plain form
39209 -10379340 -18350697 -11716298 -1058357 2427849 -1099311 -5818474 -9337665 -11259226
39201 -11259226 -9578007 -4543277 -1071311 -1591863 -1118134 4597036 10696144 10403150
39193 10403150 6848589 8715345 15514480 17004957 9055919 998704 2119637 7437211
39185 7437211 4353476 -9178473 -20862055 -19830949 -10175230 -4259779 -5896575 -6832434
39177 -6832434 -541188 7589744 8681432 3823768 1475754 3792360 4744981 2407051
39169 2407051 2941109 8173749 8933714 -1209920 -12845164 -11826693 486117 9519180
39161 9519180 9073942 8506017 15088549 20233004 11318852 -8764322 -22709201 -18182621
39153 -18182621 45035 17315961 23462558 18927094 10641143 4948990 3856822 5928835
$$ packed form
39209a0379340p971357O634399J0657941L486206l527160m719163l519191j921561
39201a1259226J681219N034730L471966n20552M73729N715170O099108k92994
39193A0403150l554561J866756O799135J490477p949038q057215J120933N317574
39185G437211l083735j3531949j1683582J031106R655719N915451j636796r35859
39177f832434O291246Q130932J091688m857664k348014K316606R52621k337930
39169B407051N34058N232640P59965j0143634j1635244J018471J2312810R033063
39161I519180m45238n67925O582532N144455q914152k0083174j3944879M526580
39153a8182621J8227656J7270926O146597m535464q285951n692153j092168K072013
$$ plain form
39145 5928835 9095153 12007072 13909030 15247417 18184592 23861459 28526418 25682014
39137 25682014 14319896 2175791 -2547631 -445471 2229224 3665906 6867094 10284231
39129 10284231 6968504 -2860837 -6776388 3959696 18919299 19821061 5382952 -7137712
39121 -7137712 -6599481 -1249843 -1696955 -3225677 3651153 13692004 12723956 304170
39113 304170 -7609272 -603868 13166283 19980018 17248743 12008634 10016862 12174899
39105 12174899 16689044 19453801 16085480 8068921 3471794 7438384 15206361 18604324
39097 18604324 16338645 13386239 12824852 13341847 13650639 14568994 16334181 17324477 16643183
39088 16643183 16290524 19746022 28452378 39553162 47456975 48482425 43636974 36413611
$$ packed form
39145E928835L166318K911919J901958J338387K937175N676867M664959k844404
39137B5682014j1362118j2144105m723422K102160K674695J436682L201188L417137
39129A0284231l315727r829341l915551J0736084J4959603R01762j4438109j2520664
39121g137712N38231N349638m47112j528722O876830J0040851r68048j2419786
39113C04170p913442P005404J3770151O813735k731275n240109j991772K158037
39105A2174899M514145K764757l368321q016559m597127L966590P767977L397963
39097A8604324k265679k952406n61387N16995L08792R18355J765187R90296o81294
39088A6643183l52659L455498Q706356J1100784P903813J025450m845451p223363
$$ plain form
39080 36413611 29751088 26480436 29318347 36673656 41576573 40017546 37652457 41796178
39072 41796178 49491966 52114417 49986223 51366182 56380246 54801801 44063856 36804451
39064 36804451 42687899 53454412 55773229 50001511 45085137 42298174 36836303 30477424
39056 30477424 28967702 29275452 23123358 12863324 10109306 16543459 19656674 12622253
39048 12622253 5981799 11324898 23130811 27446646 22464469 18732866 21069421 22114027
39040 22114027 16375206 10778768 14524774 24027183 26347466 16736670 5171345 2984186
39032 2984186 8848006 12634132 9392574 3723707 1795718 4689585 9743823 13685357
39024 13685357 13825735 10241477 7201561 8763356 13331290 16616244 18568668 21753508
$$ packed form
39080C6413611o662523l270652K837911P355309M902917j559027k365089M143721
39072D1796178P695788K622451k128194J379959N014064j578445j0737945p259405
39064C6804451N883448J0766513K318817n771718m916374k786963n461871o358879
39056C0477424j509722L07750o152094j0260034k754018O434153L113215p034421
39048A2622253o640454N343099J1805913M315835m982177l731603K336555J044606
39040B2114027n738821n596438L746006R502409K320283r610796j1565325k187159
39032B984186N863820L786126l241558n668867j927989K893867N054238L941534
39024A3685357J40378l584258l039916J561795M567934L284954J952424L184840
$$ plain form
39016 21753508 24393923 22627845 19128472 20408378 24621863 22178526 11364323 2964153
39008 2964153 4609992 10438490 12073454 9983550 6991550 728008 -8348312 -10769787
39000 -10769787 -810106 12062196 15602631 11955697 10929022 12843434 11319537 7674378
38992 7674378 7860746 8765150 3263311 -2873673 3809894 20739185 27807712 15360528
38984 15360528 -799797 -940104 12842058 21965040 15725519 1463317 -6696050 -3255548
38976 -3255548 3827332 2289324 -8614155 -13580041 1256222 27722746 41750075 31916745
38968 31916745 12756995 5453676 13245907 22176240 20773497 11875246 6368559 10023991
38960 10023991 17568672 19167919 12347918 4818405 3597807 5851768 5351375 2995803
$$ packed form
39016B1753508K640415j766078l499373J279906M213485k443337j0814203q400170
39008B964153J645839N828498J634964k089904k992000o263542r076320k421475
39000a0769787R959681J2872302L540435l646934j026675J914412j523897l645159
38992G674378J86368R04404n501839o136984O683567J6929291P068527j2447184
38984A5360528j6160325j40307J3782162R122982o239521j4262202q159367L440502
38976c255548P082880j538008j0903479m965886J4836263K6466524J4027329r833330
38968C1916745j9159750p303319P792231Q930333j402743q898251n506687L655432
38960A0023991P544681J599247o820001p529513j220598K253961n00393k355572
$$ plain form
38952 2995803 2824093 1535207 -7059277 -18453128 -20577609 -12198066 -5966500 -8772745
38944 -8772745 -10838067 -2085374 10136013 10218567 -3622088 -16610597 -16053609 -5021568
38936 -5021568 4064876 4317812 -250006 -2243530 -28479 2610948 3648736 4579124
38928 4579124 4581951 -339563 -8950804 -12761567 -8742006 -7082251 -16959169 -30090187
38920 -30090187 -30226310 -16222348 -3149270 -777320 -3279772 -2215117 1474296 2061426
38912 2061426 -2827340 -11269349 -17370166 -12786489 3474242 17966743 16442686 3974220
38904 3974220 -1265981 5451162 10326536 5302669 266717 3495283 6215333 -1165296
38896 -1165296 -10109652 -5969696 8871528 18441759 15921998 9807658 8179283 8331207
$$ packed form
38952B995803j71710j288886q594484j1393851k124481Q379543O231566k806245
38944h772745k065322Q752693J2221387Q2554j3840655j2988509N56988J1032041
38936e021568R086444K52936m567818j993524K215051K639427J037788R30388
38928D579124K827m921514q611241l810763M019561J659755r876918j3131018
38920c0090187j36123J4003962J3073078K371950k502452J064655L689413N87130
38912B061426m888766q442009o100817M583677J6260731J4492501j524057j2468466
38904C974220n240201O717143M875374n023867n035952L228566K720050p380629
38896a165296q944356M139956J4841224R570231k519761o114340j628375J51924
$$ plain form
38888 8331207 4639976 -1290627 -3124364 664042 4128193 2034580 -1774035 897686
38880 897686 8928531 10479492 78372 -11086324 -10508651 -2019317 3681727 8220082
38872 8220082 18984298 29065899 23993311 7351750 -1312448 3911535 9025650 7204459
38864 7204459 9247713 19397018 23793081 15025238 7399092 13546304 24470695 27929008
38856 27929008 28749097 34126500 35651763 24886018 12202072 10565413 13705210 10541617
38848 10541617 8756135 21491771 40187542 44027885 30743030 16724670 10983467
38841 10983467 8922260 7989738 10113599 11342624 6439968 387085 -218748 -768816
38833 -768816 -6967982 -8770187 3393138 15543904 8177010 -9464583 -10835173 5933424
$$ packed form
38888H331207l691231n930603j833737L788406L464151k093613l808615K671721
38880H97686Q030845J550961j0401120j1164696N77673Q489334N701044M538355
38872H220082J0764216J0081601n072588j6641561q664198N223983N114115j821191
38864G204459K043254J0149305M396063q767843p626146O147212J0924391L458313
38856B7929008Q20089N377403J525263j0765745j2683946j636659L139797l163593
38848A0541617j785482J2735636J8695771L840343j3284855j4018360n741203
38841A0983467k061207r32522K123861J229025m902656o052883o05833n50068
38833g68816o199166j802205J2163325J2150766p366894j7641593j370590J6768597
$$ plain form
38825 5933424 17170856 14331944 13845021 21943628 21894487 6629781 -5654228 -2766597
38817 -2766597 1358653 -5417422 -9856782 2247899 18666718 19929236 9961534 5057937
38809 5057937 4651851 -3791471 -18487854 -24128127 -15957514 -4554452 2224179 6302329
38801 6302329 8849977 6981087 2366969 1645207 5994493 8551093 3753431 -6416166
38793 -6416166 -15263681 -16028348 -6005026 9157496 18215391 16271409 10662576 10296732
38785 10296732 13436759 11808316 2990294 -7443878 -13357300 -12413056 -5849864 1455598
38777 1455598 3652460 670560 -1035679 2191739 5911068 5711795 5311271 10945192
38769 10945192 21810045 31477283 35262101 31566619 20288278 5550864 -3511671 -550499
$$ packed form
38825E933424J1237432k838912m86923Q098607m9141j5264706j2284009K887631
38817b766597M125250o776075m439360J2104681J6418819J262518r967702m903597
38809E057937m06086q443322j4696383n640273Q170613J1403062O778631M078150
38801F302329K547648j868890m614118p21762M349286K556600m797662j0169597
38793f416166q847515p64667J0023322J5162522R057895j943982n608833l65844
38785A0296732L140027j628443q818022j0434172n913422R44244O563192P305462
38777A455598K196862k981900j706239L227418L719329j99273m00524N633921
38769A0945192J0864853R667238L784818l695482j1278341j4737414r062535K961172
$$ plain form
38761 -550499 11315938 24191054 33316191 36687398 31769397 18829572 4937949 -1173389
38753 -1173389 2291329 9689167 14296129 13022865 7513593 2783584 2350923 3935931
38745 3935931 3369728 2004322 4192610 8052456 7645589 5403005 11238349 25161051
38737 25161051 32597009 24571574 11722382 8085351 10338462 5948475 -4718568 -9105500
38729 -9105500 -2920661 3907689 2837248 -2951084 -6361318 -5618406 -2578635 1481095
38721 1481095 5438902 8267884 10825222 13826383 14225779 8416996 -1038038 -6876478
38713 -6876478 -5636890 -296540 5227560 9192218 9790465 5660322 237107 811162
38705 811162 10581792 24094087 32004866 28882066 16739481 3516089 -2271641 1608340
$$ packed form
38761e50499J1866437J2875116R125137L371207m918001j2939825j3891623o111338
38753a173389L464718P397838M606962j273264n509272m730009m32661J585008
38745C935931n66203j365406K188288L859846m06867k242584N835344J3922702
38737B5161051P435958q025435j2849192l637031K253111m389987j0667043m386932
38729i105500O184839O828350j070441n788332l410234P42912L039771M059730
38721A481095L957807K828982K557338L001161L99396n808783r455034n838440
38713f876478J239588N340350N524100L964658N98247m130143n423215N74055
38705H11162R770630J3512295P910779l122800j2142585j3223392n787730L879981
$$ plain form
38697 1608340 9271124 13728598 14852021 17752958 24699478 32678747 38523532 41854991
38689 41854991 41986222 36366568 24918473 13199319 7768164 9049895 11689105 12466530
38681 12466530 14962599 23696342 35215914 39786079 33542838 24415409 21969893 25111034
38673 25111034 25990461 23793287 26290411 36607350 46500989 46770903 38570698 29877064
38665 29877064 25119702 22976895 21221966 19084224 16486558 14315493 14120693 15475084
38657 15475084 15554381 12859774 8908876 5241277 2207936 1750312 6647984 14801941
38649 14801941 19167451 16630943 12622502 13355185 17520350 19507747 17159895 12340262
38641 12340262 7132631 3481452 3700539 7606862 11724863 14217353 17242476 21535381
$$ packed form
38697A608340P662784M457474J123423K900937O946520P979269N844785L331459
38689D1854991J31231n619654j1448095j1719154n431155J281731K639210P77425
38681A2466530K496069Q733743J1519572M570165o243241r127429k445516L141141
38673B5111034Q79427k197174K497124J0316939R893639K69914q200205q693634
38665B9877064m757362k142807j754929k137742k597666k171065j94800J354391
38657A5475084P9297k694607l950898l667599l033341m57624M897672Q153957
38649A4801941M365510k536508m008441P32683M165165J987397k347852m819633
38641A2340262n207631l651179K19087L906323M118001K492490L025123M292905
$$ plain form
38633 21535381 23011922 18919392 13557375 13277712 18700307 25677471 30552526 30778138
38625 30778138 24775937 16125810 13568216 20755467 29488744 29784949 23867235 22583612
38617 22583612 29069215 33889283 28013439 14587921 4681418 4442380 9454194 11576742
38609 11576742 9854113 12037153 22868105 33756778 31117663 15375819 3000967
38602 3000967 5734422 16247065 21043908 19829494 22308382 30808055 37413089 37069471
38594 37069471 33351802 30524069 28696895 28602011 33242039 41635452 47027055 45123966
38586 45123966 40321492 40605762 48218083 56871414 57108004 45123474 28416236 21179169
38578 21179169 30796018 49954879 65035976 70136386 68930613 65783563 61796696 58904264
$$ packed form
38633B1535381J476541m092530n362017k79663N422595O977164M875055K25612
38625C0778138o002201q650127k557594P187251Q733277K96205n917714j283623
38617B2583612O485603M820068n875844j3425518r906503k39038N011814K122548
38609A1576742j722629K183040J0830952J0888673k639115j5741844j2374852
38602C000967K733455J0512643M796843j214414K478888Q499673O605034l43618
38594C7069471l717669k827733j827174r4884M640028Q393413N391603j903089
38586D5123966m802474K84270P612321Q653331K36590j1984530j6707238p237067
38578B1179169R616849J9158861J5081097N100410j205773l147050l986867k892432
$$ plain form
38570 58904264 60632134 66858990 72935798 75750175 76263317 74818028 69265770 60632175
38562 60632175 56084558 61819605 75050299 86671780 90742054 88334295 83228661 78074902
38554 78074902 75743599 80033532 90730348 99720204 97822597 87152680 81600013 91257887
38546 91257887 110266081 124546700 127539304 122267455 112247286 99812382 91457215
38539 91457215 93479558 100843011 101036538 91852622 84644319 86054778 88429005 85041225
38531 85041225 82863956 89952444 99961060 101643276 96825759 95947430 100366703 102148569
38523 102148569 98817735 95715698 94658819 91917819 87326769 84522549 82200720 76173700
38515 76173700 70322431 73317927 82448322 83379118 70848008 58162844 58960098 68696219
$$ packed form
38570E8904264J727870O226856O076808K814377N13142j445289n552258q633595
38562F0632175m547617N735047J3230694J1621481M070274k407759n105634n153759
38554G8074902k331303M289933J0696816Q989856j897607j0669917n552667R657874
38546I1257887J9008194J4280619K992604n271849j0020169j2434904q355167
38539I1457215K022343P363453J93527r183916p208303J410459K374227l387780
38531H5041225k177269P088488J0008616J682216m817517q78329M419273J781866
38523A02148569l330834l102037j056879k741000m591050k804220k321829o027020
38515G6173700n851269K995496R130395R30796j2531110j2685164P97254R736121
$$ plain form
38507 68696219 72802687 66763421 59107850 57894979 62173771 65729562 63491551 54865324
38499 54865324 45099716 42356616 49069197 56748024 53878771 39731356 26406381 25270057
38491 25270057 34484962 43053144 44907354 44011215 45587981 48745945 51415167 56656439
38483 56656439 66818021 74920445 71291694 58625222 50937622 55326099 63542045 65088681
38475 65088681 60106904 54596002 51046154 49729794 52112479 56817701 58802348 58308872
38467 58308872 63299684 76545867 88178499 88814659 82526686 78443683 77226038 75112278
38459 75112278 73358874 73006288 68050851 55713302 46038073 48246749 54960946 54663386
38451 54663386 52361557 60131720 72904953 74381828 65019254 62576160 73270753 83588838
$$ packed form
38507F8696219M106468o039266p655571j212871M278792L555791k238011q626227
38499E4865324r765608k743100O712581P678827k869253j4147415j3324975j136324
38491B5270057R214905Q568182J854210q96139J576766L157964K669222N241272
38483E6656439J0161582Q102424l628751j2666472p687600M388477Q215946J546636
38475F5088681m981777n510902l549848j316360K382685M705222J984647m93476
38467E8308872M990812J3246183J1632632O36160o287973m083003j217645k113760
38459G5112278j753404l52586m955437j2337549r675229K208676O714197k97560
38451E4663386k301829P770163J2773233J476875r362574k443094J0694593J0318085
$$ plain form
38443 83588838 85126765 86763656 94656740 99787889 96098016 93935552 102728205 114346586
38435 114346586 117340237 116327123 123023067 136484770 146354383 150276550 155131659 163756843
38427 163756843 171424261 174945915 177549882 184663831 198933974 217839005 234262236
38420 234262236 243281189 249719914 263241324 284790056 305517766 320770936 335718944
38413 335718944 354203587 372584290 389118911 408219150 429125616 441695144 441790118
38406 441790118 440713693 450147682 466828343 481318040 492360773 501852533 504799468
38399 504799468 496970918 485439487 478771511 472911352 460026173 445939294 444018760
38392 444018760 454330031 462886198 460926281 452525933 443620330 435765935 431249159 432683584
$$ packed form
38443H3588838J537927J636891P893084N131149l689873k162464Q792653J1618381
38435A14346586K993651j013114O695944J3461703R869613L922167M855109Q625184
38427A63756843P667418L521654K603967P113949J4270143J8905031J6423231
38420B34262236R018953O438725J3521410K1548732K0727710J5253170J4948008
38413C35718944J8484643J8380703J6534621J9100239K0906466J2569528R4974
38406D41790118j076425R433989J6680661J4489697J1042733R491760K946935
38399E04799468p828550j1531431o667976n860159j2885179j4086879j920534
38392D44018760J0311271Q556167j959917q400348q905603p854395m516776J434425
$$ plain form
38384 432683584 436079310 434644725 430540071 432678902 441859110 448653789 447691921 443277775
38376 443277775 438553120 430535160 420101621 415744853 420927779 427003212 426015996 422472578
38368 422472578 423888120 426082374 417867088 397264356 373874196 356069642 343986906
38361 343986906 335671224 332215665 333305612 332936443 324515379 308727415 293025138 283601111
38353 283601111 279913519 276804166 269778052 257695043 242371723 227200920 215213751
38346 215213751 206895740 200243036 193899754 189095249 186783685 184105076 176519255 163397709
38338 163397709 149011598 137789702 130873965 127344845 126009228 125191567 123128427 119643382
38330 119643382 115938305 112386593 108037062 102313230 95874106 90288014 87865323 90044895
$$ packed form
38384D32683584L395726j434585m104654K138831R180208O794679r61868m414146
38376D43277775m724655q017960j0433539m356768N182926O075433r87216l543418
38368D22472578J415542K194254q215286k0602732k3390160j7804554j2082736
38361C43986906q315682l455559J089947l69169q421064j5787964j5702277r424027
38353B83601111l687592l109353p026114j2083009j5323320j5170803j1987169
38346B15213751q318011o652704o343282m804505k311564k678609p585821j3121546
38338A63397709j4386111j1221896o915737l529120j335617q17661k063140l485045
38330A19643382l705077l551712m349531n723832o439124n586092k422691K179572
$$ plain form
38322 90044895 94202661 94396422 87580500 76482373 64526541 52788924 45103387 48764917
38314 48764917 62983192 73539954 69170845 57931659 55255521 60292724 59100431 49289480
38306 49289480 44219524 50673880 59369964 62460726 64220741 67705536 66732625 59872653
38298 59872653 57343531 63706403 68078259 63101271 59196538 65915004 72761044 65659117
38290 65659117 51427352 46939101 51898958 51880352 43244636 35719601 33100576 30146384
38282 30146384 27504824 31528633 38911954 38989296 32546252 31019639 34961265 31665553
38274 31665553 18979668 13227510 24877145 41633836 45949035 37142478 26039818
38267 26039818 18383560 14535081 17117064 27296477 38400878 42865248 42201456 42798274
$$ packed form
38322I0044895M157766J93761o815922j1098127j1955832j1737617p685537L661530
38314D8764917J4218275J0556762m369109j1239186k676138N037203j192293r810951
38306D9289480n069956O454356Q696084L090762J760015L484795r72911o859972
38298E9872653k529122O362872M371856m976988l904733O718466O846040p101927
38290F5659117j4231765m488251M959857j8606q635716p525035k619025k954192
38282C0146384k641560M023809P383321P7342o443044j526613L941626l295712
38274C1665553j2685885n752158J1649635J6756691M315199q806557j1102660
38267B6039818p656258l848479K581983J0179413J1104401M464370o63792N96818
$$ plain form
38259 42798274 45762025 48053260 49958351 53708461 56717493 53425117 43890005 35400442
38251 35400442 34721782 41468918 49243405 51773598 48299252 43406657 40930163 39361146
38243 39361146 35753001 32138624 33108673 37620687 39099439 34865162 30180067 30753403
38235 30753403 35264154 37539331 33593512 25608357 20926962 25979084 38097159 45524482
38227 45524482 40114488 27584301 19440832 17766354 16077283 13069643 15010343 23657122
38219 23657122 32089060 35418922 36557611 37962065 36666830 32119317 30533516 35450829
38211 35450829 40725147 39138221 32663589 28241971 27680178 27338052 24746542 21043130
38203 21043130 19088301 21560167 27829257 31944613 29066808 24734118 30029775 45014633
$$ packed form
38259D2798274K963751K291235J905091L750110L009032l292376r535112q489563
38251C5400442o78660O747136P774487K530193l474346m892595k476494j569017
38243C9361146l608145l614377R70049M512014J478752m234277m685095N73336
38235C0753403M510751K275177l945819p985155m681395N052122J2118075P427323
38227D5524482n409994j2530187q143469j674478j689071l007640J940700Q646779
38219B3657122Q431938L329862J138689J404454j295235m547513j585801M917313
38211C5450829N274318j586926o474632m421618n61793l42126k591510l703412
38203B1043130j954829K471866O269090M115356k877805m332690N295657J4984858
$$ plain form
38195 45014633 56086834 54917406 50640330 55034581 63755574 63698511 54321092 48701197
38187 48701197 53349715 58743393 54036277 42520161 35796363 37094721 37957832 31852293
38179 31852293 25003898 29025694 44692482 59167935 61684468 56770584 56839588 65436445
38171 65436445 74916096 78878284 78575997 76397087 71270645 63463964 57320707 55652985
38163 55652985 56259812 56568033 57139445 58828646 61286206 65266687 71024499 74607668
38155 74607668 73194778 73789043 86093550 104879502 112045108 101932643 92289640 100834087
38147 100834087 121240283 133844375 132387435 127421427 128113885 133575843 140289270 146515844
38139 146515844 149143798 145418912 138470032 134193804 133338843 132868581 132735746 133932999
$$ packed form
38195D5014633J1072201j169428m277076M394251Q720993n7063r377419n619895
38187D8701197M648518N393678m707116j1516116o723798J298358Q63111o105539
38179C1852293o848395M021796J5666788J4475453K516533m913884O9004Q596857
38171F5436445R479651L962188l02287k178910n126442p806681o143257j667722
38163E5652985O06827L08221N71412J689201K457560L980481N757812L583169
38155G4607668j412890N94265J2304507J8785952P165606j0112465r643003Q544447
38147A00834087K0406196J2604092j456940m966008O92458N461958O713427O226574
38139A46515844K627954l724886o948880m276228q54961m70262j32835J197253
$$ plain form
38131 133932999 132585930 124722449 114969274 111276167 112395151 110484537 105314667 104544438
38123 104544438 108551101 106803592 93816720 78738458 72858995 75165720 76778029 73745038
38115 73745038 68678019 63939505 59986205 58311480 60298831 63697993 64031095 59241813
38107 59241813 50993465 42745576 38276808 39978615 46094733 50954366 49997422 43753489
38099 43753489 36030647 30146081 28134300 30955101 36694031 40007908 36521494 28100250
38091 28100250 21833425 22966659 29682892 35589312 36883829 35683657 35534309 35439541
38083 35439541 31520643 24520856 21243493 25898612 33582923 36574414 34784406 34720975
38075 34720975 38851061 41880867 39173436 33858747 32146355 34488836 35325060 30912759
$$ packed form
38131A33932999j347069p863481r753175l693107J118984j910614n169870p70229
38123A04544438M006663j747509j2986872j5078262n879463K306725J612309l032991
38115G3745038n067019m738514l953300j674725J987351L399162L33102m789282
38107E9241813q248348q247889m468768J701807O116118M859633r56944o243933
38099D3753489p722842n884566k011781K820801N738930L313877l486414q421244
38091B8100250o266825J133234O716233N906420J294517j200172j49348r4768
38083C5439541l918898o999787l277363M655119P684311K991491j790008o3431
38075C4720975M130086L029806k707431n314689j712392K342481Q36224m412301
$$ plain form
38067 30912759 24313014 21731008 25379224 31145369 33187097 29976961 25183661 23114690
38059 23114690 24543456 27014978 27637825 24925135 19401700 13499959 9905563 9239519
38051 9239519 10079006 11058398 11338706 9596452 5635133 3065379 6130375 12492499 14152392
38042 14152392 8868399 5832392 14224632 29050512 35551514 27762748 15951290 12995233
38034 12995233 18575681 21606532 15864046 7404741 5070854 8152624 8169583 1641615
38026 1641615 -4852853 -4553630 99144 2986610 4734570 9851928 15624687 13572978
38018 13572978 3475189 -3310251 1216718 10835387 14397396 10064011 4800310 4447913
38010 4447913 9532958 16935932 21189313 17993488 9970397 4182984 1413371 -4594676
$$ packed form
38067C0912759o599745k582006L648216N766145K041728l210136m793300k068971
38059B3114690J428766K471522O22847k712690n523435n901741l594396o66044
38051I239519Q39487R79392K80308j742254l961319k569754L064996O362124J659893
38042A4152392n283993l036007Q392240J4825880O501002p788766j1811458k956057
38034A2995233N580448L030851n742486q459305k333887L081770J6959o527968
38026A641615o494468K99223M652774K887466J747960N117358N772759k051709
38018A3572978j0097789o785440M526969R618669L562009m333385n263701l52397
38010D447913N085045P402974M253381l195825q023091n787413k769613o008047
$$ plain form
38002 -4594676 -13472873 -14142992 -2183832 8930850 5557160 -5254039 -6426822 3500532
37994 3500532 10984669 10467158 9800491 12326427 10354118 642856 -8231663 -9862676
37986 -9862676 -8871163 -9528546 -7246817 1112223 8846720 9748352 8155565 10283577 13306747
37977 13306747 11887115 8666307 8712119 9032901 3672862 -4400844 -6347822 -596583
37969 -596583 5765152 7818094 7153684 5830664 3773617 3100322 7841672 16549039 20357576
37960 20357576 12315276 -3341181 -13857422 -9835007 5916109 20952460 24697660
37953 24697660 17507206 8101731 3495790 3930475 6581149 9694204 11978609 11996010
37945 11996010 10157040 8295624 5986153 754331 -6765130 -11792109 -11233845 -6867032
$$ packed form
38002d594676q878197o70119J1959160J1114682l373690j0811199j172783R927354
37994C500532P484137n17511o66667K525936j972309r711262q874519j631013
37986i862676R91513o57383K281729Q359040P734497R01632j592787K128012L023170
37977A3306747j419632l220808M5812L20782n360039q073706j946978N751239
37969e96583O361735K052942o64410j323020k057047o73295M741350Q707367L808537
37960B0357576q042300j5656457j0516241M022415J5751116J5036351L745200
37953B4697660p190454r405475m605941M34685K650674L113055K284405J7401
37945A1996010j838970j861416k309471n231822p519461n026979N58264M366813
$$ plain form
37937 -6867032 -1319948 4886917 10749850 13967313 14760737 15909417 17328306 16171982
37929 16171982 14243614 18226632 28711157 36004316 32330394 22180612 14591189 10984839
37921 10984839 7735157 5504508 7336008 10610411 9717377 5696255 5530243 11691089
37913 11691089 18640041 20419976 17138792 13489397 13786474 17665032 18911324 11652035
37905 11652035 -233024 -5347373 -371028 3398181 -4172067 -16354452 -19081766 -11076400
37897 -11076400 -3235271 -924527 750374 4451447 5920868 4163017 5259598 11974519
37889 11974519 18504278 19566915 16740532 12201672 4556470 -4521042 -7643939 -1771607
37881 -1771607 5590366 6443183 3040167 2310381 4470950 4340099 816197 -2085209 -2407607
$$ packed form
37937f867032N547084O206865N862933L217463P93424J148680J418889j156324
37929A6171982j928368L983018J0484525P293159l673922j0149782p589423l606350
37921A0984839l249682k230649J831500L274403q93034m021122j66012O160846
37913A1691089O948952J779935l281184l649395K97077L878558J246292p259289
37905A1652035j1885059n114349M976345L769209p570248j2182385k727314Q005366
37897a1076400P841129K310744J674901L701073J469421j757851J096581O714921
37889A1974519O529759J062637k826383m538860p645202r077512l122897N872332
37881a771607P361973Q52817l403016p29786K160569j30851l523902k901406l22398
$$ plain form
37872 -2407607 -2420426 -3619797 -4230885 -2468722 775291 3513480 5525612 8747062 13991284
37863 13991284 16769753 9285210 -9130851 -25421669 -23760190 -4511009 14601717
37856 14601717 19291678 13903150 11184917 13791014 13965787 7742775 232379 -3083423
37848 -3083423 -2515080 180131 5942442 14750799 21980674 22430497 16181919 7552957
37840 7552957 -284298 -6569262 -9976291 -8793043 -5231971 -5195508 -10185978 -12759940
37832 -12759940 -5580780 6690465 11631590 5568512 -2121746 -3565824 -2293275 -3595609
37824 -3595609 -4469841 -1630320 -963654 -7392042 -12085924 -4022570 10004192 13166807
37816 13166807 5010942 2515237 12955133 24048392 26380491 26862243 30436046 26499383
$$ packed form
37872b407607j2819j199371o11088J762163L244013K738189K012132L221450N244222
37863A3991284K778469p484543j8416061j6290818J661479J9249181J9112726
37856A4601717M689961n388528k718233K606097J74773o223012p510396l315802
37848c083423N68343K695211N762311Q808357P229875M49823o248578q628962
37840G552957p837255o284964l407029J183248L561072L6463m990470k573962
37832a2759940P179160J2271245M941125o063078p690258j444078J272549j302334
37824c595609q74232K839521O66666o428388m693882Q063354J4026762L162615
37816A3166807q155865k495705J0439896J1093259K332099M81752L573803l936663
$$ plain form
37808 26499383 7962535 -10716242 -11721781 112888 6763748 4418412 3047846 4104583
37800 4104583 -1270469 -12375952 -16131010 -7615166 1928483 2398347 -2466993 -4637720
37792 -4637720 -3298168 -1698128 -1073402 -1890652 -4325637 -5631763 -4017438 -4610041 -12131203
37783 -12131203 -18757550 -12080282 3942493 10855106 2479312 -5599331 -214742 11257745
37775 11257745 17287661 21647571 31479114 37861926 27365110 7023840 -1760249 6439553
37767 6439553 14877084 11601834 5472578 7715452 12058968 5910245 -7073389 -10211602
37759 -10211602 1532820 12760203 7995856 -7587262 -15391228 -7602313 4530443
37752 4530443 7419059 1761676 -2719776 -2928803 -4268658 -9264773 -13561735 -14179192
$$ packed form
37808B6499383j8536848j8678777j005539J1834669O650860k345336j370566J056737
37800D104583n375052j1105483l755058Q515844R543649M69864m865340k170727
37792d637720J339552J600040O24726q17250k434985j306126J614325n92603p521162
37783a2131203o626347O677268J6022775O912613q375794q078643N384589J1472487
37775A1257745O029916M359910R831543O382812j0496816k0341270q784089Q199802
37767F439553Q437531l275250o129256K242874M343516o148723j2983634l138213
37759a0211602J1744422J1227383m764347j5583118p803966P788915J2132756
37752D530443K888616n657383m481452k09027j339855m996115m296962o17457
$$ plain form
37744 -14179192 -13506390 -12686992 -8751389 -1861440 2023534 515375 41833 6031127
37736 6031127 14161671 18050530 19682493 23912321 27350153 22579124 11310815 3755386
37728 3755386 5004716 10336791 14417324 17142337 19118633 18991784 17544890 17829440
37720 17829440 18792712 15148550 6554383 608371 2424177 6643611 5434395 629311
37712 629311 1065866 8670545 13854806 7692266 -5115625 -10519134 -2938757 5818533
37704 5818533 183878 -18371964 -31221724 -25476036 -9749173 -1182525 -2915966 -4123319
37696 -4123319 502345 3506496 -748537 -5451007 -2201712 4883311 4624173 -4904456
37688 -4904456 -13514053 -12035082 -2023425 8788625 15824202 19881341 22889535 24834332
$$ packed form
37744a4179192O72802Q19398L935603O889949L884974j508159m73542N989294
37736F031127Q130544L888859J631963M229828L437832m771029j1268309p555429
37728C755386J249330N332075M080533K725013J976296j26849j446894K84550
37720A7829440R63272l644162q594167n946012J815806M219434j209216m805084
37712F29311M36555P604679N184261o162540j2807891n403509P580377Q757290
37704E818533n634655j8555842j2849760N745688J5726863Q566648j733441j207353
37696d123319M625664L004151m255033m702470L249295P085023k59138r528629
37688d904456q609597J478971J0011657J0812050P035577M057139L008194J944797
$$ plain form
37680 24834332 25040136 24386292 24254294 23349509 18171368 8657447 1134828 1784118 8021784
37671 8021784 11176112 8303152 5927971 9573839 14897817 13988066 6720318 -129111
37663 -129111 -3088212 -4618773 -5601455 -2412700 5459265 10694484 6444202 -3644706
37655 -3644706 -9474260 -7593688 -4535743 -6492062 -11712857 -16149947 -21014140 -28593592
37647 -28593592 -33582360 -26682925 -8333243 7628934 8157847 -4390681 -15513671 -14553335
37639 -14553335 -4381837 3591598 1249893 -8956685 -16639192 -13588864 -2093964 7612833
37631 7612833 8205081 1566224 -5663005 -9257482 -8840680 -5945324 -3137949 -2201529 -1229695
37622 -1229695 3070882 8431957 7414758 -1780315 -10182282 -8988895 -1146987 4166341
$$ packed form
37680B4834332K05804o53844j31998r04785n178141r513921p522619O49290O237666
37671H021784L154328k872960k375181L645868N323978r09751p267748o849429
37663a29111k959101j530561r82682L188755P871965N235219m250282j0088908
37655c644706n829554J880572L057945j956319n220795m437090m864193p579452
37647b8593592m988768O899435J8349682J5962177N28913j2548528j1122990R60336
37639a4553335J0171498P973435k341705j0206578p682507L050328J1494900R706797
37631G612833N92248o638857p229229l594477M16802K895356K807375R36420R71834
37622a229695M300577N361075j017199r195073q401967J193387P841908N313328
$$ plain form
37614 4166341 4584007 4624788 5732823 4859237 2075490 1284525 2702831 1833499 -3025844
37605 -3025844 -8642840 -13086926 -17867989 -22784590 -24562370 -21962376 -17383968 -13131464
37597 -13131464 -10709494 -12229449 -16361161 -15408565 -4822854 6660988 6887551 -1254239
37589 -1254239 -3853167 1855678 4614988 777160 1249784 10065206 13969393 4917268
37581 4917268 -3536444 2219587 12137861 9259236 -1015474 -604640 9108357 9430685
37573 9430685 -2115276 -5117675 11150554 29967670 31910587 20121273 9049178
37566 9049178 1979540 -6328267 -14086830 -13936064 -5901864 2097228 4791628 3146342
37558 3146342 -86029 -2228221 -705696 3752860 6580123 5226704 1373351 -4666013
$$ packed form
37614D166341M17666M0781J108035q73586k783747p90965J418306q69332m859343
37605c025844n616996m444086m781063m916601j777780K599994M578408M252504
37597a3131464K421970j519955m131712R52596J0585711J1483842K26563q141790
37589a254239k598928N708845K759310l837828M72624Q815422L904187r052125
37581D917268q453712N756031R918274k878625j0274710M10834R712997L22328
37573I430685j1545961l002399J6268229J8817116J942917j1789314j1072095
37566I049178p069638q307807p758563J50766Q034200P999092K694400j645286
37558C146342l232371k142192J522525M458556K827263j353419l853353o039364
$$ plain form
37550 -4666013 -14236281 -21567781 -15110224 4542753 18062902 10402936 -7154737 -11811361
37542 -11811361 -879567 7607199 4406109 1343689 9696630 22204152 25955431 21926609
37534 21926609 20382634 23276858 22344434 12726835 -124915 -7650882 -7118152 -2908167
37526 -2908167 -1814788 -6811272 -14105549 -17669907 -16688584 -15026842 -13423822 -8534122
37518 -8534122 -1868650 -2013038 -12257080 -22186418 -19283435 -5242452 6747989 8396537
37510 8396537 2730495 -3468231 -5567698 -784884 9350108 16032021 11083586 -958837
37502 -958837 -6708731 -1560047 5061356 4918674 2240273 4219308 8237260 6573476
37494 6573476 -1019699 -7565030 -9309925 -8886939 -8969113 -8675775 -6461894 -2296341 3393352
$$ packed form
37550d666013r570268p331500O457557J9652977J3520149p659966j7557673m656624
37542a1811361J0931794Q486766l201090l062420Q352941J2507522L751279m028822
37534B1926609j543975K894224r32424r617599j2851750p525967N32730M209985
37526b908167J093379m996484p294277l564358R81323J661742J603020M889700
37518h534122O665472j44388j0244042r929338K902983J4040983J1990441J648548
37510H396537n666042o198726k099467M782814J0134992O681913m948435j2042423
37502i58837n749894N148684O621403j42682k678401J979035M017952j663784
37494F573476p593175o545331j744895M22986q2174K93338K213881M165553N689693
$$ plain form
37485 3393352 10106688 16593916 21331450 22861416 19491466 11648413 4899034 5607792
37477 5607792 11821766 14572260 11454656 11674790 21680827 32685824 31411968 19061126
37469 19061126 9937199 12723720 21777542 26881513 24387515 18250499 15242896 18335554
37461 18335554 21059729 12751102 -5041227 -14441390 -3606176 13392964 13290107 -3929710
37453 -3929710 -16698497 -15215689 -12892008 -19567092 -24087867 -15649981 -5607505 -11106856
37445 -11106856 -27273020 -33007866 -19776288 185756 12186295 12922128 6799011 -456543
37437 -456543 -3405670 -92791 5369471 8114349 8544214 8771139 7541087 4488267 3920605
37428 3920605 7093182 6815041 -1257417 -8331417 -4830998 2520135 -276373 -11792329
$$ packed form
37485C393352O713336O487228M737534J529966l369950p843053o749379P08758
37477E607792O213974K750494l117604K20134J0006037J1004997j273856j2350842
37469A9061126r123927K786521R053822N103971k493998o137016l007603L092658
37461A8335554K724175q308627j7792329r400163J0835214J6999140j02857j7219817
37453c929710j2768787J482808K323681o675084m520775Q437886J0042476n499351
37445a1106856j6166164n734846J3231578J9962044J2000539P35833o123117p255554
37437d56543k949127L312879N462262K744878M29865K26925j230052l052820n67662
37428C920605L172577k78141q072458p074000L500419P351133k796508j1515956
$$ plain form
37420 -11792329 -16681724 -9114248 857841 5850155 10151931 15828601 15254442 5273036
37412 5273036 -4032465 -3949368 -203375 -2065522 -7318371 -7911091 -3116721 2959232 10380634
37403 10380634 19082611 21001754 8828667 -9626185 -17645553 -10678938 -1163442 -575756
37395 -575756 -5798435 -7083549 -2382171 1884629 916724 -2671154 -3086751 1060548 4737522
37386 4737522 2463545 -4632201 -10030779 -9929670 -6491155 -2423739 2406593 6705950
37378 6705950 6497666 2831263 4310818 14754488 23993539 20547608 9426344 5782643
37370 5782643 12801056 19092794 18589594 17871152 19065020 11561673 -8518995 -24049475
37362 -24049475 -17508620 2519032 12309007 5864283 -1054446 1345792 4455851 735635
$$ packed form
37420a1792329m889395P567476R972089M992314M301776N676670n74159r981406
37412E273036r305501Q3097L745993j862147n252849n92720M794370O075953P421402
37403A0380634Q701977J919143j2173087j8454852q019368O966615R515496N87686
37395e75756n222679j285114M701378M266800r67905l587878m15597M147299L676974
37386D737522k273977p095746n398578J01109L438515M067416M830332M299357
37378F705950k08284l666403J479555J0443670R239051l445931j1121264l643701
37370E782643P018413O291738n03200p18442J193868p503347k0080668j5530480
37362b4049475O540855K0027652R789975o444724o918729K400238L110059l720216
$$ plain form
37354 735635 -2863778 -89662 1770210 -3261639 -5044678 7217023 23817698 26023463
37346 26023463 13833022 5074572 8350188 13806536 12331205 7572947 4195681 -1078882
37338 -1078882 -9505121 -13662674 -9159191 -3190490 -3188100 -5578039 -4248307 -2253808 -5787633
37329 -5787633 -12741817 -16385323 -15543125 -13014385 -8745985 -2457032 1853274 1777432 1609839
37320 1609839 3762530 1545767 -9746523 -20813763 -19271413 -8045326 -298437 532967
37312 532967 1984100 5779032 4649246 -2946359 -8800394 -8699996 -7932362 -9542859 -8657728
37303 -8657728 -2666101 3793446 8466245 15522427 25036112 28928425 23416576 15822765
37295 15822765 12568571 9770466 2931227 -3131349 -2634733 437946 -1090884 -6274785
$$ packed form
37354G35635l599413K774116J859872n031849j783039J2261701J6600675K205765
37346B6023463j2190441q758450L275616N456348j475331m758258l377266n274563
37338a078882q426239m157553M503483N968701K390k389939J329732J994499l533825
37329e787633o954184l643506Q42198K528740M268400O288953M310306p5842j67593
37320A609839K152691k216763j1292290j1067240J542350J1226087P746889Q31404
37312E32967J451133L794932j129786p595605n854035J00398P67634j610497Q85131
37303h657728N991627O459547M672799P056182R513685L892313n511849p593811
37295A5822765l254194k798105o839239o062576M96616L072679j528830n183901
$$ plain form
37287 -6274785 -9686234 -10996186 -12831321 -14173010 -13913734 -15846529 -21525363 -23158103
37279 -23158103 -13508458 716181 5829941 -347417 -7194933 -7904979 -7097103 -10208233
37271 -10208233 -14431158 -13968673 -8096097 -549772 4781872 5249464 471352 -5894534
37263 -5894534 -8552518 -6454992 -3879968 -4788601 -8640726 -12507889 -14728319 -15276634
37255 -15276634 -14297309 -11608093 -7430238 -3473628 -2647508 -5970069 -10061556 -10712106
37247 -10712106 -9090717 -9909261 -12163238 -7911979 5438838 17305907 15419744 2129146
37239 2129146 -8369671 -8332467 -4706383 -7795361 -17937847 -26790064 -28222173 -24234992
37231 -24234992 -20872325 -20659443 -20314889 -16092408 -9720881 -6199322 -6147928 -4924062 -824822
$$ packed form
37287f274785l411449j309952j835135j341689K59276j932795n678834j632740
37279b3158103R649645J4224639N113760o177358o847516p10046Q07876l111130
37271a0208233m222925M62485N872576P546325N331644M67592m778112o365886
37263e894534k657984K097526K575024r08633l852125l867163k220430n48315
37255a5276634R79325K689216M177855L956610Q26120l322561m091487o50550
37247a0712106J621389q18544k253977M251259J3350817J1867069j886163j3290598
37239B129146j0498817L7204L626084l088978j0142486q852217j432109L987181
37231b4234992L362667K12882L44554M222481O371527L521559N1394J223866M099240
$$ plain form
37222 -824822 1157649 -2361693 -5768025 -1264172 9483251 16804675 15503840 10277966
37214 10277966 8039400 9330539 8863893 1812672 -11478939 -25197524 -31946674 -28267865
37206 -28267865 -16910188 -4181192 3689627 2925957 -4812176 -11405437 -9341362 -1567691
37198 -1567691 1032998 -5733235 -13677623 -14594661 -10619641 -6368631 936060 13702379
37190 13702379 22631167 16054639 -1165008 -10649741 -3928046 8008105 11593754 7291016
37182 7291016 4294114 6446016 9878285 10234517 6698127 964628 -4297787 -7384843
37174 -7384843 -9511443 -12952525 -16842426 -17608497 -13802409 -7540337 -1593646 1385402
37166 1385402 -1957225 -11729059 -20148341 -17223030 -2937854 11243500 14955711 8875629
$$ packed form
37222h24822J982471l519342l406332M503853J0747423P321424j300835n225874
37214A0277966k238566J291139m66646p051221j3291611j3718585o749150L678809
37206b8267865J1357677J2728996P870819p63670p738133o593261K064075P773671
37198a567691K600689o766233p944388r17038L975020M251010P304691J2766319
37190A3702379Q928788o576528j7219647r484733O721695J1936151L585649m302738
37182G291016k996902K151902L432269L56232l536390n733499n262415l087056
37174g384843k126600l441082l889901p66071L806088O262072N946691K979048
37166A385402l342627r771834q419282K925311J4285176J4181354L712211o080082
$$ plain form
37158 8875629 1121738 -1499512 2700114 10580668 16610703 18431820 19627244 22536220
37150 22536220 20773448 7318020 -10948728 -18309824 -12328016 -8287592 -15249224 -20561138
37142 -20561138 -9850194 7609162 9666385 -6426223 -19228202 -12707110 3750773
37135 3750773 11169741 5975131 138671 2386730 8647008 10136227 4277342 -3767179
37127 -3767179 -7205417 -4070228 1569071 4948618 6674798 11038374 18058807 21407663
37119 21407663 16985913 9862120 7971902 10882230 10299752 1661012 -10164765 -18147786
37111 -18147786 -21084606 -21467905 -19558134 -13984103 -6291399 -857527 -585597 -4635284
37103 -4635284 -9055549 -8371209 109280 10983825 14117847 7538856 1779765 4680286
$$ packed form
37158H875629p753891k621250M199626P880554O030035J821117J195424K908976
37150B2536220j762772j3455428j8266748p361096N981808M040424o961632n311914
37142b0561138J0710944J7459356K057223j6092608j2801979O521092J6457883
37135C750773P418968n194610n836460K248059O260278J489219n858885q044521
37127c767179l438238L135189N639299L379547J726180M363576P020433L348856
37119B1407663m421750p123793j890218K910328n82478q638740j1825777p983021
37111a8147786k936820l83299J909771N574031P692704N433872K71930m049687
37103d635284m420265O84340Q480489J0874545L134022o578991n759091K900521
$$ plain form
37095 4680286 7566841 -2446035 -19786932 -24722837 -11878871 783614 -2396165 -14286149
37087 -14286149 -19600955 -17249635 -15020057 -12190568 -3578690 5198993 3776234 -3698268
37079 -3698268 -2035050 11267723 21520377 19536895 14126212 15875893 21313164 21356590
37071 21356590 15430999 8356379 991025 -7064075 -11186006 -7033563 1122872 4662825
37063 4662825 1235889 -4199268 -6681504 -4944513 -152554 4566254 4964266 -311633
37055 -311633 -7635353 -12313373 -12821224 -10282241 -6795957 -5040921 -5707777 -4902007 855182
37046 855182 6567549 2531840 -11647751 -23740135 -22936739 -10920590 4127530 17054070
37038 17054070 24850007 24343294 17753839 14373409 19231793 24770420 20875354 9066656
$$ packed form
37095D680286K886555j0012876j7340897m935905J2843966J2662485l179779j1889984
37087a4286149n314806K351320K229578K829489Q611878Q777683j422759p474502
37079c698268J663218J3302773J0252654j983482n410683J749681N437271M3426
37071B1356590n925591p074620p365354q055100m121931M152443Q156435L539953
37063D662825l426936n435157k482236J736991M791959M718808L98012n275899
37055c11633p323720m678020n07851K538983L486284J755036o66856Q05770N757189
37046H55182N712367m035709j4179591j2092384Q03396J2016149J5048120J2926540
37038A7054070P795937n06713o589455l380430M858384N538627l895066j1808698
$$ plain form
37030 9066656 -251545 -986353 4961453 13568458 20997927 22660991 16857678 7921027
37022 7921027 1026459 -3138055 -4424313 307638 10042218 14656487 6289407 -7971349
37014 -7971349 -14019606 -8665141 -425725 5101314 10126615 15370301 16251600 10502220
37006 10502220 2139709 -3755194 -4852495 -1103310 3524638 1364054 -9206308 -17321632
36998 -17321632 -12430640 -626199 3514406 -516673 1001132 12717928 22185979 19829545
36990 19829545 12666410 10895721 13316113 14656715 16314993 20101012 20820605 15252134
36982 15252134 10107040 10677204 9810442 134534 -9884894 -5902760 10718195 25078653
36974 25078653 29746960 29435032 25850854 13613823 -5293284 -16913721 -12184058 992643
$$ packed form
37030I066656r318201p34808N947806Q607005P429469J663064n803313q936651
37022G921027o894568m164514j286258M731951R734580M614269q367080j4260756
37014g971349o048257N354465Q239416N527039N025301N243686Q81299n749380
37006A0502220q362511n894903j097301L749185M627948k160584j0570362q115324
36998a7321632M890992J1804441M140605m031079J517805J1716796R468051k356434
36990A9829545p163135j770689K420392J340602J658278L786019P19593n568471
36982A5252134n145094N70164q66762r675908j0019428L982134J6620955J4360458
36974B5078653M668307l11928l584178j2237031j8907107j1620437M729663J3176701
$$ plain form
36966 992643 8953233 7982793 2935798 -2654715 -7815177 -10218428 -8059051 -3567472
36958 -3567472 52892 2631714 4264300 2386669 -3382891 -6901497 -2321255 6368828
36950 6368828 8967830 2251643 -6157120 -8240843 -4810517 -1918425 -2179132 -3332318
36942 -3332318 -3293651 -2764560 -2996869 -3926073 -5353882 -7866985 -11078932 -12284122 -9054802
36933 -9054802 -3193600 11717 -2260226 -6383109 -5918911 1180263 10522135 16253444
36925 16253444 16402700 13009192 8917050 5868140 4643984 5116498 5882167 5106691 2551233
36916 2551233 334627 956525 4557326 8712019 11082260 11541417 11188475 10272379 8535594
36907 8535594 7083635 7748904 10086728 11043116 8700082 4506942 501241 -3430177
$$ packed form
36966I92643P960590r70440n046995n590513n160462k403251K159377M491579
36958c567472L620364K578822J632586j877631n769560l518606M580242Q690083
36950F368828K599002o716187q408763k083723L430326K892092k60707j153186
36942c332318L8667N29091k32309r29204j427809k513103l211947j205190L229320
36933i054802N861202L205317k271943m122883M64198P099174R341872N731309
36925A6253444J49256l393508m092142l048910j224156M72514P65669p75476k555458
36916B551233k216606O21898L600801M154693K370241M59157l52942r16096j736785
36907H535594j451959O65269K337824R56388k343034m193140m005701l931418
$$ plain form
36899 -3430177 -7325716 -8586341 -5419111 -1514687 -2397373 -6653498 -5995437 3308942
36891 3308942 13353504 13244825 2491913 -8780066 -11905477 -7361904 -641552 4170886
36883 4170886 4893952 483965 -6009794 -7120114 840814 10539301 10703415 1305805
36875 1305805 -4617543 2264158 14474973 17403585 8682327 69581 352646 4834219
36867 4834219 5073170 1849036 2220800 7973575 14008014 16555114 16567872 15272054 12351112
36858 12351112 9227374 8486288 8569089 4616000 -2860887 -5615394 1667527 12387840
36850 12387840 15208877 8258012 633699 -137596 2999494 2304505 -3599776 -7806824
36842 -7806824 -4150289 4542660 9367488 6056468 -79824 -1529558 1965163 5033083
$$ packed form
36899c430177l895539j260625L167230L904424q82686m256125O58061R304379
36891C308942J0044562j08679j0752912j1271979l125411M543573O720352M812438
36883D170886P23066m409987o493759j110320P960928R698487J64114r397610
36875A305805n923348O881701J2210815K928612q721258q612746K83065M481573
36867D834219K38951l224134L71764N752775O034439K547100J2758j295818k920942
36858A2351112l123738p41086Q2801l953089p476887k754507P282921J0720313
36850A2387840K821037o950865p624313p71295L137090o94989n904281m207048
36842g806824L656535Q692949M824828l311020o136292j449734L494721L067920
$$ plain form
36834 5033083 5708248 7127938 10137061 10598429 6459292 1883089 874320 1679370 1341222
36825 1341222 863317 1265704 -378041 -5181623 -7705216 -4166890 -831743 -5190741
36817 -5190741 -12180113 -10187921 211441 5651003 250885 -5387105 -881195 8456345
36809 8456345 10912635 5863323 2626413 5581546 9359904 8462096 4884837 4434457
36801 4434457 8886525 13696075 13364759 8843495 7323944 11993371 15407437 9652838
36793 9652838 673256 2100751 14007723 20259747 12042387 1308177 1507909 6497836
36785 6497836 2398371 -7672612 -7739524 4775970 14051541 9660670 616198 -225834
36777 -225834 5909077 9207855 6410230 1972248 -1105585 -3786676 -5952677 -4521733
$$ packed form
36834E033083O75165J419690L009123M61368m139137m576203j008769Q05050l38148
36825A341222m77905M02387j643745m803582k523593L538326L335147m358998
36817e190741o989372J992192J0399362N439562n400118n637990M505910R337540
36809H456345K456290n049312l236910K955133L778358q97808l577259m50380
36801D434457M452068M809550l31316m521264j519551M669427L414066n754599
36793I652838q979582J427495J1906972O252024q217360j0734210J99732M989927
36785F497836m099465j0070983o6912J2515494R275571m390871r044472q42032
36777b25834O134911L298778k797625m437982l077833k681091k166001J430944
$$ plain form
36769 -4521733 2838217 14085187 22760102 22341798 13515139 6438206 11081008 24502537
36761 24502537 32492989 25572351 9098802 -4347628 -8220095 -4982737 184232 4474996
36753 4474996 7208001 7126184 1322999 -11175979 -23851717 -25140624 -11739792 3462868
36745 3462868 4288145 -8651325 -18976593 -16388697 -8139260 -5097230 -5601888 -698888
36737 -698888 10240765 17821580 15118999 5387508 -3055753 -5443567 -3301995 -1053507
36729 -1053507 -864905 -668506 2473282 8075112 12960612 14766323 12034270 3264519
36721 3264519 -9261796 -16865082 -12712656 -2280918 1960458 -3232466 -9150472 -9420401
36713 -9420401 -6841878 -3085953 6511598 20818725 26556671 14998547 -2508622 -7757663
$$ packed form
36769d521733P359950J1246970Q674915m18304q826659p076933M642802J3421529
36761B4502537P990452o920638j6473549j3446430l872467L237358N166969M290764
36753D474996K733005q1817n803185j2498978j2675738j288907J3400832J5202660
36745C462868Q25277j2939470j0325268K587896Q249437L042030n04658M903000
36737f98888J0939653P580815k702581r731491q443261k387814K141572K248488
36729a053507J88602J96399L141788N601830M885500J805711k732053q769751
36721C264519j2526315p603286M152426J0431738M241376n192924n918006k69929
36713i420401K578523L755925R597551J4307127N737946j1558124j7507169n249041
$$ plain form
36705 -7757663 451020 8162408 9025415 11044774 19195352 24773007 18406631 4543291
36697 4543291 -4789123 -5425546 -2881916 -1399441 1379359 7667334 12806000 9396312
36689 9396312 -2794476 -14641493 -17288340 -12158952 -8467081 -11401257 -16498375 -16596660
36681 -16596660 -10614008 -3069097 2429081 6254748 10357372 14724698 16192096 11142215
36673 11142215 806061 -7466753 -7546233 -2256709 494638 -1300628 -2065410 1932713
36665 1932713 7709746 11348997 12390465 10853505 6489643 2847507 4757844 9510798
36657 9510798 8933553 3317451 3263506 12275640 18125284 10046376 -4754465 -12215999
36649 -12215999 -11426337 -11686165 -15224812 -15612086 -10454681 -3641503 3652330 13111913
$$ packed form
36705g757663Q208683P711388Q63007K019359Q150578N577655o366376j3863340
36697D543291r332414o36423K543630J482475K778800O287975N138666l409688
36689I396312j2190788j1847017k646847N129388L691871k934176n097118r8285
36681a6596660N982652P544911N498178L825667M102624M367326J467398n049881
36673A1142215j0336154q272814p9480N289524K751347j795266p64782L998123
36665A932713N777033L639251J041468j536960m363862l642136J910337M752954
36657I510798n77245n616102n3945R012134N849644q078908j4800841p461534
36649a2215999P89662k59828l538647l87274N157405O813178P293833R459583
$$ plain form
36641 13111913 21164393 21351313 15087540 10537662 10429239 9894511 6531997 3533661
36633 3533661 2216122 159604 -2414242 -2672122 -2160608 -5565952 -11945716 -15229009
36625 -15229009 -13556367 -9811801 -3579937 7310341 17100134 15534839 3324504 -6895167
36617 -6895167 -8328614 -7679606 -10782258 -12305069 -6943240 -754667 -2065390 -8102427
36609 -8102427 -9905106 -5860999 -1944293 -1550288 -2545151 -2759162 -2363653 -1541420 -37595
36600 -37595 1752588 3925310 7640997 12391417 14834171 12337151 5724422 -2462928
36592 -2462928 -9775424 -13613072 -13105096 -12141932 -16351957 -25586083 -32974883 -32474634 -24112940
36583 -24112940 -11924530 -849954 4787904 4714466 4434405 8797841 15034814 17609298
$$ packed form
36641A3111913Q052480J86920o263773m549878j08423n34728l362514k998336
36633C533661j317539k056518k573846k57880N11514l405344o379764l283293
36625a5229009J672642L744566O231864J0890278R789793j565295j2210335j0219671
36617f895167j433447O49008l102652j522811N361829O188573j310723o037037
36609h102427j802679M044107L916706L94005r94863k14011L95509Q22233J503825
36600c7595J790183K172722L715687M750420K442754k497020o612729q187350
36592b462928p312496l837648N07976R63164m210025r234126p388800N00249Q361694
36583b4112940J2188410J1074576N637858p3438k80061M363436O236973K574484
$$ plain form
36575 17609298 17477385 18914517 19659222 14134989 5179349 1185484 1566472 -2332428
36567 -2332428 -10435489 -12082338 -4791786 -459601 -6324779 -13318142 -11597989 -4986377
36559 -4986377 -511614 4069956 11144629 13129094 4446450 -6078610 -8361853 -7758575
36551 -7758575 -13887972 -20818987 -15675425 -2131622 2803334 -5707095 -14879678 -15341207
36543 -15341207 -12005781 -11336690 -12227861 -13814204 -19350496 -26771883 -26621888 -15681483
36535 -15681483 -3456401 778606 -1065493 -3685868 -8436224 -17663978 -25604987 -24220565
36527 -24220565 -15254000 -8528024 -8867266 -10878238 -7414457 1201394 8027111 7326371
36519 7326371 175260 -6994211 -8631029 -4743937 162794 1801820 -628209 -4822006
$$ packed form
36575A7609298j31913J437132P44705n524233q955640l993865L80988l898900
36567b332428q103061j646849P290552M332185n865178o993363J720153O611612
36559d986377M474763M581570P074673J984465q682644j0525060k283243O03278
36551g758575o129397o931015N143562J3543803M934956q510429r172583m61529
36543a5341207L335426O69091q91171j586343n536292p421387J49995J0940405
36535a5681483J2225082M235007j844099k620375m750356r227754p941009J384422
36527b4220565Q966565O725976l39242k010972L463781Q615851O825717p00740
36519G326371p151111p169471j636818L887092M906731J639026k430029m193797
$$ plain form
36511 -4822006 -8094151 -9849303 -10903889 -9873295 -2731143 10742598 22449316 23872092
36503 23872092 17792126 14857432 17852383 18240965 11273781 4789263 6862881 13182183
36495 13182183 14572792 10120553 4396457 -1967535 -9451353 -12861942 -7787552 9737
36487 9737 1687121 -1681809 -3249049 -3519904 -7345671 -10441970 -2604208 14868496 27392105
36478 27392105 25298868 13693801 2402001 -3703707 -2598411 5516919 13168110 10183730
36470 10183730 -2184515 -10748609 -8322413 -3095034 -4954483 -11367117 -13655290 -9994399
36462 -9994399 -4576576 731702 6188819 9077813 6008267 -915122 -5588897 -5271971
36454 -5271971 -2797251 -1522221 -872515 1934692 6471519 7464342 1347627 -6460241
$$ packed form
36511d822006l272145j755152j054586J030594P142152J3473741J1706718J422776
36503B3872092o079966k934694K994951L88582o967184o484518K073618O319302
36495A3182183J390609m452239n724096o363992p483818l410589N074390P797289
36487I737J677384l368930j567240k70855l825767l096299P837762J7472704J2523609
36478B7392105k093237j1605067j1291800o105708J105296Q115330P651191k984380
36470A0183730j2368245q564094K426196N227379j859449o412634k288173L660891
36462i994399N417823N308278N457117K888994l069546o923389m673775L16926
36454e271971K474720J275030O49706K807207M536827R92823o116715p807868
$$ plain form
36446 -6460241 -6721595 -483043 49730 -10054077 -18202410 -11996115 956893 4434347
36438 4434347 -910665 -80679 10188646 16171531 10677340 4206344 5976765 9170448
36430 9170448 4177661 -5873505 -12571827 -15096031 -16039111 -12904180 -3400987 7162456
36422 7162456 12006987 11150545 7663133 2078847 -4083997 -6528828 -5271865 -5784676
36414 -5784676 -8355290 -5907964 2082240 5034534 -1348910 -4855477 5434452 21464968
36406 21464968 28261862 24539462 18540719 11878824 2232541 -4113947 1840987 15952584
36398 15952584 24371813 21441669 13387033 7092875 5903818 12706393 25452771 33086905
36390 33086905 27918320 18727727 19363691 28046561 31561516 26880000 23667345 26716023
$$ packed form
36446f460241k61354O238552N32773j0103807q148333O206295J2953008L477454
36438D434347n345012Q29986J0269325N982885n494191o470996J770421L193683
36430I170448m992787j0051166o698322k524204r43080L134931R503193J0563443
36422G162456M844531q56442l487412n584286o162844k444831J256963n12811
36414e784676k570614K447326P990204K952294o383444l506567J0289929J6030516
36406B1464968O796894l722400n998743o661895r646283o346488N954934J4111597
36398A5952584Q419229k930144q054636o294158j189057O802575J2746378P634134
36390C3086905n168585r190593O35964Q682870L514955m681516l212655L048678
$$ plain form
36382 26716023 31035742 34451798 40280666 46420558 46022211 40584637 38768837 41014675
36374 41014675 39395048 33633304 31647851 32481385 26128528 14266486 12669226 25879907
36366 25879907 37417797 34969822 28450614 30718043 35754882 31298101 21074497 17728278
36358 17728278 21623438 22742590 18830931 17316316 21905668 29077589 35505811 39120497
36350 39120497 36153392 26770115 20128110 24293151 34319764 39002000 35386486 27906707
36342 27906707 18538413 8352151 3800326 9230931 16393616 13581778 2887089 -3559261
36334 -3559261 -2050836 939458 3520021 10267713 19014759 20664083 14889038 12009707
36326 12009707 15425386 16029273 9342134 4363021 7906843 12993455 12252710 11396760
$$ packed form
36382B6716023M319719L416056N828868O139892l98347n437574j815800K245838
36374D1014675j619627n761744j985453Q33534o352857j1862042j597260J3210681
36366B5879907J1537890k447975o519208K267429N036839m456781j0223604l346219
36358A7728278L895160J119152l911659j514615M589352P171921O428222L614686
36350C9120497k967105r383277o642005M165041J0026613M682236l615514p479779
36342B7906707r368294j0186262m551825N430605P162685k811838j0694689o446350
36334c559261J508425K990294K580563O747692Q747046J649324n775045k879331
36326A2009707L415679O03887o687139m979113L543822N086612p40745q55950
$$ plain form
36318 11396760 17896495 25430575 22422024 9992924 -922594 -5987402 -8763490 -8691699
36310 -8691699 -961231 11382179 17361412 13264975 8440266 11737446 19526834 21978514
36302 21978514 15997713 6996215 814952 -1821729 -3569879 -5616477 -5238774 1042932
36294 1042932 11472531 18839675 18554097 13900472 9762149 5179770 -1742438 -5380911
36286 -5380911 1359965 13383048 16799581 8669053 2569913 8809801 19063504 19592434
36278 19592434 11867381 8428485 12644122 15519729 12321612 9926628 14283177 21024635
36270 21024635 24147020 25549909 28648507 29018950 20708603 8712186 5174360 12332288
36262 12332288 18008192 12162673 1369885 -45569 9643938 16417745 9759885 -1950720
$$ packed form
36318A1396760O499735P534080l008551j2429100j0915518n064808k776088P1791
36310h691699P730468J2343410N979233m096437m824709L297180P789388K451680
36302B1978514n980801r001498o181263k636681j748150k046598L77703O281706
36294A042932J0429599P367144k85578m653625m138323m582379o922208l638473
36286e380911O740876J2023083L416533q130528o099140O239888J0253703N28930
36278A9592434p725053l438896M215637K875607l198117k394984M356549O741458
36270B1024635L122385J402889L098598L70443q310347j1996417l537826P157928
36262A2332288N675904n845519j0792788j415454R689507O773807o657860j1710605
$$ plain form
36254 -1950720 -1902200 12188619 24082770 19991786 6006977 -1086009 4814669 14860366
36246 14860366 19930652 20305249 19547931 17630119 14690239 15144374 21945096 30407467
36238 30407467 33434510 30794382 28169488 28131736 26610004 18453638 3719866 -11428309
36230 -11428309 -18739291 -14509387 -3873848 3768869 5084872 5180751 7995357 9755303
36222 9755303 6146966 502962 -1495283 -722398 -635165 1442526 9297129 16662797 12993760
36213 12993760 1010349 -4003776 3733270 11420373 8023344 2559688 10211857 27219563
36205 27219563 34350971 24782645 14556279 19781621 33297867 33430127 12406658 -13430497
36197 -13430497 -23738889 -17392009 -9592373 -9280575 -8770276 1070767 13833811 14918911
$$ packed form
36254a950720M8520J4090819J1894151m090984j3984809p092986N900678J0045697
36246A4860366N070286L74597p57318j917812k939880M54135O800722Q462371
36238C0407467L027043k640128k624894l7752j521732q156366j4733772j5148175
36230a1428309p310982M229904J0635539P642717J316003R5879K814606J759946
36222I755303l608337n644004j998245P72885Q7233K077691P854603P365668l669037
36213A2993760j1983411n014125P737046P687103l397029n463656P652169J7007706
36205B7219563P131408r568326j0226366N225342J3516246J32260k1023469k5837155
36197a3430497j0308392O346880P799636L11798N10299R841043J2763044J085100
$$ plain form
36189 14918911 2641678 -8611558 -7737854 202160 4705088 4810712 6174563 9394062
36181 9394062 10483576 10331970 14415803 22470592 26178528 19903020 8293059 -147521
36173 -147521 -3153421 -4400795 -5502671 -3414448 3043097 7952808 3911052 -7187416
36165 -7187416 -13389998 -5838641 9807963 19046728 14332633 1422995 -8314605 -6907841
36157 -6907841 6956705 26128411 36443541 28580659 10528823 -182557 1048145
36150 1048145 1720065 -5261925 -8441261 2481527 16129094 14960325 3862334 3789474
36142 3789474 18327785 26787257 15539327 -1808985 -5621307 2184237 4941269 -2782179
36134 -2782179 -9827460 -6183178 5261457 14942549 16620466 10249043 595199 -5815442
$$ packed form
36189A4918911j2277233j1253236Q73704P940014M502928J05624J363851L219499
36181I394062J089514j51606M083833Q054789L707936o275508j1609961q440580
36173a47521l005900j247374j101876K088223O457545M909711m041756j1098468
36165g187416o202582P551357J5646604R238765m714095j2909638r737600J406764
36157f907841J3864546J9171706J0315130p862882j8051836j0711380J230702
36150A048145O71920o981990l179336J0922788J3647567j168769j1097991p2860
36142C789474J4538311Q459472j1247930j7348312l812322P805544K757032p723448
36134b782179p045281L644282J1444635R681092J677917o371423r653844o410641
$$ plain form
36126 -5815442 -5772975 -1686267 2747300 6887648 10713661 11539650 7582774 2328828 450860
36117 450860 924187 -1025068 -6164819 -10286859 -10743474 -9470464 -8910313 -8500853 -6233461
36108 -6233461 -1597389 3311240 4656189 553702 -4566212 -2724557 6893116 13631200
36100 13631200 7523651 -6776811 -15209555 -11967080 -3775270 3093448 9719492 15435907
36092 15435907 12781225 -697252 -13529005 -12983816 -1973189 6225313 6481405 4598006
36084 4598006 4148275 2946915 2859436 9639593 19434724 19024018 6424875 -1769802 5980862
36075 5980862 17038786 13228486 -915564 -6480621 -1174369 -1129651 -11772757 -18620122
36067 -18620122 -13098954 -7370895 -12578466 -19504760 -15007886 -3918221 1268971 1451684
$$ packed form
36126e815442M2467M086708M433567M140348L826013Q25989l956876n253946j877968
36117D50860M73327j949255n139751m122040m56615J273010N60151M09460K267392
36108f233461M636072M908629J344949m102487n119914J841655R617673O738084
36100A3631200o107549j4300462q432744L242475Q191810O868718O626044N716415
36092A5435907k654682j3478477j2831753N45189J1010627Q198502K56092j883399
36084D598006m49731j201360q7479O780157R795131m10706j2599143q194677P750664
36075E980862J1057924l810300j4144050n565057N306252M4718j0643106o847365
36067a8620122N521168N728059n207571o926294M496874J1089665N187192J82713
$$ plain form
36059 1451684 4701864 8172862 5025969 2740499 13652006 30120136 30885717 13522029
36051 13522029 -585715 1538623 7352787 2096904 -8957087 -12859254 -8852433 -3552131
36043 -3552131 1952598 8065853 9709917 4911857 1234134 2753111 661035 -10749146
36035 -10749146 -19135308 -10922294 4811484 7088163 -6458018 -17567799 -14558721 -4303635
36027 -4303635 4073819 10627932 15540396 13780663 5760840 1609902 7375295 15837172
36019 15837172 17548632 13254443 9327483 8178525 9549113 14689380 21920411 22920861
36011 22920861 11381937 -6463504 -16418365 -11763049 -203225 5574184 2225483 -1381660
36003 -1381660 3341750 11499445 9681169 -4673689 -17324277 -16748917 -10962651 -13786664
$$ packed form
36059A451684L250180L470998l146893k285470J0911507J6468130P65581j7363688
36051A3522029j4107744K124338N814164n255883j1053991l902167M006821N300302
36043c552131N504729O113255J644064m798060l677723J518977k092076j1410181
36035a0749146q386162Q213014J5733778K276679j3546181j1109781L009078J0255086
36027d303635Q377454O554113M912464j759733q019823m150938N765393Q461877
36019A5837172J711460m294189l926960j148958J370588N140267P231031J000450
36011B2920861j1538924j7845441r954861M655316J1559824N777409l348701l607143
36003a381660M723410Q157695j818276j4354858j2650588N75360N786266k824013
$$ plain form
35995 -13786664 -21258661 -17645774 -2695348 5378240 -2400726 -12370117 -10216589 -1247302
35987 -1247302 1843662 -1152518 -2909177 -3729334 -8154154 -12799312 -10583675 -3047419
35979 -3047419 2905440 6710600 11560167 14109129 8978148 993691 189112 5279671
35971 5279671 4669591 -5092803 -13943210 -13962862 -9246697 -6074610 -3093484 3265243 11031765
35962 11031765 15482293 14266945 6920293 -4324882 -10954016 -3830376 13102248 22963907
$$ packed form
35995a3786664p471997L612887J4950426Q073588p778966r969391K153528Q969287
35987a247302L090964k996180j756659q20157m424820m645158K215637P536256
35979c047419N952859L805160M849567K548962n130981p984457q04579N090559
35971E279671o10080r762394q850407j9652M716165L172087K981126O358727P766522
35962A1031765M450528j215348p346652j1245175o629134P123640J6932624R861659
$$ [...]
##END NTUPLES=NMR SPECTRUM
##END=
