##TITLE=31Pdec_MTBDP1301
 CDCl3, 24 sc
 16.1.2023
##JCAMPDX= 6.0         $$ Bruker NMR JCAMP-DX V2.0
##DATA TYPE= NMR SPECTRUM
##DATA CLASS= NTUPLES
##ORIGIN= UXNMR, Bruker Analytische Messtechnik GmbH
##OWNER= root
$$ XWIN-NMR		Version 3.5
$$ Mon Jan 16 14:06:36 2023 Russian Standard Time (UT+4h)  she@DPX200
##.OBSERVE FREQUENCY= 81.013821
##.OBSERVE NUCLEUS= ^31P
##.ACQUISITION MODE= SIMULTANEOUS
##.ACQUISITION SCHEME= undefined
##.AVERAGES= 24
##.DIGITISER RES= 16
##SPECTROMETER/DATA SYSTEM= spect
##.PULSE SEQUENCE= zgpg30
##.SOLVENT NAME= DMSO
##.SHIFT REFERENCE= (INTERNAL, DMSO, 0, 248.564)
##AUDIT TRAIL= $$ (NUMBER, WHEN, WHO, WHERE, WHAT)
$$ ##TITLE= Audit trail, XWIN-NMR		Version 3.5
$$ ##JCAMPDX= 5.01
$$ ##ORIGIN= Bruker BioSpin GmbH
$$ ##OWNER= she
$$ F:/spectra/data/she/nmr/P31/1/pdata/1/auditp.txt
$$ ##AUDIT TRAIL=  $$ (NUMBER, WHEN, WHO, WHERE, WHAT)
(   1,<2023-01-16 14:05:44.37 +0400>,<she>,<DPX200>,
      <created by zg, POWCHK disabled, PULCHK disabled
       configuration hash MD5:
       00 E9 B6 7A A2 85 ED C7 34 08 36 98 17 FE 4E 26
       data hash MD5: 32K
       C8 1D 2D 02 FC 77 28 28 86 91 6D E1 F7 8A EC 4E>)
(   2,<2023-01-16 14:05:48.56 +0400>,<she>,<DPX200>,
      <Start of raw data processing
       efp BC_mod = 2 LB = 1 FT_mod = 6 PKNL = 1 PHC0 = -10849.56 PHC1 = 661.0566 SI = 64K 
       data hash MD5: 64K
       DE FA 06 90 B3 1C 19 78 16 66 30 18 13 57 50 A4>)
(   3,<2023-01-16 14:06:01.75 +0400>,<she>,<DPX200>,
      <pk PHC0 = -2.136938 PHC1 = 0 
       data hash MD5: 64K
       0E 3D 95 E4 14 5D 51 A8 76 4F 7F F1 E3 3D 46 37>)
(   4,<2023-01-16 14:06:07.20 +0400>,<she>,<DPX200>,
      <abs ABSG = 5 
       data hash MD5: 64K
       F3 E7 FB E8 2B 1F 8E 37 7E 91 5C 7C 74 45 BD AB>)
$$ ##END=
$$ 
$$ hash MD5
$$ 44 E4 D1 AB B5 34 59 8A DF 99 19 41 26 47 EC 9E
##$RELAX= 
##$RELAX= 
##$RELAX= 
##$RELAX= 
##$RELAX= 
##$RELAX= 
##$RELAX= 
##$RELAX= 
##$RELAX= 
$$ Bruker specific parameters
$$ --------------------------
##$DU= <F:/spectra>
##$EXPNO= 1
##$NAME= <P31>
##$PROCNO= 1
##$TYPE= <nmr>
##$USER= <she>
##$AMP= (0..31)
100 100 100 100 100 100 100 100 100 100 100 100 100 100 100 100 100 100 
100 100 100 100 100 100 100 100 100 100 100 100 100 100 
##$AQSEQ= 0
##$AQ_mod= 1
##$AUNM= <au_zg>
##$AUTOPOS= <>
##$BF1= 81.014009
##$BF2= 200.13
##$BF3= 200.13
##$BF4= 200.13
##$BF5= 200.13
##$BF6= 200.13
##$BF7= 200.13
##$BF8= 200.13
##$BYTORDA= 1
##$CFDGTYP= 0
##$CFRGTYP= 5
##$CHEMSTR= <none>
##$CNST= (0..31)
1 1 145 1 1 1 1 1 1 1 1 1 1 1 1 1 1 1 1 1 1 1 1 1 1 1 1 1 1 1 1 1 
##$CPDPRG= <waltz16>
##$CPDPRG1= <>
##$CPDPRG2= <waltz16>
##$CPDPRG3= <>
##$CPDPRG4= <mlev>
##$CPDPRG5= <mlev>
##$CPDPRG6= <mlev>
##$CPDPRG7= <mlev>
##$CPDPRG8= <mlev>
##$CPDPRGB= <>
##$CPDPRGT= <>
##$D= (0..31)
0 1 0 0 0 0 0 0 0 0 0 0.03 2e-05 3e-06 0 0 0 0 0 0 0 0 0 0 0 0 0 0 0 0 
0 0 
##$DATE= 1673863543
##$DBL= (0..7)
120 120 120 11 120 120 24 19 
##$DBP= (0..7)
150 150 150 150 150 150 150 150 
##$DBP07= 0
##$DBPNAM0= <>
##$DBPNAM1= <>
$$ [...]
##$SUBNAM3= <"">
##$SUBNAM4= <"">
##$SUBNAM5= <"">
##$SUBNAM6= <"">
##$SUBNAM7= <"">
##$SUBNAM8= <"">
##$SUBNAM9= <"">
##$SW= 501.771253377433
##$SWIBOX= (0..15)
0 1 3 0 0 0 0 0 0 0 0 0 0 0 0 0 
##$SW_h= 40650.406504065
##$TD= 32768
##$TD0= 1
##$TE= 0
##$TE2= 300
##$TE3= 300
##$TEG= 300
##$TL= (0..7)
0 120 53 12 22 120 120 120 
##$TP= (0..7)
150 150 150 150 150 150 150 150 
##$TP07= 0
##$TPNAME0= <>
##$TPNAME1= <>
##$TPNAME2= <>
##$TPNAME3= <>
##$TPNAME4= <>
##$TPNAME5= <>
##$TPNAME6= <>
##$TPNAME7= <>
##$TPOAL= (0..7)
0.5 0.5 0.5 0.5 0.5 0.5 0.5 0.5 
##$TPOFFS= (0..7)
0 0 0 0 0 0 0 0 
##$TUNHIN= 0
##$TUNHOUT= 0
##$TUNXOUT= 0
##$USERA1= <user>
##$USERA2= <user>
##$USERA3= <user>
##$USERA4= <user>
##$USERA5= <user>
##$V9= 5
##$VALIST= <valist>
##$VCLIST= <CCCCCCCCCCCCCCC>
##$VD= 0
##$VDLIST= <DDDDDDDDDDDDDDD>
##$VPLIST= <PPPPPPPPPPPPPPP>
##$VTLIST= <TTTTTTTTTTTTTTT>
##$WBST= 1024
##$WBSW= 4
##$XGAIN= (0..3)
0 0 0 0 
##$XL= 0
##$YL= 0
##$YMAX_a= 9102
##$YMIN_a= -9282
##$ZGOPTNS= <>
##$ZL1= 120
##$ZL2= 120
##$ZL3= 120
##$ZL4= 120
##$ABSF1= 248.5645
##$ABSF2= -253.2056
##$ABSG= 5
##$ABSL= 3
##$ALPHA= 0
##$AQORDER= 0
##$ASSFAC= 0
##$ASSFACI= 0
##$ASSFACX= 0
##$ASSWID= 0
##$AUNMP= <proc_1d>
##$AZFE= 0.1
##$AZFW= 0.5
##$BCFW= 0
##$BC_mod= 2
##$BYTORDP= 0
##$COROFFS= 0
##$CY= -3
##$DATMOD= 1
##$DC= 0
##$DFILT= <>
##$DTYPP= 0
##$F1P= 0
##$F2P= 0
##$FCOR= 1
##$FTSIZE= 65536
##$FT_mod= 6
##$GAMMA= 0
##$GB= 0
##$INTBC= 1
##$INTSCL= 6.047779e-11
##$ISEN= 30
##$LB= 1
##$LEV0= 0
##$LPBIN= 0
##$MAXI= 10000
##$MC2= 0
##$MEAN= 0
##$ME_mod= 0
##$MI= 50
##$NCOEF= 0
##$NC_proc= -6
##$NLEV= 6
##$NOISF1= 182.463
##$NOISF2= 159.3651
##$NSP= 0
##$NTH_PI= 0
##$NZP= 0
##$OFFSET= 248.5645
##$PC= 4
##$PHC0= -10851.7
##$PHC1= 661.0566
##$PH_mod= 1
##$PKNL= yes
##$PPARMOD= 0
##$PSCAL= 0
##$PSIGN= 0
##$REVERSE= no
##$SF= 81.0140089999694
##$SI= 65536
##$SIGF1= 159.3651
##$SIGF2= -187.1042
##$SINO= 113.3802
##$SIOLD= 16384
##$SREGLST= <1H.CDCl3>
##$SSB= 0
##$STSI= 65536
##$STSR= 0
##$SW_p= 40650.406504065
##$SYMM= 0
##$S_DEV= 0
##$TDeff= 32768
##$TDoff= 0
##$TI= <>
##$TILT= no
##$TM1= 0
##$TM2= 0
##$TOPLEV= 0
##$USERP1= <user>
##$USERP2= <user>
##$USERP3= <user>
##$USERP4= <user>
##$USERP5= <user>
##$WDW= 1
##$XDIM= 65536
##$YMAX_p= 282924578
##$YMIN_p= -5690180
$$ End of Bruker specific parameters
$$ ---------------------------------
##NTUPLES= NMR SPECTRUM
##VAR_NAME=  FREQUENCY,     SPECTRUM/REAL,   SPECTRUM/IMAG
##SYMBOL=    X,             R,               I
##VAR_TYPE=  INDEPENDENT,   DEPENDENT,       DEPENDENT
##VAR_FORM=  AFFN,          ASDF,            ASDF
##VAR_DIM=   65536,         65536,           65536
##UNITS=     HZ,            ARBITRARY UNITS, ARBITRARY UNITS
##FACTOR=    0.620285442955139, 1,           1
##FIRST=     20137.2065510682, 0,            0
##LAST=      -20513.1999529968, 0,           0
##MIN=       -20513.1999529968, -5690180,    0
##MAX=       20137.2065510682, 282924578,    0
$$ Real data points
##PAGE= N=1
##DATA TABLE= (X++(R..R)), XYDATA
$$ [...]
42684 1002574 798721 288549 -158659 40514 761692 1044153 201994 -1284980 -2316409
42675 -2316409 -2341646 -1687054 -995037 -698200 -804768 -792750 56300 1714807 2984147
42666 2984147 2667049 1156150 121874 395784 896453 182960 -1474584 -2345586 -1411734
42657 -1411734 412871 1394234 844464 -394505 -1062609 -719178 139875 872893 1239884
42648 1239884 1195428 679052 1960 -27879 891079 1688930 1060886 -532653 -1220790 -426254
42638 -426254 179313 -714129 -1882396 -1492091 -127243 111538 -960951 -1345788 -194494
42629 -194494 851978 486871 -122659 595872 1984370 2327955 1641598 1397832 1929914
42620 1929914 1966518 891141 -93792 345343 1814287 2707868 2130861 797550 104890
42611 104890 518147 1029207 436328 -1015330 -1942717 -1813152 -1591331 -1942044 -1996476 -934082
42601 -934082 266154 146156 -831929 -907859 237480 1133940 981998 683544 961574
42592 961574 1096878 344952 -722405 -1220516 -1230551 -1168117 -837216 -90858 390687 15834
42582 15834 -685455 -948374 -1070040 -1708418 -2379633 -1927915 -359317 954691 1024810 285116
42572 285116 -267343 -199534 280509 726405 727936 271098 -75862 219703 864088 1077647
42562 1077647 683772 246894 119928 60537 -77216 -26689 210508 88208 -587678 -1071031
42552 -1071031 -603980 441982 955565 366727 -994330 -2532406 -3723694 -4018727 -3228949
42543 -3228949 -2079126 -1605994 -1801704 -1626290 -704800 -123471 -822447 -1975132 -2075025
42534 -2075025 -1192864 -802104 -1375594 -1617444 -587564 741292 985956 384062 127011
42525 127011 370288 282311 -267427 -511116 -306269 -494727 -1395410 -2132801 -2027189 -1649719
42515 -1649719 -1788006 -2175544 -2076444 -1564055 -1350632 -1626954 -1812236 -1367826 -350054
42506 -350054 751599 1367848 1222892 670624 411452 580056 473823 -418331 -1513992
42497 -1513992 -1822632 -1263597 -685882 -692418 -1031027 -1160533 -909481 -465473 -88993 37328
42487 37328 -62551 -84607 302815 1032968 1560192 1296338 212655 -933113 -1147867 -244474
42477 -244474 826437 1094304 857027 1219982 2397679 3326390 3183228 2376882 1561265
42468 1561265 573643 -890959 -2276640 -2739093 -2243760 -1309630 -179883 911302 1236117
42459 1236117 425990 -589189 -658594 -122581 -203403 -921747 -1095726 -477425 -305925 -1243213
42449 -1243213 -2187102 -1936126 -892352 -194278 -74469 -54441 -33829 -128226 75938 1022019
42439 1022019 2147711 2305686 1239085 -76841 -624664 -313828 293332 708714 781100
42430 781100 538849 27644 -643983 -1133657 -992367 -269766 234243 -104748 -683651 -350625
42420 -350625 818781 1452995 946894 449252 1017433 1844752 1512663 249822 -514599
42411 -514599 -509207 -981799 -2558374 -4106426 -4231969 -2921816 -1190538 90146 509385
42402 509385 30951 -772812 -940546 -189968 611039 567358 4830 26296 1017551 2142076
42392 2142076 2324471 1369135 47642 -700639 -573024 4619 459219 545583 214711
42383 214711 -561667 -1460934 -1729810 -1111676 -557012 -1111151 -2236742 -2364696 -1215145
42374 -1215145 -264911 -466851 -916405 -658374 -419945 -1122428 -1757990 -622782 1827193
42365 1827193 3279446 2706549 1418000 757379 548595 388746 724484 1639548 2024741
42356 2024741 1190567 192569 287280 1022959 1224004 1045651 1473095 2295676 2269605 1201837
42346 1201837 330074 465170 1087441 1536183 1855049 2088168 1860737 1132523 446149
42337 446149 41002 -385224 -726698 -318396 816812 1605573 1388791 800294 615064
42328 615064 749083 1063025 1982119 3347174 3791957 2564879 1036605 890597 1558429
42319 1558429 1197242 -248643 -957897 -230824 434456 -173476 -1197331 -1361521 -959034
42310 -959034 -985451 -1340016 -1210490 -620222 -336746 -537070 -625824 -246690 401294 1131956
42300 1131956 1818076 1954561 1082318 -203782 -483825 865694 2798309 3722505 3172184
42291 3172184 2050379 1473269 1729280 2316167 2682793 2704238 2416374 1567065 -112544
42282 -112544 -2094025 -3043798 -2155988 -283796 831586 473471 -403281 -530358 175162
42273 175162 766276 579111 -18489 -149928 537971 1444331 1622734 837671 -122314 -352885
42263 -352885 138270 669813 964627 1331110 1699604 1320280 -51242 -1348523 -1405487
42254 -1405487 -589610 -298605 -990970 -1725615 -1725084 -1321028 -999785 -581261 -11971 -16491
42244 -16491 -986123 -1915300 -1586565 -399774 167014 -298135 -789752 -669594 -469889 -603510
42234 -603510 -550005 47034 540299 325386 -126152 -113714 143980 104105 8222 383437
42224 383437 897762 795881 229708 88923 576319 977312 943436 1035575 1683197 2383000
42214 2383000 2351528 1448230 99693 -1269909 -2382628 -2959959 -2771853 -1846659 -630715
42205 -630715 64235 -407992 -1747965 -2744206 -2513631 -1484512 -696860 -426021 -159187
42196 -159187 239507 174459 -683946 -1665932 -1724566 -560902 1028852 1853254 1454637 606975
42186 606975 441588 1062150 1552739 1423818 1161077 1006662 373055 -740446 -1000480
42177 -1000480 300546 1619299 1138769 -482486 -1212177 -799871 -653670 -1006395 -691549
42168 -691549 279904 539500 88721 479365 1590528 1144829 -1302987 -2805973 -1350443
42159 -1350443 877335 911019 -596657 -1165057 -780352 -1210635 -2288855 -2221531 -1032982
42150 -1032982 -551233 -1137122 -1387351 -1133395 -1781548 -3271903 -3557797 -1910532 -181363
42141 -181363 207126 168876 720169 1055217 281224 -763479 -925448 -498027 -222451 104221
42131 104221 721165 921692 340515 27505 831352 1757289 1347826 -182694 -1509108
42122 -1509108 -2027877 -1835531 -778729 1012945 2361510 2282827 1467364 1208099 1464129
42113 1464129 1377951 1072406 1315445 1845622 1745687 1248506 1414840 2030052 1611304 -202941
42103 -202941 -1940120 -2466912 -2354936 -2429795 -2387365 -1753090 -1034736 -864284 -849774 -316081
42093 -316081 439146 607926 142228 -330127 -540148 -729061 -1011781 -1318865 -1765331 -2374461
42083 -2374461 -2611701 -1932151 -725947 -458 -82622 -303319 -80253 322233 314685 -290686
42073 -290686 -1292224 -2314673 -2799052 -2365242 -1491391 -1196927 -1621816 -1651684 -652185
42064 -652185 178855 -670590 -2622570 -3563333 -2773103 -1751729 -1716553 -1872781 -1130537
42055 -1130537 -154506 -251793 -1124830 -1364519 -725468 -286373 -472698 -493056 103325 772262
42045 772262 1217561 1902701 2772591 2737281 1236525 -628509 -1336298 -647793 518641
42036 518641 1222610 1005858 33588 -721121 -202097 1293695 2225186 1841873 1086477
42027 1086477 844996 558723 -380948 -1084522 -494362 637838 783994 83849 6707
42018 6707 852097 1389601 1045198 698372 930107 1074308 642539 315488 708095 1259412
42008 1259412 1220906 857630 777537 778435 290340 -500492 -828819 -404334 386835 1153805
41998 1153805 1804621 2281106 2444278 2226617 1703733 1112203 810735 901752 893513 277111
41988 277111 -475800 -258855 952895 1558507 273017 -1954837 -2922760 -1823043 40054
41979 40054 1130102 1263791 1038413 624958 -145447 -995734 -1311616 -947605 -303945 430994
41969 430994 1512754 2880437 3697652 3174372 1647590 334801 -1070 267292 359394
41960 359394 89072 -94673 193566 808887 1209006 902858 -114785 -1239975 -1677308
41951 -1677308 -1121490 -13938 855726 920147 148669 -921307 -1508419 -1258241 -599832
41942 -599832 -177655 -68492 22548 -5108 -503294 -1174475 -1168490 -333782 419845 375542
41932 375542 -128591 -498708 -708693 -747994 -111512 1307530 2483080 2377613 1373244
41923 1373244 709958 848467 1214362 1256846 979593 681275 788268 1518822 2139277 1293593
41913 1293593 -1078601 -2997957 -2786441 -1356674 -732444 -1048339 -885132 -125343 -221222
41904 -221222 -1447315 -2092658 -1092658 429952 1176682 1523514 2194373 2538455 1562557
41895 1562557 -274368 -1632270 -2020896 -1864408 -1421578 -708376 -88770 4108 -292866
41886 -292866 -548287 -617317 -473183 14244 616399 661862 -28409 -737922 -917818 -920199
41876 -920199 -1073339 -906893 -142466 407602 51126 -335314 627381 2616022 3733525
41867 3733525 2861010 875321 -582209 -724989 112550 1102209 1571289 1450443 1211674
41858 1211674 1186159 1145955 831600 518921 583174 815229 738617 406387 312801 560874
41848 560874 563063 -341236 -2070445 -3527198 -3313238 -1217552 1098020 1661911 498653
41839 498653 -551498 -441619 -68225 -305938 -371803 680529 1989516 1959646 684176
41830 684176 -243309 -96473 212866 -209963 -990381 -1190398 -536789 294412 299885 -816346
41820 -816346 -2019922 -1860032 -309645 1083376 1329552 1208671 1585290 1799170 1038937
41811 1038937 176105 497566 1394095 1206210 -99237 -1035232 -1120468 -1303606 -1875969
41802 -1875969 -1980952 -1463458 -1237919 -1330290 -490983 1454542 2652308 1711267 -249657
41793 -249657 -1174738 -587017 523206 1364907 1804970 1820270 1452315 951063 438382 -119296
41783 -119296 -381111 136501 1027988 1162819 269978 -656267 -957606 -1149928 -1559767 -1405427
41773 -1405427 -221063 871246 520286 -907800 -1854179 -1566028 -607924 229852 631493
41764 631493 597688 307888 30759 -174777 -369405 -253579 496732 1229282 708275 -982383
41754 -982383 -2053901 -1328008 113582 562431 -46003 -664623 -986933 -1297338 -1168351
41745 -1168351 -17317 1290467 1106468 -551542 -1721460 -1148430 47758 91038 -1009486
41736 -1009486 -1699657 -1123452 -152896 -42227 -733451 -1072873 -541662 -12486 -363903
41727 -363903 -989160 -621005 625211 1214428 358079 -953155 -1534932 -1532194 -1692741 -2101731
41717 -2101731 -2460222 -2807949 -3118795 -2880882 -1885847 -755468 38806 841848 1713532
41708 1713532 1727333 508823 -560139 -169028 694543 72680 -1886184 -3000454 -2107595
41699 -2107595 -353714 683254 627607 -135726 -1079646 -1405957 -638669 331045 87924
41690 87924 -1119581 -1448422 -176806 1150444 1078851 349709 513964 1513332 2004619
41681 2004619 1529125 1069955 1561651 2788040 3812651 3887656 2910369 1412562 116867
41672 116867 -710782 -1337282 -1876760 -1900622 -1064468 157988 808882 500617 -111296 8079
41662 8079 1130999 2307193 2256485 862996 -552010 -788284 -214887 -81571 -703741
41653 -703741 -1163888 -758111 138434 832149 1166124 1296646 1223379 901563 419911 -137025
41643 -137025 -637998 -698682 -60165 791514 1029513 628595 412356 752999 956926 329957
41633 329957 -764034 -1385508 -1145911 -472065 -69141 -362962 -1128860 -1513789 -834736
41624 -834736 515596 1410234 1315818 736730 268380 -77053 -371555 -349213 88605 537386
41614 537386 693223 794569 1071805 1231615 870445 -13164 -1189944 -2385816 -3042030
41605 -3042030 -2501726 -834869 1020989 2260368 2823528 2809297 2073921 864038 57199
41596 57199 131873 531922 644049 696287 989751 1023279 370691 -179166 461565 1916523
41586 1916523 2652920 2009979 896573 383657 531512 810906 855722 482615 -362201
41577 -362201 -1307746 -1708516 -1416740 -1012414 -991245 -1094001 -765769 -10028 589388 626539
41567 626539 349317 270981 463292 483132 68997 -395629 -458580 -411756 -935499 -1947070
41557 -1947070 -2520700 -2179334 -1540202 -1264159 -1084699 -513238 115100 130937 -329178 -515438
41547 -515438 -164554 365806 848639 1279279 1405102 1035703 712466 1118080 1809034 1567940
41537 1567940 225604 -910494 -884935 -400760 -663117 -1705944 -2640586 -2970086 -2816020
41528 -2816020 -2275987 -1471574 -1008844 -1457165 -2359694 -2601008 -1898886 -1150257 -1051651 -1180373
41518 -1180373 -925614 -608217 -915430 -1685386 -2152960 -2226612 -2574256 -3330861 -3637315 -2864631
41508 -2864631 -1549551 -570304 -20225 434844 631503 226374 -367959 -336887 273758
41499 273758 558265 151356 -234735 25309 550033 654232 343385 65718 -68624 -264264
41489 -264264 -526303 -659371 -625844 -567001 -599304 -773346 -1007772 -947825 -263760 722075
41479 722075 1127027 497675 -656634 -1535841 -1828102 -1609181 -1007252 -289935 250774
41470 250774 827708 1926927 3135015 3037238 1076570 -1202668 -1843524 -957436 -303578
41461 -303578 -590029 -615480 544692 1789152 1385322 -535694 -1959450 -1479408 -9793
41452 -9793 408201 -903490 -2605927 -3189102 -2719988 -2208841 -1856229 -1005004 313151
41443 313151 1072666 867645 648589 1173781 1801193 1725891 1407469 1566032 1608671 562751
41433 562751 -940135 -1274697 -291387 448367 73897 -510959 -374783 67383 148168 190338
41423 190338 721381 1321558 1198246 342953 -646382 -1399355 -1759155 -1451061 -510423 327225
41413 327225 376048 -95869 -300670 -28318 267252 287120 227022 393785 937171 1841919
41403 1841919 2748182 2920007 1912900 286025 -790518 -741424 -99667 252010 69051
41394 69051 -157283 109007 855281 1589478 1850875 1533996 756705 -328277 -1393826
41385 -1393826 -1828604 -1187643 190255 1341762 1606512 1200254 771370 608238 460333
41376 460333 36146 -499568 -605285 16753 926412 1270413 682797 -333634 -995444
41367 -995444 -916096 -115170 1139224 2165431 2084564 811835 -513828 -750558 -163691
41358 -163691 51162 -564740 -1303674 -1425726 -950699 -315595 57219 -132424 -685132 -710504
41348 -710504 370760 1690124 1755998 477267 -682039 -760104 -368601 -312155 -337534 -6728
41338 -6728 186695 -442933 -1552323 -2200614 -2086491 -1606944 -1064061 -503208 -13929 411414
41328 411414 1001359 1696825 1953345 1558696 1109234 1058079 889020 48988 -828208 -638694
41318 -638694 546573 1572852 1811636 1674733 1503987 991609 35736 -669661 -444757
41309 -444757 434212 1048650 850887 86197 -601463 -759691 -425727 14159 239680 228412
41299 228412 87632 -121873 -261540 -60969 555521 1222841 1428147 977745 122291 -579463
41289 -579463 -527961 384764 1402747 1530952 722231 -51056 -117735 118637 65042 -110347
41279 -110347 13598 282561 366062 455368 744594 667874 -358315 -1651129 -1753104 -303531
41269 -303531 1390276 1829204 780032 -806595 -1752307 -1469422 -401240 251931 -269541
41260 -269541 -1314957 -1522507 -487719 786968 1145988 453020 -590079 -1295680 -1457380
41251 -1457380 -1295911 -1129588 -1007409 -752388 -455583 -552313 -1074324 -1259539 -476688 780564
41241 780564 1467150 1308382 872368 545275 206275 -178690 -408591 -486218 -535372 -359309
41231 -359309 201247 593436 111203 -868057 -1144827 -383964 326520 -79035 -1338849
41222 -1338849 -2305497 -2123179 -784944 907335 1816101 1468995 612633 198238 48980
41213 48980 -557864 -1228519 -720096 980374 2267640 2102029 1269211 815472 539630
41204 539630 -60445 -546572 -368121 56289 266313 884626 2503054 4174750 4460548
41195 4460548 3496326 2591296 2144908 1500662 699173 703506 1627435 2251888 1858117 1316202
41185 1316202 1685501 2720817 3465477 3520447 3022531 2041531 760053 -196258 -298302
41176 -298302 248252 824624 1055645 847958 248020 -349199 -366954 107888 204359 -415172
41166 -415172 -736733 217867 1665781 1913623 823966 136759 999524 2375090 2617188
41157 2617188 1661925 672561 200119 -107184 -314126 -45137 407334 98290 -993393
41148 -993393 -1505923 -550964 827763 966391 -248146 -1499848 -1914534 -1728547 -1293021
41139 -1293021 -588204 129721 258675 -217101 -600521 -658726 -1019380 -1846257 -2047330 -727802
41129 -727802 1190763 1914032 1106386 191234 248626 668031 361090 -520972 -903720 -446313
41119 -446313 30358 -129519 -457896 -235225 206599 -122055 -1248725 -1911485 -1246994
41110 -1246994 -99282 47328 -985546 -1997189 -2089442 -1551664 -987233 -387241 541954
41101 541954 1664587 2454686 2516409 1883960 1022046 532731 538139 423980 -365113 -1384398
41091 -1384398 -1636432 -908007 27980 544050 692018 524161 -185213 -1227962 -1832347
41082 -1832347 -1658126 -1190975 -846220 -515901 -268374 -423614 -530013 425973 2075113
41073 2075113 2373222 442637 -1603823 -1281107 825138 2083226 1597624 878954 962596
41064 962596 1058283 470323 -65494 218508 837953 1036789 910270 740016 211774 -843157
41054 -843157 -1706517 -1588128 -628009 498004 1373367 1737656 1301169 303702 -341456
41045 -341456 -109795 416890 441944 40793 -185107 6822 534220 1334877 2019918 1750197
41035 1750197 284365 -1236033 -1402111 -245843 901807 1097801 614686 186944 170192
41026 170192 528412 1066975 1512715 1705858 1724377 1555585 881492 -322902 -1217277 -871509
41016 -871509 350889 965405 240575 -769840 -624015 556216 1315761 917539 264431
41007 264431 429220 1052759 1026036 339085 113050 709602 1032939 315360 -518935 -314670
40997 -314670 394142 354991 -98929 495874 2041893 2569815 1132106 -750920 -1398701
40988 -1398701 -1106410 -833165 -324664 832654 1538491 575975 -1040979 -1215549 59069
40979 59069 813252 393053 334670 1364811 1812603 360743 -1428416 -1205081 632004
40970 632004 1494123 299923 -1269651 -1382268 -314005 505040 495735 99602 -323702
40961 -323702 -811508 -1258965 -1340066 -1013010 -620684 -424785 -385561 -412769 -466839 -375863
40951 -375863 23370 441168 324576 -225028 -262073 715976 1729563 1407197 -52030
40942 -52030 -998210 -569798 211920 85394 -647606 -783677 -12608 909762 1350271 1175598
40932 1175598 276131 -1145101 -1922957 -856318 1432778 2732833 1884503 203823 -417132
40923 -417132 85735 399763 3661 -321336 80623 935541 1748623 2355399 2534962 1957906
40913 1957906 935417 461629 942533 1498092 1205311 509655 519591 1226158 1519142 1009835
40903 1009835 669675 1179591 1688038 1090988 -182677 -776611 -432357 -213376 -708833
40894 -708833 -1182574 -868770 -139961 202491 101775 69361 300761 546646 559023 221310
40884 221310 -483549 -1285674 -1723663 -1718985 -1685359 -1819847 -1778611 -1355780 -898319 -651704
40874 -651704 -332046 152553 242623 -346396 -869362 -505479 438817 1038039 960027 432532
40864 432532 -404978 -1267701 -1480862 -938982 -638490 -1146502 -1314278 30932 1798814
40855 1798814 1875668 322507 -642084 120231 1415009 1969879 1973247 1824842 1243627 382440
40845 382440 99472 321636 -125290 -1208652 -1139625 693820 2194306 1537937 -70580
40836 -70580 -482194 146220 346083 230060 876015 1713693 1234235 -29127 91238 1837359
40826 1837359 2863993 1738622 -68401 -578900 119644 737932 765407 474331 30990
40817 30990 -340786 -71887 989095 2067914 2372306 2042208 1731085 1706398 1738244 1487649
40807 1487649 801056 -19239 -284259 249994 834436 688213 189442 201881 577043 515253
40797 515253 129474 192495 443646 -170590 -1426082 -1812958 -1035425 -636558 -1368300 -1828111
40787 -1828111 -869623 354128 242443 -758610 -1122247 -580064 128879 884345 1858269
40778 1858269 2327226 1560762 359674 18449 203051 -387899 -1562634 -1719948 -401509
40769 -401509 1054019 1666873 1908885 2160575 1723284 237337 -1183481 -1267781 -245571
40760 -245571 680090 952535 987053 1239415 1595312 1591732 947727 -30510 -564212 -190884
40750 -190884 630578 1061810 885745 514781 220915 -39247 -220901 -280726 -477656 -877690
40740 -877690 -852464 34383 956598 801497 35514 214491 1572342 2598542 2340121
40731 2340121 1564608 1039920 270870 -1060587 -1866172 -1210608 26975 509138 559068
40722 559068 1343820 2601132 2914938 1996678 1025321 679402 375637 -264004 -590342
40713 -590342 -69437 867322 1615227 2094490 2244790 1810324 1128890 1134132 1895379 2081749
40703 2081749 753046 -1064530 -1606964 -681645 297667 324408 -182985 -363465 9036
40694 9036 628330 1131426 1208088 738280 44388 -347383 -284473 11556 463144 1160310
40684 1160310 1890617 2249156 2296225 2470787 2711830 2381420 1327889 271334 -272599
40675 -272599 -671131 -1223696 -1369879 -689092 34777 -161866 -837982 -792198 47920 700716
40665 700716 902189 1296167 1794168 1434838 349329 146488 1414499 2417634 1603828
40656 1603828 71973 -135208 783483 856555 -483187 -1679391 -1525076 -549917 359995
40647 359995 1075334 1435579 876046 -361776 -906132 -70588 985410 824931 -372694
40638 -372694 -1407380 -1780662 -1766724 -1342855 -247513 1084856 1710667 1393016 877956
40629 877956 860938 1281600 1720544 1921772 1745759 1071335 44097 -801561 -963313 -558091
40619 -558091 -345170 -934182 -1909050 -2095761 -1021801 304820 702370 510714 952545
40610 952545 1960322 2057995 786509 -252087 274410 1329518 1105641 -203526 -863018
40601 -863018 -333518 207357 60593 28515 798555 1702799 1806887 1231350 663625 299013
40591 299013 -80980 -571859 -1246845 -2243938 -3239800 -3396771 -2408578 -1117990 -510866
40582 -510866 -528123 -479589 -217001 -164789 -453971 -810630 -1227267 -1968815 -2775826 -2761797
40572 -2761797 -1502827 182093 1005936 657558 105315 389115 1377134 1986883 1576394
40563 1576394 733198 445867 808922 1036814 640989 -29614 -538818 -1003831 -1600867
40554 -1600867 -1943176 -1509891 -430846 646280 1274783 1361400 870860 -31926 -701155
40545 -701155 -550704 93438 308867 -141561 -458571 61117 1138396 2031349 2323155
40536 2323155 1810210 301383 -1768794 -3043469 -2496116 -827680 247659 94828 -332759
40527 -332759 -170727 185921 73064 -177765 175717 916033 997077 -26880 -1382937
40518 -1382937 -1954284 -1352441 -151038 619095 376487 -263851 23364 1550104 2840675
40509 2840675 2412956 959063 543732 1643528 2381966 1196735 -1036108 -2415564 -2459072
40500 -2459072 -1963340 -1264349 -123236 1010365 1176172 488909 205731 800191 1140374
40491 1140374 247990 -1071726 -1242568 20126 1541699 2274110 2228642 1923218 1645084
40482 1645084 1400074 1088699 570577 -117084 -561393 -362889 229513 507797 271880
40473 271880 135873 566578 1068440 851119 22211 -555643 -532506 -457813 -719228 -834545
40463 -834545 -271905 606018 1046887 942444 672504 275144 -381883 -822335 -368675 626455
40453 626455 985753 399103 -104568 195474 627466 374527 -152758 -138457 220410 267230
40443 267230 325849 1287604 2937566 3952069 3686104 2894234 2455813 2361986 2278796 2188462
40433 2188462 2004616 1338365 227414 -484099 -81115 1079529 1999610 2061848 1274318
40424 1274318 -40716 -1278471 -1614517 -695767 727884 1326031 520426 -847756 -1271574
40415 -1271574 -30991 2042685 3319143 3019321 1988708 1608076 2168633 2796011 2833519
40406 2833519 2597605 2615683 2804367 2804363 2611728 2367419 1877937 935749 -18548 -143741
40396 -143741 739306 1714268 1698498 677935 -306222 -471647 -224840 -405202 -914845 -889641
40386 -889641 -284498 -266799 -1438827 -2568728 -2085267 -240365 1342657 1855873 1788336
40377 1788336 1514959 902552 379498 838864 2051989 2597374 1965303 1379829 1757316
40368 1757316 2165181 1359395 -238817 -1279632 -1354479 -994020 -544581 -196515 -470215
40359 -470215 -1490652 -2323732 -2149948 -1515062 -1277617 -1033992 -6794 1148830 1149621 329790
40349 329790 217535 927950 920885 -351914 -1479764 -1410582 -950998 -1029465 -1089465 -442578
40339 -442578 135806 -361012 -1309528 -1364627 -617243 -341645 -911179 -1411581 -1293848 -1081913
40329 -1081913 -1204190 -1252551 -833492 -281187 -15046 141779 441395 513028 -132436 -1092597
40319 -1092597 -1253030 -173264 1148781 1324589 264959 -677317 -433840 412998 524627
40310 524627 -261904 -746403 -177735 660191 663480 -21408 -416384 -277948 -337694 -995061
40300 -995061 -1545025 -1007419 674507 2519858 3419236 3064831 2112961 1466753 1382136
40291 1382136 1434364 1374808 1565163 2229826 2741744 2321455 1252122 639963 904690 1231640
40281 1231640 786538 -163311 -783014 -852218 -849349 -1083617 -1300751 -1167961 -750560 -380766
40271 -380766 -265163 -323860 -314240 -61208 387671 820839 1071199 1121521 1028649 847799
40261 847799 618120 306623 -169898 -678747 -748099 -87314 795945 1021463 534909 294229
40251 294229 883091 1512962 1055080 -313077 -1270115 -1007744 35327 1060338 1735480
40242 1735480 2011276 1882982 1642139 1749177 2150609 2272901 1945668 1712089 1927663
40233 1927663 2234123 2313251 2429238 2708678 2633543 1915389 1162616 914486 730598 144678
40223 144678 -228582 298122 1039252 925955 433703 799463 1523662 683096 -1877178
40214 -1877178 -3675754 -2917308 -1036363 -559236 -1641910 -2328399 -1569619 -366149 7747
40205 7747 -371318 -531471 45493 867690 1040366 406246 -43977 632546 1814722 1881201
40195 1881201 480863 -827473 -686369 426329 1386260 2059143 2678904 2657328 1437964
40186 1437964 -132915 -714233 -340962 -114300 -423187 -765474 -982395 -1314955 -1482420
40177 -1482420 -1058229 -561689 -796937 -1286189 -851973 308846 717947 -96381 -970711
40168 -970711 -1031623 -730490 -606226 -536990 -688538 -1676349 -3140982 -3598923 -2464636 -923154
40158 -923154 -84121 380472 983678 1254270 835291 431651 540970 463771 -256247 -662221
40148 -662221 -9459 641425 36585 -1116863 -1372291 -1023866 -1351779 -1991898 -1321573
40139 -1321573 588113 1619313 664743 -849897 -1208956 -557985 69761 486888 987976
40130 987976 1240631 735048 -184290 -719336 -741551 -729531 -821142 -661139 -138470 317263
40120 317263 284436 -134198 -433776 -199109 537937 1374737 1988312 2420782 2756800 2690363
40110 2690363 1849615 588280 -49545 546773 1782832 2544306 2422925 1859239 1203988
40101 1203988 224996 -1196262 -2335799 -2208327 -862107 480250 822729 476188 373008
40092 373008 750926 1091298 1039231 668623 10098 -884021 -1433230 -927568 435895 1666113
40082 1666113 2216925 2290006 1865355 570297 -1139250 -1890070 -1193375 -294377 -388653
40073 -388653 -957077 -876699 -323141 -341299 -1074873 -1630134 -1411351 -608986 337324 896133
40063 896133 492246 -686582 -1405383 -881499 -41477 -192601 -1027937 -1288472 -915466
40054 -915466 -956084 -1548496 -1680107 -1043259 -549544 -722260 -1021413 -1089377 -1261547 -1462846
40044 -1462846 -1022871 -94939 131187 -744229 -1614114 -1664196 -1574368 -2089341 -2653248 -2491885
40034 -2491885 -1969063 -1758712 -1586077 -937180 -251839 -239305 -587570 -451005 242680 953328
40024 953328 1513637 1976685 1951490 1134235 155584 -103660 232318 386145 212526 146759
40014 146759 156924 -168849 -630099 -598663 -184148 -145585 -532920 -494760 243134 699560
40004 699560 334 -1292390 -1858546 -1228361 -147516 480051 542407 564575 868794 1129013
39994 1129013 890298 385600 399864 1167417 1882100 1694912 812630 109414 -37504 46432
39984 46432 42125 -88664 -399412 -879717 -1123410 -700871 111192 552548 382453 100601
39974 100601 109733 260521 378054 642899 1168989 1678768 1896389 1874281 1657521 1019080
39964 1019080 -109357 -1223944 -1648646 -1226061 -354864 514414 1151306 1425827 1251193
39955 1251193 739336 241841 82763 234690 332546 100324 -247430 -189065 428494 1065943
39945 1065943 1050083 373507 -295858 -392998 -14939 352228 446953 401710 393868 348239 91109
39934 91109 -301180 -488135 -224085 430541 1294858 2211306 2861715 2773427 1869902 788248
39924 788248 215302 73676 -168774 -588803 -836933 -918937 -1125378 -1169570 -366661 1038910
39914 1038910 1702052 908269 -331230 -617418 60992 653342 612386 318291 304467 792832
39904 792832 1680857 2347226 1894171 324801 -950468 -641957 742231 1654662 1581242
39895 1581242 1263888 1095155 620756 -197953 -505454 124408 861834 815307 399706 776784
39885 776784 2218358 3606796 3573867 1908863 -205003 -1382495 -1418969 -1160388 -980269
39876 -980269 -182963 1540857 2947757 2642432 1107130 36064 -46311 -60245 -382420
39867 -382420 -243477 597426 1206131 1110455 1079022 1458551 1186696 -427432 -2177564 -2529549
39857 -2529549 -1781498 -1336500 -1594599 -1927996 -2102085 -2258912 -1950015 -736010 448882
39848 448882 83659 -1677663 -2907164 -2342115 -737345 519952 987131 902556 412153
39839 412153 -253836 -562414 -295882 65243 29916 -236209 -269966 40683 419201 471242
39829 471242 -107328 -1182946 -2051628 -2172492 -1920957 -1888155 -1626815 -251761 1647332
39820 1647332 2200619 989765 80132 1142230 2794058 2467851 161041 -1572981 -1194627
39811 -1194627 123426 668841 370248 87279 92993 245209 691978 1384596 1586158 851663
39801 851663 -28628 -20585 642627 920914 622284 535738 1015368 1484617 1463463 1146482
39791 1146482 742167 121451 -547083 -639987 -32016 469894 166279 -607312 -1079992 -1044620
39781 -1044620 -737824 -249516 306628 453147 -108390 -870466 -1086083 -754400 -425999
39772 -425999 -258540 20185 342599 262011 -274801 -762996 -810750 -417820 365845 1374620
39762 1374620 1939080 1418957 328680 64812 1071504 2035845 1540055 -51644 -1103941
39753 -1103941 -800851 30895 175444 -514769 -1166222 -1093853 -632592 -647128 -1336761 -1897224
39743 -1897224 -1597104 -801791 -400200 -498598 -446918 -57740 146906 79194 491494 1761855
39733 1761855 3094462 3530053 3095893 2394656 1733861 1273782 1303192 1604898 1250416
39724 1250416 -89433 -1307789 -1357041 -905246 -1214095 -1905346 -1459071 186069 1226382
39715 1226382 539727 -820755 -1270351 -635719 202995 611292 482291 56927 -7434
39706 -7434 752518 1505061 738006 -1421985 -2762462 -1801480 156948 1011788 765581
39697 765581 818714 1266955 948837 -119221 -471625 368775 1064754 684853 88939 238043
39687 238043 580067 243719 -311616 -119264 622343 972902 813469 788467 1051796 1210201
39677 1210201 1268434 1532879 1752934 1463113 1036025 1164886 1326223 222014 -1893692
39668 -1893692 -2864275 -1483264 588869 1006444 -122936 -822517 -406664 -220453 -1106971
39659 -1106971 -1942965 -1531281 -561133 -410343 -871497 -581017 618067 1332687 887082
39650 887082 476843 1276606 2517360 2612954 1532677 694483 688414 511778 -612614 -1886933
39640 -1886933 -2121191 -1388315 -633253 -220959 185649 618836 624433 68739 -610882 -1013379
39630 -1013379 -1059607 -709312 3646 683876 953136 1097794 1653050 2336675 2212281 1100466
39620 1100466 30206 -42395 725887 1614954 2192197 2215181 1443771 121855 -946925
39611 -946925 -1325448 -1377175 -1367894 -945001 -110749 248313 -220480 -263344 1293739 3368199
39601 3368199 3717288 2070883 569813 814507 1964067 2413830 2109238 2163115 2876336
39592 2876336 3225742 2270216 429579 -853715 -654561 338885 605658 -177098 -558031
39583 -558031 589390 2154676 2215547 879971 36512 331789 357498 -615624 -1122064
39574 -1122064 28040 1439597 1052817 -721351 -1698156 -1165804 -526233 -824079 -1436708
39565 -1436708 -1536594 -1356831 -1408043 -1532070 -1375712 -1055187 -818277 -587015 -218955 201648
39555 201648 546405 721957 542952 31289 -231378 254223 940699 784340 -105191 -348425
39545 -348425 754902 2071184 2083230 787853 -613877 -1381950 -1709958 -1797406 -1366810
39536 -1366810 -261148 1054890 1845817 1740640 993967 324376 426725 1354058 2359929
39527 2359929 2567435 1818689 719064 -101083 -545470 -866753 -1166913 -1257298 -975052
39518 -975052 -504106 -262923 -419729 -606143 -308916 370407 535420 -620509 -2665060
39509 -2665060 -3952558 -3190839 -987669 609317 366933 -755783 -949406 120542 1144597
39500 1144597 1195220 851493 948845 1209688 881653 53951 -544688 -649832 -548869 -386378
39490 -386378 -156285 -77428 -189927 72424 1005561 1694262 1068516 -316487 -836219 -128782
39480 -128782 491368 167552 -378291 -371016 -251453 -599089 -938139 -585340 219091 947247
39470 947247 1670769 2338023 2068602 392106 -1497860 -2036118 -1348148 -743898 -604407
39461 -604407 -212776 569898 1025268 1010121 1146020 1345737 686483 -737257 -1321928 -172401
39451 -172401 1423550 1784767 1103368 719429 881587 644483 -275901 -918782 -568298
39442 -568298 187278 322653 -315201 -999517 -1117035 -828049 -759897 -1125058 -1265462 -392654
39432 -392654 1166051 2038666 1532455 697605 922931 1917872 2157903 1219243 405708
39423 405708 676649 1158115 603187 -524993 -654476 523681 1518458 1057952 -345342
39414 -345342 -1302782 -1282007 -798666 -353210 57445 473238 713560 782780 1050993 1692730
39404 1692730 2223383 2008189 1175791 619151 931636 1651712 1874080 1425530 983824
39395 983824 1014313 1124458 794158 314172 417285 1130083 1635755 1401365 887015 826566
39385 826566 1202218 1337407 806689 -110719 -810196 -939634 -656124 -485557 -843849 -1554534
39375 -1554534 -1960328 -1645521 -889524 -260912 41222 250011 610432 1083747 1338126
39366 1338126 983833 116814 -346392 536099 2319051 3246199 2344560 821541 504579
39357 504579 1382893 1853809 1199557 464407 639778 1266314 1435827 1139688 876121 760044
39347 760044 809328 1346598 2224435 2361462 1140289 -276645 -306434 656618 620794 -1115463
39337 -1115463 -2865396 -2888106 -1631025 -760867 -800104 -822254 -117897 910014 1545782
39328 1545782 1612709 1291883 724387 155200 40767 576332 1328669 1732716 1828297 2065859
39318 2065859 2386652 2049184 698269 -808890 -1227453 -464194 317338 233058 -290731
39309 -290731 -348634 125839 439947 223233 -208016 -460180 -434868 -88890 577960 1152906
39299 1152906 980134 -26103 -1166289 -1831590 -2169814 -2505051 -2510412 -1585157 46217
39290 46217 1233347 1122114 131393 -566957 -394223 69670 -121849 -1140093 -2228805
39281 -2228805 -2643475 -2437827 -2118548 -1799883 -1169351 -236482 452738 546013 335286 176764
39271 176764 -44810 -421989 -480740 180813 1024245 1164207 709318 620535 1184050 1606226
39261 1606226 1416106 1243051 1596153 1824315 1217570 396480 412966 896134 451184 -1105873
39251 -1105873 -2240893 -1802995 -519968 192341 861 -500475 -990050 -1552066 -2006902
39242 -2006902 -2012951 -1757523 -1814315 -2230722 -2328225 -1617223 -540169 -33635 -467200 -1217188
39232 -1217188 -1364846 -728580 19744 301164 280892 283381 87752 -505965 -836591 -146682
39222 -146682 964023 1072805 61703 -588739 -22329 844613 1074793 1228125 2104439
39213 2104439 3179398 3516042 3215190 2716290 1716055 212274 -465169 578633 1949434
39204 1949434 1873331 1135367 1770166 3401314 3648629 2162122 1324294 2312298 3259123
39195 3259123 2489204 1086832 732615 1117183 1198742 1221381 1707622 1968400 1364264 712227
39185 712227 797109 859114 260180 169678 1566951 2920527 2208935 249305 -458978 477141
39175 477141 1223866 974094 750846 987864 778261 -120306 -685820 -481338 -214867 -98587
39165 -98587 486475 1334766 1333175 485763 121285 541656 413327 -771967 -1574653 -926023
39155 -926023 197800 525342 304643 190282 -183942 -1196416 -2047624 -1875617 -1037962
39146 -1037962 -206561 698841 1625001 1712731 777902 243145 1151245 2340973 2154624
39137 2154624 994841 504627 982194 1362519 1221609 1075138 1036585 785265 585513
39128 585513 828434 905013 113358 -687084 -114341 1288572 1634577 731456 390515 1317901
39118 1317901 1927607 1144965 295489 798903 1722611 1412087 297440 66353 750221
39109 750221 730174 -424056 -1049851 151004 2199507 3187817 2589570 1397578 574906
39100 574906 209147 -57787 -460912 -940215 -1086192 -358738 1158874 2305222 1789198
39091 1789198 -189516 -1847248 -1797328 -703894 -337738 -1227144 -2055280 -1501636 92001
39082 92001 1312628 1371476 668462 34027 -6365 576421 1260951 1179929 -38306 -1547724
39072 -1547724 -1916983 -711322 917108 1484434 777555 -83426 -50672 711958 1173968
39063 1173968 703402 -253273 -772514 -523684 -52208 -67248 -653324 -1223647 -1131870 -311516
39053 -311516 619539 935089 523076 -124364 -679450 -1344104 -2190417 -2642103 -2198795 -1284349
39043 -1284349 -610821 -24614 1022485 2060726 1965432 892782 439430 1299253 2107193
39034 2107193 1534774 345963 144720 992456 1661508 1625089 1331922 883643 -51025
39025 -51025 -1087742 -1308007 -720315 -304988 -429205 -404353 136943 602888 558876 392650
39015 392650 405186 244391 -228002 -429806 -1035 557953 740958 742689 782005 562513
39005 562513 28113 -192534 173038 374951 -151061 -707688 -457593 100846 -51978 -724041
38995 -724041 -894973 -481401 -330907 -571312 -406618 282001 543249 -7028 -459334 -184214
38985 -184214 23463 -746970 -1995986 -2585937 -2323273 -1741184 -906846 373338 1525745
38976 1525745 1651659 938305 469302 567525 503915 65333 110624 956185 1387773 285294
38966 285294 -1559369 -2367074 -1673296 -637056 -278850 -463033 -644767 -650562 -443382 159540
38956 159540 1160459 2177338 2769081 2706804 2006142 1096559 766632 1319026 1906574
38947 1906574 1462453 256780 -344134 212771 942661 837996 201220 -78851 156642
38938 156642 377168 194153 -388610 -1104099 -1389998 -768337 331127 756859 126995
38929 126995 -564042 -440838 -103237 -627241 -1799466 -2382223 -1868454 -1021604 -714883
38920 -714883 -966980 -1155532 -714157 305415 1104775 919643 143356 386 762354
38911 762354 1275596 910745 755581 1685526 2433571 1351910 -690658 -1288841 -120195
38902 -120195 624937 -315984 -1548526 -1457611 -461204 267977 749168 1488058 1969873 1347504
38892 1347504 13656 -820001 -821788 -772926 -1219247 -1706754 -1430172 -217898 1159980
38883 1159980 1628498 1008818 431656 939981 1864893 1626326 188357 -629391 241501
38874 241501 1571409 1747790 1020681 703909 1113746 1594096 1872354 2041371 1698768
38865 1698768 492840 -732322 -675383 567701 1560297 1484092 953810 759696 864456
38856 864456 939877 967516 897450 458760 -250091 -580224 -193942 349821 336775 -74693
38846 -74693 -48229 761906 1629696 1571894 630494 -36670 391161 1202091 1045304 -113611
38836 -113611 -852588 -344651 456159 311235 -507395 -845926 -451488 -70838 -163474 -554015
38826 -554015 -1092989 -1625956 -1520637 -353238 1011608 1218472 389879 54460 793410
38817 793410 1253377 232666 -1325094 -1500673 25699 1671175 2052291 1400949 689339
38808 689339 140827 -768071 -2073691 -2792833 -1999176 -143930 1254209 1291323 529393
38799 529393 -1448 -11425 265917 841922 1752236 2470420 2397217 1726316 1020377 174281
38789 174281 -1201460 -2486329 -2379191 -828712 485784 201065 -1060018 -1728270 -1285088
38780 -1285088 -457145 68226 290551 472778 747664 1101021 1322099 1092384 467405
38771 467405 46929 252839 640251 406257 -511743 -1317693 -1356803 -835480 -437683 -518345
38761 -518345 -837155 -928283 -568894 98467 808218 1431807 1934319 2169310 1934345 1304311
38751 1304311 743500 706460 1112589 1316304 731718 -438452 -1242302 -1015619 -321065
38742 -321065 -400261 -1535662 -2480999 -1953332 -299386 894801 642873 -541793 -1437378
38733 -1437378 -1272376 -216382 757901 626896 -539591 -1379317 -814263 417891 667899
38724 667899 -322957 -1098062 -607627 472825 995463 870059 633588 348344 -161776
38715 -161776 -535070 -279276 310939 470282 100890 -92849 384014 1209155 1712563 1587358
38705 1587358 1096548 809118 1093380 1709996 2013865 1656902 897762 182167 -236884
38696 -236884 -214621 234480 637221 409956 -214053 -263994 558616 1289777 1148373 830076
38686 830076 1428744 2612715 3019709 2246273 1278682 895451 761551 409572 97976
38677 97976 123700 57962 -605611 -1494908 -1763532 -1266609 -732402 -758932 -1106461 -1142098
38667 -1142098 -704732 -279342 -341955 -718785 -757805 -128240 729257 1056091 565271 -324169
38657 -324169 -938307 -952911 -665600 -702657 -1278549 -1773022 -1402086 -348296 329403 169504
38647 169504 50797 898796 2203878 2682790 2130014 1625544 1877602 2339803 2299529 1980710
38637 1980710 1963962 2101216 1741206 780474 -176827 -676386 -878280 -1048781 -1048776 -632911
38627 -632911 -6182 307311 132181 -176235 -336409 -558155 -1036449 -1351132 -929331 26834
38617 26834 738998 995671 1330190 1889173 2055669 1677508 1681264 2582093 3231365 2290973
38607 2290973 418725 -467046 77303 564879 44283 -543471 -117658 784282 991965
38598 991965 471453 22014 -120092 -272895 -347609 -1048 451831 319178 -262098 -330264
38588 -330264 502735 1421835 1482866 744861 -3776 -235929 -65705 107340 46837 -124968
38578 -124968 -51161 444041 1050505 1271677 1049322 828304 886581 880116 335833 -556550
38568 -556550 -1056130 -861504 -559988 -707294 -804246 49781 1473723 1789411 300968
38559 300968 -1304439 -976952 792743 1575505 488625 -583922 139298 1800048 2435106
38550 2435106 1900967 1660822 2206106 2413828 1574970 584406 545619 1210417 1525908 1142036
38540 1142036 681521 724238 1043048 949480 241101 -394851 -178942 612662 868531 263355
38530 263355 -74301 818287 2103922 2150533 796611 -540402 -890897 -668070 -505640
38521 -505640 -403663 -363635 -714204 -1279039 -1223752 -315272 572686 787196 793507 1097035
38511 1097035 1276348 964940 840598 1512240 2195581 1804817 838467 764105 1755505 2466249
38501 2466249 2129361 1553469 1683516 2298677 2668059 2629784 2434976 2155880 1808008 1621284
38491 1621284 1720686 1836284 1662924 1264350 920485 831719 1074074 1520904 1746406 1412145
38481 1412145 839138 749066 1295571 1798359 1626524 937671 352331 284087 758448 1467138
38471 1467138 1792843 1226520 68336 -643457 -237127 797431 1382204 1032400 277882
38462 277882 73319 889870 2215485 2952381 2545220 1631779 1240656 1516256 1774916
38453 1774916 1665592 1488608 1329743 800395 -53131 -455336 -2450 703400 1044230
38444 1044230 1224026 1468742 1226514 123708 -924194 -720291 421472 1061709 722758
38435 722758 432095 1010750 1892689 2111306 1659215 1276245 1372851 1707048 1876007 1717881
38425 1717881 1352135 1092613 1249847 1852886 2585667 3041633 3042767 2802894 2804125 3284089
38415 3284089 3743022 3315394 1900325 553123 346083 1159706 2058339 2494879 2520368
38406 2520368 2135084 1294390 492160 461392 1112590 1482076 977476 80931 -407700 -263204
38396 -263204 252099 797076 984227 525237 -296874 -687756 -186269 838822 1702625
38387 1702625 2059878 1926674 1493974 1102749 982125 857653 277189 -552949 -834821
38378 -834821 -282537 486622 981536 1565944 2639162 3683929 3828760 3046479 2195811
38369 2195811 2051676 2708332 3677940 4174807 3622233 2356876 1567097 2048945 3223967
38360 3223967 3808485 3230980 1990630 900324 456904 735935 1407901 1955180 2188505
38351 2188505 2342340 2448767 2114220 1349880 1047252 1904210 3270139 3845574 3263284
38342 3263284 2203093 1213097 334867 -229579 -83383 593574 1076872 1115393 1241978
38333 1241978 1914053 2962701 3972198 4574170 4377618 3365628 2366350 2265851 2711410
38324 2711410 2581767 1830743 1643772 2430148 3021018 2573049 1965505 2254892 2879240
38315 2879240 2755334 2304565 2802043 4168478 5038984 4936207 4805057 5161787 5179732
38306 5179732 4196272 2956913 2574544 3022934 3387071 3087384 2278004 1467632 1240136
38297 1240136 1949821 3206905 3961518 3509477 2210765 986949 418460 519831 972676
38288 972676 1302540 1215370 995719 1146013 1470297 1157081 86270 -701114 -388118 488922
38278 488922 1023788 1328614 1906983 2197651 1123570 -951909 -2154863 -1366451 472156
38269 472156 1794623 2243951 2445824 2700236 2747678 2501872 2270297 2287227 2484449 2709706
38259 2709706 2900772 3098883 3425918 3902793 4246237 4137656 3735193 3489171 3370566
38250 3370566 2891028 2127965 1973496 2794131 3524760 2972946 1609320 1042777 1825815
38241 1825815 2807972 2847597 2228898 1939787 2270126 2711763 2768527 2269088 1202187 -120931
38231 -120931 -866926 -278560 1380582 2894511 3308787 2804033 2177290 1744448 1142466
38222 1142466 158202 -695287 -696362 205982 1360087 2199868 2722217 3118215 3293923 3017359
38212 3017359 2336847 1565067 934141 512511 404797 748597 1435828 2034459 2144365
38203 2144365 1795621 1399723 1288915 1381517 1391346 1297014 1368265 1677201 1917014 1937487
38193 1937487 2100267 2661981 3106613 2732901 1763948 1132335 1162576 1288101 1220133 1467606
38183 1467606 2280300 2947691 2790320 2163912 1800068 1755052 1730255 1852182 2292295 2571980
38173 2571980 2145034 1369677 1064019 1341788 1669902 1812602 1905503 1827387 1320370 564099
38163 564099 -80646 -623927 -1062613 -943272 -185165 255957 -308514 -909833 -265512 944760
38153 944760 885336 -502823 -1272130 -395647 933517 1411817 1229833 868517 60264
38144 60264 -1058648 -1345060 -381687 520211 246729 -404290 -159769 732612 1274691 1448894
38134 1448894 1763077 1943316 1538378 1124929 1491622 2212055 2378680 2180930 2383892
38125 2383892 2770594 2529223 1785851 1376149 1434034 1499758 1629090 2067175 2264346 1650150
38115 1650150 960038 1252903 2019750 1985266 1462491 1948514 3435114 4211449 3623683
38106 3623683 2946305 2920269 2483098 943023 -409105 -183627 998214 1607307 1297017
38097 1297017 591529 -493522 -2017581 -2959262 -2057993 301302 2237514 2479641 1474248
38088 1474248 366051 -323037 -752771 -1042474 -927076 -165288 855594 1252752 678757
38079 678757 -52395 103933 1045564 1737418 1694834 1461802 1586663 1961426 2318396 2547330
38069 2547330 2310333 1183185 -500261 -1658704 -1592085 -506790 1079490 2619320 3284558
38060 3284558 2597184 1480698 1450015 2461042 2899035 2122968 1489958 2077277 2915771
38051 2915771 2659009 1739011 1499085 2155987 2991236 3761051 4533919 4789081 4072969
38042 4072969 3071658 2749741 2881134 2660323 2229078 2222435 2291080 1639113 754925 964623
38032 964623 2264262 3167245 2904553 2324067 2297125 2620615 2941305 3444600 3990832 3727455
38022 3727455 2374504 1063209 1112575 2498984 4066110 4761609 4326585 3351197 2948212
38013 2948212 3715795 4759732 4538066 3000117 1912817 2480269 3650269 3714264 2739386
38004 2739386 2170250 2540286 3035416 3268569 3971245 5399724 6318104 5562971 3853555
37995 3853555 2893269 3040662 3136158 2671046 2731809 4123333 5735992 5992430 5213731
37986 5213731 5056192 5809907 5908997 4507864 2992447 2994344 4063242 4519802 3879456
37977 3879456 3161482 3186740 3782518 4549286 5322524 5793630 5567086 4779481 4042268 3714229
37967 3714229 3739876 4069407 4622815 4991587 4830451 4379885 3962781 3289402 2105361
37958 2105361 1178360 1499478 2629706 3105111 2604127 2410827 3348364 4515781 4749120
37949 4749120 4285715 4126892 4489841 4725346 4298210 3222195 1955889 1327600 2003969
37940 2003969 3538723 4542626 4325335 3736027 3790877 4190181 4017908 3301341 2867967
37931 2867967 2999332 3212439 3210193 3151427 3079006 2941090 3108551 3960822 4935958 4974634
37921 4974634 4118384 3670621 4325125 5090338 4825634 4067850 4241087 5400367 5982076
37912 5982076 4982116 3331931 2548943 2807016 3169494 3233498 3459318 3900669 3742798
37903 3742798 2623339 1587308 1906689 3337938 4338962 3886119 2428996 1136282
37895 1136282 844145 1714327 3209961 4244727 3978271 2736834 1708414 1579061 1958895
37886 1958895 2252456 2416487 2567828 2563621 2501234 3016355 4364907 5640272 5734994 4877274
37876 4877274 4359784 4748652 5228805 4962750 4272607 3937332 3951986 3767217 3434957 3601585
37866 3601585 4311476 4704269 4294954 3802329 4039140 4563866 4372269 3610301 3445752
37857 3445752 4177605 4701550 4318179 3905162 4442177 5338773 5384871 4692071 4345284 4476449
37847 4476449 4157527 3261571 2983600 4015077 5345991 5593578 4739498 3862982 3714998
37838 3714998 4188554 4810604 5211866 5324804 5437252 5839151 6319084 6398956 6106559 5942916
37828 5942916 6004924 5894919 5725173 6300128 7750107 8816057 8333770 6878641 6012063
37819 6012063 6196861 6415285 5832757 4921933 4589345 4841089 4941679 4688330 4808763
37810 4808763 5740540 6533965 5842987 4014070 3096545 4178317 5765646 5935129 5202420
37801 5202420 5556749 7083810 7672570 6403890 5147155 5791148 7583708 8574925 8443442
37792 8443442 8392381 9054495 9921283 10395136 10290823 9681464 9083416 9234414 9944648 9964537
37782 9964537 8821909 7783763 7924995 8346445 7707587 6504430 6166245 6765025 7460602
37773 7460602 8433321 10236384 11770198 11319302 9517742 8865456 10053528 11144038 10879847
37764 10879847 10377009 10674130 10980675 10650187 10759696 12104615 13397325 13238765 12440995
37755 12440995 12573444 13416677 13739596 13599525 13907351 14469130 14475101 14417788 15436926 16939091
37745 16939091 16952300 15099272 13393968 13594219 15304573 17252623 18983084 20485255
37737 20485255 21348379 21313822 20962320 21005215 21353525 21522076 21524933 21749737 22209258 22439814
37727 22439814 22069595 21258983 20711770 21273342 23148076 25414220 26756895 26891404 26864237
37718 26864237 27714886 29244640 30438881 30787183 30766096 31122623 32025669 33012319 33662443
37709 33662443 34208192 35302905 37090413 38754748 39337295 38897695 38482814 38972042 40356726
37700 40356726 42187136 44237109 46452780 48565486 50171674 51259854 52492042 54742333
37692 54742333 58150125 61714248 64264801 65982949 68384775 72358214 76830080 80224202
37684 80224202 82828806 86520729 92090159 98108665 103018059 107316587 112781369 120166649
37676 120166649 128628965 137066838 145062849 152632304 160031845 168030046 177557481 188619726
37668 188619726 200004646 210468235 219919485 229125417 238559045 247950472 256771511 264658974
37660 264658974 271330948 276510205 280115380 282266845 282924578 281728937 278394118 273096147
37652 273096147 266297070 258375708 249619007 240280260 230287786 219200102 207026991 194905224
37644 194905224 184189352 174831662 165489243 155445691 145519759 136654285 128614138 120851475
37636 120851475 113701075 107567024 101666463 95047423 88469213 83641682 80589710 77421159
37628 77421159 73047524 68504025 64922279 61818067 58468009 55530992 53766216 52148245
37620 52148245 49031277 44752560 41410128 40097700 39794560 39118032 37870675 36556033
37612 36556033 35484378 34751250 34208376 33172191 31049256 28498174 26995916 26914042 27053913
37603 27053913 26551302 26103277 26490799 26883071 25785481 23160453 20505935 19050180 18790652
37594 18790652 19170998 19775906 20240186 20189149 19551749 18631535 17822283 17405829 17371846 17192017
37584 17192017 16221061 14736159 14015036 14734807 15871665 16071734 15558030 15489353 15839846
37575 15839846 15459387 14225565 13440615 13649913 13716851 12873299 12115688 12369864 12673541
37566 12673541 11761836 10354979 9987190 10292168 9571731 7800622 6845470 7448066 8127263
37557 8127263 7730508 7063242 6984452 6785378 5859484 5300610 6073554 6969654 6444771 5446323
37547 5446323 6038557 7800307 8205862 6627804 5335721 5853440 6751286 6244080 4890822
37538 4890822 4147272 3941034 3507139 3308935 4092472 4905970 4201393 2540998 2157601
37529 2157601 3745579 5487774 5620979 4448089 3316953 2888290 3005392 3286089 3303420
37520 3303420 2915380 2695773 3286476 4238317 4435889 3743402 3118770 2986493 2829340
37511 2829340 2662779 3345287 4779027 5403076 4522820 3693678 4430820 5784197 5832293
37502 5832293 4653514 3956681 4274785 4439970 3773506 3012143 2782968 2702788 2469975
37493 2469975 2537203 3087507 3422708 3062634 2622616 2907807 3732410 4248875 4037109 3401986
37483 3401986 2906703 2926111 3381727 3751566 3637755 3329091 3378275 3699639 3703998 3310861
37473 3310861 3059910 3084294 2813094 2056141 1632426 2360984 3902833 5106298 5214172
37464 5214172 4423834 3565310 3454213 4232622 5170463 5426028 5033512 4717585 4796705 4915602
37454 4915602 4889542 5036625 5487364 5927335 6259909 6740067 7196660 7016579 6283136 5984685
37444 5984685 6566673 7245078 7440238 7888928 9368339 11178851 12101196 12298069 12998638
37435 12998638 14563213 16053101 16678137 16642598 16502038 16585710 17184117 18527773 20364678
37426 20364678 22089652 23387756 24370236 25230644 26245619 27844100 30027433 31952633
37418 31952633 32832541 33096571 33883693 35459657 36896550 37281030 36497987 34879034 32904570
37409 32904570 31294312 30551610 30236346 29383076 27768175 26102083 24913784 23992046 23027679
37400 23027679 22021539 20883464 19386637 17720470 16373709 15334675 14194634 13130351
37392 13130351 12765596 12783118 11841197 9528700 7402820 7168380 8487490 9488765 8999851
37383 8999851 7480113 6106874 5701683 6311859 7168763 7205759 6137032 4846630 4322598
37374 4322598 4541331 4827036 4847348 4652044 4156063 3337576 2677927 2638984 2865436 2658697
37364 2658697 2145260 2171729 2977523 3758760 3827276 3572271 3833814 4676606 5238617 4759763
37354 4759763 3502699 2508823 2430750 2804498 2782555 2449370 2759432 3979866 4978672
37345 4978672 4674302 3564365 2941333 3009768 2857160 2173719 1805214 2264533 2713739
37336 2713739 2115104 790593 89351 705856 1889727 2353635 1666090 636155 349926
37327 349926 916838 1449449 1398200 1363982 2020215 2738732 2339781 1080806 626964 1692430
37317 1692430 2920945 2811970 1690043 796042 359815 -142492 -485461 -8248 793985
37308 793985 599473 -609043 -1209772 -233078 1314279 2076772 2072586 1911875 1460763 509768
37298 509768 -117654 421758 1405925 1476338 851787 998218 2073994 2420905 1104560
37289 1104560 -571508 -933025 -73112 869632 1525818 2213278 2803724 2925247 2841658
37280 2841658 2973387 2882381 1887193 460786 -180603 162498 485403 240653 28620
37271 28620 339312 688113 520778 127745 73226 330039 493685 380904 38127 -377473
37261 -377473 -437804 292255 1516157 2290117 2199746 1905940 2130017 2621418 2579092 1681415
37251 1681415 329676 -733659 -793255 322866 1782898 2349693 1750804 894171 515985
37242 515985 426771 434089 963152 2044760 2663242 2096173 1121212 827507 954422 646864
37232 646864 219465 648107 1619573 1719594 648726 -262874 -88561 509850 626140
37223 626140 388180 213602 -119779 -801564 -1225301 -819983 -61211 227768 151367 429336
37213 429336 1064702 1238003 580728 -208960 -316071 123221 313906 -58127 -441946 -282570
37203 -282570 114529 -19617 -821583 -1647897 -2036464 -2126073 -1917659 -996068 457961 1284957
37193 1284957 891594 376195 905841 1673031 1057545 -596966 -1277645 -402556 402474
37184 402474 98082 -263730 209478 462583 -557562 -1790106 -1735104 -1034871 -1345787
37175 -1345787 -2409986 -2398904 -883353 600105 1026668 1018780 1138597 804279 -373290
37166 -373290 -1552827 -1773163 -1094026 -14242 1238672 2203914 2009065 555615 -890581
37157 -890581 -1128191 -417658 291410 841689 1633677 2413391 2389459 1462549 441266 -48765
37147 -48765 -195323 -443233 -887490 -1379771 -1774443 -1856333 -1351541 -249902 1028821 1945392
37137 1945392 2280235 2234134 2139982 2092363 1885243 1371360 819042 743766 1375762 2422534
37127 2422534 3293314 3378856 2287199 239435 -1759110 -2603422 -2107996 -1038547 -126684
37118 -126684 465673 670716 246978 -624014 -1123742 -803309 -363220 -729045 -1635915 -1915502
37108 -1915502 -1124795 -105814 245678 72787 21279 118585 -201345 -1081905 -1843512 -1845924
37098 -1845924 -1403978 -1386982 -1939047 -2120052 -1128647 521715 1589754 1650123 1378048
37089 1378048 1338131 1304080 1039616 959576 1449782 2093667 2224564 1862433 1459958 1036950
37079 1036950 301409 -508836 -658698 85485 1016310 1229064 514895 -556179 -1243882
37070 -1243882 -1352803 -1431187 -2033899 -2718228 -2313947 -539272 1284429 1775813 1191037
37061 1191037 727640 633855 175426 -739728 -1275823 -1214612 -1469201 -2473391 -3172435 -2490397
37051 -2490397 -1029708 -332704 -870139 -1672922 -1790975 -1300458 -799254 -557841 -452451
37042 -452451 -386706 -429918 -551826 -458783 61933 649914 587349 -276903 -1179617 -1359222
37032 -1359222 -908833 -240639 752122 2159841 3132133 2662333 1169389 57292 -352299
37023 -352299 -1083619 -2434607 -3154287 -2392436 -1117484 -628689 -779158 -714644 -358687
37014 -358687 -30245 478198 1196652 1214838 16894 -1154018 -811682 427944 659456
37005 659456 -483583 -1537975 -1668682 -1632084 -1996136 -2059364 -1183634 89397 943263
36996 943263 1297556 1330991 925325 183543 -294649 -241630 -201734 -720615 -1587567 -2196531
36986 -2196531 -2160167 -1443890 -476601 -95379 -611710 -1040307 -270345 1074756 1256703
36977 1256703 43252 -798970 -136043 921544 901537 115231 -229038 -13579 -27926
36968 -27926 -459818 -767373 -720513 -667939 -994246 -1838649 -2926158 -3342112 -2247873 -258247
36958 -258247 878883 587801 329498 1320998 2578281 2413113 874512 -634298 -1360658
36949 -1360658 -1482506 -1123242 -471434 -238588 -648487 -659505 417671 1368904 806444
36940 806444 -388678 -362288 649813 901662 409090 962699 2673245 3252138 1599270
36931 1599270 -311926 -355797 973064 2043494 2543069 2971271 3200666 3077063 3208151
36922 3208151 3720634 3415989 1611657 -324951 -819230 -386296 -438776 -835307 -534918
36913 -534918 103139 -151234 -911192 -423048 1519621 2890189 2221424 501443 -441359
36904 -441359 -232122 137872 -156478 -1022771 -1772741 -1833980 -1431459 -1472181 -2284673 -2834243
36894 -2834243 -2010884 -357697 543185 173988 -631295 -1332377 -2177837 -2977847 -2933941
36885 -2933941 -2098493 -1560299 -1646708 -1377794 -368025 250556 -247109 -809782 -426751
36876 -426751 12145 -764078 -2090749 -2365777 -1645691 -1322332 -1577368 -1179729 100422
36867 100422 843430 293347 -363509 116565 1198271 1596003 1129147 530232 135458
36858 135458 -222628 -486729 -457600 -349173 -531314 -905002 -1107164 -1111256 -1079939 -852729
36848 -852729 -158970 783722 1386596 1349085 856060 267540 -67844 79648 523204 681514
36838 681514 251683 -393476 -822827 -1177040 -1681773 -1936973 -1432839 -579186 -409489 -1195212
36828 -1195212 -2029322 -1958856 -1012377 58022 605645 474048 -109846 -834821 -1589582
36819 -1589582 -2367560 -2832973 -2434927 -1320688 -594899 -1005607 -1850164 -2038900 -1766928
36810 -1766928 -1953701 -2346081 -1731967 -190669 502764 -624674 -2249352 -2679709 -2098702
36801 -2098702 -1770938 -1978934 -2045056 -1774026 -1553006 -1329016 -673265 249087 765432 708053
36791 708053 544499 608625 902207 1415547 1883391 1544561 75111 -1468803 -1655836
36782 -1655836 -541982 454705 493649 89182 -94106 -99313 -41975 356152 1109990 1631306
36772 1631306 1535633 1180340 992205 819242 352363 -279660 -702664 -719554 -304034 442683
36762 442683 1131219 1262050 762547 75573 -329597 -257951 265899 935809 1220583 972450
36752 972450 740822 916094 952462 267833 -484905 -196240 834945 1128080 196371 -828361
36742 -828361 -1025871 -840831 -947289 -1181438 -1207172 -1180297 -1149735 -768330 -120067 151532
36732 151532 -32444 -62549 -30845 -819828 -2191180 -2415383 -824453 835963 916250 276478
36722 276478 644030 1856934 2514371 2299504 1768828 751607 -993672 -2254370 -1708412
36713 -1708412 -365492 -416933 -1841452 -2464482 -1473019 -494475 -709059 -1168768 -836690
36704 -836690 -287517 -314608 -565914 -696895 -1322027 -2552794 -2939666 -1291038 1427033
36695 1427033 3305438 3802546 3645957 3204480 2313368 1289513 848945 1082727 1387657
36686 1387657 1328110 920074 250056 -574030 -1215297 -1312832 -822838 -3084 661095 525934
36676 525934 -601609 -1824114 -1887097 -778695 186370 97019 -642074 -1353314 -1912533
36667 -1912533 -2103901 -1382395 8935 791579 293902 -691448 -1359773 -1937201 -2463289
36658 -2463289 -2051013 -587376 313094 -401578 -1384968 -1161390 -814070 -2068730 -3834241
36649 -3834241 -3529245 -1364320 -248717 -1280094 -2343181 -1912208 -1334058 -1971448 -2620876
36640 -2620876 -1679931 -8798 432795 -433212 -1087667 -837749 -270123 111749 217355
36631 217355 -200955 -1151493 -1824984 -1511318 -664007 -98224 250471 726492 852537 118940
36621 118940 -728951 -610013 115132 238719 -228522 -123196 820921 1501685 1173577 302643
36611 302643 -487164 -1047585 -1087028 -232387 948501 1238492 524252 85954 660326 1384073
36601 1384073 1252025 498837 -172302 -684711 -1113874 -1073628 -454890 34692 -78987 -223976
36591 -223976 136109 455681 145605 -171645 320951 1032094 803518 -48620 -64402 1056358
36581 1056358 1967973 1711876 861270 192665 -507649 -1556992 -2309813 -1981961 -987322
36572 -987322 -473635 -710155 -792994 -84143 740011 573074 -448323 -849719 254593
36563 254593 1694750 1613872 178639 -372936 1072624 2638103 2070193 141184 -480730
36554 -480730 708388 1409837 295888 -847004 61721 2205485 3165387 2278030 948686
36545 948686 261007 13133 -90128 87040 295009 -85019 -889650 -1164113 -674529 -399919
36535 -399919 -1003180 -1693290 -1293023 140191 1425540 1671548 1066675 462182 539573
36526 539573 1236461 1746284 1263930 -76491 -1222377 -1355372 -795729 -504088 -843373
36517 -843373 -1151963 -602263 696266 1663400 1433502 418845 -175422 100060 455125
36508 455125 218900 -17109 621592 1650282 1660581 366862 -878526 -929906 -260468
36499 -260468 -9028 -397092 -772705 -673584 -134584 685760 1490626 1702643 1009396 -50732
36489 -50732 -632043 -669719 -883148 -1656474 -2426478 -2378976 -1430571 -305305 216265 -13211
36479 -13211 -508097 -742804 -655298 -489608 -286135 165845 873919 1498182 1743137 1547442
36469 1547442 841865 -367321 -1492028 -1543299 -247308 1457416 2447180 2514118 2088026
36460 2088026 1487591 1043532 1319486 2332703 3037074 2588029 1744587 1844432 2645247
36451 2645247 2621313 1463819 662646 1054114 1388149 432121 -792178 -406242 1423933
36442 1423933 2627708 2089158 875464 417581 738892 963346 600604 -272505 -1398757
36433 -1398757 -2294669 -2325142 -1423239 -424842 -189668 -615008 -932764 -753576 -369521 -169666
36423 -169666 -212818 -364192 -486128 -451683 -246662 -85749 -169846 -295629 7518 821625
36413 821625 1554689 1534141 785269 -4175 -285816 -195806 -211041 -480560 -755064 -884782
36403 -884782 -1014802 -1174647 -1046798 -474072 39809 -204247 -1160910 -1988382 -2018398 -1402460
36393 -1402460 -665789 -37844 481822 746828 627450 427042 647873 1240902 1476902
36384 1476902 837664 -175173 -492161 242625 1211513 1494880 1278481 1424447 1927131
36375 1927131 1669423 180126 -1185743 -839066 678774 1217559 -3475 -1281857 -877060
36366 -877060 637173 1477897 1210963 884485 1067764 1195949 907926 739011 1065980
36357 1065980 1352066 1010072 321502 -69486 -71387 -10289 66031 412261 1033539 1471922
36347 1471922 1180605 91177 -1078280 -1248603 -105949 1309422 1689169 1085537 745382
36338 745382 1231624 1607816 940281 -206820 -544822 170508 977407 1116736 849883
36329 849883 830284 1226789 1677118 1850620 1875658 2158961 2719025 2895941 2122346 860315
36319 860315 122219 25322 -326791 -1257053 -1829053 -1407990 -926667 -1500940 -2455947 -2093705
36309 -2093705 -230789 1349755 1176577 -235085 -1321252 -1238955 -311081 613947 804202
36300 804202 107152 -852019 -1197852 -697344 108672 628065 712599 541685 493248 1014263
36290 1014263 2043546 2682757 2143081 944256 339178 529760 440081 -514339 -1499106
36281 -1499106 -1618632 -1219665 -1059617 -955336 -247691 829988 1256103 608796 -434719
36272 -434719 -1036671 -1042822 -789865 -528072 -222903 259045 852605 1203296 1057430 737619
36262 737619 834631 1292409 1296784 391974 -761538 -1181378 -719608 55608 754230 1344940
36252 1344940 1707707 1657345 1326270 984838 552962 -215967 -1148525 -1744353 -1789473 -1420907
36242 -1420907 -735566 85681 407306 -337396 -1675613 -2418013 -2189311 -1887347 -2225872
36233 -2225872 -2580418 -1987599 -762947 -209086 -841753 -1752781 -1890817 -1281318 -640795
36224 -640795 -315994 -100874 181067 433212 566981 614012 517038 136471 -440977 -846773
36214 -846773 -780140 -243350 559533 1287078 1436980 684034 -600870 -1578849 -1922943 -2139799
36204 -2139799 -2606316 -2832294 -2286158 -1522559 -1627595 -2655498 -3467745 -3213936 -2187354
36195 -2187354 -1041749 -12234 676807 437656 -902420 -2379183 -2700951 -1698204 -480767
36186 -480767 -198806 -966271 -1893657 -1893395 -586991 1301066 2544365 2591986 1990282 1526822
36176 1526822 1323095 1082848 882681 1181362 2086566 2990793 3024253 1797436 -162779
36167 -162779 -1635714 -1650977 -415677 924236 1552414 1629773 1536625 1097165 71233
36158 71233 -1070103 -1586298 -1482437 -1405592 -1584516 -1506487 -753117 335426 1022337 938524
36148 938524 403338 128695 525709 1166369 1157794 257151 -716728 -893803 -369135 230469
36138 230469 706670 1109658 1000274 -130887 -1790157 -2797409 -2792830 -2520532 -2429726 -2032792
36128 -2032792 -1147059 -767452 -1778654 -3387908 -3861089 -2640627 -862771 234834 611649
36119 611649 894603 1229202 1196067 610153 -116117 -486892 -493667 -458007 -440917 -145774
36109 -145774 465342 789415 248938 -740925 -1027368 -185769 736935 455333 -799590
36100 -799590 -1405233 -350010 1459425 2303890 1711840 834050 827119 1489834 1769842 1145895
36090 1145895 40538 -882382 -1310691 -1257147 -944751 -773688 -979424 -1241862 -1032109
36081 -1032109 -419928 -66294 -244870 -362391 228484 1305799 1992109 1618792 155811
36072 155811 -1860850 -3550615 -4191645 -3822951 -3081044 -2310561 -1348745 -373028 -139207
36063 -139207 -784540 -1161155 -281597 1090360 1323797 72179 -1520984 -2528753 -2930814
36054 -2930814 -2637476 -1242509 809784 2059181 1786640 1001796 881225 1079361 605103
36045 605103 -297345 -448938 289829 673280 -18320 -851556 -685170 82192 168102 -596449
36035 -596449 -1059279 -646012 -338427 -1072074 -2014155 -1605715 9252 957360 270471
36026 270471 -758642 -576801 354184 396106 -829988 -2118212 -2521110 -2288923 -1916251
36017 -1916251 -1342520 -418090 612074 1411556 1826993 1759403 1267118 757375 523610
36008 523610 274606 -197815 -234114 778192 1978029 1892690 737444 278633 1028064
35999 1028064 1241456 -457502 -2967321 -4347992 -4257435 -3452442 -2099799 -249703 946220
35990 946220 433622 -787419 -820022 203886 338862 -905058 -1622276 -554653 854598
35981 854598 708574 -523506 -1019144 -475822 -222556 -829254 -1302364 -877726 -230482
35972 -230482 -301490 -875591 -1069381 -644955 -71998 415377 1045159 1777040 2027399 1444744
35962 1444744 550333 183366 478433 801641 677608 378882 453734 968365 1435957 1320211
35952 1320211 442899 -894629 -1959877 -1970430 -814164 624322 1188266 599555 -310287
35943 -310287 -560740 -936 717970 877059 238197 -890024 -1827192 -1861984 -792568
35934 -792568 736824 1667233 1486684 656490 -38693 -364037 -611842 -918173 -1082862
35925 -1082862 -1084450 -1237678 -1591720 -1640252 -1050263 -349144 -372946 -1177832 -1965666 -2035317
35915 -2035317 -1427061 -690133 -367193 -635432 -1148742 -1371901 -1320428 -1590776 -2230715 -2165616
35905 -2165616 -629375 1261173 1579339 150308 -1287180 -1650591 -1744213 -2316297 -2432673
35896 -2432673 -1048891 880043 1431088 366438 -707548 -680698 -86259 216111 294612
35887 294612 653334 1328897 1938583 2102538 1542616 249132 -1210694 -1975629 -1722377
35878 -1722377 -963213 -463158 -608702 -1223452 -1622409 -1040871 443986 1570066 1123559
35869 1123559 -557005 -2007800 -2492523 -2541338 -2568994 -2064024 -697422 674458 959504
35860 959504 268813 -394204 -576728 -744699 -1326531 -2080513 -2496028 -2332734 -1642517 -614692
35850 -614692 460301 1288712 1735866 1813536 1580710 1219286 1112778 1577242 2438594 3026240
35840 3026240 2709304 1472711 -27680 -1025176 -1320565 -1349693 -1516979 -1651762 -1362740
35831 -1362740 -735280 -236867 12750 342120 805556 935571 485736 -115584 -454851
35822 -454851 -787537 -1450837 -2008043 -1708780 -700907 -80533 -568635 -1617557 -2078463
35813 -2078463 -1518864 -706370 -816108 -2081205 -3231038 -2668662 -448920 1453748 1407450
35804 1407450 137271 -373481 418990 1220918 1090466 574390 296139 -117349 -871815
35795 -871815 -1083009 -210029 650401 345577 -284276 360831 1883484 2321958 1286787
35786 1286787 629616 1515086 2718486 2705054 1742869 821862 -55994 -1107887 -1508867
35777 -1508867 -546816 765052 888637 63689 -202319 380357 567049 -274125 -1247649
35768 -1247649 -1400890 -836344 -123829 271251 -152038 -1462236 -2569411 -2237861 -997965
35759 -997965 -651553 -1563793 -2009359 -861877 597454 569121 -818834 -2096785 -2474585
35750 -2474585 -2093665 -1100895 272875 1291083 1529857 1670408 2436142 3211325 2824866
35741 2824866 1354734 34294 -436437 -452149 -513441 -674748 -964503 -1469732 -1918373
35732 -1918373 -1855406 -1270199 -547483 64058 469452 531479 378367 465162 739123 369011
35722 369011 -868178 -1628731 -609406 1378478 2281459 1477048 186485 -642557 -1327793
35713 -1327793 -2148884 -2554961 -2203683 -1622227 -1304464 -1127600 -1058120 -1395465 -1882464 -1658524
35703 -1658524 -649035 42932 -233984 -671332 -372891 205862 92006 -663280 -1183217
35694 -1183217 -964068 -110399 1082558 2050337 2032607 1012467 89471 171941 810817
35685 810817 1076991 982491 1101025 1331315 1139597 663464 438081 266086 -466155 -1471807
35675 -1471807 -1799633 -1423172 -1314166 -1697789 -1564852 -464859 465868 142039 -788439
35666 -788439 -956384 -270793 236453 141992 12427 156781 108161 -487626 -1368000 -2236814
35656 -2236814 -3002214 -3203728 -2165742 -223851 1097538 880475 60000 -1790 482783
35647 482783 339633 -375788 -322554 826125 1512572 469716 -1312530 -1811302 -569584
35638 -569584 902112 1081092 1498 -1088521 -1096350 -96436 765254 495775 -556711
35629 -556711 -1158338 -888637 -617432 -985677 -1401039 -1250676 -1125346 -1723233 -2316124 -1724618
35619 -1724618 -394916 17748 -928425 -1880669 -1662753 -512613 847841 2038086 2555028
35610 2555028 1826351 331473 -487641 -89595 455472 258961 -44867 380961 1038282
35601 1038282 1043849 744757 1050004 1706650 1624631 699741 32177 287072 918830 1183307
35591 1183307 984749 480891 -307521 -1108299 -1269676 -491590 681811 1457192 1638063
35582 1638063 1622553 1762445 1980677 1949466 1466566 630221 -290224 -1075277 -1588854 -1691830
35572 -1691830 -1340696 -782221 -404668 -315274 -278451 -128628 17886 46478 45674 78224 4128
35561 4128 -303749 -746460 -1087824 -1091474 -610501 180815 722089 640921 351910 582378
35551 582378 1279383 1563709 895692 -281545 -1217557 -1579102 -1319582 -499732 443612
35542 443612 872069 745484 663943 810463 585645 -261543 -957419 -857799 -556957 -941638
35532 -941638 -1675595 -1670047 -780744 53137 355942 746366 1716287 2667251 2786789 2368232
35522 2368232 2486813 3408119 4014166 3212336 1503025 443137 586479 833100 219711
35513 219711 -577585 -433769 279563 267232 -534253 -893461 -384905 11898 -275400 -559026
35503 -559026 -424760 -603606 -1481405 -2124146 -1781228 -1115273 -905476 -770633 -303516 -161706
35493 -161706 -683802 -743267 378893 1234231 322656 -1068161 -531033 1516038 2150549
35484 2150549 278606 -1818430 -1851662 -302974 1051400 1596364 1719593 1536850 996802
35475 996802 496363 472634 818617 1155351 1203467 743073 -119662 -613914 -64732 1002035
35465 1002035 1418814 938735 178759 -758181 -2133786 -3114946 -2292872 -75143 1234744
35456 1234744 483130 -864692 -1171121 -853248 -973553 -1187342 -679934 34577 -33251
35447 -33251 -493722 -246210 521261 608077 -193701 -867890 -896979 -866777 -1205776 -1470774
35437 -1470774 -1204052 -664225 -374088 -464995 -649824 -530593 7082 454224 56015 -1103204
35427 -1103204 -1848985 -1283145 44389 918715 922076 425755 -321277 -1162194 -1507036 -930455
35417 -930455 -139114 -288093 -1326208 -2006113 -1633094 -831382 -352180 -81289 330144
35408 330144 667168 617877 508517 897228 1652249 1987767 1418832 340217 -409062 -376172
35398 -376172 166630 587920 475158 -127987 -851640 -1205218 -841363 73266 861691 1071748
35388 1071748 1062604 1352530 1566978 868031 -531458 -1329673 -995870 -582410 -954458 -1265467
35378 -1265467 -354634 1119534 1440617 446156 -170597 610549 1669377 1421822 -28814
35369 -28814 -1216158 -1206370 -394162 339402 582062 448130 133573 -298267 -736277 -859948
35359 -859948 -410888 369963 874069 817340 492646 176680 -288060 -987058 -1428934 -1067475
35349 -1067475 -111504 637022 597446 -238077 -1429680 -2184826 -1786796 -510200 310140
35340 310140 -161721 -1007803 -724351 632695 1526464 1149630 438276 534029 1181222 1283899
35330 1283899 507009 -295803 -77239 1290593 2796903 3151521 2069566 606477 -74450
35321 -74450 -25864 -137964 -759959 -1457096 -1940599 -2285655 -2240252 -1410925 -371875 -440650
35311 -440650 -1810258 -2960953 -2694898 -1799770 -1679005 -2138265 -1887151 -845750 -418445
35302 -418445 -1266176 -2150197 -1662877 -159233 922207 1075157 1027628 1212635 1053534
35293 1053534 153493 -684916 -439906 548894 901513 65061 -1019339 -1326105 -962852
35284 -962852 -539346 -165332 180332 2220 -946259 -1691219 -1044656 519862 1223360
35275 1223360 395493 -644179 -561613 213921 415902 -174159 -665319 -446195 163108
35266 163108 477984 128102 -678040 -1207339 -782526 354765 1082806 647112 -487622
35257 -487622 -1369431 -1664723 -1547500 -994467 44844 1004306 1022738 4728 -1149229
35248 -1149229 -1467039 -732271 567758 1741691 2319655 2282657 1948150 1556646 1109012
35239 1109012 678676 551805 826526 1183254 1304020 1180292 764541 -183917 -1464909
35230 -1464909 -2130344 -1447187 92967 1281769 1495326 1028629 451968 165902 288062
35221 288062 459525 115469 -585782 -705346 -34343 178415 -915171 -2008236 -1316562
35212 -1316562 532853 1218528 194528 -691941 -342102 147238 20665 486670 2250707
35203 2250707 3493344 2448010 450862 -24265 715200 342206 -1380765 -2208046 -1275276
35194 -1275276 -443382 -922972 -1193637 234381 2121483 2429006 1430167 944352 1470499
35185 1470499 1949118 1740524 1133315 327761 -509900 -570118 614857 1791689 1292263
35176 1292263 -361178 -930254 275508 1421762 971815 -258896 -798237 -750228 -1049305
35167 -1049305 -1573483 -1442906 -628575 4424 -27613 -519438 -1273270 -2137293 -2539691 -1950901
35157 -1950901 -820783 -256772 -685568 -1453370 -1783008 -1564730 -1178443 -1032402 -1286299
35148 -1286299 -1636621 -1490747 -736110 -65429 -46289 -248396 8702 438650 290452 -169003
35138 -169003 145316 1388866 2437928 2586807 2415068 2454288 2171508 1101598 -21962
35129 -21962 -314357 -137010 -298789 -494539 111065 1113462 1207838 338676 -14496 848877
35119 848877 1652299 1104159 -94480 -412276 69046 -200470 -1801032 -3379719 -3457874
35110 -3457874 -2206568 -884913 -233870 -86899 -107646 -169443 -132720 145980 533318 754670
35100 754670 832147 1019603 1273099 1166300 442930 -647439 -1651452 -2253835 -2269363 -1710382
35090 -1710382 -1058754 -1065652 -1920393 -2850156 -2872062 -1783370 -176445 1241438 1983555
35081 1983555 1752278 680879 -431230 -706820 -176314 249212 -44143 -636070 -763798
35072 -763798 -365212 -18094 -51945 -217218 -279518 -503008 -1243331 -2247748 -2729151 -2219941
35062 -2219941 -1120064 -244690 794 -193585 -490077 -701562 -720647 -542364 -399388
35053 -399388 -524554 -747435 -726284 -591176 -788544 -1163072 -922221 108208 938449 756595
35043 756595 163351 230297 844308 1015141 523848 113821 77340 -176899 -900945 -1417945
35033 -1417945 -1223316 -822248 -917352 -1414457 -1765201 -1771547 -1575278 -1303064 -1129419 -1257717
35023 -1257717 -1497173 -1334848 -749026 -397095 -614479 -833412 -505582 -26366 -87229 -531247
35013 -531247 -557740 139755 1015701 1349716 901555 29860 -608605 -706008 -727055 -1228663
35003 -1228663 -1742142 -1180471 359787 1267675 581723 -536751 -536527 178527 1748 -1304298
34993 -1304298 -2323984 -2197370 -1664882 -1635605 -1928167 -1914675 -1498134 -935838 -363804 57375
34983 57375 46779 -359396 -639429 -326648 488715 1217100 1122622 -128820 -1871179 -2734973
34973 -2734973 -2123302 -1029903 -707533 -1007591 -983977 -622545 -616115 -689409 211101 1889740
34963 1889740 2718913 2032393 1198095 1507129 2330511 2364780 1567977 738926 117650 -383417
34953 -383417 -292554 780264 2029068 2150366 979691 -452391 -1250878 -1230408 -485084
34944 -485084 682364 1535983 1442842 635879 -118128 -447979 -459528 -213235 223075 468883
34934 468883 266057 31799 358203 1139973 1740127 1777810 1246895 214357 -1015466
34925 -1015466 -1814644 -1912241 -1747018 -1578496 -898049 462045 1365287 719275 -682755
34916 -682755 -1013762 84813 1174199 1175837 563026 227298 331343 565994 544103 -259030
34906 -259030 -1947512 -3421919 -3253208 -1597055 -134174 190071 164251 620370 1064642
34897 1064642 810686 374540 670883 1512503 1921945 1549105 984023 916753 1525477 2385274
34887 2385274 2604407 1523500 -331488 -1552304 -1520634 -1120547 -1262014 -1459423 -725571
34878 -725571 672885 1396402 846601 -72225 -152140 733131 1685342 1952465 1785556 2010641
34868 2010641 2782667 3180537 2439293 1170518 605833 897652 1147790 990947 942986
34859 942986 1079230 733572 -89738 -391104 98252 225842 -696613 -1639460 -1536096 -933894
34849 -933894 -689371 -254872 1098959 2327204 1790077 -112216 -1349802 -1145681 -725764
34840 -725764 -1131640 -1870033 -2037790 -1510238 -684645 -18426 65675 -292058 -100439 1203752
34830 1203752 2461402 2060676 282792 -1088894 -1355203 -1372703 -1381631 -389471 1651813
34821 1651813 2976154 2418532 1166338 833748 1065224 521424 -669848 -1063227 -141404
34812 -141404 974345 1106112 343628 -388968 -491911 -212268 -203955 -616488 -794267 -227740
34802 -227740 482422 388549 -231043 -157924 797597 1388685 928000 386506 747379 1471253
34792 1471253 1607677 1395697 1553384 1771579 1230973 136032 -501220 -338963 83521
34783 83521 372190 544165 474365 -17917 -693014 -1256249 -1878371 -2553034 -2419251 -834385
34773 -834385 1172501 1762789 598948 -826341 -1233339 -803620 -207934 429816 1089016
34764 1089016 1328564 907289 349783 289420 613219 719426 350698 -192261 -480689 -364147
34754 -364147 -88936 -98889 -542460 -1002105 -977800 -571111 -332153 -492826 -798395 -1077953
34744 -1077953 -1433881 -1739246 -1507151 -589823 386979 686960 340546 -26937 -138964
34735 -138964 -398741 -1127472 -1838791 -1741625 -935906 -535927 -1265270 -2420859 -2842911 -2517023
34725 -2517023 -2293618 -2198966 -1271832 606698 1973635 1652944 390760 -333590 -341089
34716 -341089 -478453 -903135 -945703 -471462 -151745 -320137 -590556 -753534 -1117139 -1704468
34706 -1704468 -1903587 -1254616 -35361 1162556 1979223 2282288 2071414 1519925 805310
34697 805310 -62695 -957591 -1436314 -1294868 -1051732 -1284826 -1716491 -1606270 -857793 -58248
34687 -58248 403870 563968 417353 -11084 -269666 98361 836753 1326672 1405197 1158311
34677 1158311 368584 -877280 -1521833 -729293 585868 824490 85867 -89500 697131
34668 697131 1184797 805045 658124 1418390 2006261 1395263 294971 -123544 39243
34659 39243 120775 238799 695540 981403 606180 119038 142208 215417 -196043 -422930
34649 -422930 263534 999140 451714 -889028 -1249390 -212062 834599 943607 727549
34640 727549 914595 1194494 1048174 626460 228778 -236340 -772459 -1008242 -824082 -618136
34630 -618136 -572971 -283151 504880 1358156 1759243 1749628 1598528 1277850 666060 -56055
34620 -56055 -565008 -727847 -564064 -126657 405110 766827 889767 913250 848896 523591
34610 523591 -58108 -588164 -782271 -581691 -38630 640725 947495 476325 -354120 -506889
34600 -506889 390319 1370410 1217837 10483 -959690 -772813 143589 799317 911973
34591 911973 937889 1109223 1122049 914701 1099751 2094682 3191770 3175580 1833322 278827
34581 278827 -330059 44076 536899 384973 -376199 -920036 -393109 988052 1843183
34572 1843183 1204731 -87962 -418855 380658 985792 780951 679025 1252183 1502446
34563 1502446 520630 -742660 -644413 860451 2255890 2377936 1340959 -38916 -891981
34554 -891981 -794192 -360017 -766653 -1987881 -2375476 -958627 866016 1279124 681513
34545 681513 666816 1159413 695947 -808590 -1830856 -1813903 -1748305 -1881379 -1150710 389033
34535 389033 845330 -597840 -1984182 -1293894 701607 1847847 1573913 840655 209387
34526 209387 -333496 -411684 213316 697441 224841 -434519 -7795 1084820 1271917 324424
34516 324424 -432080 -448740 -752243 -1966530 -3069984 -2914488 -1896388 -1292668 -1628604
34507 -1628604 -2335710 -2521960 -1687710 -199130 713466 90533 -1390450 -1987037 -1169808
34498 -1169808 -388479 -950572 -2086661 -2149813 -1077695 -349519 -659594 -970931 -247698
34489 -247698 948132 1321076 647228 -116419 -225004 174469 729893 1454134 2318076
34480 2318076 2880349 2801274 2375002 2087844 1907145 1494118 912838 553267 434316 182176
34470 182176 -273155 -568887 -568217 -558402 -646802 -570840 -310049 -232430 -355477 -176616 374349
34459 374349 602187 227388 61206 668036 1147505 421442 -829388 -957236 110233
34450 110233 667910 -194734 -1319667 -1388365 -740986 -317816 81738 1125179 2193036
34441 2193036 1834767 -58646 -1838363 -2151505 -1387149 -652201 -246267 128420 328136
34432 328136 -70283 -765437 -832726 -46567 594046 86819 -1260968 -2227672 -2145334 -1478499
34422 -1478499 -1049651 -1209332 -1800866 -2409968 -2463194 -1578559 -148010 823468 818788 371467
34412 371467 141820 -57617 -623249 -984695 -154684 1526282 2339990 1369784 -191667
34403 -191667 -642777 23815 443085 -38162 -679127 -699062 -283267 72110 405507 937978
34393 937978 1378298 1189383 383437 -404478 -633819 -386319 -167535 -327648 -685520 -711096
34383 -711096 -166761 481363 528350 -76953 -625728 -562142 -156224 -5431 -165022 -176992
34373 -176992 153101 412097 98111 -719549 -1358434 -1146452 -167923 655197 486265 -399324
34363 -399324 -909600 -590269 -225740 -594003 -1208207 -1040616 -136908 424448 131877 -328842
34353 -328842 -231486 245284 578356 669781 605877 292954 -130969 -79140 670247 1389746
34343 1389746 1302663 726607 595499 1054183 1300356 801980 -58747 -698123 -1043630 -1240794
34333 -1240794 -1157622 -640078 -35991 253 -686432 -1399243 -1273995 -287891 663177 816289
34323 816289 383629 42088 -89354 -344437 -550362 -53924 1104677 1914248 1723196
34314 1723196 1081088 737202 597129 352181 316261 691464 726910 -211115 -1264394 -1114204
34304 -1114204 -70391 312789 -373592 -898640 -469867 206318 396457 427023 588057
34295 588057 264535 -883508 -1946713 -2027464 -1615363 -1640143 -1922284 -1730107 -1229778 -1072353
34285 -1072353 -981774 -188106 885554 870875 -360256 -1132990 -218963 1422864 1995254
34276 1995254 1199148 232716 -156962 -531548 -1516703 -2564964 -2561837 -1338379 27249
34267 27249 456827 -42989 -745173 -1234940 -1617699 -1882765 -1645986 -699664 526695 1264844
34257 1264844 1037471 -777 -1134776 -1582453 -1241827 -858588 -1057754 -1383304 -946979
34248 -946979 37276 269721 -802846 -2051091 -2142749 -1273239 -698120 -1027340 -1765941
34239 -1765941 -2260283 -2317237 -1954410 -1204947 -285480 430408 677968 401481 -208483 -608015
34229 -608015 -227842 746847 1342870 1015743 502095 864166 1998043 2775151 2504199
34220 2504199 1593740 824367 563832 710353 901149 746745 250110 -66205 188789
34211 188789 659985 697696 218751 -346727 -715872 -808212 -425183 406645 957095 484874
34201 484874 -602565 -1094686 -582944 78197 127222 -73140 228684 999905 1465359 992133
34191 992133 -372445 -1948661 -2810635 -2468544 -1388707 -580427 -563792 -1025321 -1461330
34182 -1461330 -1674841 -1562027 -976763 -65543 715741 1184008 1617113 2105995 2184384 1522159
34172 1522159 651574 482458 1170085 1878337 1749418 841906 -78469 -558975 -934392
34163 -934392 -1583756 -2058972 -1592228 -441922 127060 -436794 -1162387 -1129923 -912002 -1334339
34153 -1334339 -1624439 -439631 1606143 2353313 1274465 359072 1091829 2296153 2198101
34144 2198101 1181782 872324 1450388 1692974 1246158 1054932 1475644 1584663 834383
34135 834383 90554 278893 915436 845034 -72437 -847259 -775504 -279950 -183958 -573976
34125 -573976 -746675 -239300 443657 437498 -293082 -856497 -639016 -75817 142119 143473
34115 143473 530300 1218280 1388551 670435 -283931 -676867 -523826 -369969 -417760 -430251
34105 -430251 -344179 -406474 -564637 -247246 794784 1738713 1450348 -9975 -1364537
34096 -1364537 -1816903 -1939908 -2326491 -2271602 -902646 981560 1668529 997479 525869
34087 525869 1014718 1372866 760655 154493 653124 1490490 1193252 -138741 -1211534
34078 -1211534 -1594370 -1849420 -1975712 -1349569 -202782 346661 -13165 -322897 138330
34069 138330 990612 1647675 1989845 1915594 1353482 982958 1706925 3005951 3130898 1557214
34059 1557214 -51980 -167418 590842 866780 824023 1476966 2524567 2565032 1313268
34050 1313268 105079 -14421 452645 433722 -345400 -1290378 -1635675 -1049316 -34387
34041 -34387 321901 -416328 -1210766 -747265 649328 1277463 341950 -1067532 -1627078
34032 -1627078 -1385819 -1103971 -860693 -214815 739114 1346565 1247437 643911 -97310 -591367
34022 -591367 -439398 319831 935100 698632 -145331 -774467 -871259 -687481 -227290 742099
34012 742099 1797836 1933468 903430 -308629 -858817 -1097787 -1567121 -1714023 -715077
34003 -715077 820183 1285384 313337 -648069 -428808 314390 416141 123569 519312
33994 519312 1513902 1770804 719324 -530913 -725103 -24934 543068 514729 171876
33985 171876 -224097 -618974 -804211 -540259 43546 686704 1436008 2231852 2316664 1016890
33975 1016890 -816564 -1242873 357833 2217715 2364790 1197262 760443 1763515 2632815
33966 2632815 1820121 -76419 -1230265 -928989 -129572 34337 -522445 -1128388 -1228079
33957 -1228079 -756788 -47316 419787 391678 71995 -194319 -420220 -855602 -1395973 -1560640
33947 -1560640 -1210839 -868461 -1043331 -1559226 -1828063 -1511133 -662128 399497 1003679
33938 1003679 412096 -1163824 -2200092 -1413613 431395 1278260 482055 -351628 269851
33929 269851 1644965 2134905 1625065 1337653 1576453 1262356 -31692 -1037322 -554274
33920 -554274 766976 1351253 723624 -369569 -1362461 -2258436 -2792170 -2400452 -1297823
33911 -1297823 -592911 -795194 -940018 91336 1837564 2661864 1802786 286784 -422623
33902 -422623 -157036 -10419 -816841 -2131555 -2805672 -2245916 -859399 574799 1596126
33893 1596126 2062813 1859447 995104 -87995 -686065 -477571 154699 544060 373528
33884 373528 -163373 -667844 -841254 -568609 73406 772371 1050971 615265 -250512 -802167
33874 -802167 -603667 -128470 -269294 -1186602 -2036600 -2075228 -1637390 -1578337 -2025931 -2319689
33864 -2319689 -2157896 -2101434 -2602269 -3036701 -2312248 -384603 1345067 1462065 196592
33855 196592 -770946 -326849 675586 594767 -636163 -1268927 -171471 1473727 1727079
33846 1727079 441123 -854453 -1199982 -1046548 -940020 -748735 -499654 -696881 -1228270
33837 -1228270 -1064719 205042 1451365 1404585 224060 -1039249 -1732055 -1598846 -457172
33828 -457172 1071915 1391408 -169684 -1903597 -1623941 394385 1898630 1823546 1265545
33819 1265545 1208430 1079893 217406 -715627 -744864 -36568 538317 579738 191899 -511243
33809 -511243 -1264730 -1543262 -1157946 -521533 33288 604766 1068336 849187 -146465 -1099178
33799 -1099178 -1329349 -1089180 -778154 -194526 728730 1271101 917403 323798 322801 566511
33789 566511 220544 -503612 -691847 -274503 -26039 -176684 -195704 77738 225543 221517
33779 221517 484274 821906 474230 -495399 -964054 -355236 538059 866220 845549 854893
33769 854893 387166 -1032931 -2515284 -2629423 -1436655 -599919 -1213293 -2345007 -2270505
33760 -2270505 -741989 600952 182411 -1558489 -2625975 -1886662 -463145 -231432 -1323319
33751 -1323319 -1977178 -915574 1011048 1984095 1369567 140470 -418747 164788 1447257
33742 1447257 2497049 2549052 1728976 1082247 1492889 2637582 3371797 3066746 2176059
33733 2176059 1537200 1535072 1982728 2419078 2394038 1777282 961205 565593 822636 1394635
33723 1394635 1816903 1884707 1558351 848491 73259 -49332 921774 2336177 2813499
33714 2813499 1758347 185608 -453103 -44476 296969 94562 235366 1276925 2027588
33705 2027588 1028957 -1035778 -1903766 -785671 588824 471712 -706365 -1508576 -1682626
33696 -1682626 -1917903 -2200655 -1860627 -939782 -183798 230900 720403 1048019 368464
33687 368464 -1200351 -2257654 -1891989 -811415 -170800 -136598 -197546 -110855 125216 605522
33677 605522 1194284 1401196 1093594 754002 594347 191498 -434806 -334685 886684
33668 886684 1986117 1677825 634363 518450 1457208 1991851 1403395 555162 274136
33659 274136 351941 505322 943497 1446151 1193847 256408 49772 1352356 2849053
33650 2849053 2745768 1113869 -484507 -1170530 -1387276 -1649811 -1795067 -1538087 -941904
33641 -941904 -195499 530772 1000454 1122438 1132053 1152558 832951 -63337 -987571 -1154464
33631 -1154464 -595632 -78317 -125006 -653422 -1352143 -1784350 -1374094 -61980 1165530
33622 1165530 1209257 273756 -453160 -518284 -682747 -1508903 -2381746 -2372998 -1401401 -73683
33612 -73683 1096978 1857563 2024134 1614143 989516 570042 503828 680809 843527 679511
33602 679511 118911 -445727 -550929 -231035 137728 412111 645137 664956 300119 -125081
33592 -125081 -249312 -526156 -1737220 -3602721 -4822799 -4727732 -3979951 -3347467 -2741926
33583 -2741926 -1920109 -1189779 -783479 -329073 390682 872275 755401 540096 709607
33574 709607 835919 398210 -144410 -53221 419563 458772 8890 -333016 -452357 -699831
33564 -699831 -913003 -536696 270450 678903 489968 441223 927269 1280709 790535 -195705
33554 -195705 -695584 -254481 681877 1306778 1130392 338141 -374319 -503232 -311175 -478546
33544 -478546 -1202584 -1935876 -2031505 -1358039 -257436 798997 1416819 1367604 640070 -554084
33534 -554084 -1754520 -2326262 -1903056 -855537 25649 422616 655024 883822 809753
33525 809753 429035 311371 629919 715942 274548 207679 1237800 2455864 2523339 1811565
33515 1811565 1860809 2905721 3498019 2719114 1263576 -28273 -1219823 -2217879 -2073593
33506 -2073593 -383473 1604556 2391047 2077267 1823284 1996143 1917317 1192925 320880
33497 320880 -41917 250983 897163 1380807 1242617 583476 174769 606290 1465822 1855142
33487 1855142 1589776 1320717 1494218 1808729 1874795 1856727 2063933 2248702 1843522 877475
33477 877475 176096 393599 1143809 1481749 1103383 574324 365871 280631 79692 46602
33467 46602 432965 871860 975623 1063074 1532776 1917949 1522817 748276 662373 1269280
33457 1269280 1409394 621437 -121652 -62838 112724 -453404 -1234094 -1121471 -220947 317089
33447 317089 59342 -196680 185052 631343 123194 -1441695 -3059805 -3664800 -3101481
33438 -3101481 -2047428 -1164674 -571457 -145095 81727 166061 526436 1391077 2193918
33429 2193918 2200290 1596107 1163876 962565 342852 -594192 -735588 330567 1429468
33420 1429468 1439751 932747 1166525 2094003 2542416 2087496 1587110 1748603 2104161 1797919
33410 1797919 842722 131401 303954 881372 742594 -461315 -1684324 -1693645 -636125
33401 -636125 288621 538331 623934 750256 300306 -832623 -1554266 -1001177 235246
33392 235246 1078434 1280184 1005240 127441 -1063207 -1443480 -544290 421980 275919
33383 275919 -320280 -226207 4148 -794462 -1928666 -1732078 -544658 -335601 -1303325
33374 -1303325 -1467142 -207580 436241 -829009 -2283330 -2013881 -932640 -882019 -1358331
33365 -1358331 -596968 1052228 1435000 28535 -1305812 -1274705 -810746 -1141187 -1881663
33356 -1881663 -1992395 -1458005 -1036646 -1062216 -1299532 -1499177 -1470698 -1007031 -277129 27589
33346 27589 -565741 -1616048 -2187317 -1824675 -854345 120658 745968 1007966 1035361 921757
33336 921757 789327 948496 1659684 2547737 2676673 1702409 614294 586785 1246553 1032495
33326 1032495 -543722 -1997543 -1801611 -412778 459064 95842 -658069 -859070 -538572
33317 -538572 -187687 44510 282793 528978 649091 488191 -123254 -1150918 -2080486
33308 -2080486 -2295825 -1859163 -1427773 -1226591 -743519 158121 536182 -403571 -1796945
33299 -1796945 -1887237 -333083 1218069 1199205 -39075 -981172 -864743 -123626 614406
33290 614406 1053571 893166 -52721 -1142665 -1168903 87615 1166360 597247 -1017104
33281 -1017104 -1518401 81796 2260452 2862287 1668144 324193 65506 468978 561088
33272 561088 244472 65766 115182 -101457 -773094 -1325404 -1034588 121433 1356902
33263 1356902 1784257 1207127 191646 -630133 -1086289 -1130261 -446413 934427 1893237
33254 1893237 1147188 -897505 -2275261 -1907024 -875790 -607311 -932944 -1016034 -1101182
33245 -1101182 -1812798 -2489752 -2032992 -1034010 -1139896 -2348152 -2931966 -2338751 -2088677
33236 -2088677 -3074378 -3968833 -3470016 -2364237 -1884034 -1493607 -61693 1826713 2595152
33227 2595152 2109509 1676421 1940373 2299550 2216062 1756624 1007981 204273 191563 1444987
33217 1444987 2818957 2673848 1180486 98981 246724 660678 461902 16285 -244601
33208 -244601 -737295 -1708782 -2446315 -2355319 -1969165 -2063830 -2427206 -2295161 -1558353 -857069
33198 -857069 -746806 -1227694 -1852978 -2005791 -1361610 -311911 338547 212844 -366067
33189 -366067 -885243 -1028858 -685883 -85614 216902 43536 20654 613726 1123810 641939
33179 641939 -333693 -517669 92527 274079 -219745 -202244 788175 1596863 1461551 1237086
33169 1237086 1587522 1571835 415607 -702661 -288450 1110267 1888684 1836636 1777296
33160 1777296 1512456 259907 -1185169 -981682 843392 2078956 1490193 411333 328256
33151 328256 611945 -43808 -1244470 -1535550 -727558 -101418 -525611 -1569114 -2441666
33142 -2441666 -2775224 -2361942 -1059739 674571 1820918 1822413 1215087 898262 1093945
33133 1093945 1390477 1529720 1609050 1555342 1021783 97916 -382547 187889 1174916 1382167
33123 1382167 735339 424910 1009418 1258440 -233172 -2784258 -4119386 -3129294 -1098338
33114 -1098338 129761 254390 187583 438085 769609 1034111 1277199 1071926 -193628
33105 -193628 -2073755 -3049476 -2345899 -1066732 -785234 -1521167 -1969794 -1398602 -340712
33096 -340712 484118 914430 913238 412905 -119248 41837 615653 369553 -947980 -1822237
33086 -1822237 -1072943 248496 345009 -678913 -1185855 -643513 -237883 -771849 -1490321
33077 -1490321 -1458162 -895878 -555581 -654187 -949315 -1218041 -1312647 -1266817 -1394207 -1667288
33067 -1667288 -1255341 317659 1825060 1548206 -193498 -1327665 -1033541 -646849 -1070856
33058 -1070856 -1311282 -619152 -134542 -857386 -1621299 -924618 499032 889920 227216
33049 227216 -246282 -445585 -1183920 -2001817 -1600189 -376691 -240596 -1559730 -2399730
33040 -2399730 -1455533 126712 725144 424192 168792 53029 -338360 -755294 -589205
33031 -589205 105802 705194 798171 394790 -217184 -441658 289264 1753275 2940688
33022 2940688 3086876 2296646 1107831 81260 -142143 747524 2016718 2422702 1748561
33013 1748561 990483 798351 752754 564527 801322 1680581 2211691 1554990 442479
33004 442479 169562 763275 1246704 1278408 1362179 1631606 1573913 1030233 502221 271673
32994 271673 27236 -380795 -533393 -152321 338380 375408 8865 -284992 -261435 9496
32984 9496 525764 1364562 2284625 2700045 2257307 1242262 222193 -542552 -1084171 -1308148
32974 -1308148 -1012342 -324369 290196 519240 324661 -370711 -1473653 -2144391 -1355349
32965 -1355349 547347 1768810 1252780 74796 -233065 176006 240767 69595 539647
32956 539647 1267819 925037 -396657 -1085171 -653960 -517603 -1348336 -1598789 -1434
32947 -1434 2027871 2215681 691575 -330944 319636 1532407 1717181 604268 -858252
32938 -858252 -1538024 -1002332 31354 275207 -593362 -1337731 -686449 1021143 2420097
32929 2420097 2829525 2496351 1612698 219156 -1072245 -1352322 -546870 497176 1104072
32920 1104072 1267490 1115983 659517 145021 -23314 138789 212480 3905 -331328 -749771
32910 -749771 -1367988 -2047078 -2431845 -2442217 -2322914 -2207007 -1966421 -1463223 -732818 -55231
32900 -55231 83907 -484985 -1038773 -591469 662967 1439776 1306765 1367406 2222890 2591295
32890 2591295 1305236 -485025 -880531 -136011 55068 -416600 -133681 922074 1079963
32881 1079963 49926 -256918 1049412 2132507 1367618 -52985 -226473 439584 396399
32872 396399 -102944 442121 1905144 2508213 1654542 797371 1100944 1832454 1694675
32863 1694675 598157 -537414 -970861 -612746 157508 783652 959091 855843 674791
32854 674791 218720 -589176 -1106673 -674572 274304 681891 380154 218346 607406 912317
32844 912317 591400 51682 -113156 -32033 -146060 -410065 -473797 -322761 -236379 -324275
32834 -324275 -511184 -808045 -1222343 -1498960 -1289617 -606054 90869 320560 71199 -145458
32824 -145458 213118 1107632 1890856 1982602 1420710 643141 11729 -224164 124435 826888
32814 826888 1138809 644065 -45394 -82897 344626 370768 -52242 -66540 501838 585962
32804 585962 -545744 -2096395 -2829557 -2549945 -1705839 -325943 1531401 2836525 2467079
32795 2467079 926821 -94836 -34380 -87905 -1114609 -2112602 -1656473 -32951 1123073
32786 1123073 954001 153043 -293326 -229810 -27246 100016 71517 -299343 -1053691 -1767979
32776 -1767979 -1849483 -1148612 -85092 837661 1510663 2179472 3001860 3729292 3887707
32767 3887707 3258043 2077515 755546 -437042 -1322251 -1714057 -1603844 -1259670 -856781
32758 -856781 -221905 644598 1028261 197512 -1306262 -1886219 -804842 778916 1260854
32749 1260854 531961 -255681 -417571 -278076 -146613 181459 662819 661736 -107623 -898854
32739 -898854 -770312 219238 1102390 1096325 321023 -373402 -139281 1003763 1904457 1297544
32729 1297544 -719126 -2670588 -3358415 -2969510 -2291488 -1598327 -901756 -604257 -1002453
32720 -1002453 -1501183 -1184117 -17704 1179397 1752946 1579977 771929 -226430 -589625
32711 -589625 -37021 522001 220050 -316219 11601 701159 302667 -890215 -836762 979966
32701 979966 2319633 1428115 -248968 -260054 1298854 2364634 2112243 1470889 933019
32692 933019 68107 -747506 -263864 1433919 2481363 1832057 787771 956223 1968123
32683 1968123 2398746 1986240 1629782 1729678 1728862 1093476 -151590 -1677682 -2880543 -2896077
32673 -2896077 -1426020 521606 1465615 1068101 331294 201929 622126 1059840 1334664
32664 1334664 1583186 1796859 1759842 1314024 493997 -488278 -1236856 -1248567 -259362 1321801
32654 1321801 2465372 2394595 1557297 1297084 2143780 2871260 2030943 162417 -640345
32645 -640345 460966 1847746 1619549 -93862 -1827853 -2813380 -3167058 -2839202 -1849210
32636 -1849210 -1197368 -1951608 -3357984 -3355921 -1366418 759108 1178678 285940 -301630
$$ [...]
##END NTUPLES=NMR SPECTRUM
##END=
