##TITLE=31Pdec_MTBDP0807-1217
 CDCl3, 24 sc
 9.07.2021
##JCAMPDX= 6.0         $$ Bruker NMR JCAMP-DX V2.0
##DATA TYPE= NMR SPECTRUM
##DATA CLASS= NTUPLES
##ORIGIN= UXNMR, Bruker Analytische Messtechnik GmbH
##OWNER= root
$$ XWIN-NMR		Version 3.5
$$ Fri Jul  9 09:24:00 2021 Russian Standard Time (UT+4h)  she@DPX200
##.OBSERVE FREQUENCY= 81.013821
##.OBSERVE NUCLEUS= ^31P
##.ACQUISITION MODE= SIMULTANEOUS
##.ACQUISITION SCHEME= undefined
##.AVERAGES= 24
##.DIGITISER RES= 16
##SPECTROMETER/DATA SYSTEM= spect
##.PULSE SEQUENCE= zgpg30
##.SOLVENT NAME= DMSO
##.SHIFT REFERENCE= (INTERNAL, DMSO, 0, 248.564)
##AUDIT TRAIL= $$ (NUMBER, WHEN, WHO, WHERE, WHAT)
$$ ##TITLE= Audit trail, XWIN-NMR		Version 3.5
$$ ##JCAMPDX= 5.01
$$ ##ORIGIN= Bruker BioSpin GmbH
$$ ##OWNER= she
$$ F:/spectra/data/she/nmr/P31/1/pdata/1/auditp.txt
$$ ##AUDIT TRAIL=  $$ (NUMBER, WHEN, WHO, WHERE, WHAT)
(   1,<2021-07-09 09:22:17.31 +0400>,<she>,<DPX200>,
      <created by zg, POWCHK disabled, PULCHK disabled
       configuration hash MD5:
       00 E9 B6 7A A2 85 ED C7 34 08 36 98 17 FE 4E 26
       data hash MD5: 32K
       0B BA 08 FA E6 D2 FA A9 C1 E3 E4 F8 BF AC DE 5E>)
(   2,<2021-07-09 09:22:19.65 +0400>,<she>,<DPX200>,
      <Start of raw data processing
       efp BC_mod = 2 LB = 1 FT_mod = 6 PKNL = 1 PHC0 = -8971.896 PHC1 = 2875.275 SI = 64K 
       data hash MD5: 64K
       70 4D 5E 4B D3 B2 12 AD 16 0A C7 C9 21 DB 83 97>)
(   3,<2021-07-09 09:22:50.43 +0400>,<she>,<DPX200>,
      <pk PHC0 = 33.89264 PHC1 = 21.2 
       data hash MD5: 64K
       02 0A C2 BC E7 99 D7 32 8C 81 FC 61 9A 27 C0 40>)
(   4,<2021-07-09 09:22:53.34 +0400>,<she>,<DPX200>,
      <abs ABSG = 5 
       data hash MD5: 64K
       B0 77 E6 E4 B9 4D 96 92 4D 2A F7 D3 A2 BD 33 AD>)
(   5,<2021-07-09 09:23:21.59 +0400>,<she>,<DPX200>,
      <pk PHC0 = 21.22405 PHC1 = -23.6 
       data hash MD5: 64K
       60 16 AA 81 B7 0A A1 DC 2E 0F 46 33 33 5C 5B 18>)
(   6,<2021-07-09 09:23:25.29 +0400>,<she>,<DPX200>,
      <abs ABSG = 5 
       data hash MD5: 64K
       C0 40 81 BE B9 E6 4A 65 50 EF 76 0D FC 5E 9B 81>)
$$ ##END=
$$ 
$$ hash MD5
$$ 50 74 26 B4 6C ED 7E 43 9F E4 A5 58 93 13 49 F9
##$RELAX= 
##$RELAX= 
##$RELAX= 
##$RELAX= 
##$RELAX= 
##$RELAX= 
##$RELAX= 
##$RELAX= 
$$ Bruker specific parameters
$$ --------------------------
##$DU= <F:/spectra>
##$EXPNO= 1
##$NAME= <P31>
##$PROCNO= 1
##$TYPE= <nmr>
##$USER= <she>
##$AMP= (0..31)
100 100 100 100 100 100 100 100 100 100 100 100 100 100 100 100 100 100 
100 100 100 100 100 100 100 100 100 100 100 100 100 100 
##$AQSEQ= 0
##$AQ_mod= 1
##$AUNM= <au_zg>
##$AUTOPOS= <>
##$BF1= 81.014009
##$BF2= 200.13
##$BF3= 200.13
##$BF4= 200.13
##$BF5= 200.13
##$BF6= 200.13
##$BF7= 200.13
##$BF8= 200.13
##$BYTORDA= 1
##$CFDGTYP= 0
##$CFRGTYP= 5
##$CHEMSTR= <none>
##$CNST= (0..31)
1 1 145 1 1 1 1 1 1 1 1 1 1 1 1 1 1 1 1 1 1 1 1 1 1 1 1 1 1 1 1 1 
##$CPDPRG= <waltz16>
##$CPDPRG1= <>
##$CPDPRG2= <waltz16>
##$CPDPRG3= <>
##$CPDPRG4= <mlev>
##$CPDPRG5= <mlev>
$$ [...]
##$SUBNAM3= <"">
##$SUBNAM4= <"">
##$SUBNAM5= <"">
##$SUBNAM6= <"">
##$SUBNAM7= <"">
##$SUBNAM8= <"">
##$SUBNAM9= <"">
##$SW= 501.771253377433
##$SWIBOX= (0..15)
0 1 3 0 0 0 0 0 0 0 0 0 0 0 0 0 
##$SW_h= 40650.406504065
##$TD= 32768
##$TD0= 1
##$TE= 0
##$TE2= 300
##$TE3= 300
##$TEG= 300
##$TL= (0..7)
0 120 53 12 22 120 120 120 
##$TP= (0..7)
150 150 150 150 150 150 150 150 
##$TP07= 0
##$TPNAME0= <>
##$TPNAME1= <>
##$TPNAME2= <>
##$TPNAME3= <>
##$TPNAME4= <>
##$TPNAME5= <>
##$TPNAME6= <>
##$TPNAME7= <>
##$TPOAL= (0..7)
0.5 0.5 0.5 0.5 0.5 0.5 0.5 0.5 
##$TPOFFS= (0..7)
0 0 0 0 0 0 0 0 
##$TUNHIN= 0
##$TUNHOUT= 0
##$TUNXOUT= 0
##$USERA1= <user>
##$USERA2= <user>
##$USERA3= <user>
##$USERA4= <user>
##$USERA5= <user>
##$V9= 5
##$VALIST= <valist>
##$VCLIST= <CCCCCCCCCCCCCCC>
##$VD= 0
##$VDLIST= <DDDDDDDDDDDDDDD>
##$VPLIST= <PPPPPPPPPPPPPPP>
##$VTLIST= <TTTTTTTTTTTTTTT>
##$WBST= 1024
##$WBSW= 4
##$XGAIN= (0..3)
0 0 0 0 
##$XL= 0
##$YL= 0
##$YMAX_a= 3498
##$YMIN_a= -4209
##$ZGOPTNS= <>
##$ZL1= 120
##$ZL2= 120
##$ZL3= 120
##$ZL4= 120
##$ABSF1= 248.5645
##$ABSF2= -253.2056
##$ABSG= 5
##$ABSL= 3
##$ALPHA= 0
##$AQORDER= 0
##$ASSFAC= 0
##$ASSFACI= 0
##$ASSFACX= 0
##$ASSWID= 0
##$AUNMP= <proc_1d>
##$AZFE= 0.1
##$AZFW= 0.5
##$BCFW= 0
##$BC_mod= 2
##$BYTORDP= 0
##$COROFFS= 0
##$CY= -3
##$DATMOD= 1
##$DC= 0
##$DFILT= <>
##$DTYPP= 0
##$F1P= 0
##$F2P= 0
##$FCOR= 1
##$FTSIZE= 65536
##$FT_mod= 6
##$GAMMA= 0
##$GB= 0
##$INTBC= 1
##$INTSCL= 5.30512e-09
##$ISEN= 30
##$LB= 1
##$LEV0= 0
##$LPBIN= 0
##$MAXI= 10000
##$MC2= 0
##$MEAN= 0
##$ME_mod= 0
##$MI= 50
##$NCOEF= 0
##$NC_proc= -8
##$NLEV= 6
##$NOISF1= 182.463
##$NOISF2= 159.3651
##$NSP= 0
##$NTH_PI= 0
##$NZP= 0
##$OFFSET= 248.5645
##$PC= 4
##$PHC0= -8916.78
##$PHC1= 2872.875
##$PH_mod= 1
##$PKNL= yes
##$PPARMOD= 0
##$PSCAL= 0
##$PSIGN= 0
##$REVERSE= no
##$SF= 81.014009
##$SI= 65536
##$SIGF1= 159.3651
##$SIGF2= -187.1042
##$SINO= 113.3802
##$SIOLD= 16384
##$SREGLST= <1H.CDCl3>
##$SSB= 0
##$STSI= 65536
##$STSR= 0
##$SW_p= 40650.406504065
##$SYMM= 0
##$S_DEV= 0
##$TDeff= 32768
##$TDoff= 0
##$TI= <>
##$TILT= no
##$TM1= 0
##$TM2= 0
##$TOPLEV= 0
##$USERP1= <user>
##$USERP2= <user>
##$USERP3= <user>
##$USERP4= <user>
##$USERP5= <user>
##$WDW= 1
##$XDIM= 65536
##$YMAX_p= 438375167
##$YMIN_p= -36957689
$$ End of Bruker specific parameters
$$ ---------------------------------
##NTUPLES= NMR SPECTRUM
##VAR_NAME=  FREQUENCY,     SPECTRUM/REAL,   SPECTRUM/IMAG
##SYMBOL=    X,             R,               I
##VAR_TYPE=  INDEPENDENT,   DEPENDENT,       DEPENDENT
##VAR_FORM=  AFFN,          ASDF,            ASDF
##VAR_DIM=   65536,         65536,           65536
##UNITS=     HZ,            ARBITRARY UNITS, ARBITRARY UNITS
##FACTOR=    0.620285442955139, 1,           1
##FIRST=     20137.2065510759, 0,            0
##LAST=      -20513.1999529892, 0,           0
##MIN=       -20513.1999529892, -36957689,   0
##MAX=       20137.2065510759, 438375167,    0
$$ Real data points
##PAGE= N=1
##DATA TABLE= (X++(R..R)), XYDATA
$$ [...]
15124 -10735560 -10775924 -7914817 -4896366 -4803658 -6216869 -5088150 -906596 2487101 2479715
15115 2479715 678795 -588863 -1399097 -1970911 -326312 4634498 9424559 9005046 3484285
15106 3484285 -1353260 -1178019 1710995 2051784 -1295473 -4340643 -3475758 520359 4551210
15097 4551210 7052147 8198763 7814149 5443580 2185346 135679 -490188 -1695726
15089 -1695726 -4237654 -5721067 -3777038 304046 3270201 4397936 5651413 7280264
15081 7280264 6261283 912880 -4977472 -5515961 111433 6440477 8400563 6807992
15073 6807992 5624869 5919774 5538653 3847601 3110863 4441661 5703035 5104175 4039524
15064 4039524 4130544 4032293 2026890 -425090 -1066970 -901984 -2091345 -3471123 -2619066
15055 -2619066 -1045484 -1940918 -3403129 -357948 6035411 8025469 2979276 -1481967
15047 -1481967 1365203 7034783 6785478 508875 -4187856 -3115768 1027248 4776726
15039 4776726 6911957 6009288 1478367 -2593376 -694580 5835923 9184529 5233429
15031 5233429 -1638869 -5669070 -6552870 -6528717 -5280078 -1677770 2308417 3290720 727982
15022 727982 -2998306 -5457930 -5233939 -1788080 3514300 7295902 6971911 3241559 -951726
15013 -951726 -2956780 -1626319 2185678 5594101 5958905 4023317 3039819 4153279 4787070
15004 4787070 2534446 -1465081 -4086693 -3251383 1231781 7396487 10883844 7958331
14996 7958331 347701 -5555564 -5935572 -3274660 -1185826 1038422 5724565 11461873
14988 11461873 14337505 13282912 10908206 9583957 9184940 8263864 5699897 1894650
14980 1894650 -681017 129167 2316566 1281550 -2894927 -3659041 2986592 11325455
14972 11325455 12899550 8024732 4299559 4984590 5599813 2510688 -1657578 -3273576
14964 -3273576 -2888022 -2289859 -881723 1632231 2536287 -155567 -3697617 -3978798 -1358394
14955 -1358394 125281 -1464954 -3820034 -3891001 -1547188 453305 -719612 -4858366
14947 -4858366 -8208637 -7270825 -3363754 -1516863 -4190467 -8406293 -10249783 -9570909
14939 -9570909 -8192680 -5928142 -1435390 4234935 7885269 7666174 4472947 581689
14931 581689 -1509015 -240863 2871668 3717687 829757 -1305200 2318800 9311279
14923 9311279 11699879 6260746 -1037977 -2700164 1513303 5965411 6837395 5323167
14915 5323167 4212076 4217240 4032837 2404891 -372071 -2550918 -2770277 -2009657 -2661383
14906 -2661383 -4985385 -5924783 -2963336 1992743 4780837 4530233 4321282 5707253 5554702
14897 5554702 802953 -5462192 -6483418 -719549 5434568 5992948 3429523 4493377
14889 4493377 9607461 11822071 7268848 1293646 796726 4541830 5968740 3210772
14881 3210772 647369 1118598 2234115 1352627 -731706 -2840704 -5820725 -9631723
14873 -9631723 -11741589 -10829396 -8747707 -6656923 -3149603 1089874 1461876 -3342526
14865 -3342526 -6663710 -2457749 4569540 4689260 -2399016 -6828265 -3050735 2763595
14857 2763595 2841445 -1344808 -3170795 -1178669 342688 -1073731 -3009654 -2459491 253686
14848 253686 2354945 1686949 -1179350 -3252775 -2283577 184154 521931 -2064754 -4729670
14839 -4729670 -5493938 -5324039 -4576469 -1197866 5084301 10222935 10790667 8774718 8049971
14830 8049971 8561337 7819849 5968378 4923536 3922927 575346 -4258678 -6998836
14822 -6998836 -6512732 -4594960 -1526183 4164755 10919490 13875594 11100907 6318138
14814 6318138 3645193 3102656 3203449 4337304 6729872 7883449 5432717 1042761
14806 1042761 -1342380 -194406 2772519 5383357 6538250 5966930 4593422 4481390
14798 4481390 6467771 8442199 7897444 5583501 4367150 4722491 4073445 1333971 -582728
14789 -582728 1215210 4843677 5724306 2947893 508175 1365905 3206505 2227588 -1209582
14780 -1209582 -3904370 -5234442 -7116016 -8932640 -7289233 -2071484 1780711 956691
14772 956691 -1724240 -2440027 -2149739 -3409313 -4864644 -3760322 -1449967 -1192952 -2154309
14763 -2154309 -972673 1757199 2097359 -465208 -2164949 -971514 1503172 4100592
14755 4100592 6981813 8442353 6528051 4130409 6290887 11542837 12535244 6947123
14747 6947123 1016306 -166378 1117190 1887851 4110650 9029681 12481606 11422986
14739 11422986 9407917 9842558 9467156 5052199 1062504 2857455 6814151 5932355
14731 5932355 1894689 2078049 6434121 7323206 2581550 -829300 1705480 5692857
14723 5692857 5617138 3032905 2490552 4269115 5207443 3749852 1157767 -473340 -5954
14714 -5954 1296754 277130 -3899229 -7269895 -6191611 -3184237 -3035334 -4883812 -4240585
14705 -4240585 -1602254 -1584154 -3523054 -1393303 5135741 8138913 3547560 -2043124
14697 -2043124 -1652460 1834280 1623285 -2330869 -5000582 -4446205 -2257470 730903 3540502
14688 3540502 3133721 -991439 -3409499 259053 5974295 6969169 3839308 2001552
14680 2001552 1682663 -1160540 -4912243 -2621087 6022963 11623860 8012956 1484776
14672 1484776 1773411 8490387 12613149 9285486 3372096 1992184 5713084 9002757
14664 9002757 7455101 2382924 -1859049 -3424876 -3955819 -4329177 -2430826 2970938
14656 2970938 8528150 9584974 5930739 1257080 -2096427 -4457405 -5727682 -5147256
14648 -5147256 -4256338 -5797291 -8726112 -8507500 -3995263 85252 -20334 -1512591 363366
14639 363366 5071447 8046962 7273001 4527786 1168260 -3045700 -6878556 -7466044 -4509291
14630 -4509291 -1440069 -636355 -104293 2681765 5658121 4322910 -1316972 -5433394
14622 -5433394 -3517737 1619093 3529804 549128 -2634161 -1911357 1109195 2535694
14614 2535694 1905828 1530385 1882088 1293485 -152648 -107289 1945886 3277344 1947058
14605 1947058 -483937 -1903881 -2699599 -3753023 -3872855 -2097353 -655194 -2181844
14597 -2181844 -5070494 -5297713 -2576885 -851680 -2111670 -3547456 -2411253 -284403
14589 -284403 -108207 -1688320 -3064251 -4330343 -6789186 -9472584 -9875879 -7802957 -5478427
14580 -5478427 -3954065 -2398866 -1094241 -1855585 -4555161 -6205630 -4922218 -2335234
14572 -2335234 -730609 -328685 -914533 -3351600 -7217752 -9441074 -8000327 -4926565
14564 -4926565 -2896361 -1057868 2390475 5527681 4887569 1186824 -1518810 -1869714
14556 -1869714 -1905078 -1930112 258040 4172661 5743697 3527523 1259404 1782793 2744896
14547 2744896 1434540 -122994 1050337 3155036 2310276 -929011 -2339307 -429698
14539 -429698 2100505 3105343 3440906 4216888 4659788 3640910 1402523 -792054 -1547449
14530 -1547449 -183659 2125498 3025656 2267155 2748135 5970126 8153949 4485138 -3333122
14521 -3333122 -7697155 -4094032 3639645 8332473 7264204 3355543 473495 -375811
14513 -375811 -656747 -1605330 -2538435 -1849585 752244 3869293 6169260 7066939 5641301
14504 5641301 1389481 -2995710 -2786814 2448773 6611403 4614248 -286197 -1100288
14496 -1100288 2665440 4731970 1777769 -2019327 -1590495 2361446 5538221 5666069
14488 5666069 3782003 2186354 2716475 5228933 6949855 5302760 1633382 -420138
14480 -420138 -266111 -658081 -2307959 -2396591 166556 2262132 1643043 590124 1530101
14471 1530101 2487230 537723 -2892123 -4094022 -2600050 -873103 178914 1619297
14463 1619297 3141177 2957239 1100695 -172824 306266 1286196 1466125 1118651 758894
14454 758894 -80034 -1843044 -3717021 -4280798 -3233386 -2028955 -2329749 -3655911 -3480833
14445 -3480833 -614501 2660245 3687772 3490426 4738899 6450630 4938580 503595
14437 503595 -1673881 649318 2740583 46635 -4622441 -5558914 -2918011 -1838205
14429 -1838205 -4204445 -6392484 -5233734 -1912312 897999 2435697 3237406 3498767
14421 3498767 3236490 2772387 2391702 2136906 1883345 1372382 931464 2061146 5515035
14412 5515035 8873837 8996037 7299326 8498238 12680244 13703659 8503268 2678931
14404 2678931 2109508 4015015 2727409 113916 2167949 7662550 9065096 4404735
14396 4404735 -201580 -700624 225768 277238 1469654 4222570 4787452 2103306 624823
14387 624823 2399828 2706626 -1661641 -5639264 -3207435 3079976 5943656 3508739
14379 3508739 -44689 -1430635 -638766 1550230 3608721 2656808 -1751977 -5109659
14371 -5109659 -3470263 572392 1772741 -176591 -1737260 -1924990 -2141713 -1515149 1457514
14362 1457514 3797996 1179506 -4102083 -5068221 -569104 3058723 2369490 1618130 4058080
14353 4058080 5338771 762530 -6058922 -7917541 -4151466 -147033 1158707 1249950
14345 1249950 536722 -2791139 -7589881 -9006871 -5111282 -29264 2114816 2688005
14337 2688005 4741680 6938184 5782717 2167079 574948 1822731 1679237 -1866531
14329 -1866531 -4844548 -3800304 -1857070 -3777537 -7858444 -8296585 -4408565 -1580676
14321 -1580676 -2644839 -4065890 -2508576 47150 664528 430558 1373606 2068122 613761
14312 613761 -746151 1360583 5533237 7303597 5776701 4115099 3772123 2807183 698884
14303 698884 745965 5583799 12570082 15617685 11164191 2007736 -4458770 -2837179 4354934
14294 4354934 8742578 5620460 -434194 -1797996 2400351 6213833 5329251 1570180
14286 1570180 -826037 240319 4159177 8340466 9108144 4765032 -1759969 -5630206
14278 -5630206 -5319666 -2895464 -208681 1938970 1957049 -931878 -3617493 -2098434 2354315
14269 2354315 4551141 3087234 1687992 2274786 2335110 813354 860778 3962853 6557183
14260 6557183 5928647 4861209 6642949 9529495 10170724 8936359 7785422 6114176
14252 6114176 2786125 -704486 -2928385 -5126003 -7211006 -5139113 2582208 9471666
14244 9471666 8581436 2799438 653172 3470545 4372095 -78323 -5035811 -5850481 -4300836
14235 -4300836 -3252845 -1024884 4576884 10596261 11836836 7507897 1680880 -1635146
14227 -1635146 -1618922 -111771 214009 -1736677 -3765477 -2602813 1173155 2613713 -1408171
14218 -1408171 -7322986 -8643408 -3814148 2118251 3897490 2164053 1822042 5029196
14210 5029196 7898918 5541808 -1014350 -5898227 -6482563 -6654539 -10049526 -13620379
14202 -13620379 -11702473 -4139131 4005193 9444507 12783112 14418036 13449858 11058763
14194 11058763 10002997 9517243 5385103 -2924410 -9471684 -9008099 -3695883 171964
14186 171964 -339286 -3266200 -5649348 -6330728 -5993865 -6145253 -7207124 -7343817 -5195382
14177 -5195382 -3532888 -6386984 -11824378 -12570339 -6396045 -890686 -3405684 -10192099
14169 -10192099 -11470390 -5240970 363486 -1394710 -7648357 -11010377 -8739199 -4251657
14161 -4251657 -1813290 -2215439 -3160573 -2532445 -823284 -25766 -388511 91591 2235083
14152 2235083 3863574 3103544 1421905 960851 810260 -870190 -2554361 -1116120 2738061
14143 2738061 4923630 4028810 2834830 3013584 2494337 -95248 -2193112 -1286584 782763
14134 782763 753594 -811655 -726176 1379580 2320671 187820 -2976559 -4083166 -2371959
14125 -2371959 1013462 4815859 7597000 7466212 4017565 65346 -676842 1863363
14117 1863363 3583042 1269542 -3082526 -4646762 -1837276 1938923 2811044 848782
14109 848782 -1090385 -1530878 -1710659 -3032636 -4659464 -4366224 -1483215 1602830 1509146
14100 1509146 -2283493 -6259168 -6409145 -2570037 1777068 3598739 2812305 1094170
14092 1094170 128144 1094681 3742446 5539894 4030577 634053 -633236 682670
14084 682670 -57673 -5567716 -11253676 -10698193 -4584696 293620 320221 -1146198 66589
14075 66589 3089716 4324383 2774508 617521 -33880 1221018 3928231 7393369 10334985
14066 10334985 11171949 9396800 6515601 5038672 5976472 7545253 7206125 4860900
14058 4860900 2696802 1830512 1135730 20748 -204694 703653 276804 -2789133 -5497290
14049 -5497290 -4714298 -2633871 -3925122 -8376675 -10901333 -8917092 -5297781 -3181906
14041 -3181906 -2082627 -638453 637345 1351270 2630934 4390573 4256252 1518382
14033 1518382 -776430 -283102 889448 -48325 -1548371 -196927 3498601 5737512
14025 5737512 4985755 3117430 1353652 -1030334 -3457250 -3302863 -1212 3023499
14017 3023499 2646387 219952 -826441 -144880 -517890 -3035683 -4888525 -3085096 1267057
14008 1267057 4111144 3377689 1122822 390525 1309738 1425233 -655516 -3181793 -3118200
13999 -3118200 403228 4775929 6207271 3585059 -219549 -1691703 -936766 -959411 -2665868
13990 -2665868 -3243756 -899163 1536937 464493 -3072938 -5256334 -5297524 -5242747 -4686588
13981 -4686588 -640943 6400843 10948664 9314221 4348745 963095 92278 -108122
13973 -108122 48453 1361293 2869147 2960047 2450029 3455707 5649505 6387582 4513128
13964 4513128 1744465 97925 -287496 -465932 -972065 -920335 1497229 6686700 11385872
13955 11385872 10612811 3392400 -5109144 -9082473 -8234800 -6300264 -5037012 -3004251
13947 -3004251 120166 1589038 -635905 -4125952 -3802961 2509145 10819561 13876828
13939 13876828 8473182 -209102 -3573563 354268 4496156 2105445 -4349248 -7089915
13931 -7089915 -3744171 414367 566540 -1893442 -2964620 -1837696 -901030 -1909143
13923 -1909143 -3996644 -4708406 -2329528 1991738 4640910 3513383 1109280 1435406
13915 1435406 4172232 5030302 2373731 -141458 634046 2189504 129476 -4961554
13907 -4961554 -8163366 -7194049 -5227060 -5956464 -8582061 -9429076 -7019223 -3514794 -1430100
13898 -1430100 -589757 1019234 4234446 7468961 8458733 6758518 4239886 3117070
13890 3117070 3553784 3516528 1322483 -2114017 -4559637 -5673010 -6989179 -8136259 -5802253
13881 -5802253 1147985 7733862 7830509 2232311 -2329884 -2141949 56243 1345448 3101371
13872 3101371 6589097 8780207 6676621 2581071 688406 619999 -1403746 -6451887
13864 -6451887 -11822297 -14839799 -14221750 -9242383 -1455307 4097135 3549840 -799210
13856 -799210 -3888138 -4800370 -5981752 -7286848 -6305860 -3733672 -2454973 -1490632 2782246
13847 2782246 8868985 10482556 6304000 2535993 2941432 3192174 -632002 -4237919
13839 -4237919 -1701195 4710388 7699430 5165496 1361861 -394137 -674977 -556276
13831 -556276 -205585 -567752 -2397073 -3858036 -2610395 158158 1146672 -145242 -1262364
13822 -1262364 -1008606 -363530 398736 1857614 2729883 699814 -3418751 -5578658 -3451988
13813 -3451988 1083974 4873806 6210929 4348083 -421465 -5126576 -5720525 -2041708
13805 -2041708 1457710 1770635 1409181 3773199 6803090 5240753 -1317156 -6659606
13797 -6659606 -5523446 69789 4159297 4383781 3243431 2879262 2231535 148642 -1855682
13788 -1855682 -1956739 -999142 -911021 -1788530 -2852139 -4675236 -7670176 -9753864 -8785021
13779 -8785021 -6258006 -5000392 -4259888 -1486163 1704909 932444 -2970365 -3415953 2297175
13770 2297175 8405488 8906105 5181671 1522498 -1891923 -6311228 -8880649 -6136724
13762 -6136724 -695145 1611537 3156 -1309046 -471422 186241 -668589 -1566869 -1837420
13753 -1837420 -2336200 -2244594 380274 4281332 5444363 2643266 -1241006 -3988560 -6251270
13744 -6251270 -8349794 -8798504 -7069669 -4440183 -1492399 1671942 2564199 -1723254
13736 -1723254 -8635174 -11112719 -6577554 -647683 712417 -1254994 -1661600 277098
13728 277098 1070344 -1247174 -4673544 -6045668 -4165352 -689757 1050936 -661915
13720 -661915 -3299581 -2843388 223514 750071 -3730163 -8722785 -8418465 -3007563 2632053
13711 2632053 5560530 6852448 8268036 10008268 11459090 11763669 9794962 5404939
13703 5404939 517508 -2492451 -3261097 -3202674 -3398223 -3832004 -4185913 -4359266 -4491862
13694 -4491862 -4888245 -5328252 -4569480 -1961390 409646 -721422 -5395936 -9623101 -9960179
13685 -9960179 -7009257 -3453038 -904512 -111964 -1921029 -5781276 -8765659 -8211477
13677 -8211477 -4590268 -442744 2529289 4242787 5336835 6503518 7541856 6596126
13669 6596126 2126967 -3876319 -7031247 -5740199 -2628081 77943 3270320 7443262
13661 7443262 10189637 10053380 9707350 11857303 14540398 14189852 11299399 9163867 8563369
13652 8563369 7628872 5896189 4642156 3851456 2431631 962772 855549 1233235 35903
13643 35903 -2080569 -2312888 -78961 2355718 3513616 3807962 3144189 822750 -1935680
13634 -1935680 -2729241 -1794908 -1970304 -4187401 -6014526 -5459572 -3286455 -638298 2679718
13625 2679718 6204039 7699612 5702750 1437231 -2834496 -5656916 -6062926 -3785967
13617 -3785967 -830435 -532195 -3539442 -6454561 -5909543 -2626021 -171165 -779499 -3393102
13608 -3393102 -4901944 -2706855 2862637 8110825 8998283 5139635 64516 -2478647
13600 -2478647 -1571993 1020302 2565511 1304499 -1666142 -2846710 -423190 2772099
13592 2772099 2664232 -372316 -2167821 -844191 1250528 2252618 3729007 7143684
13584 7143684 10309245 9857563 5777778 1577607 593969 2995728 5746548 5523329 2740158
13575 2740158 1887070 5836750 10905546 10924841 5699188 1125418 453598 313886 -2690184
13566 -2690184 -6112244 -5608259 -1276645 3320413 5743219 5183439 1233028 -4197328
13558 -4197328 -6131865 -1857271 4482959 6566483 4097130 2384821 4329312 6966870
13550 6966870 6516852 3367385 706682 406133 1499955 1645850 -427896 -3429413 -4931632
13541 -4931632 -4748778 -5313939 -7536480 -8548148 -5976703 -2379544 -1911169 -3820589 -3397756
13532 -3397756 697206 4236147 3663307 931963 88240 1639909 2779981 1722652
13524 1722652 -599748 -2707150 -4395360 -5858082 -6178040 -3928047 545033 4446703
13516 4446703 5260542 3646458 2026646 645805 -2327184 -6254875 -7073809 -3148944
13508 -3148944 990882 369470 -3065337 -3110334 1612771 5895152 5532396 2228972 -371693
13499 -371693 -1542152 -2180720 -1994410 -873424 -743440 -2793022 -4189127 -1048821 5335447
13490 5335447 8478825 4339412 -3181072 -6630089 -3954977 -278324 -349605 -2513349
13482 -2513349 -2734259 -1909708 -4321540 -9336697 -10455600 -4690936 2323968 4304190
13474 4304190 2939619 3511112 5440167 3755767 -1645316 -5145327 -4091191 -2028106
13466 -2028106 -1867824 -1511120 1373600 4917512 6193011 5245120 3614849 1926541 870577
13457 870577 1503307 2826599 2155594 -631078 -2525119 -2249736 -1734473 -1525667 364327
13448 364327 3099846 2180894 -2843850 -5604490 -2318537 1532091 -404405 -5214042
13440 -5214042 -5805473 -2242848 -377601 -1740120 -2617700 -1753797 -1286876 -766049 2188995
13431 2188995 5563757 4968924 1993331 2365394 5275856 3758768 -2369370 -4063120
13423 -4063120 2073878 6198753 -477924 -11745506 -15315076 -9896404 -4072947 -1928151
13415 -1928151 386592 4949630 8035280 6824202 3212261 -380076 -3364514 -4275050
13407 -4275050 -1251897 3491414 4836987 2004923 -66962 1678223 4026657 3029209
13399 3029209 -160737 -1866982 -1124626 652550 2893997 5818525 8466367 9126614
13391 9126614 7320519 4407338 2799151 4366637 8097239 9919332 7300588 3430435
13383 3430435 3495859 7164943 9131627 7483291 6194818 7540229 7761053 3927474 26299
13374 26299 1037374 4615942 4536909 178829 -3389814 -3654665 -3031056 -3048606 -1982747
13365 -1982747 473131 1318981 -706414 -2224654 -61608 3957811 5766612 4490353
13357 4490353 2525008 1572171 1038271 -134635 -1856888 -3100525 -2782477 -579425 2594933
13348 2594933 5079738 5637060 4110492 1424176 -666069 -762015 306895 -79398 -2674323
13339 -2674323 -4549885 -3084282 -460061 -1110199 -5221268 -8254500 -7259478 -4241884
13331 -4241884 -2248853 -1339614 -160173 1089457 1304833 348859 -1308201 -3305560 -4596423
13322 -4596423 -3653949 -648807 2177793 3205039 2770555 1377458 -903062 -2511074
13314 -2511074 -1094474 2312654 3085477 -745503 -5084241 -5295110 -2244833 256771
13306 256771 1160952 1538788 836711 -1626490 -3228136 -1144974 2037347 1007691 -4051448
13297 -4051448 -7099563 -4873663 -949373 362719 -434838 -862318 -755130 -775147 46999
13288 46999 1958591 2231344 -1155368 -5248258 -5118805 -373201 4520557 6197288 5774896
13279 5774896 5897904 6963111 7471729 6608627 5129581 4107397 3558633 2458438 182947
13270 182947 -2152266 -2551745 -868768 217092 -1742427 -5260127 -5966908 -1997558 3098757
13261 3098757 4293138 1264547 -1261315 331455 4087060 5632023 4187959 2943580
13253 2943580 4031036 6087294 7311214 8037269 8862712 8754654 7042739 5315818 5200969
13244 5200969 5999750 6633449 7854978 9788279 9428368 4450977 -1749836 -3098852 1340333
13235 1340333 6499780 8207484 6917672 4360197 1014054 -1885703 -2089305 65346
13227 65346 1399464 876001 1014854 2602009 2566752 34299 -190156 5306844 11667061
13218 11667061 11504961 5407610 961500 2084291 4927299 4922950 2826379 1959919 3288675
13209 3288675 5479424 7212017 7303694 4424098 -1195263 -6683836 -8783939 -7021471
13201 -7021471 -3949738 -2369348 -2487495 -1860961 1364433 5274005 5872136 2693425 408125
13192 408125 2609381 5994479 4249481 -3069396 -9489587 -9944954 -6422801 -3732206
13184 -3732206 -2841316 -1233991 1734055 2975188 -288894 -6145661 -8958249 -5270115
13176 -5270115 1632987 4565123 581003 -5528267 -7578563 -5795308 -5154404 -7422408
13168 -7422408 -9347828 -8790087 -7686512 -7335781 -5518808 -1337421 1258068 -889312
13160 -889312 -4003475 -2126924 3526681 5693073 1778536 -2055315 374070 6828971
13152 6828971 10249639 7988394 3763748 1772638 2461695 4055230 5170255 5041630
13144 5041630 3448731 1714067 2134585 4912186 6830816 4833500 416864 -1520349
13136 -1520349 1461381 6297375 8080823 5492619 1366966 -1269853 -2070836 -2297649
13128 -2297649 -2354015 -1258620 1776569 5824249 8635847 8825586 7441711 6561068 6332246
13119 6332246 4859641 1673213 -568914 390831 2801628 3538511 3276063 5361942 9469193
13110 9469193 10622140 6241822 287564 -2499856 -3158535 -5352923 -8240233 -7729997
13102 -7729997 -3997871 -2091834 -4061265 -5677823 -3364685 120367 479911 -1169595
13094 -1169595 -664451 2021754 2961733 1074044 -92352 1807966 4395899 4505920 2313735
13085 2313735 -475956 -3660061 -7159607 -8878981 -7130503 -4038981 -3359403 -5134738
13077 -5134738 -5410023 -1766408 3355155 6080540 6070371 6275647 8319781 9826991 7122662
13068 7122662 144646 -6314298 -7008491 -1669622 4820707 7649572 6256426 3071550
13060 3071550 -76928 -2851523 -4973953 -5947908 -5996737 -5789357 -5347447 -4416568 -3583649
13051 -3583649 -3633050 -3968912 -3097165 -737623 1721697 2915615 2669065 1604097 479738
13042 479738 -339163 -1426547 -3525687 -5487048 -4530775 -172400 3745653 3287753 -658682
13033 -658682 -4301469 -6185698 -7063295 -6104611 -2157560 1572811 -241157 -6836854 -10690996
13024 -10690996 -7359683 -1109690 2150249 2572385 2877503 1798921 -3049755 -8482308
13016 -8482308 -8393484 -2578519 2597162 2738048 -87821 -2220623 -3259359 -4106196 -3759325
13007 -3759325 -1012148 2388252 3089716 575605 -1615252 -185913 3039242 2499226
12999 2499226 -3601215 -9182366 -7030011 1196719 6401695 4178713 -76216 -697152
12991 -697152 -327112 -3870513 -8945489 -9544953 -6223286 -4700055 -5418693 -2660181 5097747
12982 5097747 11592743 12049920 9654459 9426920 10751401 9691938 5009776 -1280083
12974 -1280083 -6294828 -6995075 -2085616 4426509 5359891 -1103676 -8441285 -10090499
12966 -10090499 -7025310 -3965612 -2243576 -928675 -1455603 -5328266 -9083249 -7485672
12958 -7485672 -1560683 1743770 -1253983 -6338764 -7339968 -3431602 1163812 2462854
12950 2462854 111038 -3086637 -3804821 -1166686 2295666 3198396 932481 -1782977
12942 -1782977 -1677118 2298352 8186134 11998453 10339311 3634638 -3548699 -6826029
12934 -6826029 -6524086 -6611086 -9228779 -11905750 -10896380 -6140040 -1545896 -360494 -1551571
12925 -1551571 -1958529 -1343194 -2948395 -8092653 -12660899 -11645747 -5923945 -1383397
12917 -1383397 -1660381 -4841208 -7397734 -8031998 -6959623 -4724114 -2976440 -3515926 -5354882
12908 -5354882 -5629568 -4337755 -4434327 -5759297 -3542627 3816203 9730710 6998735 -2294865
12899 -2294865 -9562975 -10820363 -9641026 -9373909 -8020125 -2844787 3767165 6173944
12891 6173944 2117554 -4329817 -6615646 -2338609 4056033 6048006 2626150 -747360
12883 -747360 389150 3654201 3750017 25402 -3256916 -3128122 -870878 1092322 2062247
12874 2062247 2274603 1865234 1455304 1746720 1756924 -718487 -5823735 -10186881 -10126608
12865 -10126608 -5929807 -1867710 -1595937 -4128979 -5431322 -4031275 -3059546 -5146839
12857 -5146839 -7481077 -5455499 -163170 2390862 -3621 -2719752 -1578173 1683604
12849 1683604 3895818 5693834 8395862 9586552 6447369 745101 -3769270 -6397017
12841 -6397017 -7860629 -6668966 -2068602 2038531 1784463 -30221 1987186 6478215
12833 6478215 6646365 774683 -5027351 -5682274 -3149235 -1906138 -3082967 -4908076
12825 -4908076 -5367383 -3167691 829493 2814250 125935 -4084246 -4486459 -1599114
12817 -1599114 -1087359 -4667576 -7384602 -5494662 -1626402 333541 659542 1130229 1097727
12808 1097727 -369742 -1418207 280082 3959885 6675766 6353680 3020851 -1076614
12800 -1076614 -2340336 629373 4455738 5071758 3727828 4563858 6728399 4838909
12792 4838909 -1850111 -7185905 -7383592 -6417842 -8635145 -11468715 -10066286 -5043848
12784 -5043848 -1002386 -184467 -1381424 -2640345 -2119849 961315 3856277 2322231
12776 2322231 -2477047 -3536401 2285685 8802435 8897894 3958238 59769 -1141004
12768 -1141004 -2021470 -2791543 -1811659 37 719526 1618134 4497507 6703666 4512068
12759 4512068 7336 -1453295 221772 114545 -3006255 -4708460 -2785751 -1031787
12751 -1031787 -2581650 -4486767 -2575040 1524312 2187483 -2601244 -8764867 -11560231
12743 -11560231 -11134331 -10915586 -11335783 -8270309 332076 8992675 10288837 4973869
12735 4973869 1141289 2756129 5044867 3345673 162525 -436850 371633 -15700 -26858
12726 -26858 2224833 3805653 1633303 -1598654 -2184438 -2087894 -4326850 -5909340 -3063685
12717 -3063685 350471 -1524980 -5665267 -4729604 -254526 -414761 -5449749 -6936908
12709 -6936908 -2537533 354074 -1565261 -1621283 4310433 10089384 10134825 8445763 9901581
12700 9901581 11092621 7680946 3642609 4676136 8160847 8129327 5434194 4477606 3867824
12691 3867824 -805439 -7622987 -10345403 -8096555 -5248009 -3223520 -344204 1354082
12683 1354082 -2270420 -8772898 -10281603 -4908797 303429 -77716 -3226500 -4694650
12675 -4694650 -5207606 -6827617 -7593948 -4884197 -789405 425903 -1738257 -4371426
12667 -4371426 -6037159 -7887421 -10491385 -12347670 -11727398 -8410219 -3626862 696477
12659 696477 2866068 2373942 -73972 -3339599 -6007594 -6282429 -3389735 784391 3138830
12650 3138830 2808393 1526938 335266 -1737925 -4753806 -6163346 -4113957 -640374
12642 -640374 1021833 1170575 2736082 6052967 7961125 7041350 6391987 8711705 11112019
12633 11112019 8634357 2038267 -2320364 -1329429 396605 -2455206 -7858885 -9637121
12625 -9637121 -6618327 -3444420 -2516996 -616767 4681618 9992855 10878268 8343966
12617 8343966 6684665 6912792 6540597 5043572 5189911 8104437 10367070 7881551 932851
12608 932851 -6083182 -9045385 -7299590 -3346943 -404382 9429 -1131845 -1663156 -332342
12599 -332342 2248523 4361381 4695510 3457012 2190036 2133483 2685022 2181239 418836
12590 418836 -605916 755020 3309981 4303688 3060620 2192490 4540754 9403183 12773487
12581 12773487 11801711 8294735 6538084 7828495 9059560 7390319 4060720 1849129
12573 1849129 940092 78386 -11469 1887772 3746646 2620361 467827 2292963 7390143
12564 7390143 8313685 1660493 -5475885 -4731106 1795374 5056057 2098482 -1016549
12556 -1016549 711796 4415067 4603230 681493 -3541366 -4940284 -3051762 1018982
12548 1018982 5057133 6130979 2871807 -2591573 -6272645 -6024294 -2958244 543400
12540 543400 3221431 4996780 5485144 3823273 509472 -1763960 -777949 1928564 2320000
12531 2320000 -1042171 -4859734 -5048548 -1469729 2426625 3598407 1925472 -393273
12523 -393273 -909068 1072213 4057686 6459766 8571752 10762402 10544330 4978599 -3480771
12514 -3480771 -7789478 -5111696 -918949 -1181089 -4139989 -4158645 -739178 1765636 1788011
12505 1788011 1979484 3203786 2876506 463181 -529055 1744429 3957516 2550202 -1016527
12496 -1016527 -2857607 -2188890 -1324578 -1647119 -2367059 -2671024 -2755958 -2599910 -1295910
12487 -1295910 1763507 5522889 7548123 6142561 2504365 156473 1386363 4661012
12479 4661012 6352888 4405412 -486201 -6122541 -9824273 -9545606 -6033508 -2898915
12471 -2898915 -2338135 -1820956 2302118 8809799 12501179 10784779 6003500 1123515
12463 1123515 -3207636 -6556145 -7458317 -6129500 -5523034 -7561444 -10236373 -10076888 -5907423
12454 -5907423 794137 7236172 10089296 7440097 1534963 -2538668 -2484106 -1165614
12446 -1165614 -1901636 -3626779 -2860573 1144532 5501022 7163363 5709984 3151235
12438 3151235 1771275 1520756 -319546 -5252718 -9776945 -8595566 -2213935 2347554
12430 2347554 277114 -5027222 -7325861 -5730613 -3908836 -3491229 -2733354 -946322
12422 -946322 -49587 -1119319 -2432175 -1974114 -29511 1483690 1136551 -796524 -2499084
12413 -2499084 -2280981 -691909 -128996 -1603111 -3166811 -2631666 -417395 1647760 2839548
12404 2839548 3243556 2531329 1006946 524572 2251976 4570277 5021411 3104978 -448937
12395 -448937 -5088055 -8748737 -7266357 679358 9545382 12203902 8760580 5864583
12387 5864583 7162144 8907588 6252356 -88368 -5548655 -7291114 -6042087 -4310617
12379 -4310617 -4368798 -6503359 -8288172 -7045232 -3361264 -213696 1403752 3140039
12371 3140039 5204485 5260087 2875279 1469879 3336095 5815662 5513376 3656450 3512386
12362 3512386 4512557 3514731 1152656 1966901 7114025 11137316 8546481 1057741
12354 1057741 -4533459 -4418010 -1037964 1374379 1867633 2231028 3004275 2254108 -1183664
12345 -1183664 -4766128 -4399017 250126 4190864 2276210 -4583447 -9910448 -8658531
12337 -8658531 -2473105 2765083 3561071 1587960 363577 1113338 2687729 3992090
12329 3992090 4798261 4788003 3654980 2285044 2255460 3740970 5255729 5850640 6114550
12320 6114550 6571540 6808863 6812352 7109250 6672562 3299775 -2179015 -4939123 -2301657
12311 -2301657 1668838 1510865 -1704744 -2538775 -48869 1245540 -496978 -1450904 768405
12302 768405 2726646 1308338 -600754 967925 4094434 3908763 154532 -3100204
12294 -3100204 -3911064 -4050665 -5007787 -6525346 -8330358 -9297665 -5992007 3095047 12380750
12285 12380750 13805362 7300779 1280115 1344539 4110054 4646250 4110805 5503134 6641224
12276 6641224 3568882 -1517820 -2171045 2782290 7162473 5943362 1416889 -922952
12268 -922952 725938 3901733 5893289 6043991 5234857 4775553 5137544 4837180 1638708
12259 1638708 -4005789 -7877639 -6155458 -309101 4021792 3511834 920508 1091494
12251 1091494 4214219 5303867 837550 -6258466 -10032637 -8573950 -5222461 -3306889
12243 -3306889 -2666992 -1938623 -1275096 -1148619 -775926 271515 728530 -110583 -568771
12234 -568771 891877 3208184 5120486 7725335 11295743 11852209 5759443 -3307031
12226 -3307031 -7518432 -5390090 -3571341 -6633831 -10649022 -9953504 -5379011 -1459507
12218 -1459507 816091 3475138 6177367 6458686 4290361 1944646 -36236 -2571574
12210 -2571574 -4269760 -2413639 1986963 4394636 2919197 427102 -726809 -2208599
12202 -2208599 -5922625 -9986780 -11113046 -8879380 -5413086 -2547378 -1100936 -1169840
12194 -1169840 -1345042 504039 3840411 4898783 1656144 -2772566 -4353517 -3641123
12186 -3641123 -3710555 -4452762 -3343074 -1052784 -1211631 -3954848 -4788903 -1911230 43159
12177 43159 -3030269 -7834873 -8358504 -4928666 -3262894 -5374777 -6979503 -4850057 -1756142
12168 -1756142 -1728936 -4203153 -5803850 -5221640 -3326555 -605789 2415988 3926280 3144642
12159 3144642 2401131 3585658 4068342 347291 -5177290 -6160655 -1467542 2881909 2689872
12150 2689872 1379525 3420855 6207695 3564645 -4499525 -10488514 -8207176 229108
12142 229108 6790591 5298347 -3107554 -11010890 -11664894 -5630734 579455 2613715
12134 2613715 2282182 2497946 2331529 233732 -1511304 -271733 1416858 -973460 -6654699
12125 -6654699 -10536666 -10594351 -8928969 -6269022 -1526970 3025224 2736397 -1800417 -4309433
12116 -4309433 -2084984 471155 172904 247405 3061757 4070369 -942625 -7487232 -8195974
12107 -8195974 -3841837 -1455037 -3238903 -4389104 -1660873 2243776 3706546 2546710
12099 2546710 310065 -1715642 -2111141 -627936 -40416 -2822662 -6083948 -4440980
12091 -4440980 1589213 5127196 2400124 -2089163 -2278956 1629774 4989257 5092203
12083 5092203 2647543 -689555 -3272725 -3573350 -1697409 442643 1786177 2970693
12075 2970693 3486825 1192933 -3227985 -4814514 -731777 4729900 5690834 2984529
12067 2984529 2103857 4293233 5354089 3402487 1894982 3023010 3430220 8542
12059 8542 -4184153 -4389840 -1844259 -1746804 -4609564 -5228265 -1150002 3064795 2805228
12050 2805228 567863 1938385 6680554 8700450 4733343 -1298702 -3897714 -2611132
12042 -2611132 -1091803 -1982741 -4957097 -8159520 -9377197 -6954669 -1669604 3099130
12034 3099130 4895977 4969190 5673118 6376887 4767101 1587928 621123 3172775 5526116
12025 5526116 3568773 -1959590 -6620727 -7515733 -5738039 -4143640 -4020013 -4084518 -2322466
12016 -2322466 1222659 3753933 2451328 -2259498 -6976227 -8700596 -7100368 -3844358
12008 -3844358 -1052038 -185266 -893934 -933690 1213052 3726999 3374309 40413 -3100575
11999 -3100575 -4435574 -6020736 -9338405 -11744683 -9888622 -5045615 -1985692 -2862577
11991 -2862577 -4711917 -3433258 1313579 5708405 5631807 996166 -3560103 -3172418 1706204
11982 1706204 5809645 5884434 4716032 6349179 9611303 9961234 6730196 4301792 5524525
11973 5524525 7771318 7201425 3873385 415265 -1973569 -3582463 -4014710 -2889983
11965 -2889983 -1829313 -2877839 -5159064 -5726412 -3966367 -2630692 -3721809 -5612086
11957 -5612086 -5545820 -3251577 -558298 1226498 1893819 1289556 -479545 -2244972 -2784722
11948 -2784722 -2404103 -2126918 -1651389 259460 3432761 6056573 7070553 7218620 7293693
11939 7293693 6807777 4970778 1736767 -2441002 -6391127 -7529965 -3584034 3940662
11931 3940662 10023042 11328370 9438362 7492368 5797419 3104014 381541 149847
11923 149847 2821984 6599701 10444851 14107221 15554643 12144549 5281783 418838
11915 418838 369164 1242671 -2226264 -8838367 -11634878 -6701045 1241823 3770926 -1521929
11906 -1521929 -8303331 -9287858 -4912003 -1696877 -2722152 -3745714 -246935 5775676
11898 5775676 9527021 10678018 11919887 12199191 7525636 -1308400 -7743793 -7953490
11890 -7953490 -5397304 -4660804 -5345401 -5041875 -4274841 -4718847 -5472656 -4832711 -3580450
11881 -3580450 -3246829 -3191446 -2487627 -2503092 -4304246 -5618463 -3949426 -856642 477063
11872 477063 91205 -152366 -819346 -3212518 -5032911 -2946181 1285535 2701900 1140386
11863 1140386 1613538 5732649 8504814 6007533 1349065 -100496 2413043 6003325
11855 6003325 8679027 9653555 7910300 3938025 963002 1357855 3412733 4309486 4336739
11846 4336739 5064422 5226200 2342253 -2420414 -4980675 -4048465 -2567101 -2776423 -3071372
11837 -3071372 -1200464 2003562 4074594 4438825 4398118 4408626 3431680 1123800 -932350
11828 -932350 -1084077 38572 136196 -1748433 -3841248 -3922156 -2276682 -1223548 -1920545
11819 -1920545 -2969124 -2540770 -770596 604916 225250 -1841109 -4343713 -5613269
11811 -5613269 -4670776 -2093498 604837 2582857 4003484 4754666 3965183 1258613 -2472269
11802 -2472269 -6087110 -9172166 -11571044 -12858811 -12777331 -11402120 -8665709 -4806501
11794 -4806501 -1435245 -553192 -1894181 -2845844 -1872263 -411285 -328581 -1202599 -1618657
11785 -1618657 -1662389 -2336340 -3513034 -4111345 -3596230 -2172668 -522549 -234281 -2742508
11776 -2742508 -6525149 -7522219 -4328445 -730327 -499245 -1977711 -1281174 1188594 1862479
11767 1862479 417785 84729 1631781 1976240 -397789 -3120323 -4144913 -4062496 -3169035
11758 -3169035 -779064 1264547 -411273 -4185032 -3640767 2502974 6631104 3159880
11750 3159880 -2432068 -1903451 3211566 5311127 3584341 3881922 7028370 7189573 3067912
11741 3067912 1103888 4168553 5827110 1121183 -4388039 -3207038 2078773 3297110
11733 3297110 -216833 -1316848 3122553 7746552 7294891 3568903 1432842 2021506
11725 2021506 2583286 739623 -3028164 -5877466 -4860084 58866 5129516 6352563
11717 6352563 3647795 94843 -2136042 -3073757 -3039510 -2027304 -679032 355145 1523046
11708 1523046 2773019 2155315 -1097098 -3637544 -2164260 649762 -601707 -5292317
11700 -5292317 -7193807 -4521807 -2921357 -5730037 -7864286 -4255332 1101694 1041123
11692 1041123 -3433441 -5000319 -1650630 905502 -1087041 -4103603 -3883839 -1803983
11684 -1803983 -1372251 -2323857 -2057163 -471650 510011 984721 2793280 5123725 3932271
11675 3932271 -2433641 -9182565 -9535741 -3203787 2202542 -180613 -8105937 -12988112
11667 -12988112 -10226701 -3528716 1280716 2756372 2156861 -793049 -6313069 -10938806
11659 -10938806 -10404066 -5874146 -2941928 -3889505 -5124321 -3649009 -1961372 -3760336
11651 -3760336 -7800939 -9597667 -7751005 -5093489 -3899639 -3177970 -1475902 247550
11643 247550 338869 -423509 321404 2706569 3885797 2111734 -270311 -59361 1614892
11634 1614892 504653 -3961096 -6572533 -3175016 3029243 5149850 1163669 -4381068
11626 -4381068 -6519201 -4593988 -954658 2061669 3306924 3230402 3480744 4427992 3776305
11617 3776305 107371 -3337183 -2385627 863287 -385016 -7482620 -12876868 -9878932
11609 -9878932 -1723645 3271292 2561758 588755 846759 1879309 1259695 -825955 -3223345
11600 -3223345 -5856377 -8459303 -9330327 -7055737 -2541905 1708756 3824282 3636406
11592 3636406 2163560 500436 -941071 -2143567 -2591436 -1450291 938927 2544900
11584 2544900 1377103 -2611972 -7523641 -10687357 -10005691 -5707268 -1065011 477541
11576 477541 -531469 -380571 2120160 3686618 1918856 -593513 -405343 1280075 981413
11567 981413 -1213116 -2379005 -1887218 -1130822 981428 6799869 13821700 15526660 10356391
11558 10356391 4870146 4894493 7696588 6827501 1612712 -2637572 -2209389 1373372 4627586
11549 4627586 5523983 3791448 776434 -886574 146191 1712240 729232 -2247741
11541 -2247741 -3667621 -2349461 -1337370 -3213822 -5802183 -4471109 2044782 9448186
11533 9448186 11592259 6385335 -1686110 -5539392 -2862186 1514239 2148562 329331
11525 329331 1519956 6089346 7555831 2042591 -5054653 -5880980 -648423 3483309
11517 3483309 2426329 -1261512 -4452746 -7271547 -9405163 -8136851 -3252373 422745
11509 422745 -688574 -3506836 -3434179 -1741824 -2499854 -4512869 -2931382 1716304 3143970
11500 3143970 -828116 -4789011 -4816102 -4647957 -8420324 -12662572 -11435670 -5841338 -2075089
11491 -2075089 -2084764 -2493248 -1910312 -2920793 -6174360 -8186811 -6748473 -4040489 -2505997
11482 -2505997 -1448235 288169 1573634 1080042 -399452 -1382019 -1277996 338899 3284107
11473 3284107 4732846 1039182 -6843493 -12915634 -12855736 -8321515 -3268315 384360
11465 384360 1795215 289616 -1981325 -883463 2947122 2937385 -3541423 -9189196 -6814342
11456 -6814342 -912965 -1161108 -7172054 -9248227 -3926662 1176351 230136 -2492333
11448 -2492333 -1625381 118382 -1800505 -4530705 -2463171 2761458 4556080 1775627
11440 1775627 -442848 307255 729021 -1186675 -2291550 252514 4215836 5835955
11432 5835955 4929465 3819754 3497864 3389540 3420167 4065055 5075794 5613527 5139157
11423 5139157 3595129 1749035 1638093 4838948 9522339 11355942 8744111 5095035
11415 5095035 3946825 3955523 1710473 -1899136 -2111847 2658295 7906450 8720375 5527753
11406 5527753 2030530 -304412 -2731975 -5394475 -6376070 -5008803 -3520299 -4145844
11398 -4145844 -6144496 -6914679 -5182701 -2138481 -33488 -337347 -2698895 -5171872
11390 -5171872 -5987849 -5405348 -5091694 -5567367 -5518024 -4100489 -2411731 -1674594 -1378847
11381 -1378847 -563235 303269 268470 -425120 -1327499 -3202860 -6196462 -7593752 -4343432
11372 -4343432 2338422 7753437 9428351 9267027 9462161 9413363 8212139 7276181 7992795
11363 7992795 8640413 6460227 1928509 -1563554 -2111355 -1289664 -1533398 -3274737 -5377686
11354 -5377686 -7196580 -8994779 -10465191 -9937593 -6078520 -255334 4133849 5389735
11346 5389735 5285162 5950436 6477235 4642419 811616 -2485595 -4064786 -4297983 -2703898
11337 -2703898 891586 3187621 155885 -6173885 -8536644 -3937361 2251585 4086851
11329 4086851 2237493 256359 -1441010 -3574225 -4483844 -3853053 -5850989 -12319521
11321 -12319521 -16434723 -10907226 -345184 3317107 -2435286 -7519959 -4694476 641805
11313 641805 463991 -3450475 -3703998 573488 2874754 -670563 -6158900 -7472360 -3413166
11304 -3413166 1881355 3853783 1838490 -1163225 -2452626 -2316278 -2024930 -945290
11296 -945290 1871508 4433518 3562361 -387386 -3943997 -5518135 -6424595 -7103056 -6508348
11287 -6508348 -5431455 -5757069 -5859305 -2000668 4429555 6837801 2953666 -1207070
11279 -1207070 -181783 3434892 4297601 2195495 -38070 -2180891 -4995727 -6431510
11271 -6431510 -4709885 -2441584 -2754030 -3946308 -2786224 -368506 399307 481771 2441226
11262 2441226 4883176 4887535 3883152 5140358 7202170 6021363 2220865 -89541 -482131
11253 -482131 -1625670 -2735567 -893242 1731433 -86891 -5063450 -6070941 -1583037
11245 -1583037 1939492 1205925 838763 3350976 3178888 -3529549 -10581740 -10231544 -4477371
11236 -4477371 -729534 -603161 -481525 28345 -1839608 -4889925 -4359668 246648 3659100
11227 3659100 2007281 -3170421 -8563433 -12329446 -13070515 -9881834 -4840777 -2140187
11219 -2140187 -3285195 -5529757 -5871632 -4156487 -1497846 1770583 5232743 7438249
11211 7438249 7346147 5763890 4423395 4207669 4651922 4677311 3767976 2729508 2802578
11202 2802578 3756817 3984647 2976720 1930621 931982 -1934609 -6491187 -8163311 -3523655
11193 -3523655 3556940 5909338 2687797 -41186 1076413 2014547 -1203566 -5537669
11185 -5537669 -5801071 -2913050 -1882520 -3480547 -3775077 -1668519 -909698 -3090328 -4137085
11176 -4137085 -913488 3131857 3149761 481143 110396 2511521 3418408 1093135 -1542432
11167 -1542432 -2483344 -3170896 -4127981 -3098039 162890 1841622 -103749 -2103036 -549215
11158 -549215 2392019 2718581 1278130 1746041 4073162 4915680 3417691 1963486 1844252
11149 1844252 2295085 3188823 4764455 5423794 3697673 1471295 1180833 1051314 -2062326
11140 -2062326 -6133528 -5893824 -1175388 2374296 1501379 -1182860 -2807305 -3852632
11132 -3852632 -4798655 -4344816 -2649786 -1754674 -1605963 -367079 765885 -1160807 -4014651
11123 -4014651 -1986385 4216817 6060124 -527898 -8665916 -10690207 -8167040 -6678497
11115 -6678497 -6907274 -6887945 -7664229 -10226813 -11346114 -8842693 -6882629 -9581985 -13253100
11106 -13253100 -11834777 -6620469 -3517488 -3481515 -2868476 -1020805 -259958 92470 2738500
11097 2738500 6490822 7580726 5792775 3685876 1538604 -1122940 -1464670 2592360
11089 2592360 6881997 6815180 5765253 9160000 13079494 9226127 -36443 -3247151
11081 -3247151 2669111 8010120 5891376 1042639 -823350 -1536384 -2994007 -1349097
11073 -1349097 4472468 7300853 2446450 -3640372 -3370189 96035 -569607 -4376728
11065 -4376728 -5401982 -3960165 -4545911 -5671532 -1662317 6652179 12079110 11621547
11057 11621547 8794727 5551197 212498 -5638024 -6389505 -1048693 4102377 4432492
11049 4432492 2877124 3984909 7197560 9421286 10013858 9755983 8305445 5899873
11041 5899873 4651725 5196863 4819393 1803005 -1093319 -697013 1524918 2047027 947929
11032 947929 1126176 3115550 4542335 4099643 2404321 -609709 -5162481 -8514109 -6903270
11023 -6903270 -1776633 296489 -3792361 -9056266 -9394993 -5735423 -3198337 -2961817
11015 -2961817 -2100557 -169724 -336148 -3560719 -6586563 -6942290 -5734582 -4164128 -1547884
11006 -1547884 1378388 1468146 -1977978 -5150804 -5256351 -4409615 -5036464 -5293469 -2868694
10997 -2868694 229415 1079836 961185 2387742 3842472 2478844 -441644 -2056019
10989 -2056019 -3302476 -5998633 -7074303 -2702017 3590462 4755980 1455391 1129051
10981 1129051 5481770 7690041 3966816 -789944 -2142455 -2628512 -4716112 -4974133
10973 -4974133 -945940 2854249 2264769 1099931 4411785 8903541 7913071 2680491
10965 2680491 447163 2839025 4015824 499695 -4151518 -5847113 -5340542 -4785295
10957 -4785295 -3159383 1854723 9243240 14135895 12225443 4883269 -761599 809374
10949 809374 5924850 5518996 -1968283 -6894944 -1805918 6676750 6340150 -3302420 -10537242
10940 -10537242 -8000059 -1495926 -40239 -3943632 -6902314 -5436880 -1815966 88596
10932 88596 -1655004 -6366713 -11043939 -12057312 -8304380 -2235666 2951802 6081573
10924 6081573 7441030 7136348 5349403 3294628 2585062 3714973 5597829 6448771 5179461
10915 5179461 2368878 -159773 -943078 175236 2466170 4539333 4156136 -104733
10907 -104733 -5944134 -8116664 -3882674 3725532 9571296 11573301 10541727 7371169
10899 7371169 3455379 2044061 5246163 10105996 11085706 6589944 308500 -3755727
10891 -3755727 -4764836 -3731046 -1899856 -903905 -1713588 -2768927 -1582611 1306955
10883 1306955 2447188 100375 -3647387 -6014169 -6343274 -5121362 -2745817 -386441
10875 -386441 207501 -899657 -1451547 -150284 1488677 1358066 -869941 -4293558 -7633210
10866 -7633210 -8752460 -5929317 -1067056 1045471 -1115785 -2918016 122549 5224889
10858 5224889 5686613 561254 -3714037 -2339541 1609680 2562389 525309 -259374 1274601
10849 1274601 1878155 284179 -202482 2704702 6073487 6227847 4476996 4540218 6209188
10840 6209188 5980766 3133956 449325 -1386440 -5210175 -11523349 -15524513 -12961399
10832 -12961399 -6084187 -792478 218241 -1063806 -1613000 -46193 2996697 5089239
10824 5089239 3956408 785925 -344659 1756033 2662798 -1735385 -8668595 -11461621
10816 -11461621 -7943559 -2412567 166989 -1336726 -5126493 -8589640 -9345528 -6947959
10808 -6947959 -3808523 -2339293 -1770104 -376663 251859 -2796002 -7621679 -8195805 -2869691
10799 -2869691 2023554 76604 -6708771 -10829673 -8637661 -2985783 2303178 6169096
10791 6169096 8000794 5984187 464706 -3764500 -2107191 3834883 8130472 8083229
10783 8083229 6518524 6216097 6134751 4905401 3986498 4159079 2519002 -2590295 -6591818
10774 -6591818 -4251659 1646062 3718478 1365063 1378448 6288421 9939800 7733824
10766 7733824 3947623 3941487 5156157 2052992 -4363397 -8542408 -9115995 -9386690 -10822860
10757 -10822860 -11800864 -11778674 -11527928 -9952772 -5570087 -761352 11154 -3754766 -8107135
10748 -8107135 -9823869 -8559901 -4709367 709409 4413177 3302034 -1081422 -3811497
10740 -3811497 -2359257 1596732 5328961 6928708 5172115 1204309 -623193 2480500
10732 2480500 6995291 7130857 2635178 -1857019 -4149592 -5724899 -6148777 -2671282
10724 -2671282 3286543 5321194 515830 -5979246 -7857883 -5229384 -2089080 296679
10716 296679 3426683 6935701 8060088 5821547 3088445 3456319 6945122 9635249
10708 9635249 7965283 3046884 -553715 -487963 1066767 1741834 2632885 5047900 6397879
10699 6397879 3410926 -2083880 -4977665 -3963106 -2638762 -3542504 -5095629 -5060055 -3439834
10690 -3439834 -1033968 1848213 4303358 5059597 4524604 4311483 4277409 2399966 -1794789
10681 -1794789 -5740774 -6470418 -3490767 916384 3126768 650591 -5323144 -10594409
10673 -10594409 -12306686 -11345747 -9560520 -7191359 -4777855 -4455807 -6540948 -7744000
10665 -7744000 -5996228 -4061941 -4648827 -5084093 -1581225 3626798 4570667 -325747 -6703160
10656 -6703160 -9681239 -7444624 -1450147 3727722 3611508 73599 294740 5827657
10648 5827657 8531252 2990319 -3721110 -2932274 1227801 -861549 -7252031 -7475186
10640 -7475186 -611342 3195206 -62263 -2620767 644986 4260837 3197671 1352454
10632 1352454 3268360 6000894 5221835 2590370 1561670 1480211 617055 337013 2269733
10623 2269733 5215366 7389491 8002671 5787774 729589 -2795594 -633996 3709472
10615 3709472 3374816 -557360 -652629 3829493 5322077 938320 -3061836 -2487369 -969734
10606 -969734 -1196651 -266844 2332561 1923539 -1840147 -2414658 1938080 3818070 -601470
10597 -601470 -4525861 -2349896 1261881 938117 -220658 1564647 2947952 1449851
10589 1449851 2367241 8870496 13454765 8960779 1131630 335353 6506679 11642461
10581 11642461 12182980 10116203 6551328 2558699 1808054 4592828 4245871 -2736756
10573 -2736756 -8569634 -4737936 4550738 8636058 5658460 2218310 1534738 1415259
10565 1415259 1403021 2882564 3624899 257411 -4869251 -6099746 -2695483 1058862 2407480
10556 2407480 1688600 -671198 -3898790 -5424352 -3644933 -318422 2267679 3694964
10548 3694964 3554267 1403713 -433185 626796 1778227 -1472747 -6196952 -5663135
10540 -5663135 -2036288 -4111802 -11326852 -13242978 -7471545 -3465014 -4433645 -1601589
10532 -1601589 7343032 11017395 4207183 -1638695 1880062 6012879 2006821 -3406161
10524 -3406161 -2353570 -535804 -4356686 -7909643 -5852447 -4413562 -6937676 -4899201
10516 -4899201 3505473 4245504 -8204692 -17145134 -10846323 -2497832 -4689090 -6770898
10508 -6770898 1211258 6132816 -2372067 -8515445 301629 7016546 -2300508 -7931470
10500 -7931470 6591513 18389486 7032600 -1394444 18320853 34937779 14242293
10493 14242293 -7926358 16395354 50013701 32525159 19781237 131304850 337988545
10486 337988545 438375167 313900745 95828109 -12315502 11912289 41350087
10480 41350087 14009850 -13707563 -1726465 12363666 -335896 -11419542 -160193
10473 -160193 8062673 -3471595 -10477559 2823587 13332870 4080984 -5270884 1992690
10465 1992690 9249255 512717 -9981253 -6375217 842663 -1641878 -5194453 443184
10457 443184 5858137 1274936 -4093705 -636068 3289432 -1206655 -6201315 -3259239
10449 -3259239 521693 -1846411 -2681525 4156791 9104325 4214935 -1126658 2739989
10441 2739989 7826878 3430571 -4509259 -4938374 -754046 -860050 -3600594 -2874324 -1287682
10432 -1287682 -3100295 -2947975 4491774 11651517 8651874 -167502 -3491647 -830255
10424 -830255 -303689 -3527791 -5049819 -3632056 -3175092 -4483967 -5020359 -4863384 -5682087
10415 -5682087 -6134257 -4219739 -1305922 923678 3549777 6243163 5063162 -1170922
10407 -1170922 -7570100 -10226632 -10757026 -10333800 -6422306 263381 3361677 596730
10399 596730 -1733988 607795 2667921 -168619 -3659783 -2733625 -356412 -738289 -824850
10390 -824850 3183333 7168229 5614680 1574716 1639602 5253681 7038848 6061327 5221219
10381 5221219 4592992 2410562 36772 -180723 549093 162656 -198048 521961 -125721
10372 -125721 -3426963 -5791553 -4773187 -4099267 -7006594 -9190592 -4924752 3435810
10364 3435810 8553893 7977581 5114619 2832771 1549018 1783081 3909768 6695291
10356 6695291 8984488 10620782 10091055 5464397 -487803 -1789873 1474013 2053933
10348 2053933 -2632655 -5105759 225858 7109643 6907354 2078259 1731733 7547140
10340 7547140 12269456 10228353 2827211 -4869766 -8087886 -5092144 -9736 191484
10332 191484 -5057513 -8257128 -5069033 -1150632 -2678386 -6679426 -7630267 -7368111 -9996749
10323 -9996749 -12160335 -8027310 -591949 1630721 -2619992 -6720676 -7111900 -6384634
10315 -6384634 -5900761 -3552971 362395 2054413 339584 -1586723 -1336763 132206
10307 132206 1229229 928700 -2149286 -7773101 -11968284 -10706558 -4873471 1554258
10299 1554258 6375144 8920558 7749096 2871918 -2003851 -3521948 -2748597 -1936085
10291 -1936085 -663016 1155822 792634 -2207556 -3158517 357417 3361146 1834044
10283 1834044 548049 4889470 10213267 8597020 2019913 -1238443 -231124 -839284
10275 -839284 -3802314 -4271890 -2354625 -2960700 -5086104 -2501942 3805291 5339080 630357
10266 630357 -1283417 4097699 8889931 5501805 -2173516 -6422242 -6352657 -4259253 1096652
10257 1096652 9758959 14930158 10343944 -165932 -7468025 -8682657 -7632767 -6578348
10249 -6578348 -4443518 -1927614 -1719222 -3339057 -2995677 682241 4851814 7032512
10241 7032512 7859022 8363501 7700257 5103069 1954925 287483 372790 1070767 1860915
10232 1860915 3184814 4669475 4261525 446945 -4824797 -7078165 -4075916 1550750
10224 1550750 5503869 6355025 5462767 3902773 1886922 421919 791551 2234229 2345190
10215 2345190 211504 -2528330 -4003131 -3998120 -3388186 -3078269 -3640713 -4790707 -5150038
10206 -5150038 -3584338 -818767 1060781 682228 -1373184 -2997557 -2244052 442628
10198 442628 1926187 -3571 -3001550 -2767852 609664 2320180 -267325 -4108319
10190 -4108319 -5449266 -4330960 -1989638 1927097 6418476 7574895 3950213 -132657
10182 -132657 -843239 -732523 -3542333 -6855163 -5990269 -2394155 -1318661 -2806851 -2139668
10173 -2139668 1170772 1996566 -1766816 -5542412 -5158700 -2507478 -1586149 -2609920 -2529005
10164 -2529005 773580 6154669 9686609 7786035 1798038 -1813223 1286552 7306158
10156 7306158 9051036 5063892 -142062 -3459744 -5604357 -6823592 -5820009 -3481349
10148 -3481349 -2561247 -2611620 38847 5804579 9623839 7233239 574671 -4723151 -5092128
10139 -5092128 -1513709 1832852 1459244 -1234677 -963140 4104957 8531077 6612053
10131 6612053 326812 -4435418 -6582445 -8515501 -8741779 -3898652 2648830 2976803
10123 2976803 -3490535 -8437026 -7127788 -4489852 -5593895 -7692297 -6285418 -2727966
10115 -2727966 -621963 326255 1808116 2502460 1049062 -109762 1484565 3668485
10107 3668485 3144183 957558 352123 1455023 2041008 1647675 1289875 774221 -383458
10098 -383458 -946467 71284 932266 -446336 -3053377 -4425966 -4406864 -4675049 -5621351
10089 -5621351 -5997245 -4812026 -1911876 2111441 5178403 4594970 327025 -4281220
10081 -4281220 -6633011 -7793991 -9586701 -11063007 -10337121 -8114869 -6582058 -5945214
10073 -5945214 -4897553 -3885588 -4949168 -7900253 -9163670 -5985642 -660419 1375732
10065 1375732 -1949448 -6362277 -6393656 -2468089 -3427 -1434611 -2979175 -1011803
10057 -1011803 2348580 3285616 2449066 2652809 3028243 674141 -3267044 -4309939 -855259
10048 -855259 4610181 9606513 12634482 11555447 6117602 837544 -59273 802431 -1642876
10039 -1642876 -5764314 -5895671 -2779650 -2437504 -4611819 -2286129 5380575 9820064
10031 9820064 6509302 1985299 2290068 3592975 889450 -2406578 -1642875 -609777
10023 -609777 -4848171 -10572707 -9973636 -4164856 -1243131 -3206532 -4064621 -805622 2370939
10014 2370939 2232408 1601286 3507384 5639007 3902076 -1662461 -7077540 -8763841
10006 -8763841 -6207197 -1627716 1936266 2762096 1257662 -747260 -758264 3224079 9905399
9997 9905399 13855508 11123850 5510210 4556552 8718506 10270288 4938929 -1673948
9989 -1673948 -3028549 -1111271 -1706606 -4966458 -6824292 -6485720 -6269048 -6047563 -3652892
9980 -3652892 343694 3203562 4416386 5232834 4938247 1776920 -3262246 -7247992 -8999144
9971 -8999144 -8949095 -6879346 -2981214 482699 1700484 1712553 1534156 -492617 -5110832
9962 -5110832 -8757762 -7827598 -3995433 -1388323 -858317 -941482 -1711060 -3309698 -3435925
9953 -3435925 -1006560 446848 -1945649 -4677513 -3194477 -153024 -1570657 -6600729
9945 -6600729 -8563527 -5656953 -3252910 -4660598 -6380201 -4712041 -1732940 -1911676
9937 -1911676 -6113351 -10915725 -11821636 -6774332 1390163 6505249 5417364 1635808
9929 1635808 230678 1195611 1156660 -759905 -2924026 -4866596 -6541076 -6181183 -3539711
9920 -3539711 -2616275 -5826278 -8392575 -5031815 483157 212838 -5286992 -7876971 -4967635
9911 -4967635 -2674160 -4806724 -7624530 -7982689 -8347051 -10124422 -9521714 -4575764 -13841
9902 -13841 -197817 -2396705 -2087822 -617580 -2155737 -5951635 -7154866 -4486326 -2646833
9893 -2646833 -6121652 -12777994 -15319254 -9616715 -555730 3043973 -519671 -4245537
9885 -4245537 -3539050 -2617033 -5399801 -7128453 -2785291 2604669 2272127 366314 3522053
9876 3522053 5663616 -727026 -890837 30523819 87262881 124363005 108875740 60723242
9868 60723242 24811519 16031013 13969654 3603422 -5234435 -993637 9582444 13751555
9860 13751555 10563251 6993923 5974637 6377516 8006632 9765509 7973871 1915032
9852 1915032 -3151538 -2616153 1841069 6256144 9432091 11052182 9804847 6896362
9844 6896362 6600498 9569131 10378460 5827874 797839 917563 3992579 4595377 3189323
9835 3189323 3744608 5144526 2864559 -1812108 -2292176 2744428 6576988 4402045 -452467
9826 -452467 -3203101 -4325299 -5378081 -3577369 3599944 11809754 13936024 9175488
9818 9175488 2873019 -1201757 -2997175 -1868943 3281182 9039234 9239099 3967402
9810 3967402 1098328 5507410 11637888 11127192 4128498 -1879665 -2276615 632336 2800040
9801 2800040 3289772 3548225 4670336 5936218 4951442 139556 -5965783 -8112421 -4766289
9792 -4766289 -578531 -54056 -1648867 -1350051 839985 2186534 2510558 3344667 3581514
9783 3581514 1129187 -2176345 -2491325 -198161 801296 -440830 -1232213 -575177 259750
9774 259750 2181119 7169979 12391211 12059327 6575450 3170807 5219685 7565461 5713410
9765 5713410 3079738 4307223 6890306 5363912 141315 -3654669 -3896777 -2769205
9757 -2769205 -1839655 -513883 1230510 2414766 3171631 4459482 5953650 6311412 4978864
9748 4978864 2235272 -1470729 -4915991 -6351601 -5718323 -5019644 -5401500 -5835225 -5646004
9739 -5646004 -5772255 -6247142 -5259766 -2310488 495014 1823085 2728426 3454686 2383324
9730 2383324 157924 586823 4467121 6680662 3252973 -2427761 -4737802 -3729755
9722 -3729755 -2988697 -2509144 483028 5114588 7019355 4801366 1683668 482794 835190
9713 835190 1648890 2787955 3841992 4060578 3915143 4576202 5861709 6448571 5636636
9704 5636636 3507472 510162 -1777697 -1412419 829916 1720460 771312 1596977 5263168
9695 5263168 6571070 1572927 -5095357 -6404699 -3482027 -2931549 -5468603 -5288195 -848256
9686 -848256 1919095 -614969 -3923056 -2821523 851658 2231903 778119 -714088
9678 -714088 -1317644 -1908291 -1865950 242838 3550616 5458666 4972120 3454992 2525870
9669 2525870 2749427 3884685 5115825 5353686 4057794 1393263 -2454650 -7011781 -10490332
9660 -10490332 -10692145 -7607058 -3768048 -1412627 -607372 -653646 -1559898 -2915309 -2769270
9651 -2769270 466055 5253512 7599842 5158083 157917 -2539649 -576643 3328223
9643 3328223 4656884 2309840 -833283 -2103200 -1592845 -325665 1434830 2915804
9635 2915804 2455131 146867 -1326742 -351539 1266722 1422603 646962 -319882 -3001877
9626 -3001877 -8070186 -12305202 -12427024 -10001654 -8772310 -8989968 -8392224 -6936176 -6091415
9617 -6091415 -5109326 -2847411 -1679351 -3991167 -6038630 -1878734 6651218 10763816
9609 10763816 6700074 373412 -1761971 -69713 2498789 5425051 7667514 5694663
9601 5694663 -591617 -4708165 -1623791 4792301 7521884 6198969 5442035 6061967 4497906
9592 4497906 228917 -2400133 -591047 3364228 6135779 7209817 7368406 6385130 3919881
9583 3919881 862751 -1421717 -2140934 -1113792 1029371 2738680 2914744 2219862 1888268
9574 1888268 1814355 1218712 459060 403304 582679 -132580 -1469617 -2301188 -2777341 -3706770
9564 -3706770 -4160720 -2348392 848087 1950563 -491492 -3696449 -4451089 -3046211 -1616703
9555 -1616703 -360972 2018715 4976208 6137731 5089619 4698848 7270957 10961418
9547 10961418 11759375 8295144 3014796 -1021642 -2659458 -1929955 946432 4601000
9539 4601000 6180890 3972870 4247 -1556954 1180654 5903004 8628126 7426764
9531 7426764 3589546 -140978 -2023897 -2081934 -885089 1330937 3528360 3164445 -956437
9522 -956437 -5365542 -4552780 2066310 8682000 10149096 7569723 4779478 2732568 851434
9513 851434 813566 4023140 7079437 5173391 -539265 -4187406 -3829210 -3433379 -5425319
9504 -5425319 -6874951 -5143835 -2195461 -368404 1711772 5515801 8590678 8091395
9496 8091395 5758505 5673775 8806777 12738000 15006907 14155486 9659359 3758900 1241525
9487 1241525 4174254 8557422 9194867 5994221 2313673 -677688 -3946215 -6662500
9479 -6662500 -6956073 -5843171 -5992128 -6888374 -5548242 -2025107 279324 328516 943632
9470 943632 3342961 4571942 2509015 -299681 -489764 1290979 2104404 1030169 -825304
9461 -825304 -2717104 -4106046 -3778698 -1776745 -833488 -3051459 -6116359 -5875925 -2348725
9452 -2348725 -33319 -1759735 -5109708 -6196573 -4629944 -2811097 -1932299 -1108480 105537
9443 105537 839536 965801 1772287 3272925 2746111 -1682178 -6977721 -7845904 -3863499
9434 -3863499 -774463 -2904729 -7111583 -7328409 -3171562 30511 -829697 -3138262 -3826812
9425 -3826812 -3847735 -5178702 -6870710 -7112817 -6642182 -6844448 -6607410 -4664605 -3198856
9416 -3198856 -4768662 -6819858 -4331008 2028384 5628261 2995361 -1789437 -3846321
9408 -3846321 -3701845 -3713032 -3151638 -1296079 -1310461 -5391243 -8959358 -6077423 949822
9399 949822 4088687 1182117 -1967255 -1786642 -1764400 -4571886 -6426980 -3750917 244335
9390 244335 1016086 364965 2724928 6963337 8251425 6354157 5709833 7661476 8484514
9381 8484514 5775622 1673997 -1433762 -3807617 -5373558 -4178760 -310786 2014783
9373 2014783 -666593 -6057987 -8646585 -6178273 -1451535 1682303 2109249 1128563 -60546
9364 -60546 -1300772 -2123509 -1137942 1615174 2705536 -1317532 -8317658 -11873828 -9589962
9355 -9589962 -6182986 -5781526 -5638605 -1954312 2211162 1435248 -2199250 -1552943 3689060
9346 3689060 5622450 150593 -7013749 -9199176 -6897404 -3338220 1615079 7917237
9338 7917237 10918365 6913505 12576 -2624714 -564770 490197 -2073270 -4691611
9330 -4691611 -3885699 -862056 1217529 1188213 4349 -812847 -238088 1121614 1091237
9321 1091237 -1297795 -3826944 -3811771 -1853294 -505468 -156973 729380 1667124 -44183
9312 -44183 -4710134 -8422056 -7575694 -3337938 183702 1081529 1080911 2136519 3441387
9303 3441387 2773111 -116986 -3006877 -4150324 -4024616 -3333377 -1236496 2476716 5152659
9294 5152659 4219571 1473309 994315 3122508 4330476 3291933 2738337 4180685 5226584
9285 5226584 4068589 2338307 996768 -2280172 -8250869 -12608172 -11422903 -6905958
9277 -6905958 -3647999 -2158435 -507960 728710 409241 1105170 5534843 10439766 10206657
9268 10206657 5636923 2731939 3030629 1931087 -2528436 -6086795 -5771138 -4874986 -7020267
9259 -7020267 -10121629 -10029819 -6401386 -1350053 4449745 10600073 14613235 14492671 11874565
9250 11874565 9482823 7312255 4350301 1984146 1976865 2544590 535756 -3054812 -3753366
9241 -3753366 -80816 4195594 5115539 2712222 -963013 -4875108 -8070501 -8351893 -4894334
9232 -4894334 -860210 -270163 -2531600 -3051878 200854 3674536 3241839 -291725 -3064114
9223 -3064114 -3753324 -4306291 -5918478 -7436133 -7770729 -7023837 -4919948 -1008191 3058174
9214 3058174 4512955 3574057 3254639 3937472 2012657 -3891013 -9172465 -9007944 -4665602
9205 -4665602 -526680 2188716 4587397 5812720 4639715 3400722 4898981 6641178
9197 6641178 3824998 -2524407 -6396629 -5917862 -5351520 -6894263 -7014592 -3569381 -585619
9188 -585619 -2064049 -5738226 -7231430 -6569690 -6138485 -5424563 -2688061 353810 432468
9179 432468 -1880755 -3117542 -2497267 -2326298 -3106694 -2501935 222455 2501304 2498712
9170 2498712 1826477 2629723 4265730 4679205 3494855 1976111 918234 301357 588836
9161 588836 2648112 5957287 8146604 7517286 5704386 6371802 10513337 14270049 13119432
9152 13119432 7795076 3845297 4721542 7451963 6803591 2227556 -1740261 -1695919 485959
9143 485959 781215 -1392109 -2761896 -1119349 1592024 2342858 1451059 1426532 2049156
9134 2049156 139530 -4612436 -7161846 -3490211 2948353 5165715 1922730 -1257797
9126 -1257797 -465856 1584925 450796 -3694059 -6995503 -6944333 -4211271 -912834 1096674
9117 1096674 1143245 265720 212389 1484590 3369906 5632970 8157241 9101189 6382932
9108 6382932 1578708 -900767 306280 1836926 1439412 1669722 5006034 8866959 9361249
9099 9361249 7235864 5698434 4438734 883085 -3671057 -4663229 -1412173 1434489
9091 1434489 1069669 600075 3438601 7299235 7281151 2909700 -1325006 -1764570 837391
9082 837391 3500399 4505042 4035502 2918814 1950130 1953337 3271279 4760473 4222594
9073 4222594 1107147 -1533292 267229 6071015 10587035 10268606 8202070 9326285
9065 9326285 12322749 10956284 3957080 -1563570 475145 6243388 7174792 2005757
9057 2005757 -1736116 1508394 8106049 10904745 8347754 4670758 3297997 3696080
9049 3696080 3970982 3268653 1520807 -402121 56023 4935563 11869708 14976790 11241168
9040 11241168 4101233 -859843 -1932493 -1219117 -518536 96571 689567 1133389 1964714
9031 1964714 3342317 3642725 1393996 -1844090 -3066689 -2029080 -1097205 -921305 508993
9022 508993 3697924 5683929 3893596 -360616 -3778850 -4491720 -2426524 1247692 3421996
9013 3421996 560015 -6440049 -10988212 -7558549 1413954 8183896 8296383 3776430
9005 3776430 -1200493 -4181667 -4060355 -788558 3036614 3259548 -1045826 -5748955 -6572420
8996 -6572420 -4304540 -2977554 -4027679 -4961399 -3669303 -1326189 -724 456590 1333101
8987 1333101 2199799 1406294 -912104 -2542255 -2300724 -1478314 -1423253 -1598261 -1243361
8978 -1243361 -1063225 -1467179 -901303 1552206 3234813 747361 -4726095 -8253211 -7585276
8969 -7585276 -5468538 -4687268 -4145279 -1625945 2377229 5792106 7660870 7465028 4011398
8960 4011398 -2127737 -6734293 -5839197 -881087 2863102 2546121 -297863 -3536857 -6665323
8951 -6665323 -8697205 -7388966 -2565949 2115331 3058559 1095481 -57667 1226466
8943 1226466 3154148 3728040 3156994 2724164 2934962 3488692 3966276 3983957 3619301 3930172
8933 3930172 5609903 6725127 4047939 -1850604 -5309990 -2425600 2600807 2350500
8925 2350500 -2956724 -4768527 1952333 11209274 13847179 9026066 3120107 -200403
8917 -200403 -3141052 -7641443 -11377194 -11231367 -7446238 -3146375 -1685192 -4317988 -8345998
8908 -8345998 -8496005 -2997986 2953682 3481251 438061 679149 5614687 9434716 8502191
8899 8502191 6345745 7076756 9441790 10522463 10406397 9597865 6267943 227728 -4149895
8890 -4149895 -3428765 -540397 -430509 -2913417 -4182830 -3122044 -1594298 -198818 1737284
8881 1737284 2963729 1224559 -3029540 -6907022 -8317435 -6632355 -1974968 3301260
8873 3301260 4718125 889056 -3379791 -3076574 -61331 220679 -2712293 -4253880 -2301328
8864 -2301328 179995 327880 -1335234 -3245381 -4661732 -4852388 -3639047 -2671950 -3281860
8855 -3281860 -3973704 -3240050 -3170590 -6091828 -9491159 -9554437 -8095488 -9447400 -11373260
8846 -11373260 -7024668 2942137 8402765 3306256 -5705962 -8663866 -4619267 291762
8838 291762 2438106 2744342 2283237 1284423 971377 2124668 3036316 2197561 1405402
8829 1405402 3025435 5970928 7719513 8527932 10013883 11103339 9486308 6376703
8821 6376703 5709087 8277942 10130383 7824441 2873251 -254077 795502 4136428
8813 4136428 6186061 5936814 6073985 8822962 11597566 9724581 3760704 66025 2055170
8804 2055170 4969672 3090872 -1340822 -1765584 2138940 3854841 89286 -4683969
8796 -4683969 -5657302 -4337068 -4410424 -5050868 -2798050 2091483 5639847 5818881 4431894
8787 4431894 3341346 2335040 1391887 1693351 2861221 2166278 -1180816 -3374381 -776070
8778 -776070 4230888 5821364 2582408 -1148286 -2115405 -2088937 -3473819 -5152639 -5488069
8769 -5488069 -5822546 -7216239 -6772018 -2047214 2993751 2203423 -3262862 -5852565 -2828357
8760 -2828357 -300830 -3419356 -8234798 -7864255 -2704318 1027248 803855 124997 1618158
8751 1618158 3146695 2404223 1321382 3016511 6522438 7535877 3821949 -2478246
8743 -2478246 -7964677 -11198475 -12001993 -9717772 -4416984 1174945 3835317 4137665 5727437
8734 5727437 9365703 10848498 7004782 847760 -2528820 -2963480 -4076992 -6499788
8726 -6499788 -6950698 -4032214 -492400 1147862 1413804 1323375 624336 -228066 204623
8717 204623 1318445 554818 -2109635 -3314416 -1593771 231004 43902 12849 2397604
8708 2397604 5289702 5831648 4655625 3633254 2053543 -1034868 -3193128 -1824821
8700 -1824821 670563 -290480 -4320490 -6332777 -3991994 -642459 -9700 -1552215 -2364106
8691 -2364106 -1005242 1880305 4808738 6225450 5442958 3584268 2615034 3141189 3971492
8682 3971492 3729603 2116436 20940 -940434 66292 1314590 -127497 -4034334 -6152195
8673 -6152195 -3822505 -295344 -301765 -3073683 -3829313 -1396415 321379 -909084 -2040538
8664 -2040538 -56727 2686171 1640557 -3384520 -8103017 -9494851 -8763712 -8194322 -7515095
8655 -7515095 -5036207 -1280069 740968 -548471 -2714645 -2222395 927107 3457248
8647 3457248 3475334 2491362 2260737 2114317 808389 -1109990 -2638076 -4315531 -6857655
8638 -6857655 -9142335 -9640034 -8765132 -7788801 -6486368 -4102837 -1810242 -1683399 -3353154
8629 -3353154 -3795960 -790504 4639946 9190851 9946844 6823305 3152457 2709464 5311565
8620 5311565 7031537 5854229 4727420 6950241 10939060 12585457 11073762 9032619
8612 9032619 8057320 7398988 6385711 5065160 3023703 355693 -1056081 -47889 1320573
8603 1320573 990912 914942 3585365 6148608 3574202 -2761175 -5964168 -4068070 -3128913
8594 -3128913 -7339383 -12024627 -10540235 -3509572 3329463 6807922 7137503 4243413
8586 4243413 -1125969 -4438495 -1363036 5429910 8507183 5336718 1203705 1304187
8578 1304187 4275028 5821725 5030369 3695950 1908181 -1526725 -5087540 -5163109 -1613625
8569 -1613625 671729 -2105410 -7218358 -8768644 -5248726 -845337 481656 -780784
8561 -780784 -1978591 -1978027 -1141184 213592 1543075 1732866 552774 -730720 -1232603
8552 -1232603 -1348600 -882340 1364570 4651621 5693024 3220688 361894 -330700 -1125945
8543 -1125945 -4508869 -7340244 -4969058 763798 3763113 3085359 3457671 6058651 5964758
8534 5964758 995555 -3632001 -3266169 -824696 -1247939 -3606933 -4074008 -3229918 -4480734
8525 -4480734 -7189503 -7206352 -3636755 -12849 1337610 1617553 1864195 1145790 -566347
8516 -566347 -1471786 -1295897 -2295976 -5190153 -7016460 -5271581 -1798352 45836 245314
8507 245314 1100505 2506261 1897771 -950043 -2726849 -1619516 -292914 -1374789 -2853921
8498 -2853921 -1780210 -427982 -3391938 -8879965 -9206821 -2069463 4634427 3338729
8490 3338729 -2865153 -5919334 -4662888 -3908080 -4259704 -1352704 4698850 7408428 3703839
8481 3703839 -1490495 -3550832 -4517476 -7133447 -8586289 -5723491 -1966828 -2811553 -7162260
8472 -7162260 -8956835 -5748023 -436859 4286783 8055324 9909984 8249914 4223828
8464 4223828 1357625 1248941 2594711 4394610 6933263 9594312 10912239 11035581 11241512
8455 11241512 10985142 8534977 4654774 2241450 1709293 235821 -3137165 -4985527
8447 -4985527 -2250253 2893970 5424347 3483426 -100927 -1738161 -835857 394732
8439 394732 -109199 -1940908 -2898607 -1842170 -4974 1268388 3021570 7148457 12671174
8430 12671174 15650857 13530277 8153930 3544625 1577828 840383 -617068 -2458843
8422 -2458843 -2638022 -648439 882773 -904853 -5017179 -7344800 -5992302 -3808650
8414 -3808650 -4281612 -6785037 -7961882 -6500515 -4024829 -1790826 874813 4390984
8406 4390984 7205678 7427270 5411023 3818211 4833011 7325626 7500944 3466202 -1434228
8397 -1434228 -1924694 2566689 7246822 8445640 7378059 6032738 3468340 -533510
8389 -533510 -1855838 2908277 9870018 11714199 7482381 3300991 3193390 4404170 3244888
8380 3244888 850535 506907 2531278 4541716 4815084 3305122 801389 -1436621 -2389864
8371 -2389864 -2413362 -2455272 -2180655 -792157 586586 162578 -885285 477967 3700092
8362 3700092 4204750 18845 -4899549 -6267068 -4947852 -3983271 -3445293 -1934139 -530850
8353 -530850 -840307 -788524 2765018 7687837 7848341 1894680 -3492841 -1672781 5336950
8344 5336950 9325837 5855801 -1050145 -4375474 -1997751 2285817 4342008 3884305
8336 3884305 2598440 673975 -2186936 -3547399 150404 7818987 12888664 10525449
8328 10525449 3592274 -925852 268215 4991264 9741514 12138098 10186899 3472428
8320 3472428 -4052646 -6233020 -1726673 3755451 4443489 1495519 159680 1692376
8312 1692376 2108852 -928372 -4066689 -3259962 2530 762746 -2251542 -5053680 -4243343
8303 -4243343 -1112417 1522702 3633841 6390405 8193492 6000403 464500 -3578330
8295 -3578330 -2749472 1228252 4714149 6606994 7680237 7301053 3698360 -2624736 -8065406
8286 -8065406 -9457965 -7385635 -5118626 -4721756 -5055179 -3784301 -643433 2253688 3292232
8277 3292232 3158643 2956530 1967091 -864807 -4052853 -4640433 -2237211 347737 995243
8268 995243 470064 -61577 -1158214 -3263500 -5069232 -5639407 -6025614 -6477796 -4312460
8259 -4312460 2060496 8556487 9193210 4408049 1310861 4320400 9265924 9167677 3046181
8250 3046181 -4076584 -8112565 -9268380 -8973521 -7117645 -3676294 -677380 -371733 -2217087
8241 -2217087 -3465264 -2742614 -1555011 -1606657 -1872105 40933 3741184 5204190 1441510
8232 1441510 -5039147 -8474902 -6565233 -2948387 -2200692 -4258131 -5474449 -3982278
8224 -3982278 -1816688 -1914076 -4754997 -8084207 -8705076 -4943831 1044839 4086634 1613946
8215 1613946 -1874343 439715 7806877 11203547 5076903 -4446285 -7504722 -3366217
8207 -3366217 595649 973657 2077015 6848278 11243840 10964124 8155752 7074997 7327907
8198 7327907 6132676 3966567 2874003 1600164 -2231476 -6591025 -7082820 -3907704
8190 -3907704 -1644565 -2102307 -2391580 -618213 1510683 2993265 5595336 9476963 10991933
8181 10991933 7709510 2456952 -510605 -898454 -1171204 -1908465 -1158509 2445372 7693176
8172 7693176 11223798 9451922 2007772 -6009262 -7842153 -2665385 3044264 3361685
8164 3361685 -462236 -3270567 -3090943 -1928653 -1576834 -2182369 -3963445 -7000895 -9468786
8155 -9468786 -8754509 -4626707 429906 3916111 4987784 4062715 2413467 1702800 2424348
8146 2424348 3160445 2483357 863149 -384310 -984012 -1249588 -900315 176466 1021771
8137 1021771 931618 665918 989439 1202820 473232 -727464 -1771620 -2660620 -2281693
8128 -2281693 1544750 7898693 11290720 7930072 1687543 -162559 3828410 8278626
8120 8278626 8694009 6022034 3172174 1055159 -457270 -641640 1136048 4128650 6846949
8111 6846949 8001769 6960307 4710130 3795366 5383353 7076045 5865889 2481576
8103 2481576 189509 100987 792063 1960597 4760293 8380827 9893760 8116660 4586648
8094 4586648 484941 -4065326 -7506265 -7575875 -5220251 -3865600 -3903943 -2068271 2423141
8085 2423141 5584929 4653934 2217429 1760397 2879452 3825196 5211119 7740912 9197119
8076 9197119 7335470 3641057 1073532 95220 -265659 312958 2093214 3316508 2621367
8067 2621367 1520662 1775209 2500460 2604310 3515302 6330905 8815543 8612058 6903226
8058 6903226 5554885 3679496 799985 -236473 1741279 2280504 -1565559 -4096468
8050 -4096468 1143979 9363189 10081843 3507133 530485 5267748 9017614 5626927
8042 5626927 1942120 5907892 13145573 14371318 10003013 7862631 10184280 12220018
8034 12220018 11707817 10898092 9894384 6345662 2222337 3018181 8485445 11143095 6641592
8025 6641592 -294181 -3284615 -2454777 -1625413 -1703455 -1018165 707717 2612227 4893240
8016 4893240 7396590 7704919 3961143 -1412118 -3776130 -1613766 2450167 5428628
8008 5428628 6632649 6875287 7015023 7467110 7891535 7286570 5136129 2229603 -87797
7999 -87797 -908597 84092 2203700 3338199 1874149 -377257 358921 4191888 6213124
7990 6213124 2966431 -2462558 -4916123 -4324094 -4416080 -6017702 -6393584 -4656503 -2918883
7981 -2918883 -1840912 -6648 1451863 -929302 -6044985 -7040840 -683409 6791346
7973 6791346 7929500 4372390 3233996 5813349 6609530 3010476 -636979 -139254 2532179
7964 2532179 2724021 -936038 -6076893 -9306201 -7972877 -2033489 4489534 6671868
7956 6671868 4480410 2506317 3068971 3449368 1521600 -425357 -410115 -935889 -4291434
7947 -4291434 -7316944 -5916134 -2147684 -1289340 -3524580 -4314690 -2178334 -105205 787842
7938 787842 2816205 5872710 6142429 2882342 741415 2145483 2790365 -858262 -4318204
7929 -4318204 -1310485 5716940 7985278 2660718 -3486925 -3867147 -273458 1334339
7921 1334339 -519218 -2160304 -1215380 54074 -1292369 -3939706 -3610249 898441 5229200
7912 5229200 4619485 170178 -2639231 -1369369 608483 -380638 -3248366 -4629968 -3822005
7903 -3822005 -2529540 -1583032 -833551 -967123 -2441849 -3554405 -2466846 -371439 336873
7894 336873 269639 1943699 4710484 4635111 273963 -4731279 -6123595 -3462981 943841
7885 943841 4747079 5808339 2594278 -3468192 -7947596 -7843281 -4759882 -2075240 -547654
7876 -547654 1315666 3887836 5785973 6123060 5500234 4864024 4681914 5014652 5337506
7867 5337506 4681534 2939386 1419892 906396 -129501 -3549579 -7833975 -8481244 -3375425
7858 -3375425 3577121 6188389 3231862 -249835 119718 2159151 964629 -2933750
7850 -2933750 -3958345 -672055 898101 -3436071 -8172024 -5468527 2498303 5880346
7842 5880346 1489907 -2817982 -86131 6337690 9201997 7568821 5542263 4678322
7834 4678322 3176060 531545 -1886202 -3775707 -5521401 -6028375 -4407380 -2402686
7826 -2402686 -1644591 -186396 4217482 9034132 9878197 7440486 6302961 7189582 6041875
7817 6041875 1645656 -1419097 387506 4475683 6590536 6406888 5631894 4053029 1235647
7808 1235647 -342712 2064980 6875266 9761170 9299121 7882771 7141566 5628229 1992906
7799 1992906 -2035676 -3636812 -2668956 -1599798 -1840400 -1922024 -246640 1739084 1249372
7790 1249372 -1239030 -1864932 1048745 4136592 4083843 3019085 5018201 8813859 8907358
7781 8907358 4007395 -759357 -1640431 -1425780 -3829579 -6803655 -5823229 -1299433 2129439
7772 2129439 2672426 2968225 4317404 3900915 -307760 -5201885 -6016220 -2485255 1247835
7763 1247835 2287415 1956709 2703302 4231850 4209874 1817841 -961508 -1439737 1431623
7754 1431623 6569729 11433146 13285184 11159832 6850714 2903187 -177703 -3137815
7746 -3137815 -4838534 -2815410 2297040 6066637 5793004 3876801 3390610 3279270 1202134
7737 1202134 -1536210 -2109622 -1449178 -2875550 -6372817 -8519558 -7516755 -4244202 696267
7728 696267 6357462 8925677 5478537 -68092 -928340 2442722 3104967 -560527 -1875169
7719 -1875169 2425089 5828243 2618359 -2522041 -2435331 781765 56004 -4595122 -6787098
7710 -6787098 -4522168 -2056710 -1636318 -928298 825518 937131 -1128347 -2188038 -1069734
7701 -1069734 -726355 -2672057 -3898870 -1699100 2105370 4097570 3654655 2433388 1576029
7692 1576029 892415 -623576 -3853177 -7627478 -8475185 -4729873 141046 1623862 591992
7683 591992 1458466 4498627 5215521 2033461 -675249 853973 4777521 7475285 8220170
7674 8220170 7491898 4656969 508515 -1318948 903834 3391879 1525143 -3737370
7666 -3737370 -7339244 -6486527 -2569400 1843363 4855430 5040732 2429156 -460372 -856100
7657 -856100 935156 1921947 -60903 -4254883 -7753274 -7547117 -2926231 3109449 6074056
7648 6074056 4831653 3015638 4464931 8588202 11602740 11073058 7732609 3929236
7640 3929236 1757312 1809003 2438062 1076844 -2606444 -5716606 -5272862 -1574421 2212610
7631 2212610 3028938 398679 -2837748 -2692709 1015967 2673453 -2593611 -10576496 -11337356
7622 -11337356 -2633048 5544651 3751578 -4281538 -7353779 -1983816 4597153 5518030
7614 5518030 1922508 -1215252 -1526327 531053 4024959 7640567 9453123 8337954
7606 8337954 4820341 509734 -2237653 -1332494 2076203 2999939 -1731378 -8184775 -9644927
7597 -9644927 -5723960 -2568303 -3682352 -5657454 -4624342 -1979787 -790642 -575189
7589 -575189 764998 2853069 4279005 5718986 8025289 9190869 6928191 2799506
7581 2799506 101558 -1184886 -3448090 -6169679 -5820693 -1388444 3737793 6354947
7573 6354947 6788233 6607748 5989886 4814431 3844416 3189047 1756372 -244889 -562829
7564 -562829 1420814 2540138 5684 -3986321 -4907833 -2224667 238777 151332 -390611
7555 -390611 1431631 5337352 9113569 11196462 10517444 6116272 -693235 -5417473 -4570152
7546 -4570152 -165879 2692248 2508770 2713877 5790239 9347536 9959566 8296502 7470939
7537 7470939 7788400 6711708 3847437 2221109 3297433 4011450 1347536 -2448768 -2751461
7528 -2751461 390673 2064056 -209854 -2900015 -2054190 881537 1895697 681420
7520 681420 146499 815341 145189 -2252745 -3022208 -373458 2642027 2729574 1338932
7511 1338932 1807952 3554251 2982982 -521974 -3315646 -2702080 -273887 1202051 1831597
7502 1831597 3697140 7129365 9563240 8095813 2698284 -3022451 -4574198 -883568
7494 -883568 4329993 6359381 4339084 1158068 -776888 -1588659 -1697621 -184776 3123555
7485 3123555 5772510 5070987 1781976 -432232 707641 3779986 5838985 5556254 3571587
7476 3571587 1021201 -858350 -357484 3393002 8264121 10216419 7819301 4109511
7468 4109511 2370669 1935324 743819 103313 2560404 5776143 4040046 -2869098 -7799337
7459 -7799337 -5895227 -1054081 997421 987257 2153935 2540741 -1613732 -7517178 -8749394
7450 -8749394 -5556797 -4310168 -6518622 -6657462 -2705896 -536051 -4037093 -8253990
7442 -8253990 -7665431 -5244454 -6842167 -10915978 -10919694 -5588438 -103863 2214340 3288806
7433 3288806 4878103 5056706 1935403 -2617233 -5114541 -4532369 -2807096 -2173552 -2828408
7424 -2828408 -2948856 -912075 2550122 4978379 4862415 2686315 -380649 -3151506 -4047802
7415 -4047802 -2399728 -169765 280275 174306 2669325 6869241 7866816 4285086 1196634
7406 1196634 2817561 6493952 7501573 6164860 5944538 7191126 7287797 5303969 2548264
7397 2548264 -186291 -2485025 -2823435 -544159 1955752 2070015 667549 95940 166565
7388 166565 -767607 -2198555 -1998516 525781 4399097 8159553 9394155 5780935 -950088
7379 -950088 -5062112 -3526179 487506 3235098 4957606 5583060 1863685 -5622168 -8400046
7370 -8400046 -732659 10046708 12388646 6379163 1544747 1445852 923759 -2145825 -3356491
7361 -3356491 -1356723 -755882 -2902891 -3017426 390422 2038184 -566592 -2558371 -940713
7352 -940713 -139000 -3245420 -5535751 -2842698 547973 -705030 -3532940 -1874071 2910488
7343 2910488 4720370 2835880 1936899 3524581 4009620 1238270 -2231639 -2843018 260594
7334 260594 5079390 8090140 6827489 2976572 1169320 3212056 6055093 6908670 6775741
7325 6775741 6828211 5422766 1752134 -1446144 -2227039 -2719753 -4526386 -4827022 -1321702
7316 -1321702 2617640 2521644 -447778 -2112943 -1991065 -2531432 -3732012 -3252185 -587408
7307 -587408 2624255 5057807 5667193 3509374 139389 -1095019 -729414 -3536721 -9687657
7298 -9687657 -11286526 -3300491 7363733 10687341 7011002 3943946 3695891 2457541
7290 2457541 -30801 160810 2868368 3817138 3099081 5272020 10267187 12336682 9424916
7281 9424916 5957508 4748057 3637905 2013304 2972792 6307842 6605332 1731212 -3277778
7272 -3277778 -4190576 -3253934 -3389328 -2916420 -192193 2231916 2644431 4099863 8354553
7263 8354553 10618792 5943815 -2713945 -8280872 -8795449 -7810955 -7674701 -7377876 -6110207
7254 -6110207 -4848159 -4628213 -5726370 -7735073 -8814235 -6648898 -1838055 1866246
7246 1866246 2347487 1584374 1812515 2542498 3318264 5487852 8357214 7556796 1120090
7237 1120090 -6034034 -7796144 -4407222 -418396 2174814 4455945 6565069 7694870
7229 7694870 8502376 9545410 9110045 6447885 4819213 6756402 8716936 5986323 1015736
7220 1015736 440033 4582595 6823089 3974730 458748 287011 1326689 715932 413985
7211 413985 3031584 6202309 5827868 2474222 348739 1501369 4562265 7752318 9593318
7202 9593318 7826395 1608742 -5310015 -7223895 -3064251 2376722 4602782 4196593
7194 4196593 4270123 5626124 6551955 5939943 4368932 2704637 1518550 1512260 2659423
7185 2659423 3142923 1210813 -1824571 -2823111 -1618153 -1727264 -4645827 -6381878 -2803786
7176 -2803786 3631066 6617930 4710349 2789123 4280031 6416182 5288534 1796341
7168 1796341 -591345 -1374146 -2668133 -4630369 -4769042 -1776321 2548961 5543835 6107727
7159 6107727 4816164 3160732 2809612 4347409 6506577 7398452 6448576 4637980 3264477
7150 3264477 2881546 2794467 1425352 -1606008 -3681559 -1686249 2880604 4209635 -249105
7141 -249105 -5285936 -4419242 1120824 4284009 2299597 -48167 1815934 5744126 6598343
7132 6598343 3325683 -692807 -2451418 -1598684 955895 3922747 5473575 4666515 3257316
7123 3257316 4048713 6897628 8240397 5710577 1775317 1015887 4307470 7563083 6662540
7114 6662540 2124745 -2058509 -3070335 -1362276 1104558 2800374 2763356 684959 -2254734
7105 -2254734 -3783344 -2661041 162812 2760109 3713080 2478620 -93775 -1318905
7097 -1318905 1045433 4984276 5031075 -1014500 -8011327 -8898002 -3186222 2888766 4313644
7088 4313644 2308095 1004897 2148097 4500542 6258449 6170807 3693994 35413 -1627644
7079 -1627644 1080051 6509566 9871545 8047653 2965947 -455105 494820 3924053
7071 3924053 6272647 6486944 6004227 5282982 2687122 -2407197 -7498887 -9688411 -9157239
7062 -9157239 -8041396 -6975586 -5093452 -2840472 -2125888 -3391119 -4670438 -4059658 -1439079
7053 -1439079 2381632 6271914 8353290 7260059 4456254 3140264 4168530 5328302
7045 5328302 5254904 5096134 5040675 2760668 -2043305 -4793765 -1692989 3882856 5154091
7036 5154091 1103179 -2768019 -2740104 -1143186 -1259412 -2416118 -2348076 -1007633 466839
7027 466839 1983128 3427914 3605875 2233609 812146 -107055 -1800850 -3854089 -3409399
7018 -3409399 -523370 -115131 -4638918 -8927907 -7647624 -4118009 -4855200 -8241970 -7116497
7009 -7116497 -1424625 1225700 -1504311 -2985391 371391 3169308 1822035 1804265 7123551
7000 7123551 11005140 6195148 -1981525 -3181533 1932655 4164832 1362745 -106030
6992 -106030 1402894 90184 -4996411 -6197749 71765 6234041 4496585 -2467667
6984 -2467667 -7281613 -8226609 -8162156 -7806541 -5747058 -2266459 993154 2837511 1681846
6975 1681846 -3498111 -9323350 -9774760 -4423612 99776 -156775 -811135 2938281 8448445
6966 8448445 10612070 9569845 8045467 5735274 2217330 1100078 4960355 9858182
6958 9858182 11055224 10366426 11333652 11338090 6445634 612341 1001805 6134794 7983435
6949 7983435 5047763 3971120 7716487 11352205 11348596 10517981 10956448 9725170 5074105
6940 5074105 624201 -169058 1433712 3090157 4551545 5158629 3555853 1863329 4315975
6931 4315975 9606654 10918228 6299362 2329004 3869755 6907371 6171791 3415902
6923 3415902 2460981 1758165 -1621373 -5258141 -5382125 -3750793 -3745176 -3023386 2548236
6914 2548236 10088789 12532298 9033337 5127515 3089487 -142527 -4713982 -5297549
6906 -5297549 442055 7014577 8352854 5355186 2668454 1713172 882806 171109 1431318
6897 1431318 4733832 7548006 7690660 5248172 1499533 -2656179 -6794365 -10191872
6889 -10191872 -11504118 -9530137 -4579526 1115326 4836626 5360495 3598240 1734326
6881 1734326 1676433 3399917 4532660 2682104 -1335111 -3803367 -2313881 1609378 4808627
6872 4808627 5905711 5424810 4153632 2855872 2357480 2555415 2505679 2498750 4239478
6863 4239478 7519541 8820786 5455958 -576582 -5216576 -7197818 -7656583 -6516049
6855 -6516049 -2665282 2958626 7691816 10304356 11076938 9341522 4309264 -1791534
6847 -1791534 -5066460 -5049442 -5014386 -6304520 -6060492 -2473329 1174753 806781 -2417923
6838 -2417923 -3912127 -2361560 -924239 -1658811 -2423281 -1013598 459264 -1542159 -5925397
6829 -5925397 -7608316 -4946280 -2826535 -5722676 -10530518 -10606593 -5638865 -2217785 -3897757
6820 -3897757 -6098221 -3577569 1643977 3939698 2292997 93081 -1041877 -2082921
6812 -2082921 -2354246 254985 4745671 7375255 7205542 7046246 8116499 8142140 6101463
6803 6101463 4558784 5232067 6114033 5424622 4812670 5737031 5987541 3334915 -15484
6794 -15484 -487176 1307066 2043673 1318337 1653721 3663567 5464909 6812745 9498480
6785 9498480 12931574 13577212 10430276 7226466 6850817 6941753 4197061 256984 -731866
6776 -731866 1237606 2250243 875912 -105790 942700 1756148 583302 -449540 816723
6767 816723 2450070 1597204 -645160 -1594606 -2396629 -6029326 -10463913 -9676614 -3070672
6758 -3070672 1609363 -1586863 -7841818 -7695844 -57122 6332468 4581331 -1985906
6750 -1985906 -5186889 -2482354 1062533 298494 -3626103 -5523723 -3020577 1192474
6742 1192474 3886765 5250048 6434417 5628077 572459 -5647513 -6218850 330831 6792695
6733 6792695 5860889 -1081311 -6989617 -8195702 -6423739 -3856579 -1046615 744801
6725 744801 -250939 -2926873 -3643220 -1084779 1930215 2497827 1165529 440492 1649814
6716 1649814 4097646 5844651 4936753 1332320 -2295757 -3184239 -1716369 -441395 -458578
6707 -458578 -846898 -1004160 -947699 217693 3136411 5718147 5088198 2113345 443333
6698 443333 616484 -868337 -5304889 -8626916 -6894328 -1814086 1886922 2274702 886457
6689 886457 -514036 -1449088 -2222253 -3528839 -5328631 -5415102 -1468601 4551371 7276747
6680 7276747 4860742 1457635 390354 -1011553 -5776870 -10330081 -8920682 -2775199
6672 -2775199 1649801 2829194 5601332 11300050 13549246 7712468 -930284 -3901988
6664 -3901988 -1207626 -317697 -4590056 -8717871 -6945924 -845836 4049765 6012219
6656 6012219 7645646 10282689 12044031 11669966 10624753 10045713 8613916 5584443 3482537
6647 3482537 4883844 8124152 9500528 8807145 8985509 10453203 10014203 6574773 3791159
6638 3791159 4392899 5198499 1564913 -5108877 -8545871 -5928557 -1186163 946551 796978
6629 796978 1515387 3241772 2843322 -654769 -3590876 -2585528 -7695 -1220907 -6517246
6620 -6517246 -9730310 -6892937 -2681012 -4101754 -9891485 -11725714 -6088894 721371
6612 721371 1660649 -1697926 -2543227 1507454 6250684 7010364 3366324 -1839587 -5623855
6603 -5623855 -6931227 -6977724 -7231675 -6812513 -3740419 741858 2278739 -391018 -2775283
6594 -2775283 -1090710 1934714 1758841 -285217 847389 5639023 9392375 9460943 7768358
6585 7768358 5830973 2662100 -1074615 -1915198 1063025 3824186 2828099 -493430 -3138106
6576 -3138106 -5120486 -7775952 -10182337 -10384607 -8364622 -5254409 -1393252 2515049
6568 2515049 4366971 3431049 2254800 3007096 3859267 2315412 368897 2144613 7107252
6559 7107252 9925700 7416990 1798180 -3523374 -7342128 -8573984 -5145839 2076393
6551 2076393 7467634 6545116 1942427 -112319 1871103 3692328 2477867 445996
6543 445996 618908 2500810 4122703 5479812 7241864 8174769 6921343 5000282 4822652
6534 4822652 5476226 3907686 282461 -1361334 1244707 5367487 7190168 6435967 5281334
6525 5281334 4704702 3936975 2210667 -548907 -3642286 -5206260 -3631391 -473483 277717
6516 277717 -2556162 -5234903 -4344389 -1614327 -701436 -1595727 -1820683 -1245108 -1499539
6507 -1499539 -1880809 -372386 1840738 1527369 -925018 -1669952 355634 2194328 2751113
6498 2751113 4595709 7950109 8341875 3758963 -484463 1353830 6949436 9282756
6490 9282756 6492192 3409178 4076563 7290640 9823749 10365299 9421967 7959069 6999321
6481 6999321 6880534 6617209 5255043 3448938 2332080 1677399 844968 430535 874565
6472 874565 638565 -1522013 -3286332 -843373 5850407 12547714 15369142 13545502 8085925
6463 8085925 974403 -4346488 -5284891 -3587477 -3275232 -4566992 -3720700 85173 2493074
6454 2493074 1167331 473914 4419642 8577790 5350164 -3965810 -9018575 -3682316
6446 -3682316 5968271 9940963 6629422 2850477 3763017 7196480 8126458 5288745 1689696
6437 1689696 256856 823888 1241861 375191 -542036 569003 4113083 8195272 10455335
6428 10455335 10029903 7662513 4712857 2527322 1858387 1906442 669172 -2352327 -4298989
6419 -4298989 -1788949 4187786 8448945 7782158 4824249 3927584 5091924 5026877 3227780
6410 3227780 3040758 5926645 8306507 6258121 753822 -4300520 -7153292 -8313844
6402 -8313844 -7225932 -2846887 2550089 4081733 158380 -5023946 -6387861 -3242350
6394 -3242350 1615429 5636135 7393188 5874538 1689096 -2023809 -2402821 -138343
6386 -138343 1984891 2972659 3700393 3878239 2062138 -1020882 -2140936 304101 4033584
6377 4033584 5836436 4802436 1714834 -2372355 -5440530 -4774004 -245435 4262273
6369 4262273 5019248 2783089 808662 -20956 -1299575 -3352751 -4565362 -4216637 -3092994
6360 -3092994 -1393253 982313 2124723 -263736 -4225292 -4428057 487087 5023214
6352 5023214 4044966 -47697 -841045 3350337 8035904 8945269 6303594 2848213 786034
6343 786034 1174130 3576002 5432815 3871731 -834543 -4960929 -5051754 -889216 5133807
6334 5133807 9968388 11229194 8571874 4384772 1614845 574880 -470921 -1502628
6326 -1502628 -67902 4517551 8711515 8537791 4379259 -63443 -2556727 -3844408
6318 -3844408 -4877415 -5006416 -3544710 -1323108 452753 1871201 3642291 5304807
6310 5304807 5497524 4167338 3143941 3631510 4256102 3254135 1915085 3234395 6624581
6301 6624581 7058599 1805772 -4336658 -4200701 2238291 7552994 6592549 2525224 1202027
6292 1202027 2898569 3136755 4869 -3275317 -3341074 -1171121 -154666 -1471799 -3184043
6283 -3184043 -3271907 -1822308 130939 2405114 4916866 5949195 3432313 -1512784 -4576076
6274 -4576076 -3450030 -1187341 -1999519 -5153701 -6270946 -4000430 -1473486 -615889 838604
6265 838604 4730769 8447220 8462393 5367434 2166126 -415674 -3196267 -4463291 -1152478
6256 -1152478 5483190 9405610 6754221 521042 -3681803 -4273694 -3612288 -2817230 -145913
6247 -145913 5066071 9815315 10837250 9226886 9229888 12460391 15564846 14654889 10384030
6238 10384030 6917789 6729529 8308339 8944365 8133106 7647487 9050763 11598261 12617433
6229 12617433 10471675 7116829 6188377 7935277 8319531 4852852 773890 369874 2378198
6220 2378198 2395518 517863 1207155 5396917 8329452 6870287 3870932 2757459 2396390
6211 2396390 566118 -1467865 -1621536 -1073922 -1838388 -2736208 -1441477 1494950 3922911
6202 3922911 5411438 6386532 6231455 5086300 4886672 5727769 4561565 973119 138849
6193 138849 5184307 10673911 10003874 5808766 5401055 8320836 7410665 1780490 -823455
6184 -823455 3480310 8489124 7833607 3976325 2896853 5469025 8617510 10460585 10114400
6175 10114400 6489790 1347056 -273370 3187147 6096638 2948100 -3740215 -7296201
6167 -7296201 -5956697 -3243031 -1209459 1540385 5480885 8147781 7326775 3782462
6159 3782462 253641 -1051565 -161558 900450 886888 1494045 4458781 6965038 4042152
6150 4042152 -3757644 -9915174 -10860284 -9874392 -9330553 -5500336 3557979 10678817 7926429
6141 7926429 -986498 -4842216 -299599 4799904 3884883 -124482 -1249161 983437
6133 983437 2687104 1340407 -2519485 -6722045 -8716857 -7564292 -5659170 -6165295 -8226467
6124 -8226467 -7457820 -1878475 5303187 9538905 9174824 5435274 700393 -2699455 -4123808
6115 -4123808 -5147423 -6603958 -6244612 -2253127 2354485 3002110 331151 -1045819 -44853
6106 -44853 128008 -1166801 -609042 2384182 3977945 3063453 3408039 5505333 3446793
6097 3446793 -4882140 -11086552 -7024074 2482086 5963323 1419999 -2668698 -1400741
6089 -1400741 606105 -1163172 -3735466 -2604996 952108 2990492 3275247 4215482 6047973
6080 6047973 6947654 6308602 4792136 2475230 -244367 -1179742 1234926 4809051 5747619
6071 5747619 3667251 1743043 1806194 2177775 1199852 164994 924380 2636033 3360845
6062 3360845 3718306 6036299 9895335 11404250 8019500 1895282 -2994274 -5091125
6054 -5091125 -4808294 -1983830 3166082 7696402 8150941 5233019 3021659 3088217 2805187
6045 2805187 500791 -1425239 -596161 1479818 2403083 2802778 3964627 4249789 2109879
6036 2109879 676185 4205716 10576965 12665900 7982646 2050475 484771 2164344
6028 2164344 2892409 2001352 1705252 2392504 2373743 1185632 51420 -373236 -384018 -51572
6018 -51572 326453 -458438 -2705169 -4408163 -3953628 -3018601 -4135554 -6514202 -7425649
6009 -7425649 -6784307 -6572534 -6213813 -3086626 1782198 3453517 453244 -2159514 -194161
6000 -194161 3120561 2033575 -3205356 -7323385 -7751982 -6748846 -6640986 -7294206 -8069627
5991 -8069627 -8352589 -6316244 -1154322 3543692 3054714 -1393522 -3407367 -373932 3047147
5982 3047147 2128428 -1785328 -4657939 -4888596 -2348017 3168129 8982522 9396371 2932306
5973 2932306 -4001362 -5333934 -3456671 -3794002 -5272146 -3315431 664037 1340145 -268538
5964 -268538 2037075 7625394 7969525 510865 -5761207 -3704679 1228296 578076 -3491091
5955 -3491091 -2768028 3079563 6512559 4580318 2605884 4582241 7193490 5772417
5947 5772417 981888 -2967294 -3184901 504968 5869402 8704852 6096946 511796
5939 511796 -2254055 -295394 2211193 1195024 -2137507 -4072994 -3464421 -1883309 -935461
5930 -935461 -1443270 -3360145 -4727462 -2871686 1377035 3078199 -422607 -4599177 -2975887
5921 -2975887 3793526 8245217 5825621 308567 -2104227 -627605 1144501 1868810
5913 1868810 3932549 8353739 12022203 11804345 8774303 5832742 2992274 -1504882
5905 -1504882 -6161389 -6708013 -2781906 80057 -1971952 -4937480 -2740068 2998935
5897 2998935 4522048 -833929 -6635157 -6408349 -1750625 1790304 2810636 3513706 3776882
5888 3776882 1151391 -3777716 -6886195 -6148802 -4017891 -3182738 -3381489 -3701847 -4668875
5879 -4668875 -6138233 -6131137 -4074837 -2455534 -2629655 -1842252 2084946 5748372 4597291
5870 4597291 659936 82300 3297602 4159139 398705 -1769599 2676191 9069537 9905399
5861 9905399 6009056 4043484 5293150 4567408 84115 -3129436 -1717438 621576
5853 621576 -281033 -2190415 -581469 3824112 6243825 4702292 1675391 -241020 -946783
5844 -946783 -1343816 -1754700 -2045469 -2035835 -1982303 -2971927 -5491827 -7329241 -5275731 150674
5834 150674 4409631 4718641 3132866 2213671 1302175 -296527 -393401 1933347 2842906
5825 2842906 -697885 -4689793 -3081288 2995697 7027644 6979840 6862409 8616638 9248432
5816 9248432 7345390 6156516 7823200 9841629 9819851 8991393 8454899 6690431 3765470
5807 3765470 3276332 6474230 8883849 7068365 4712108 6721582 10432793 8904284
5799 8904284 1614125 -4272392 -3757024 -38761 782264 -2807909 -7480121 -9622736 -8060673
5790 -8060673 -3698179 1601618 5927918 8107261 8112705 6960886 5967275 5341016 3636316
5781 3636316 -257188 -4714339 -6705268 -5710010 -4217056 -3880793 -3674795 -2682698 -1800953
5772 -1800953 -1179133 955136 4696409 6654515 4649913 1588611 1229571 2380648 1350382
5763 1350382 -1537810 -2549154 -1011967 -446243 -2715828 -5321463 -5847091 -5457050 -5984359
5754 -5984359 -6383569 -4632425 -1589678 -448800 -2553801 -5423639 -5547144 -2579506 152109
5745 152109 -127772 -1796165 -1002791 2515128 4540135 2329696 -1459436 -2936562 -2404292
5736 -2404292 -2596881 -3606573 -3302172 -1697257 -1161954 -2548989 -4245320 -4907482 -4403922
5727 -4403922 -2511416 474314 2371365 1329672 -1130915 -2260704 -2327877 -3240973 -4020654
5718 -4020654 -2116073 1204241 1792089 -617394 -1652950 572501 2660642 2049382 965168
5709 965168 1658458 2247055 616638 -1306344 -721552 1580196 3140055 3495557 2975494
5700 2975494 777084 -2498363 -3274324 335768 4726267 5430698 3367377 2587340 3832443
$$ [...]
##END NTUPLES=NMR SPECTRUM
##END=
