##TITLE=31Pdec_MTBDP0607
 CDCl3, 24 sc
 7.07.2021
##JCAMPDX= 6.0         $$ Bruker NMR JCAMP-DX V2.0
##DATA TYPE= NMR SPECTRUM
##DATA CLASS= NTUPLES
##ORIGIN= UXNMR, Bruker Analytische Messtechnik GmbH
##OWNER= root
$$ XWIN-NMR		Version 3.5
$$ Wed Jul  7 09:47:04 2021 Russian Standard Time (UT+4h)  she@DPX200
##.OBSERVE FREQUENCY= 81.013821
##.OBSERVE NUCLEUS= ^31P
##.ACQUISITION MODE= SIMULTANEOUS
##.ACQUISITION SCHEME= undefined
##.AVERAGES= 24
##.DIGITISER RES= 16
##SPECTROMETER/DATA SYSTEM= spect
##.PULSE SEQUENCE= zgpg30
##.SOLVENT NAME= CDCl3
##.SHIFT REFERENCE= (INTERNAL, CDCl3, 0, 248.564)
##AUDIT TRAIL= $$ (NUMBER, WHEN, WHO, WHERE, WHAT)
$$ ##TITLE= Audit trail, XWIN-NMR		Version 3.5
$$ ##JCAMPDX= 5.01
$$ ##ORIGIN= Bruker BioSpin GmbH
$$ ##OWNER= she
$$ F:/spectra/data/she/nmr/P31/1/pdata/1/auditp.txt
$$ ##AUDIT TRAIL=  $$ (NUMBER, WHEN, WHO, WHERE, WHAT)
(   1,<2021-07-07 09:45:50.76 +0400>,<she>,<DPX200>,
      <created by zg, POWCHK disabled, PULCHK disabled
       configuration hash MD5:
       00 E9 B6 7A A2 85 ED C7 34 08 36 98 17 FE 4E 26
       data hash MD5: 32K
       13 38 2D CA 93 99 AA C2 8C E0 7D 7E 8C 43 B7 34>)
(   2,<2021-07-07 09:45:53.00 +0400>,<she>,<DPX200>,
      <Start of raw data processing
       efp BC_mod = 2 LB = 1 FT_mod = 6 PKNL = 1 PHC0 = -7416.008 PHC1 = 155.8859 SI = 64K 
       data hash MD5: 64K
       4A A0 BC AA 31 B3 21 21 56 94 1F 33 71 E4 2B DB>)
(   3,<2021-07-07 09:46:08.67 +0400>,<she>,<DPX200>,
      <pk PHC0 = 13.30579 PHC1 = 0 
       data hash MD5: 64K
       F0 2F 2D F1 B0 33 F0 63 B5 67 C2 EB 87 20 A9 39>)
(   4,<2021-07-07 09:46:11.53 +0400>,<she>,<DPX200>,
      <abs ABSG = 5 
       data hash MD5: 64K
       CA F0 81 54 A6 BA A1 F9 BD 3E 5D 9F 3E 58 CB BE>)
$$ ##END=
$$ 
$$ hash MD5
$$ 3E 6A D4 66 D9 35 08 AA 62 7D 4D 1F EE F3 A1 01
##$RELAX= 
##$RELAX= 
##$RELAX= 
##$RELAX= 
##$RELAX= 
##$RELAX= 
##$RELAX= 
##$RELAX= 
$$ Bruker specific parameters
$$ --------------------------
##$DU= <F:/spectra>
##$EXPNO= 1
##$NAME= <P31>
##$PROCNO= 1
##$TYPE= <nmr>
##$USER= <she>
##$AMP= (0..31)
100 100 100 100 100 100 100 100 100 100 100 100 100 100 100 100 100 100 
100 100 100 100 100 100 100 100 100 100 100 100 100 100 
##$AQSEQ= 0
##$AQ_mod= 1
##$AUNM= <au_zg>
##$AUTOPOS= <>
##$BF1= 81.014009
##$BF2= 200.13
##$BF3= 200.13
##$BF4= 200.13
##$BF5= 200.13
##$BF6= 200.13
##$BF7= 200.13
##$BF8= 200.13
##$BYTORDA= 1
##$CFDGTYP= 0
##$CFRGTYP= 5
##$CHEMSTR= <none>
##$CNST= (0..31)
1 1 145 1 1 1 1 1 1 1 1 1 1 1 1 1 1 1 1 1 1 1 1 1 1 1 1 1 1 1 1 1 
##$CPDPRG= <waltz16>
##$CPDPRG1= <>
##$CPDPRG2= <waltz16>
##$CPDPRG3= <>
##$CPDPRG4= <mlev>
##$CPDPRG5= <mlev>
##$CPDPRG6= <mlev>
##$CPDPRG7= <mlev>
##$CPDPRG8= <mlev>
##$CPDPRGB= <>
##$CPDPRGT= <>
##$D= (0..31)
0 1 0 0 0 0 0 0 0 0 0 0.03 2e-05 3e-06 0 0 0 0 0 0 0 0 0 0 0 0 0 0 0 0 
0 0 
##$DATE= 1625636750
##$DBL= (0..7)
120 120 120 11 120 120 24 19 
##$DBP= (0..7)
150 150 150 150 150 150 150 150 
##$DBP07= 0
##$DBPNAM0= <>
##$DBPNAM1= <>
##$DBPNAM2= <>
$$ [...]
##$SUBNAM3= <"">
##$SUBNAM4= <"">
##$SUBNAM5= <"">
##$SUBNAM6= <"">
##$SUBNAM7= <"">
##$SUBNAM8= <"">
##$SUBNAM9= <"">
##$SW= 501.771253377433
##$SWIBOX= (0..15)
0 1 3 0 0 0 0 0 0 0 0 0 0 0 0 0 
##$SW_h= 40650.406504065
##$TD= 32768
##$TD0= 1
##$TE= 0
##$TE2= 300
##$TE3= 300
##$TEG= 300
##$TL= (0..7)
0 120 53 12 22 120 120 120 
##$TP= (0..7)
150 150 150 150 150 150 150 150 
##$TP07= 0
##$TPNAME0= <>
##$TPNAME1= <>
##$TPNAME2= <>
##$TPNAME3= <>
##$TPNAME4= <>
##$TPNAME5= <>
##$TPNAME6= <>
##$TPNAME7= <>
##$TPOAL= (0..7)
0.5 0.5 0.5 0.5 0.5 0.5 0.5 0.5 
##$TPOFFS= (0..7)
0 0 0 0 0 0 0 0 
##$TUNHIN= 0
##$TUNHOUT= 0
##$TUNXOUT= 0
##$USERA1= <user>
##$USERA2= <user>
##$USERA3= <user>
##$USERA4= <user>
##$USERA5= <user>
##$V9= 5
##$VALIST= <valist>
##$VCLIST= <CCCCCCCCCCCCCCC>
##$VD= 0
##$VDLIST= <DDDDDDDDDDDDDDD>
##$VPLIST= <PPPPPPPPPPPPPPP>
##$VTLIST= <TTTTTTTTTTTTTTT>
##$WBST= 1024
##$WBSW= 4
##$XGAIN= (0..3)
0 0 0 0 
##$XL= 0
##$YL= 0
##$YMAX_a= 7231
##$YMIN_a= -7355
##$ZGOPTNS= <>
##$ZL1= 120
##$ZL2= 120
##$ZL3= 120
##$ZL4= 120
##$ABSF1= 248.5645
##$ABSF2= -253.2056
##$ABSG= 5
##$ABSL= 3
##$ALPHA= 0
##$AQORDER= 0
##$ASSFAC= 0
##$ASSFACI= 0
##$ASSFACX= 0
##$ASSWID= 0
##$AUNMP= <proc_1d>
##$AZFE= 0.1
##$AZFW= 0.5
##$BCFW= 0
##$BC_mod= 2
##$BYTORDP= 0
##$COROFFS= 0
##$CY= -3
##$DATMOD= 1
##$DC= 0
##$DFILT= <>
##$DTYPP= 0
##$F1P= 0
##$F2P= 0
##$FCOR= 1
##$FTSIZE= 65536
##$FT_mod= 6
##$GAMMA= 0
##$GB= 0
##$INTBC= 1
##$INTSCL= 5.30512e-09
##$ISEN= 30
##$LB= 1
##$LEV0= 0
##$LPBIN= 0
##$MAXI= 10000
##$MC2= 0
##$MEAN= 0
##$ME_mod= 0
##$MI= 50
##$NCOEF= 0
##$NC_proc= -6
##$NLEV= 6
##$NOISF1= 182.463
##$NOISF2= 159.3651
##$NSP= 0
##$NTH_PI= 0
##$NZP= 0
##$OFFSET= 248.5645
##$PC= 4
##$PHC0= -7402.702
##$PHC1= 155.8859
##$PH_mod= 1
##$PKNL= yes
##$PPARMOD= 0
##$PSCAL= 0
##$PSIGN= 0
##$REVERSE= no
##$SF= 81.014009
##$SI= 65536
##$SIGF1= 159.3651
##$SIGF2= -187.1042
##$SINO= 113.3802
##$SIOLD= 16384
##$SREGLST= <1H.CDCl3>
##$SSB= 0
##$STSI= 65536
##$STSR= 0
##$SW_p= 40650.406504065
##$SYMM= 0
##$S_DEV= 0
##$TDeff= 32768
##$TDoff= 0
##$TI= <>
##$TILT= no
##$TM1= 0
##$TM2= 0
##$TOPLEV= 0
##$USERP1= <user>
##$USERP2= <user>
##$USERP3= <user>
##$USERP4= <user>
##$USERP5= <user>
##$WDW= 1
##$XDIM= 65536
##$YMAX_p= 422875808
##$YMIN_p= -110638597
$$ End of Bruker specific parameters
$$ ---------------------------------
##NTUPLES= NMR SPECTRUM
##VAR_NAME=  FREQUENCY,     SPECTRUM/REAL,   SPECTRUM/IMAG
##SYMBOL=    X,             R,               I
##VAR_TYPE=  INDEPENDENT,   DEPENDENT,       DEPENDENT
##VAR_FORM=  AFFN,          ASDF,            ASDF
##VAR_DIM=   65536,         65536,           65536
##UNITS=     HZ,            ARBITRARY UNITS, ARBITRARY UNITS
##FACTOR=    0.620285442955139, 1,           1
##FIRST=     20137.2065510759, 0,            0
##LAST=      -20513.1999529892, 0,           0
##MIN=       -20513.1999529892, -110638597,  0
##MAX=       20137.2065510759, 422875808,    0
$$ Real data points
##PAGE= N=1
##DATA TABLE= (X++(R..R)), XYDATA
$$ [...]
40590A083759k241856j182328L21908N15184K24742Q13517J566969J019654l78572
$$ 1083759 -1158097 -2340425 -2018517 -1503333 -1278591 -465074 1101895 2121549 1742977
40581A742977r04442k17271M11342K40200j40269j24523J11345K45790K08732
$$ 1742977 838535 621264 1032606 1272806 1132537 1008014 1119359 1365149 1573881
40572A573881j13055o84425r33513m62130P4628j51558o62926l74728M49906N44506
$$ 1573881 1460826 776401 -157112 -619242 -544614 -696172 -1359098 -1733826 -1283920 -739414
40562g39414q1790r8255O06799M93314p20352j035591M68104J523714J52803j681385
$$ -739414 -821204 -919459 -312660 180654 -539698 -1575289 -1107185 416529 569332 -1112053
40552a112053q45797J813485K541612M67447j305823q27691P5853m23345j066843
$$ -1112053 -1957850 -144365 2397247 2864694 1558871 731180 807033 383688 -683155
40543f83155k39398R35447P18420j41521q5304J80358q37461k135167j502386
$$ -683155 -922553 12894 731314 589793 504489 684847 -152614 -2287781 -3790167
40534c790167O10851J606831Q71019L49162Q64040R14006j95742r11640k62448
$$ -3790167 -3179316 -1572485 -701466 -352304 511736 1425742 1230000 318360 55912
40525E5912L87568j81709r91326q24010l07286l70459l46770N36923J232670M43012
$$ 55912 443480 261771 -729555 -1553565 -1860851 -2231310 -2578080 -2041157 -808487 -365475
40515c65475r60699j107515K3135Q29182O57016L30959L92877M74733L48672K25776
$$ -365475 -1326174 -2433689 -2410554 -1581372 -924356 -593397 -200520 274213 622885 848661
40505H48661R8127q2635J05645P35942P58035n18770j729810j044055Q37018J311051
$$ 848661 946788 864153 969798 1705740 2463775 1945005 215195 -828860 8158 1319209
40495A319209l34062j823844j238094M18819J062871M75276L5931L89545P33691
$$ 1319209 985147 -838697 -2076791 -1657972 -595101 -119825 -83894 305651 1039342
40486A039342K05097r22497j490553o41696J095190J986781R07515j099520j866670
$$ 1039342 1244439 321942 -1168611 -1810307 -715117 1271664 2179179 1079659 -787011
40477g87011p39936P80363J188745O20016r1515p76518j464737j509422l80715
$$ -787011 -1526947 -746584 442161 1062177 970662 194144 -1270593 -2780015 -3160730
40468c160730J101367J464001M73083n63311n39083J13354K29555l59969n52335
$$ -3160730 -2059363 -595362 -122279 -685590 -1224673 -1111319 -881764 -1241733 -1794068
40459a794068M18967J648758J570580J94539p12396j19448P29329K76199q62639
$$ -1794068 -1375101 273657 1844237 2038776 1326380 1206932 1936261 2212460 1349821
40450A349821r37188L5139L61938m05582p31884K18906J114211O44862m50230
$$ 1349821 412633 447772 809710 404128 -327756 -108850 1005361 1650223 1199993
40441A199993p67117l22652M2983K43754N50125N12644k76472j002329o25667
$$ 1199993 432876 110224 153207 396961 947086 1459730 1183258 180929 -444738
40432d44738L88992O85593M7436m67854k69819Q1923l2216m78377p38714m44312
$$ -444738 -55746 629847 677283 209429 -60390 21533 -10683 -489060 -1227774 -1672086
40422a672086L76752J096447Q92117j21199p37639k82160L68110K34415j76944
$$ -1672086 -1295334 -198887 693230 572031 -165608 -447768 -79658 154757 -22187
40413b2187O7802N08848N8447r68038j256897o39484j49654p8469K83047R07781
$$ -22187 45615 554463 612910 -355128 -1612025 -2251509 -2401163 -2479632 -2196585 -1288804
40403a288804Q37363K3675l70511J5079J14116n41729q46823n4374Q49466P80465
$$ -1288804 -451441 -427766 -798277 -783198 -669082 -1210811 -2057634 -2112008 -1262542 -482077
40393d82077K19152N5862j3142n84310j031372l83654R00508J437444Q36580p2005
$$ -482077 -262925 -207063 -220205 -804515 -1835887 -2219541 -1319033 118411 954991 882986
40383H82986o16096p77966n64122M1319N93618N66504J38751j19523j21891j18578
$$ 882986 266890 -511076 -1075198 -1033879 -440261 126243 264994 145471 23580 -94998
40373i4998m9168J15088j81302j208053j863907q03166J346662K287796R85908
$$ -94998 -144166 -29078 -210380 -1418433 -3282340 -4085506 -2738844 -451048 534860
40364E34860q93557j154209K52608J542662J462118M21646m78791p12343m77869
$$ 534860 -358697 -1512906 -1260298 282364 1744482 2166128 1687337 974994 497125
40355D97125j49368N5248q087m70745j193678j570749j007603K49589J172467
$$ 497125 347757 403005 394918 -75827 -1269505 -2840254 -3847857 -3598268 -2425801
40346b425801J143472O89945O00245P50023M85622j37232l73516j3339K68766
$$ -2425801 -1282329 -592384 7861 757884 1243506 1106274 732758 719419 988185
40337I88185l6527n96652q45781o49238j48110M46744P02677K65622m43171n27464
$$ 988185 951658 355006 -490775 -1140013 -1288123 -841379 -138702 126920 -316251 -843715
40327h43715R7117M86536J18157l22212j90654J517l83532p82383l16617N41175
$$ -843715 -746598 -260062 -141905 -464117 -654771 -653254 -1036786 -1819169 -2135786 -1594611
40317a594611N45033k99004o69798K8094Q78332J006646O86222M13395M5637m57990
$$ -1594611 -1049578 -1348582 -2018380 -1990286 -1111954 -105308 580914 994309 1039946 581956
40307E81956m81135K04115O99604K50401m57162l16593M32973O07635q7771p81894
$$ 581956 100821 304936 1004540 1254941 797779 481186 914159 1521794 1434023 652129
40297F52129q66187o09465l23127O7710M68519N22260K65671J27965J76260J12054
$$ 652129 -214058 -823523 -1146650 -1078940 -610421 -88161 177510 305475 481735 593789
40287E93789J1831J80847K83626k93934j118785j011264L0573O01517J41308r2246
$$ 593789 605620 786467 1070093 776159 -342626 -1353890 -1323317 -721800 -580492 -672738
40277f72738P51749J424264N67924q09659p15838O78848J274372K28668j031677
$$ -672738 79011 1503275 2071199 1261540 545702 1224550 2498922 2727590 1695913
40268A695913j215087p86050n84678l71757L25157J037001J033067M64873j9746
$$ 1695913 480826 -305224 -889902 -1261659 -936502 100499 1133566 1598439 1578693
40259A578693k70642n01799o02628l00010K46903N87564N57578L25269N0636j97692
$$ 1578693 1308051 806252 203624 -96386 150517 738081 1295659 1620928 1671564 1473872
40249A473872l86361n91260q86301j044171p14873j8668N06285O92682R02286
$$ 1473872 1087511 496251 -390050 -1434221 -2149094 -2167762 -1661477 -968795 -66509
40240f6509J174273R39654N4015n98204k75439L79143K03641o48394q18343J79916
$$ -66509 1107764 2047418 2101433 1503229 1227790 1606933 1810574 1162180 343837 523753
40230E23753J033347M02156j066639j438581p6349J429417J332274J7810o32165
$$ 523753 1557100 1959256 892617 -545964 -622313 807104 2139378 2157188 1525023
40221A525023J17225R39195M71594p45314j151826l64547M94468M46585k52993
$$ 1525023 1642248 2581443 3053037 2307723 1155897 791350 1285818 1732403 1479410
40212A479410o95800l38948N66760J101960M52457r21163j343310L0992J716941
$$ 1479410 783610 444662 1011422 2113382 2565839 1644676 301366 332358 2049299
40203B049299J597917k05968j560964j306271m29110m8198P5239L79644M30266
$$ 2049299 3647216 3441248 1880284 574013 144903 96705 171944 551588 981854
40194I81854m2145l13974R3275M44174P4872l91736j91141J93897o0640o79997
$$ 981854 939709 625735 719010 1163184 1238056 846320 655179 849076 788436 108439
40184A08439q98930p14315m34218J60304J048509J313367N54938l9605M52976
$$ 108439 -790491 -1504806 -1939024 -1778720 -730211 583156 1138094 1098489 1551465
40175A551465Q31224l44104j919859j548350N34074J648206O70263n73346m23931
$$ 1551465 2382689 2038585 118726 -1429624 -895550 752656 1422919 849573 425642
40166D25642L90881N50025J63191j19909m08736q38692q67196l23031O0833M6971
$$ 425642 816523 1366548 1529739 1409830 1001094 162402 -704794 -1027825 -966992 -920021
40156i20021M94731J595527J931860N53418j262145j724156r48722k41966L8734
$$ -920021 -425290 1170237 3102097 3655515 2393370 669214 -279508 -521474 -482740
40147d82740L21557L56464l13269r27147l36998R63284J338127N06527j28208
$$ -482740 -161183 195281 -117988 -1045135 -1382133 -418849 919278 1425805 1297597
40138A297597J73225M50682j34819r06178r00669l80760j95973m09341m70963
$$ 1297597 1470822 1921504 1786685 880507 -20162 -400922 -596895 -1006236 -1477199
40129a477199k63894j19007m2231L00078Q46418J016863N01018k36453n07654
$$ -1477199 -1741093 -1860100 -1902331 -1602253 -755835 261028 762046 525593 17939
40120A7939k39615P5188K01363M55407R33028R53195n7599j389836j670156p05097
$$ 17939 -221676 -146488 54875 510282 1443310 2396505 2338906 949070 -721086 -1426183
40110a426183K71347M47225M19689P66396Q17817r8944j140588j016014K5497
$$ -1426183 -1154836 -707611 -287922 478474 1296291 1197347 56759 -959255 -933758
40101i33758O67487N76482N02762N76952J44409o24855o32841K21926N78465k46796
$$ -933758 -266271 310211 812973 1389925 1534334 909479 276638 498564 1077029 830233
40091H30233j061554o36467M57862Q90865M76494m8544l57421n31870l61829K35938
$$ 830233 -231321 -867788 -409926 480939 957433 908889 551468 19598 -342231 -106293
40081a06293N78729P5730o50992n39072L29990R18451P18664O1293p45314j479394
$$ -106293 472436 548166 -102826 -641898 -311908 606543 1325207 1386500 641186 -838208
40071h38208j479428l28062J008968J061952J429m50679M26318J283779Q24472
$$ -838208 -2317636 -2645698 -1636730 -574778 -573349 -1024028 -597710 686069 1510541
40062A510541k93630o32420p3393L64559J80420k09039l80522k98272M391L99551
$$ 1510541 1216911 584491 511098 875657 1056077 847038 466516 168244 172635 572186
40052E72186N06347J76768j10995N4559K59081j00543p15865p22829j3715O18274
$$ 572186 1078533 1255301 1144306 1198865 1457946 1357403 641538 -81291 -95006 523268
40042E23268O14693J71597l82996r40479j206617p16680M11531J298137J235130
$$ 523268 1137961 1309558 926562 -13917 -1220534 -1937214 -1525683 -227546 1007584
40033A007584M57898k43530m00024j99849j67370n58750r62463p11415J05747
$$ 1007584 1465482 1221952 821928 622079 454709 -104041 -1066504 -1777919 -1672172
40024a672172N18794N2172l55862L11560J376678J260713j37463j264980j225876
$$ -1672172 -1153378 -1101206 -1457068 -1145508 231170 1491883 1354420 89440 -1136436
40015a136436p56021m88877J09690J200640J533213L34278r59767n36594R98303
$$ -1136436 -1892457 -2381334 -2271644 -1071004 462209 796487 -163280 -699874 298429
40006B98429J459217L25343p22817n58683n4504k27169n53162j27066O36403O39037
$$ 298429 1757646 2082989 1360172 801489 746985 519816 -33346 -160412 475991 1115028
39996A115028j77727q31271p53716l26428o285K76797O50171Q23962M81752j32276
$$ 1115028 937301 106030 -647686 -974114 -980399 -703602 -53431 770531 1252283 1120007
39986A120007m24386k23990l237j81318n04562m53110p8405O8442j56918k46770
$$ 1120007 695621 471631 468394 287076 -217486 -670596 -749001 -680559 -837477 -1084247
39976a084247R0409M03063K31625j41774j95831K30N3484q297O0664L8178m61787
$$ -1084247 -993838 -590775 -359150 -500924 -696755 -696525 -643041 -651338 -590674 -552496 -1014283
39965a014283j068803q52886L58894J496692J432955L06825o48764m81997M68929
$$ -1014283 -2083086 -2935972 -2577078 -1080386 352569 659394 10630 -471367 -2438
39956b438J009101N26754k47694k82165K13771R8619q14015j284491n53715M14469
$$ -2438 1006663 1533417 1285723 1003558 1217329 1315948 501933 -782558 -1336273 -921804
39946i21804M92693J70304N38652J291143J222980K75245m41423m63965l57618
$$ -921804 -429111 -258807 279845 1570988 2793968 3069213 2627790 2163825 1806207
39937A806207l67144j43416J60889k3627l95493n1340P71140P49294l89148j307388
$$ 1806207 1439063 1295647 1456536 1432909 1037416 986076 1757216 2506510 2117362 809974
39927H09974j098179m12005m4471J09962J34343l09532p89215j67965J311208
$$ 809974 -288205 -700210 -744681 -634719 -500376 -809908 -1599123 -1767088 -455880
39918d55880J750590M49457p82627m86090J55251l63166j051758k43840J170054
$$ -455880 1294710 1744167 961540 475450 630701 267535 -784223 -1028063 141991
39909A41991J028198l86316p43510M46498J131704K20263q19072o59444j29011
$$ 141991 1170189 783873 40363 486861 1618565 1838828 1019756 360312 231301
39900B31301l35697o63202j10393P41670O64530j79581n90214k30851J19491N366
$$ 231301 -104396 -767598 -877991 -136321 528209 348628 -241586 -472437 -352946 -347580
39890c47580j74057j36038k25233o02415o58088J44646J190271J231294Q9019
$$ -347580 -521637 -657675 -882908 -1485323 -2143411 -1998765 -808494 422800 511819
39881E11819q88043n52409M76212Q13227L87059K51123N11190J10021r68421j127970
$$ 511819 -376224 -928633 -452421 360806 747865 998988 1510178 1620199 651778 -476192
39871d76192K29529J269693M05538j082480j017937K46966O12477l05224q96197
$$ -476192 -246663 1023030 1428568 346088 -671849 -424883 187594 -117630 -1013827
39862a013827m52847M6519R6638K81751M65521k94291j492857j207434P46114
$$ -1013827 -1466674 -1420155 -1323517 -1041766 -576245 -870536 -2363393 -3570827 -2824713
39853b824713J979031J057838l06017j38024P46562N41170l69410l71371L37429
$$ -2824713 -845682 212156 -93861 -231885 514677 1055847 686437 315066 652495
39844F52495J79584p91772p62669P74067J935702J140306o70611j433197o20531
$$ 652495 832079 40307 -722362 51705 1987407 3127713 2457102 1023905 403374
39835D03374M23210L70358o06229j247699p58331L01924P85448L96749j22400
$$ 403374 826584 1196942 590713 -656986 -1415317 -1113393 -327945 68804 -53596
39826e3596k01497r9768j38908r8740J50810J90479j50504k57481K65643P26002
$$ -53596 -255093 -354861 -493769 -592509 -441699 -251220 -401724 -659205 -393562 332440
39816C32440L57440l62212m27100N1802L0679p30772j159574l35356J219795K031056
$$ 332440 689880 327668 -99432 -47630 -16951 -747723 -1907297 -2242653 -1022858 1008198
39806A008198J191435o60506j800096j096168O86695J709835J231417J96858m70283
$$ 1008198 2199633 1539127 -260969 -1357137 -670442 1039393 2270810 2467668 1997385
39797A997385r69372j430273j010090N82825J785217J035780p75248j461143o82445
$$ 1997385 1028013 -402260 -1412350 -829525 955692 1991472 1216224 -244919 -927364
39788i27364k6103j29313J05696J039954J218306j65870j488886q91723R13789
$$ -927364 -953467 -1082780 -977084 62870 1281176 1115306 -373580 -1265303 -351514
39779c51514J659516O83245n18340o80621k19628n4009k02541j59234J06211K25331
$$ -351514 1308002 1991247 1472907 792286 572658 518649 316108 156874 263085 488416
39769D88416J30408N4796p511k64140n33376k85201M60376Q05593Q4254j036923
$$ 488416 618824 673620 666109 401969 -131407 -416608 43768 849361 933615 -103308
39759a03308j272434m16290M57212N44703J89260n7837k87856n64527l01448P84364
$$ -103308 -1375742 -1792032 -1334820 -790117 -600857 -658694 -946550 -1511077 -1812525 -1028161
39749a028161J734249J412624J56781o65124n61283l54310o95752j112860q21262
$$ -1028161 706088 2118712 2275493 1610369 1049086 694776 -976 -1113836 -1935098
39740a935098J72506J078233J092811J33397r18254r20133K05227J217915J126870
$$ -1935098 -1762592 -684359 408452 541849 -376405 -1296538 -1091311 126604 1253474
39731A253474M79897L45078N91186K90921n39981r20392n43473j34199o9628N5742
$$ 1253474 1733371 2078449 2669635 2960556 2420575 1500183 956710 822511 752883 808625
39721H08625K51262j16953r08874q85095M05095J547197J094958l52594j025031
$$ 808625 1059887 942934 34060 -851035 -445940 1101257 2196215 1843621 818590
39712H18590m17552K82967P4908n64308n44182K78536Q99019M86779m66099p52904
$$ 818590 401038 684005 758913 194605 -349577 -71041 827978 1314757 848658 95754
39702I5754j61605J77787m25684r88407l89397O04727L60091r12982j259775K8670
$$ 95754 -65851 111936 -313748 -1302155 -1691552 -1086825 -726734 -1639716 -2899491 -2870821
39692b870821J338782J265271N15880L03674L47499j93142r22330q28223j1227
$$ -2870821 -1532039 -266768 249112 552786 900285 707143 -215187 -1043410 -1054637
39683a054637N51512N31999L87251L08262O5973l20201n89781o82400n56586O487
$$ -1054637 -503125 28874 416125 724387 790360 470159 -119622 -802022 -1358608 -1352121
39673a352121Q25513J126544N89323o4409k11724k60134o30112p40746r0853N39537
$$ -1352121 -526608 599936 1189259 1124850 913126 652992 22880 -717866 -808719 -269182
39663b69182K62902l23051j51065M15713L28127p7973L77834J378813J301697
$$ -269182 -6280 -329331 -480396 -64683 263444 185471 563305 1942118 3243815
39654C243815j10895j161285p45005J82298L43359q9237k53957j5040J68053J6067
$$ 3243815 3132920 1971635 1226630 1408928 1752287 1663050 1409093 1394053 1562106 1578173
39644A578173m46368r22737q50493j25453L03193l73509j256122q31079M72070
$$ 1578173 1131805 209068 -641425 -766878 -463685 -837194 -2093316 -2924395 -2452325
39635b452325O92793m41149q55043N17095J862777J315422k31435q29331m35888
$$ -2452325 -1759532 -2200681 -3055724 -2538629 -675852 639570 408135 -421196 -857084
39626h57084k37136k37366L38030J020688O39766m83595q74872l01917K4295l47072
$$ -857084 -1094220 -1331586 -993556 27132 666898 183303 -691569 -993486 -969191 -1316263
39616a316263n11525m4424K65852l2802k57754R7066N09683M50941J60661q8455
$$ -1316263 -1827788 -1872212 -1606360 -1639162 -1896916 -1799850 -1290167 -839226 -678565 -767020
39606g67020m43788p23813l14994O24384R39483J43005o89706m60670M20998R00198
$$ -767020 -1210808 -1934621 -2249615 -1625231 -685748 -542743 -1232449 -1693119 -1272121 -371923
39596c71923Q40786P49126N98359K5131o79136q10797l43038P2075J02166J5686
$$ -371923 468863 1217989 1816348 1841479 1162343 351546 8508 80583 182749 198435
39586A98435M7396J39176K53157L62106K22830k70466o35695l39372K97073M09441
$$ 198435 245831 385007 638164 1000270 1223100 952634 316939 -22433 274640 684081
39576F84081j67537o44140l93341K83987P07850O03291J27802l95886n66930k18465
$$ 684081 516544 -127596 -520937 -236950 470900 1074191 1201993 806107 239177 20712
39566B0712J38335k55426j200772j395941j06232J517250J656402J97357j064587
$$ 20712 159047 -96379 -1297151 -2693092 -2799324 -1282074 374328 571685 -492902
39557d92902p84075K76184N36577j38144m46479K62029R86427N77409n56084j023419
$$ -492902 -1276977 -1000793 -464216 -602360 -1048839 -786810 199617 777026 220942 -802477
39547h02477l76023M08857M00602j01509k02137L03659P69291O05182m5481n11720
$$ -802477 -1178500 -769643 -369041 -470550 -672687 -369028 400263 1005445 959964 448244
39537D48244l14907K64575L95032k69627r05674m83427N80406O85017o14366j609104
$$ 448244 133337 397912 792944 523317 -382357 -865784 -285378 399639 -214727 -1823831
39527a823831p65012Q60073J021459l63457j091703k0467J343290J319587M19039
$$ -1823831 -2588843 -1728770 -707311 -1070768 -2162471 -2182938 -839648 479939 898978
39518H98978J3774L5809l72132q36140k59143R95499J270310J17579r71455p90513
$$ 898978 912752 948561 576429 -259711 -518854 476645 1746955 1864534 893079 102566
39508A02566K173J85286k69814n54150l31865Q3260L23903J54572m46281r48048
$$ 102566 104739 290025 20211 -533939 -865804 -782544 -458641 -304069 -750350 -1698398
39498a698398n95106M97415J238344J015073M85078L42071J93629m66804j031528
$$ -1698398 -2293504 -1796089 -557745 457328 942406 1284477 1478106 1011302 -20226
39489b0226p03132j1733m0197n13883j80123R51943J330952K09123j131243j196487
$$ -20226 -723358 -735091 -775288 -1289171 -1469294 -517351 813601 1022724 -108519 -1305006
39479a305006k28199M91982M41194P8770j39047j21594J08119L32899J22093n23062
$$ -1305006 -1533205 -1041223 -600029 -521259 -660306 -781900 -673781 -340882 -218789 -741851
39469g41851q61206l40146N34434Q93749O91781M62784K48215l04589r18851p89758
$$ -741851 -1603057 -1943203 -1408769 -515020 176761 639545 887760 583171 -335680 -1125438
39459a125438J25180Q18011N75288j25497m56554l07051l3513K41338M66181K92975
$$ -1125438 -1000258 -182247 393041 267544 -189010 -496061 -529574 -288236 177945 470920
39449D70920l88476q64607l69724O54912R19839M8658q16218n58266M22555Q72990
$$ 470920 82444 -782163 -1151887 -496975 422864 471522 -344696 -902962 -480407 392583
39439C92583M16345j32041p5995K85330L30333R4582Q8726L83854M33681q6066
$$ 392583 808928 676887 600892 886222 1216555 1311137 1399863 1783717 2217398 2131332
39429B131332o84262o56797j00346J64106k17518n40984p9357O96015O86906j48749
$$ 2131332 1447070 790273 689927 854033 636515 95531 16174 712189 1399095 1250346
39419A250346o25723j15316M66546J23340o09452n44235K21260N05169j4698l93499
$$ 1250346 624623 509307 975853 1099193 489741 -54494 166766 671935 657237 263738
39409B63738j12800J14706k87152p22776m66700J57188M23226L29327L02945L63573
$$ 263738 150938 265644 -21508 -744284 -1210984 -1053796 -630570 -301243 1702 365275
39399C65275L14224K55308K34375p3046o62236q00565j03019O30451N42673N6331
$$ 365275 679499 934807 1169182 1096136 433900 -366665 -469684 160767 703440 759771
39389G59771N6281L36077R3745m69039m36079J31183K10823m16060p54258j93230
$$ 759771 816052 1152129 1245874 776835 340756 471939 682762 266702 -487556 -680786
39379f80786O41336R39815O23274l4689p67708j113695p61293k11043j74295l44285
$$ -680786 -39450 900365 1523639 1488950 721242 -392453 -1153746 -1364789 -1539084 -1883369
39369a883369J26835R68858R74034q86o57067k51962M18766N04272J93946j75921
$$ -1883369 -1756534 -787676 186358 185472 -471595 -723557 -304791 199481 393427 217506
39359B17506o98894j021515l97565P05043O76293o78299j366200j77319J270806
$$ 217506 -481388 -1502903 -1900468 -1195425 -519132 -1197431 -2563631 -2740950 -1470144
39350a470144R95510l53125p77170m176O81767P71848P02254L52174o24228j364081
$$ -1470144 -474634 -827759 -1604929 -1609105 -927338 -155490 546764 898938 274710 -1089371
39340a089371o42771R86177J661224P97956l74879q15125o56279k05761M97891
$$ -1089371 -1732142 -745965 915259 1713215 1338336 523211 -133068 -338829 159062
39331A59062R81960N92002l47288q04743n47434k55101k12909r2481P0334n9317
$$ 159062 1141022 1733024 1385736 580993 33559 -221542 -434451 -526932 -456598 -515915
39321e15915j73214K76279Q51935O29106k23190p09016o40554n47466k51736P28439
$$ -515915 -689129 -412850 439085 1068191 845001 135985 -504569 -1052035 -1303771 -575332
39311e75332J535767P31351j170751j940756p99999N56862O18789j11516n66362
$$ -575332 960435 1691786 521035 -1419721 -2219720 -1662858 -1044069 -1155585 -1721947
39302a721947o04837l20143M86613J379650J356160M85682k6639J22856l0589
$$ -1721947 -2326784 -2646927 -2160314 -780664 575496 1061178 1034539 1157395 1126806
39293A126806o07548m51425N26353P80222j70900p74349l00629k05956j152325
$$ 1126806 519258 67833 594186 1374408 1203508 429159 128530 -77426 -1229751
39284a229751j260371N93070K164905J147319r40718j121199L41962Q02152k43391
$$ -1229751 -2490122 -1897052 267853 1415172 474454 -646745 -304783 497369 253978
39275B53978p96137j11786L60503p9366l34063J39947L90196K976l9908P42727
$$ 253978 -542159 -653945 -293442 -372808 -706871 -566924 -176728 -173752 -213660 529067
39265E29067J362901J006052J81126l47135n18517m68792k10775o1062l08259
$$ 529067 1891968 2898020 3079146 2732011 2213494 1744702 1533927 1472865 1164606
39256A164606m44212J21377P45028L10198q54289j327184p87247k74140k83601
$$ 1164606 720394 841771 1586799 1896997 1042708 -284476 -1071723 -1345863 -1629464
39247a629464k55650j3881k246L1339P91735J671921J160071n54770j337577j78836
$$ -1629464 -1885114 -1898995 -1901241 -1869902 -1078167 593754 1753825 1199055 -138522 -317358
39237c17358J312680J383466M37877j81094k72739m78223r55884j343627j282056
$$ -317358 995322 2378788 2816665 2635571 2362832 1884609 928725 -414902 -1696958
39228a696958m61189R38101J656500N60433j313136j595134N7722J334179P60566
$$ -1696958 -2158147 -1220046 436454 996887 -316249 -1911383 -1853661 -519482 241084
39219B41084k30252O9593R38657Q28710R177l03340j76402l79252n87807j02159
$$ 241084 10832 80425 1019082 1847792 1856969 1553629 1377227 997975 410168 308009
39209C08009M69648J61721m14804m6878P40211M14596p89944j023781J50666R88435
$$ 308009 777657 939378 524574 477696 1217907 1632503 842559 -181222 -30556 957879
39199I57879L30484p19061p12952N6370M32220K51078K00484M55482M83120k774
$$ 957879 1288363 569302 -143650 -87280 344940 596018 796502 1251984 1735104 1732330
39189A732330o27452r14842q43028p39078p70201o64575n9501Q91790J536826
$$ 1732330 1104878 190036 -652992 -1392070 -2162271 -2826846 -2886347 -1994557 -457731
39180d57731J452972Q49212J30371n00746q31064o00713j8515K47548j4667k49693
$$ -457731 995241 1844453 1974824 1474078 643014 42301 23786 271334 256667 6974
39170F974j36701j41346m86378m43731M46696J231900P88870l37822o56914N243
$$ 6974 -129727 -271073 -757451 -1201182 -754486 477414 1266284 928462 271548 276791
39160B76791L55210k38878q39859n35405K02916L81263o1328l30282O5185P26189
$$ 276791 632001 393123 -446736 -982141 -779225 -397962 -459290 -789572 -724387 1802
39150A802Q41768Q9554q86972j047728k03772O10789M13039m25100p38835j67761
$$ 1802 843570 933124 46152 -1001576 -1205348 -594559 -181520 -606620 -1345455 -1513216
39140a513216N44693P51264O28831N89620O14580M47416P2197k34128j97507J15436
$$ -1513216 -968523 -217259 411572 1001192 1615772 2063188 2135385 1901257 1703750 1819186
39130A819186K34340j80506o94463n11428K77247N80629j28688r60729r83396
$$ 1819186 2053526 1873020 1178557 667129 944376 1525005 1396317 435588 -547808
39121e47808n76790m73529l33201M09846R94599L03879r53599q80921O78825J682144
$$ -547808 -1124598 -1598127 -1931328 -1521482 -526883 -223004 -1176603 -2057524 -1378699 303445
39111C03445Q71006m62701n72891K96932P17883K99874j49525j11137J39424K66466
$$ 303445 1174451 711750 138859 435791 1153674 1453548 1304023 1192886 1332310 1598776
39101A598776K44223R3894j52712l41426m35340o19813q43668o44036J48938R09083
$$ 1598776 1842999 1936893 1784181 1442755 1007415 387602 -456066 -1100102 -951164 -42081
39091d2081R06067K22031m66278p53291p01268m09113J03155O36587Q35964N31954
$$ -42081 863986 1086017 619739 -133552 -834820 -1243933 -1140778 -504191 331773 863727
39081H63727q8734o15667o87779l17897L0033m9129k95188m4010Q27735J609064
$$ 863727 774993 159326 -528453 -846350 -816317 -865446 -1160634 -1204644 -376909 1232155
39071A232155J540527N54408q19440j848276j861051p34584O64496J122572M80822
$$ 1232155 2772682 3327090 2507650 659374 -1201677 -1936261 -1271765 -149193 331629
39062C31629j70919l8024L18334L4314n73779m67070M38986R85782L23719q91852
$$ 331629 160710 122686 441020 475334 -98445 -565515 -126529 859253 1182972 291120
39052B91120j223114j29411J360425J735478P36635k51944J03794J235877J311650
$$ 291120 -931994 -1061405 299020 2034498 2771133 2519189 2622983 3858860 5170510
39043E170510j63824j451071r74445L65485N21837o52769j311461n51150K96514
$$ 5170510 5006686 3555615 2581170 2946655 3468492 2815723 1504262 953112 1249626
39034A249626l9149p48992m61192L71895K61986p14208r42085O7007Q38225L43247
$$ 1249626 1210477 461485 293 372188 634174 -80034 -1022119 -955112 -116887 226360
39024B26360l59110M9573R51688Q34453k93867j069621r36862n96841m08290J00919
$$ 226360 -132750 -83177 868511 1702964 1409097 339476 -597386 -1194227 -1602517 -1501598
39014a501598Q85291R92247P2505q75169q74938j35789O60908J234952J325568
$$ -1501598 -616307 375940 448445 -426724 -1301662 -1437451 -776543 458409 1783977
39005A783977N21615p90333j321066n66717L37483L34233J3579L68742R35439
$$ 1783977 2305592 1515259 194193 -372524 -35041 299192 312771 681513 1616952
38996A616952N72875n26932j066749n77963J51892L98360J42656l94930q55756
$$ 1616952 2189827 1662895 596146 18183 170075 568435 711091 316161 -539595
38987e39595o61053J93849O57706l1515j008751r47662k8621N75451O31978P44124
$$ -539595 -1200648 -1006799 -349093 -380608 -1389359 -2337021 -2365642 -1790191 -1158213 -414089
38977d14089P96248K39614l89807j08285N38527J47095r11970p56701P85031J527999
$$ -414089 382159 621773 231966 123681 662208 809303 -102667 -859368 -74337 1453662
38967A453662K87532j248083j124170K05876J058862Q86317K42312l80369o18698
$$ 1453662 1741194 493111 -631059 -425183 633679 1519996 1762308 1381939 763241
38958G63241k32256J84497l23488j304156j131455L42806J201753M44840m44009
$$ 763241 530985 715482 391994 -912162 -2043617 -1700811 -499058 -54218 -498227
38949d98227j49719L45377o1820l35107O67561J659133Q60402q74097j386186
$$ -498227 -647946 -302569 -364389 -699496 -31935 1627198 2487600 1613503 227317
38940B27317o31425k33880m53549k00069M86545N57696K18826N51079J111127
$$ 227317 -404108 -637988 -1091537 -1291606 -805061 -247365 -28539 522540 1633667
38931A633667M77786q95904j043847J47596O40347k71570r02307l28549R4071
$$ 1633667 2111453 1215549 171702 319298 959645 688075 -214232 -542781 -448710
38922d48710n20611q73570j994P47264M9384r79585o45785N36026R30347N20081
$$ -448710 -969321 -1842891 -1844885 -1097621 -1048237 -2027822 -2673607 -2137581 -1207234 -687153
38912f87153N27586J044553R93888J13707p07564r47398q87204o13687J20098
$$ -687153 -159567 884986 1878874 1992581 1285017 337619 -549585 -1163272 -1043174
38903a043174R62190J009743L1594j132972j570977j135533k58730N64041J047029
$$ -1043174 -80984 928759 960353 -172619 -1743596 -2879129 -3137859 -2573818 -1526789
38894a526789J195817J114745O88782j83163r74703q43342J11791O76598J70547
$$ -1526789 -330972 783773 1472555 1289392 314689 -528653 -416862 259736 430283
38885D30283n09718k92742L54374K35247n18181n61268M66400J194657N13975
$$ 430283 -79435 -372177 -17803 217444 -300737 -862005 -395605 799052 1313027
38876A313027p09787q31008J94418P31073j45615j222309q53300N51745R96597
$$ 1313027 603240 -227768 -33350 697723 552108 -670201 -1523501 -971756 24841
38867B4841j12946q96276K43222K002535J852094k89980j881379j289759K85536
$$ 24841 -88105 -984381 -741159 1261376 3113470 2823490 942111 -347648 -62112
38858f2112R69026O62518L56879K72058l5210m77770n82399m21319m00498m15372
$$ -62112 906914 1569432 1926311 2198369 2163159 1685389 1102990 681671 281173 -134199
38848a34199q0593M42756O37904M78098L84666M52840L26985j74795p44832r11475
$$ -134199 -214792 227964 865868 1343966 1728632 2181472 2508457 2333662 1588830 677355
38838F77355n19671L987m9225p18629r55832M2528J278416R99502n89431j296495
$$ 677355 157684 161671 112446 -606183 -1562015 -1519487 -241071 758431 169000 -1127495
38828a127495k27406P23276q3794j241171n14338J399323J779811N5046j439412
$$ -1127495 -1354901 -631625 -715419 -1956590 -2470928 -1071605 708206 763252 -676160
38819f76160j052122J22264M70089J90670K79360O15957L90762l60439p85625
$$ -676160 -1728282 -1606018 -1135929 -945259 -665899 -49942 340820 -19619 -805244
38810h05244m20190L75940R17957O98307k62930j244771j373504n75576L89694
$$ -805244 -1225434 -849494 68463 766770 503840 -740931 -2114435 -2690011 -2300317
38801b300317R12942J017053Q30805L14741k92062m79451k17949o1997k40503
$$ -2300317 -1387375 -370322 460483 775224 483162 3711 -214238 -276235 -516738
38792e16738l15359l3175J91799K3214k24469j65228J02637L90363P47275J012290
$$ -516738 -832097 -865272 -673473 -650259 -874728 -1039956 -937319 -546956 200319 1212609
38782A212609P02028j81936q59611p91506l89957j92872K2793O35154J254489
$$ 1212609 1914637 1732701 873090 81584 -308373 -501245 -478452 156702 1411191
38773A411191J194962N01156k27537p45120j178470j367286r40120l6937O42841
$$ 1411191 2606153 3107309 2879772 2134652 956182 -411104 -1351224 -1388161 -745320
38764g45320O19504J25184j99843P1753P10344R19365J67683j002375j478128
$$ -745320 -125816 -632 -200475 -128722 581622 1500987 1668670 666295 -811833
38755h11833r84128l14465J5118M03294R93191R75972k0299q27357k87341Q12660
$$ -811833 -1795961 -2110426 -2095308 -1692014 -698823 277149 256850 -570507 -857848 -45188
38745d5188Q22557k18421p50483k64724N9425m37853p75991j29114P41575Q38912
$$ -45188 777369 558948 -191535 -456259 -396834 -834687 -1610678 -1739792 -998217 -159305
38735a59305N07701M96504M07665n21318j655095j481237J38955J530379J338422
$$ -159305 348396 844900 1252565 731247 -923848 -2405085 -2266130 -735751 602671
38726F02671J29937o32272m97817k35343m65698q10412n59889K34111P36203L76440
$$ 602671 732608 100336 -397481 -632824 -1098522 -1908934 -2468823 -2234712 -1498509 -1122069
38716a122069m18670p59188l59454K30661L89513J05986j35408O0761N48063O88272
$$ -1122069 -1540739 -2299927 -2659381 -2428720 -2039207 -1933221 -2068629 -2007868 -1459805 -771533
38706g71533N3179p90749o58387O66609J755429J225176l21863j114169p03749
$$ -771533 -718354 -1509103 -2167490 -1500881 254548 1479724 1157861 43692 -660057
38697f60057k79217m42056k96975O42136J217407M17628q29087j011154k79235
$$ -660057 -939274 -1381330 -1678305 -1036169 181238 598866 -230221 -1241375 -1520610
38688a520610J06861r2019n2162M17580O58948M82086K93580J7981o82975j175026
$$ -1520610 -1413749 -1505768 -1557930 -1140350 -481402 684 294264 312245 -370730 -1545756
38678a545756m12825J097677J535433M07757o33581l04860N16103M80747j38155
$$ -1545756 -1958581 -860904 674529 1082286 448705 143845 659948 1140695 1002540
38669A002540l21169j74215m54553r36150p52691k6723K50622j07459k10019L58742
$$ 1002540 681371 507156 52603 -883547 -1636238 -1662961 -1412339 -1519798 -1729817 -1371075
38659a371075Q46571N83315J9553o8063J88988K6587o33990q59638o259J100507
$$ -1371075 -524504 58811 78364 10301 199289 225876 -408114 -1267752 -1274011 -173504
38649a73504R91562m06072j415625q20833M30375P37343K90485M31818J007973
$$ -173504 818058 411986 -1003639 -1824472 -1394097 -656754 -366269 65549 1073522
38640A073522M69613j146430j645490p5813J452534R08359n80406p78866J07914
$$ 1073522 1543135 396705 -1248785 -1324598 127936 1036295 455889 -322977 -215063
38631b15063L51384j5599L95746J251024P73856q61574j309010J80963J424597
$$ -215063 136321 120722 516468 1767492 2541348 1679774 370764 551727 1976324
38622A976324P45900o27479r35850n49797o19066p71441k6453J154445J494056
$$ 1976324 2722224 2094745 1158895 609098 -9968 -781409 -807862 346583 1840639
38613A840639Q11556j45759j051948j814325j757229m61084J057338J361325M84619
$$ 1840639 2652195 2506436 1454488 -359837 -2117066 -2578150 -1520812 -159487 325132
38604C25132l28203m03598o8769L10370N97380M88573j12767n97196m31080l4225
$$ 325132 -3071 -406669 -475438 -165068 432312 920885 808118 210922 -220158 -254383
38594b54383K4860J16566P22459J146907M45689p90607j085937k85555L91742
$$ -254383 -229523 -112957 609502 1756409 2202098 1411491 325554 39999 431741
38585D31741L94624L63071N46134L03724m69313q80908n04565o1766j51627m19947
$$ 431741 826365 1189436 1735570 2039294 1569981 689073 184508 122742 -28885 -448832
38575d48832m32027k95951m9892M46048O89999r5477j354164j393705J36258J406099
$$ -448832 -880859 -1176810 -1226702 -780654 -90655 -186132 -1540296 -2934001 -2797743 -1391644
38565a391644R55304k91523o74789j82895J85081L47445Q06879J114913L82345
$$ -1391644 -436340 -727863 -1402652 -1585547 -1400466 -1053021 -246142 868771 1251116
38556A251116r56685j427034n61304N77608R63642O10355m0324o97542j023219
$$ 1251116 294431 -1132603 -1693907 -1116299 -152657 457698 417374 -280168 -1303387
38547a303387p20405m9971L46108K41644K702O4974O17766J472732J822267P53265
$$ -1303387 -2023792 -2073763 -1727655 -1486011 -1483309 -1418335 -800569 672163 2494430 3247695
38537C247695j309864k426639j418401L79697Q96491J77260j22081M36399P13296
$$ 3247695 1937831 -488808 -1907209 -1527512 -631021 -453761 -575842 -139443 573853
38528E73853L38559K75782O93523L89060r20793j726666j168095m58850n96251
$$ 573853 912412 1188194 1881717 2270777 1349984 -376682 -1544777 -2003627 -2599878
38519b599878n15637P58394J805852Q75603r38909j097731M17711J129711L8389
$$ -2599878 -3115515 -2357121 -551269 324334 -614575 -1712306 -1294595 -164884 -126495
38510a26495r75023l36811Q69348Q99104P33l58243J51874N54206K38853l54682
$$ -126495 -1101518 -1438329 -568981 330123 330856 -27387 124487 678693 917546 562864
38500E62864n76670k99912J64110M26338L25322M3253k09216n30561r55777r52062
$$ 562864 -13806 -313718 -149608 276730 602052 645305 436089 -94472 -1050249 -2002311
38490b002311n6152J027736R81070k20136j013419m00430O41256P17050Q6541
$$ -2002311 -2058463 -1030727 -49657 -269793 -1283212 -1683642 -1042386 -325336 -238795
38481b38795L7997P34016R76994J00943j013605j170794l80297L41824L51059
$$ -238795 -200798 533218 1510212 1611155 597550 -573244 -953541 -611717 -260658
38472b60658O0277J73461N47181L06110p24215j308815l08417J430905J847346
$$ -260658 -200381 -26920 520261 826371 102156 -1206659 -1515076 -84171 1763175
38463A763175M44612r55482p70165K74317N61626m046l18136r8753q6710m68511
$$ 1763175 2207787 1252305 482140 756457 1318083 1314037 995901 897148 810438 341927
38453C41927n32260j5190M13589L10090R6969J64876J55534l78307j158128j467820
$$ 341927 -190333 -205523 208066 518156 615125 780001 935535 557228 -600900 -2068720
38443b068720r54042Q7184R76734J141827O16003N5302J9525L52566N26885L65081
$$ -2068720 -3022762 -2935578 -1958844 -817017 -201014 -145712 -126187 226379 753264 1118345
38433A118345Q4199j10611j22973M3667R8645k79903p28341m56149L77250N52845
$$ 1118345 1202544 1091933 968960 1012627 1111272 831369 103028 -353121 24129 576974
38423E76974k34682n26000N88683J572652O45266j123302j211443L56382R89163
$$ 576974 342292 -183708 404975 1977627 2622893 1499591 288148 644530 1633693
38414A633693l50227j574568p90447J049380J935987J444794M06994n55660j030611
$$ 1633693 1283466 -291102 -1081549 -32169 1903818 3348612 3755606 3199946 2169335
38405B169335o33191J78902K83649l79528o19303j38208j25934q88838r27519
$$ 2169335 1536144 1715046 1998695 1619167 999864 861656 735722 -153116 -1080635
38396a080635L63952J181057J99047j004250n06226P63387Q11839N4792K54544
$$ -1080635 -716683 464374 663421 -340829 -847055 -83668 728171 782963 1037507
38387A037507J110389Q58546l68466p44555o4140L7280p50613q47647K01392Q07026
$$ 1037507 2147896 3006442 2637976 1893421 1829281 1866561 1115948 268301 469693 1276719
38377A276719J40432n51448l05799P9985q8227r7376M90874O71904k47860j235459
$$ 1276719 1417151 865703 559904 639889 551662 454286 945160 1617064 1369204 133745
38367A33745j077917j26811N21521N10426Q8590m34998m91372L32986J222351
$$ 133745 -944172 -1070983 -549462 -39036 49554 -385444 -876816 -543830 678521
38358F78521Q28369n47533j073194j86865N62409J78449l10343o5129j0286p79403
$$ 678521 1506890 959357 -113837 -300702 261707 440156 129813 64684 54398 -725005
38348g25005j110783n6089J024905O73397r1097L65754J251243O84229q97204
$$ -725005 -1835788 -1891877 -866972 -193575 -284672 81082 1332325 2016554 1119350
38339A119350j301225r2996R48278P82504K60086J76882J77518p9703l04134l88408
$$ 1119350 -181875 -274871 673407 1455911 1715997 1892879 2070397 1990694 1686560 1298152
38329A298152m88796k83702M91212R55130Q8822j318101j434252j12279Q84572
$$ 1298152 809356 525654 1016866 1971996 2060818 742717 -691535 -803814 80758
38320H0758N28584l22880p03309p73466q34147o25812j13598L15642P13291J306607
$$ 80758 609342 286462 -416847 -1190313 -2024460 -2650272 -2763870 -2448228 -1734937 -428330
38310d28330J354836m4337j880895j967917k01136J025020M13466m14404J51925
$$ -428330 926506 882169 -998726 -2966643 -3167779 -2142759 -1729293 -2143697 -1991772
38301a991772J118054Q72731p0080k92728q444k65809o90404k02090P34922P61829
$$ -1991772 -873718 -987 -71067 -363795 -372239 -638048 -1328452 -1530542 -795620 -33791
38291c3791R6960J73109R36537P36482p72110j723006q30461O59404R07110M6939
$$ -33791 63169 236278 1172815 1909297 1137187 -585819 -1416280 -756876 150234 197173
38281A97173m45133n9100L99912L53794J36032J52075K82669K94433J70925j53098
$$ 197173 -247960 -307060 92852 446646 582678 734753 1017422 1311855 1482780 1329682
38271A329682p76084j285454q84612L98417J199354L91001j137147j411569j31759
$$ 1329682 553598 -731856 -1616468 -1218051 -18697 372304 -764843 -2176412 -2308171
38262b308171Q51088L07561n89174l37184M36027L06854k12898M50663J804299
$$ -2308171 -1457083 -1149522 -1738696 -2075880 -1639853 -1332999 -1545897 -1095234 709065
38253G09065J629606l01691j460501l94574J073161Q47428l73703p95300m88597
$$ 709065 2338671 2036980 576479 181905 1255066 2102494 1728791 933491 444894
38244D44894n89567q97947m74468K91079L35364j5735L33524J080828R59151m1713
$$ 444894 -144673 -1042620 -1517088 -1226009 -890645 -906380 -572856 507972 1467123 1425410
38234A425410p88114r76595j094299q26611L81785J486165R04384o44900q51941
$$ 1425410 637296 -339299 -1433598 -2260209 -1878424 -392259 512125 -132775 -984716
38225i84716M47902R21376k87426j040929J10284J372045O86149q75542r46392
$$ -984716 -536814 384562 97136 -943793 -833509 538536 1224685 349143 -597249
38216e97249L83933J011162K12857n82085k26560O71201Q72527J8673j103479
$$ -597249 -213316 797846 1010703 428618 202058 873259 1745786 1764459 660980
38207F60980j260063J8401J603115J800876N56109l87055j8827N54889J31175
$$ 660980 -599083 -580682 1022433 2823309 3379418 2992363 2973536 3528425 3659600
38198C659600o03123m32833K36387K01914m32172o51005m18258m98646p79033
$$ 3659600 3056477 2623644 2860031 3061945 2629773 1978768 1560510 1061864 282831
38189B82831l98046N86103J104041O43389k71817j065148j492045j257837l48798
$$ 282831 -115215 470888 1574929 2218318 1946501 881353 -610692 -1868529 -2217327
38180b217327M78577N64069L59279N58730P66630K78913l77253j78794N51786
$$ -2217327 -1738750 -1174681 -815402 -256672 509958 788871 411618 232824 784610
38171G84610O41118Q2819j25162N8000k71245j012219r87364l0001O27725L90081
$$ 784610 1425728 1508547 1383385 1441385 1170140 157921 -829443 -859444 -231719 158362
38161A58362M3433R4533K8562l24544l23670O8793K2649m57575k28955R09583
$$ 158362 201795 296328 324890 346 -323324 -254531 -231882 -689457 -918412 -8829
38151h829J495566O29391n96469q33805k78672J69341K60481N9720m89924r16335
$$ -8829 1486737 2116128 1519659 685854 407182 576523 837004 896724 406800 -509535
38141e09535m28317N81473P22004r8772l44489M15049N45226o90931j438102k36223
$$ -509535 -937852 -356379 365625 266853 -77636 337413 882639 191708 -1246394 -1482617
38131a482617J352782J224901O8946j59970L87189K26612m33031j97943O57704
$$ -1482617 -129835 1095066 1164012 1004042 1391231 1617843 1184812 986869 1644573
38122A644573N49431n35059j046114o26233m40773p53436n09702M71779J062217
$$ 1644573 2194004 1658945 612831 -13402 -454175 -1207611 -1717313 -1245534 -183317
38113a83317Q39216N52086M03592j32974o68091k09654O89974L83155r40282j200304
$$ -183317 655899 1207985 1611577 1478603 810512 600858 1290832 1673987 733705 -466599
38103d66599J11649R70157K53628m39078K02642Q41643K2795j065242o29239N66228
$$ -466599 -354950 615207 868835 429757 632399 1474042 1496837 431595 -197644 368584
38093C68584N65154l75810l70858O41869O68206r23724k083388j036349J122732
$$ 368584 933738 557928 187070 828939 1497145 573421 -1509967 -2546316 -1423584
38084a423584J978556R39730m10917p18473l77101l55801m91738N0248R88003
$$ -1423584 554972 1494702 1083785 365312 -11789 -367590 -859328 -809080 178923
38075A78923R88696r8066n54639N69124J511164K89002j877713k047535o7122
$$ 178923 1167619 1069553 514914 1084038 2595202 2884204 1006491 -1041044 -1108166
38066a108166J156307K09258q64656k12654R30242P40539q7685L5440N96791P5315
$$ -1108166 48141 257399 -607257 -819911 110331 850870 763185 798625 1395416 1470731
38056A470731j093235j121366J47615J105235R48913L95376l7202o00368j117594
$$ 1470731 377496 -743870 -596255 508980 1457893 1853269 1816067 1215699 98105
38047I8105q74103P4334P76190O89978R3480o25982j053277n56228P54402J418968
$$ 98105 -775998 -701664 74526 764504 857984 232002 -821275 -1377503 -623101 795867
38037G95867M41896q67814o18906O23618O71246o39454j123544P3773J024663
$$ 795867 1237763 369949 -248957 374661 1045907 406453 -717091 -643318 381345
38028C81345K45207q96148m92135R54439J597601R78064l950q78414j660758j756274
$$ 381345 626552 -269596 -761731 192708 1790309 2768373 2764423 1886009 225251 -1531023
38018a531023n22898J253010J889230R06619m73548r93243n90735J07496O41902
$$ -1531023 -2053921 -800911 1088319 1994938 1521390 528147 -62588 44908 686810
38009F86810Q02172N07087m8109m50770m82540l07263k05842k48285k04249K43037
$$ 686810 1488982 1996069 1947960 1497190 1014650 707387 501545 253260 49011 292048
37999B92048J027905J485184R88991j21925p62561m65345M206k45167j003897
$$ 292048 1319953 2805137 3794128 3672203 2909642 2444297 2448503 2203336 1199439
37990A199439j339772q49185j7030M59367K96704k30164m68167J5367P60207P73644
$$ 1199439 -140333 -989518 -1006548 -547181 -250477 -480641 -948808 -933441 -173234 600410
37980F00410r8571p45498l02189N32579N69805L1768J61551J038894J183113j88688
$$ 600410 501839 -243659 -545848 -13269 556536 588304 749855 1788749 2971862 2783174
37970B783174j708135j590298o6984J011400O80191j46784k65753K48070N41126
$$ 2783174 1075039 -515259 -582243 429157 1109348 962564 696811 944881 1486007
37961A486007L50402J56397K48119L27743R6551k82900n06308n39963m50341j13801
$$ 1486007 1836409 1992806 2240925 2568668 2665219 2382319 1876011 1336048 885707 771906
37951G71906N07512R29877M99502o44817j385158q37555M34586R75265K74380
$$ 771906 1279418 2209295 2708797 2063980 678822 -158733 275853 1251118 1525498
37942A525498n46839k56476Q18704J332323Q16142J22501m4629k4254k47856l70267
$$ 1525498 978659 722183 1540887 2873210 3689352 3811853 3767224 3742970 3495114 3124847
37932C124847n8149J64139k21943o65811m19984N4376j75469p45149m73317M84914
$$ 3124847 3066698 3230837 3008894 2343083 1923099 1977475 1802006 1056857 583540 1068454
37922A068454O61487k70422q37804k38626L03510k09979o00083N24037K088834
$$ 1068454 1729941 1459519 621715 383089 686599 476620 -123463 400574 2489408
37913B489408J887242l6009j392388r31108K13632P14546P81581R89811Q64442
$$ 2489408 4376650 4340641 2948253 2017145 2230777 2945323 3726904 4716715 5581157
37904E581157k32769j621494j823427m01973J369952J766802L94369j285984j413688
$$ 5581157 5348388 3726894 1903467 1501494 2871446 4638248 5032617 3746633 2332945
37895B332945J23300J459673J112870q8843l42875M51405P46065q0708p96457
$$ 2332945 2456245 3915918 5028788 4939945 4597070 5048475 5794540 5713832 4917375
37886D917375l64770M92575N65154q0268n13667l85728p8007J03047J12231j24222
$$ 4917375 4552605 5045180 5610334 5530066 5016399 4630671 4552664 4655711 4767942 4643720
37876D643720n38282o75170j24739R08241J718581J641287N01630j054913j752367
$$ 4643720 4105438 3430268 3305529 4213770 5932351 7573638 8075268 7020355 5267988
37867E267988q87742O11509J142772N32117J54245O94677J092321M34766l70249
$$ 5267988 4380246 4991755 6134527 6666644 6820889 7515566 8607887 9042653 8672404
37858H672404l3386R42176J013146L5995n74709n4751P55875R20426O56402N76786
$$ 8672404 8639018 9581194 10594340 10630335 10055626 10000875 10756750 11677176 12333578 12910364
37848A2910364O10815L37766j71827m58054l28835N710K62435K56110q3039o00925
$$ 12910364 13521179 13858945 13687118 13229064 12900229 12905939 13168374 13424484 13341445 12740520
37838A2740520r20152p36992j05093O27219J112411J226067J054428O92801J37853
$$ 12740520 11820368 11083376 10978283 11605502 12717913 13943980 14998408 15691209 15829062
37829A5829062m83267o99653j18633Q64831J291421Q65127M44264Q09959J431436
$$ 15829062 15345795 14646142 14527509 15392340 16683761 17548888 17993152 18803111 20234547
37820B0234547J231553K96590j53999M39922J202300J206378P58674O71048R62837
$$ 20234547 21466100 21762690 21608691 22048613 23250913 24457291 25215965 25887013 26849850
37811B6849850J138316J279798J851047K592926K690193K159497K031395K789204
$$ 26849850 27988166 29267964 31119011 33711937 36402130 38561627 40593022 43382226
37803D3382226L622808L819985L931173M682457N604069N917374O110716P193962
$$ 43382226 47005034 50825019 54756192 59438649 65042718 70960092 77070808 84264770
37795H4264770Q816232R802400J0420655J2182507J5092998J7192416J7683547
$$ 84264770 93081002 102883402 113304057 125486564 140579562 157771978 175455525
37788A75455525J8462927K1144666K4401013K6117121K6637919K7575797K8463520
$$ 175455525 193918452 215063118 239464131 265581252 292219171 319794968 348258488
37781C48258488K7124175K2807398J6453835Q231912k313207j3424137k1420212
$$ 348258488 375382663 398190061 414643896 422875808 420562601 407138464 385718252
37774C85718252k4912175k6356230k8164295k9442612k8154827k4646675k1112665
$$ 385718252 360806077 334449847 306285552 276842940 248688113 224041438 202928773
37767B02928773j8788984j7384870j6352411j5196624j3329841j0963549r370508
$$ 202928773 184139789 166754919 150402508 135205884 121876043 110912494 101541986
37760A01541986r095819q867795p520436n885388n274813n172167m258277k910008
$$ 101541986 92446167 83578372 76057936 70172548 64897735 59725568 55467291 52557283
37752E2557283k656590l566916m123248l567686k632441j973814j503120j293631
$$ 52557283 49900693 46333777 42210529 38642843 36010402 34036588 32533468 31239837
37744C1239837j615953k003036j697046j026215r32407j236563r51038k58866
$$ 31239837 29623884 27620848 25923802 24897587 23965180 22728617 21777579 21518713
37736B1518713l93448j356902j606951n16133N65112L74712o37496j422810j642371
$$ 21518713 21125265 19768363 18161412 17645279 18210391 18585103 17947607 16524797 14882426
37727A4882426j211175j986J250135J216552l938n96826K95563J157374N45050
$$ 14882426 13671251 13669265 14919400 16135952 16132014 15535188 15830751 16988125 17533175
37718A7533175n88936n74221K88066N55024K01604L43607R25553O97551n55234
$$ 17533175 16944239 16370018 16658084 17213108 17414712 17758319 18683872 19381423 18826189
37709A8826189j540684j451013r50001q20365q62853n89386p2235L01666K68858
$$ 18826189 17285505 15834492 14884491 14064126 13201273 12611887 12539652 12841318 13110176
37700A3110176k69243j038050j293119o39229K17191L31539j27655l47854l41719
$$ 13110176 12840933 11802883 10509764 9870535 10087726 10419265 10291610 9943756 9602037
37691I602037o81695j022768m73970N28808M95012o22168j089067k62241K01694
$$ 9602037 8920342 7897574 7423604 7952412 8447424 7825256 6736189 6473948 6675642
37682F675642p87581j649824p06205Q33780P95463k98809k64430P42979M30378
$$ 6675642 5888061 4238237 3532032 4365812 5161275 4862466 4598036 5341015 5771393
37673E771393j330539j757169K16628J722912L72184j746579j254983J156008
$$ 5771393 4440854 2683685 2900313 4623225 4995409 3248830 1993847 3149855
37665C149855J852646p2822j684444r66864M60243M73716l42638l32142L06584
$$ 3149855 5002501 4929679 3245235 2278371 2738614 3212330 2869692 2537550 2844134
37656B844134K57534l94131l99332M07224Q76528M69153q2489j83921j97301n00914
$$ 2844134 3101668 2707537 2308205 2715429 3591957 4061110 3978621 3794700 3597399 3096485
37646C096485p17924l86289K40561N41157L29560j1868k3261L55750O95209M96548
$$ 3096485 2378561 1992272 2232833 2773990 3103550 3091682 3068421 3424171 4119380 4615928
37636D615928j76973o75159n56561j26899J02991J31942J91924J19051l54374
$$ 4615928 4438955 3763796 3207235 3080336 3183327 3315269 3507193 3626244 3271870
37627C271870q83152p97776r1756N17068N61738K88792R1758N6386J59359L44462
$$ 3271870 2388718 1590942 1499186 2016254 2577992 2866784 2958542 3014928 3174287 3518749
37617C518749K73927m00152j310248j509628o51899M65474Q82479N49282N2517
$$ 3518749 3792676 3392524 2082276 572648 -79251 386223 1268702 1817984 1870501
37608A870501k63561l99401k86334J16765M67755L52403p7197k72008r4531O6623
$$ 1870501 1606940 1207539 921205 1037970 1505725 1858128 1780931 1508923 1414392 1481015
37598A481015O9269K95208Q46135J039735L05519p73579j075042m94638n6492
$$ 1481015 1550284 1845492 2691627 3731362 4036881 3263302 2188260 1693622 1637130
37589A637130l13072n43359o5610M89120J44963o96014o70436M74225J369164
$$ 1637130 1324058 780699 715089 1204209 1349172 653158 -17278 456947 1826111
37580A826111Q94958l68716j054010o57213K50005Q98303Q60017J48687o68078
$$ 1826111 2721069 2352353 1298343 641130 891135 1789438 2649455 2798142 2130064
37571B130064p46018J69711J335119J775702J263491L40481l24457m19385j64873
$$ 2130064 1384046 1553757 2888876 4664578 5928069 6268550 5944093 5524708 5359835
37562E359835j43225o05728r67081n20367M22840Q87176P04627O12513P88281
$$ 5359835 5216610 4610882 3643801 3123434 3546274 4433450 5138077 5750590 6538871
37553F538871N84695R5521M64526J812442K376278J005127p64898p13293R56859
$$ 6538871 7123566 7219087 7683613 9496055 11872333 12877460 12112562 11399269 12356128
37544A2356128K229368K279594K039824K170692K319342K346571K646849L138169
$$ 12356128 14585496 16865090 18904914 21075606 23394948 25741519 28388368 31526537
37536C1526537L303355L221827L255549K914820J535492j30105p23100n79285
$$ 31526537 34829892 38051719 41307268 44222088 45757580 45627475 44904375 44325090
37528D4325090j302840k951861l765008l107958k481751k798826k857658j766727
$$ 44325090 43022250 40070389 36305381 33197423 30715672 27916846 25059188 23292461
37520B3292461q51306j468583k562570k314337j042203m81394r58462j230732
$$ 23292461 22441155 20972572 18410002 16095665 15053462 14572068 13613606 12382874
37512A2382874p44816k52195k39884k91026j38789j03448k93056l81368l33017
$$ 12382874 11638058 11385863 11145979 10854953 10716164 10612716 10319660 9938292 9605275
37503I605275m88566q36595r96970r83119j176643j433175j033440J63079J169562
$$ 9605275 9116709 8280114 7283144 6300025 5123382 3690207 2656767 2819846 3989408
37494C989408R53807k46847j124041p85364K35568O42428l9929r21043r73223
$$ 3989408 4943215 4696368 3572327 2786963 3022531 3664959 3625030 2703987 1730764
37485A730764l29646J65103K58057L08917L10088l6298l53552N8002P71595M92711
$$ 1730764 1401118 1566221 1824278 2133195 2443283 2406985 2053433 2111435 2883030 3375741
37475C375741q27967j524427n54658R50836J338148N08875n37881j147609j053987
$$ 3375741 2547774 1023347 468689 1419525 2757673 3266548 2728667 1581058 527071
37466E27071j09293R72384P64983p63135j509869r2872J756960J532703k89955
$$ 527071 417778 1390162 2155145 1392010 -117859 -210731 1546229 3078932 2788977
37457B788977j066747j4150J010666P55999J72887K01121J42161p03566j479021
$$ 2788977 1722230 1708080 2718746 3474745 3647632 3848753 3990914 3287348 1808327
37448A808327j135169j84727J55778j92076l15541J47013N84781M14073j68336
$$ 1808327 673158 488431 644209 452133 136592 283605 868386 1282459 1114123
37439A114123n15727l43635p9779k48092n26998l5781J081764J285717j67966
$$ 1114123 598396 254761 174982 -73110 -600108 -635889 445875 1731592 1563626
37430A563626j545176p43275J412662J988976J22189j769731j595603l12914J68877
$$ 1563626 18450 -724825 687837 2676813 2799002 1029271 -566332 -879246 -710369
37421g10369m9474K54112R03949P44580j00852l67874J62517L98341o6856l25967
$$ -710369 -759843 -505731 398218 1142798 1041946 674072 836589 1234930 1168074 842107
37411H42107J42181O01754M20706L7073r1127l46953r35386j051513j65257O75909
$$ 842107 984288 1586042 2006748 2043821 1952694 1605741 670355 -381158 -546415 129494
37401A29494J77022j020552r88145O42765J963568J393781k70219j203745r22435
$$ 129494 306516 -714036 -1702181 -1059416 904152 2297933 2027714 823969 -98466
37392i8466k75193J68821N06070O65758L98522j2353p0008o667l84599q78873
$$ -98466 -373659 -204838 301232 966990 1365512 1353159 1283151 1276484 891885 13012
37382A3012o40639J47829M10672P68p7961M09394L97753m70987r74329l81150
$$ 13012 -627627 -479798 -69126 -68358 -146319 263075 660828 189841 -784488 -1165638
37372a165638K26089r1696m35601J72525Q52529M95745o8893L31302P24466l48832
$$ -1165638 -939549 -1031245 -1466846 -1294321 -441792 53953 -14940 316362 1040828 691996
37362F91996j684792r29856J233778J726926N2167q24668N58620J752727O47450
$$ 691996 -992796 -1922652 -688874 1038052 1090219 265551 824171 2576898 3224348
37353C224348r78691o04437Q06849O82564p03551q15152Q58802K090131J488101
$$ 3224348 2245657 1641220 2448069 3130633 2427082 1611930 2470732 4560863 6048964
37344F048964K70666J4593O16500J126849J133523O98718j3326o10985p77238
$$ 6048964 6319630 6334223 6950723 8077572 9211095 9909813 9896487 9285502 8508264
37335H508264q22652j169311j443499j054755m30399m42881p79823l61942N68673
$$ 8508264 7685612 6516301 5072802 4018047 3587648 3144767 2364944 2003002 2571675
37326B571675M62137r83414j950577j077335N26836J007153L51747j16280K5544
$$ 2571675 3033812 2050398 99821 -977514 -450678 556475 908222 791942 817486
37317H17486J25988N6669L61347Q44718N54059m85815r07780n2391P98631K53619
$$ 817486 943474 1000143 1361490 2206208 2760267 2274452 1366672 1314281 2112912 2366531
37307B366531r84980j046694L60565J519516J139574n2045o82288o18888n93048
$$ 2366531 1381551 334857 695422 2214938 3354512 3302467 2620179 2001291 1408243
37298A408243o67569k17257P87459J513064J386507P19603P0985l58955n55933
$$ 1408243 740674 523417 1310876 2823940 4210447 4930050 5001035 4642080 4086147
37289D086147n39951n47907p84161q78110k61781P69337J169395O03939m5458
$$ 4086147 3546196 2998289 2214128 1336018 1074237 1843574 3012969 3616908 3571450
37280C571450p7072K3825l52041p22652l34712M09564M61795k46093p66262o00926
$$ 3571450 3494378 3518203 3166162 2443510 2108798 2518362 2980157 2734064 1967802 1366876
37270A366876j72321J65633N45322Q45446N38684l34665q88711n86522j9328N5691
$$ 1366876 1194555 1360188 1905510 2750956 3289640 2954975 2066264 1479742 1460414 1516105
37260A516105j52643K4141N10747N82070L4091m64614l34505J32836K46941j36566
$$ 1516105 1363462 1387603 1898350 2480420 2514511 2049897 1715392 1848228 2095169 1958603
37250A958603m98007l93866K3513L33726M14503L85709J61959m39472j071029
$$ 1958603 1460596 1066730 1090243 1423969 1838472 2224181 2386140 1946668 875639
37241H75639r30588J23974J019898P01309l39515n87913M01019J307848Q36063
$$ 875639 -54949 69025 1088923 1790232 1450717 862804 1263823 2571671 3407734
37232C407734n31358j240353p05348J66483M07326J48820Q2301L80583P00098
$$ 3407734 2876376 1636023 930675 1097158 1504484 1653304 1735605 2116188 2816286
37223B816286R39584J328783J749025J635753Q93622L44935O43404J114613N53808
$$ 2816286 3755870 5084653 6833678 8469431 9363053 9707988 10351392 11466005 12019813
37214A2019813r08815j800480j441295r12432j123841j074543N07831K489751
$$ 12019813 11110998 9310518 7869223 6956791 5832950 4758407 5266238 7755989
37206G755989K247866n90627l197225l115905j227668k502j34974n00982n19356
$$ 7755989 10003855 9413228 6216003 3100098 1872430 1869928 1734954 1233972 714616
37197G14616o18296o87109m2665Q79214O65771o84786j286006j92545R69835N68449
$$ 714616 96320 -590789 -633454 245760 911531 226745 -1059261 -1251806 -281971 286478
37187B86478l30880K62359J804252J899352J74189j026466l49784M84230l95372
$$ 286478 -44402 217957 2022209 3921561 4095750 3069284 2719500 3203730 2808358
37178B808358j872524j547240M92715J734010Q46000o89702r40674R480P28962
$$ 2808358 935834 -611406 -118691 1615319 2461319 1771617 830943 840423 1569385
37169A569385N27821p8153m68399n85236n91384m92247k36711J08235M05309N58110
$$ 1569385 2097206 2019053 1550654 965418 374034 -118213 -354924 -246689 158620 716730
37159G16730N33843L31172k9249m39567o46766m13061J58707N95531N12595J6401
$$ 716730 1250573 1581745 1552496 1112929 466163 53102 211809 807340 1319935 1336336
37149A336336m74932o90776o49134m88970l35901k26698o6714J79346K52437p7648
$$ 1336336 861404 170628 -478506 -967476 -1303377 -1530075 -1596789 -1417443 -1165006 -1242654
37139a242654l92834P9569J250191J898740J187320j40551q06082o96419n71295
$$ -1242654 -1635488 -1555919 -305728 1593012 2780332 2639781 1833699 1137280 565985
37130E65985n27292j9142P03434N81894n06396j251140p57512J72489L67273j1607
$$ 565985 38693 19551 722985 1304879 798483 -452657 -1210169 -1037680 -670407 -682014
37120f82014l2514M03370N70130J94394k37515l35905j67513J96505P49238J116603
$$ -682014 -714528 -311158 258972 453366 215851 -120054 -287567 -91062 658176 1774779
37110A774779P59570j82605q06055n04978K46193M86511o9162p60443q18758k39149
$$ 1774779 2534349 2351744 1545689 1040711 1286904 1773415 1704253 943810 125052 -114097
37100a14097K82535J97258k78081m81966j39009L32821L64030q7127m87495l14945
$$ -114097 168438 365696 87615 -394351 -533360 -200539 163491 76364 -411131 -726076
37090g26076L30526P48069M30347j80195j13096P59826J271067L93780j225675
$$ -726076 -395550 352519 782866 602671 489575 1249401 2520468 2914248 1688573
37081A688573j895397r42908N50508J143071N37600m48974q88857n12245J89546
$$ 1688573 -206824 -1149732 -599224 543847 1081447 632473 -256384 -768629 -579083
37072e79083N36127M81738N83744Q89384N39854p74098j724190r85248N71898
$$ -579083 -42956 438782 1022526 1911910 2451764 1677666 -46524 -1031772 -459874
37063d59874R56189O5333l22594L25886M22588p85735j651244q51978L27184K20425
$$ -459874 496315 561648 239054 564940 987528 201793 -1449451 -2301429 -1974245 -1753820
37053a753820m05070J04589J235073J207119J30382k43085M02510N43936m20380
$$ -1753820 -2158890 -2054301 -819228 387891 518273 275188 677698 1221634 801254
37044H01254j260496j129697o36834k05491O47109J675192J486892j70316j380636
$$ 801254 -459242 -1588939 -2225773 -2431264 -1784155 -108963 1377929 1207613 -173023
37035a73023o32023R04882J101024j04792r03907k96143Q26288J154819M63277
$$ -173023 -805046 99836 1200860 1096068 192161 -103982 722306 1877125 2340402
37026B340402m87129q99337o45395k49799j68527k06304p663J38897k29303o43014
$$ 2340402 1853273 953936 308541 58742 -109785 -316089 -323752 -184855 -414158 -1057172
37016a057172j85224Q39296J035623Q6106o25682k18358L07076j13219p79694
$$ -1057172 -1242396 -403100 632523 718629 92947 -125411 181665 68446 -711248
37007g11248n56747J34385K22469j9022L77897J058301Q26990j65116n79474j83853
$$ -711248 -1267995 -1133610 -911141 -930163 -552266 506035 1333025 1167909 588435 404582
36997D04582j14249o18140m41880Q56827J687408O06861j473496k408261j401911
$$ 404582 290333 -327807 -769687 87140 1774548 2381409 907913 -1500348 -2902259
36988b902259M59346J683240J590616N25594m87972o28455j71147l0150k80509
$$ -2902259 -2442913 -759673 830943 1356537 868565 240110 68963 38813 -241696
36979b41696l9622Q60364J263608M80527m70519m69317j11920n69161j427563
$$ -241696 -281318 579046 1842654 2323181 1852662 1383345 1271425 702264 -725299
36970g25299j275922l6334R17391Q69441M51670J53844l31444r68137r95411j89147
$$ -725299 -2001221 -2037555 -1120164 -250723 200947 354791 23347 -944790 -1940201 -2129348
36960b129348O69139J024156J118541R92777K37142p75672q69756K472L16663
$$ -2129348 -1460209 -436053 682488 1675265 1912407 1136735 266979 269451 586114
36951E86114n79893j176341k95195O88955P026j366950j043745R69083K198497
$$ 586114 6221 -1170120 -1465315 -776360 -769334 -2136284 -3180029 -2210946 -12449
36942a2449J368226j19228o44683k86401K18080N89723M92639m07500j261699
$$ -12449 1355777 1236549 591866 305465 523545 1113268 1605907 1198407 -63292
36933f3292o11328J177841J836790M18887j225010j305063n40184k81638o9784
$$ -63292 -674620 503221 2340011 2758898 1533888 228825 -311359 -592997 -662781
36924f62781R23816J579425M33756j373841j391724L14124J210983K32386q61972
$$ -662781 261035 1840460 2274216 900375 -491349 -177225 1033758 1266144 404172
36915D04172o00723O5327j88952p87395m57826N62908R89515M51125k25330l45249
$$ 404172 -196551 -131224 -320176 -1107571 -1565397 -1002489 -12974 438151 212821 -132428
36905a32428n1076J47421k4275l66321l43855K75352R08147P84285O5008l76296
$$ -132428 -183504 -36083 -60358 -426679 -770534 -495182 412965 1197250 1262258 885962
36895H85962l04502l29717n98088l75514N68989J209773O79038l54394n95774
$$ 885962 581460 251743 -346345 -721859 -152870 1056903 1735941 1381547 785773
36886G85773J17135P87030O38181j72857r70072j127993m77265M32200P69357
$$ 785773 902908 1689938 2328119 2155262 1185190 57197 -420068 12132 781489
36877G81489M24080J07277J68288L5830o41708j111999o26715K31205L94815L7399
$$ 781489 1205569 1312846 1481134 1516964 875256 -236743 -863458 -632253 -237438 -200039
36867b00039K28857J031634J245606K98231p75733q20234j45530J38450j85920
$$ -200039 28818 1060452 2306058 2604289 1828556 1008322 862792 1001242 815322
36858H15322l20247J28300M84958R6085n31988l75363M77354O84282m51853j663032
$$ 815322 495075 623375 1108333 1204418 672430 297067 774421 1458703 1006850 -656182
36848f56182j209693O10711J617968O03623j117771j596784o76267L59104P46462
$$ -656182 -1865875 -1255164 362804 966427 -151344 -1748128 -2424395 -2065291 -1318829
36839a318829P11061M71667L4843j86204K75917R65801R70280L91185J71739L21528
$$ -1318829 -607768 -136101 -101258 -287462 -11545 954256 1924536 2315721 2487460 2808988
36829B808988k69918j718420k308083q57165J206414J570438J81725q75417l95770
$$ 2808988 2539070 820650 -1487433 -2344598 -1138184 432254 613979 -261438 -657208
36820f57208O22924Q64253M38743J30766O5489r395N9769L82005L55453n36374
$$ -657208 -34284 829969 1268712 1399478 1464967 1455572 1515341 1897346 2252799 1716425
36810A716425j566122j424839l1087J217882J169180J50881p32493q64575l68911
$$ 1716425 150303 -1274536 -1305623 -87741 1081439 1232320 499827 -364748 -733659
36801g33659L06840O55972M08233p5191r6322L90504N79366O607o06046l40451
$$ -733659 -426819 229153 637386 562195 465873 856377 1435743 1442350 836304 495853
36791D95853M95099P30641k6811r00015r50025k25614N44897P65271K97359n36122
$$ 495853 990952 1721593 1694782 794767 -155258 -380872 164025 929296 1226655 690533
36781F90533j048637o94196K77581R63931P78836N665p09436j033610r48617m97077
$$ 690533 -358104 -1052300 -774719 189212 968048 973713 264277 -769333 -1717950 -2215027
36771b215027J39032N72398N61118K97576J25281J10424Q8284j5896j09228o1324
$$ -2215027 -2075995 -1503597 -942479 -644903 -519622 -409198 -320914 -336810 -446038 -507362
36761e07362K09786O10297P39906K12477o47166p98647L02573J660340J583275
$$ -507362 -297576 312721 1052627 1265104 617938 -180709 121864 1782204 3365479
36752C365479k39823k091799k110596m65188R44427Q34586j21743n12356o8049
$$ 3365479 3125656 1033857 -1076739 -1541927 -597500 237086 115343 -397013 -465062
36743d65062K96111J233m17987k10041M78012P72408J78042p76554j053872k48784
$$ -465062 -168951 -167718 -585705 -795746 -317734 454674 632716 -143838 -1197710 -1446494
36733a446494Q49797J071408K97041l62748j23396L31257k9781q34185q08171
$$ -1446494 -596697 474711 771752 409004 285608 616865 587084 -247101 -1055272
36724a055272J30120O18641k4507p35572m19348L96460N20349j42452p42074p65607
$$ -1055272 -925152 -306511 -331018 -1066590 -1485938 -1089478 -569129 -711581 -1453655 -2219262
36714b219262k96871M45398J042126R43883L58551L42760J173763J527599M02011
$$ -2219262 -2516133 -2070735 -1028609 -84726 273825 616585 1790348 3317947 3719958
36705C719958j048946j074851j5583K97863n68682j214035q10132j31288R2514
$$ 3719958 2671012 1596161 1580578 1878441 1309759 95724 -714408 -845696 -753182
36696g53182J74676L43828J17127n68745q73773l61553K75513L55669P2503k43757
$$ -753182 -578506 -234678 -117551 -686296 -1560069 -1921622 -1646109 -1290440 -1217937 -1461694
36686a461694o75822j034482o94533L00745R61512P72226M51208O95921J089248
$$ -1461694 -2137516 -3171998 -3866531 -3565786 -2604274 -1832048 -1380840 -684919 404329
36677D04329R09113K19781m63411q83283r04461l82389L83446P43996N53730K18899
$$ 404329 1313442 1533223 1069812 186529 -717932 -1100321 -716875 27121 580851 799750
36667G99750j85970q69730j346724p89381M28746R58375N58360L70555O80378
$$ 799750 613780 -255950 -1602674 -2392055 -1963309 -1004934 -446574 -76019 604359
36658F04359K88107j046241j523308n0995J667347J503558j8395q47747n10869
$$ 604359 892466 -153775 -1677083 -1728078 -60731 1442827 1424432 576685 65816
36649F5816j69333l38540m36871k04033N3037L38677P45768P54979J8213o61954
$$ 65816 -103517 -442057 -878928 -1082961 -1029924 -691247 54521 809500 827713 165759
36639A65759m10284K36073K52204r1359J54195P85294Q39012L97396L51661O30926
$$ 165759 -244525 -8452 243752 152393 306588 1091882 1930894 2328290 2679951 3310877
36629C310877L13188n88892j014438n77699l6647J8488k48909n98107q63671o20453
$$ 3310877 3624065 3035173 2020735 1443036 1406389 1424877 1175968 577861 -285810 -906263
36619i06263K08140P55154L83077p2073M14957J152322P68091l84163p70146k77639
$$ -906263 -698123 57031 440108 368035 782992 1935314 2703405 2319242 1549096 1271457
36609A271457j94573p09880o38088J93675M89647j46457m90004M6936M39785P2251
$$ 1271457 1076884 367004 -271084 -77409 412238 265781 -224223 -177287 262498 334749
36599C34749j89685J97966M21362L5472o0502N42706O85101l50345j341105j037485
$$ 334749 145064 343030 764392 799864 739362 1282068 1967169 1616824 275719 -761766
36589g61766j49727N4087j49311J59978O22218K93694m83867n54621J84310Q16752
$$ -761766 -911493 -857406 -1006717 -846739 -224521 69173 -414694 -969315 -785005 31747
36579C1747R04348O53437J4193j047927j702454j051822L22146Q76319K14020
$$ 31747 936095 1589532 1603725 555798 -1146656 -2198478 -1876332 -1000013 -785993
36570g85993m77181k56825L69635M60553K602k85780n0159L31156L81964J93726
$$ -785993 -1263174 -1519999 -1150364 -689811 -687209 -972989 -1023148 -691992 -310028 -116302
36560a16302K68042P14970R20988L65231m59954n59749J58520P17540M65993j18069
$$ -116302 151740 866710 1787698 2152929 1692975 1133226 1291746 2009286 2475279 2357210
36550B357210l53603l46902n22788p37920m97273K30880R00136R55360L16980
$$ 2357210 2003607 1656705 1133917 395997 -101276 129604 1029740 1985100 2302080
36541B302080m88557o64635q950N99814J78384q95807j188317j71132R63495Q85277
$$ 2302080 1813523 1148888 1139938 1739752 1918136 1022329 -165988 -337120 626375 1511652
36531A511652j83439r11294n17488N08038J060152M89236p62439j504007j030681
$$ 1511652 1328213 416919 -100569 407469 1467621 1956857 1194418 -309589 -1340270
36522a340270R6637Q55784R99215Q68951M39049m54736j220604j036803j88212
$$ -1340270 -1243633 -387849 611366 1480317 1919366 1464630 244026 -792777 -980989
36513i80989L03316K99713M92677Q01044L84433n80291q07976j3828N25915R8324
$$ -980989 -677673 -377960 114717 915761 1300194 719903 -88073 -101901 424014 522338
36503E22338l96819k52165j63630o83259j000947m03299L92199N22235L89396
$$ 522338 125519 -126646 -290276 -973535 -1974482 -2377781 -1985582 -1463347 -1073951
36494a073951O46985R05691N91199N6004k02271l83037n22523k2232R80569J149999
$$ -1073951 -426966 478725 1069924 1125928 923657 540620 18097 -4135 976434 2126433
36484B126433M542r95908o95946o9805l11457o62077K1634R36184O65384k79478
$$ 2126433 2130975 1135067 439121 369316 57859 -604218 -582584 353600 1018984 739506
36474G39506m27378O0511k4255n21825l43406K50675J04064n07470k95389N36483
$$ 739506 312128 372639 348384 -173441 -516847 -266172 -162108 -669578 -964967 -428484
36464d28484N07653m67482q79875k29092L35599K37243K55068O99723P76169K64822
$$ -428484 79169 -388313 -1268188 -1497280 -1161681 -924438 -669370 30353 806522 1071344
36454A071344J4760K42687Q5607o07611p57437K9541O42654K93466l06418l35126
$$ 1071344 1086104 1328791 1414398 806787 49350 78891 721545 1015011 708593 373467
36444C73467q7895p4156r7832M5873K3560k63739l25926J6016L04939L48649M63959
$$ 373467 285572 211416 113584 159457 183017 -80722 -406648 -390632 -85693 262956 726915
36433G26915O04356L25273k04839l18841j07962l02339p91028o76485L1615L07980
$$ 726915 1331271 1656544 1451705 1132864 1024902 722563 -68465 -744950 -713335 -405355
36423d05355o8490k13657N2020j11522o22260j91217J257742J874441O89641p22260
$$ -405355 -473845 -687502 -635482 -747004 -1369264 -1560481 -302739 1571702 2261343 1539083
36413A539083p30321p4805k00962o80529k23837P90878Q41401j81296p89515k10913
$$ 1539083 808762 733957 532995 -147534 -371371 419507 1260908 1079612 290097 79184
36403G9184O13559N57510k29159p24612l41830M11012M88153l93452j217071r40058
$$ 79184 692743 1250253 1021094 296482 -45348 365664 853817 460365 -756706 -1696764
36393a696764j541L79442J42649K48946O73300L16830p11032o97210Q93560K118471
$$ -1696764 -1698305 -1318863 -1176214 -927268 -253968 62862 -648170 -1345380 -451820 1666651
36383A666651J344585k87699p35392l1606K99628k37008q62943j031536o76984
$$ 1666651 3011236 2723537 1988145 1956539 2256167 2019159 1156216 124680 -552304
36374e52304L04249J428815J340861l42238j768520j115866O65111J216576K30195
$$ -552304 -248055 1180760 2521621 2179383 410863 -705003 -39892 1176684 1406879
36365A406879n22857k67905j29369q06136j355693q53409K69285J094622J230323
$$ 1406879 884022 616117 486748 -319388 -1675081 -2528490 -2259205 -1164583 65740
36356F5740O22475m84114j168285o10928N26949P29430j56371o80050j16586M39777
$$ 65740 688215 204101 -964184 -1575112 -1048163 -318733 -475104 -1155154 -1271740 -831963
36346h31963J459o69003l88364N13602Q19114L57614P9276M16698O94161L25867
$$ -831963 -830504 -1499507 -1887871 -1374269 -555155 -197541 -118265 298433 992594 1318461
36336A318461k64129l53633k9767N949m07211n68999j4896O00253L37844n79339
$$ 1318461 1054332 700699 670932 676881 269670 -299329 -314225 286028 623872 44533
36326D4533r80432m04667L54264N73967N11027N53170M53498P5077m4107K80551
$$ 44533 -935899 -1340566 -986302 -412335 98692 651862 1105360 1180437 1136330 1416881
36316A416881J91368q13833j619203r40462N54830J034694J01276q65075q75355
$$ 1416881 1608249 794416 -824787 -1765249 -1210419 -175725 -74449 -939524 -1814879
36307a814879l95726r3377J18884M05127N09313L82181L86089N20532L23284j55937
$$ -1814879 -2210605 -2303982 -2185098 -1779971 -1270658 -888477 -502388 18144 341428 185491
36297A85491k41069J21645K0396q87321j428647m39542J338647J931886N97863
$$ 185491 -55578 66067 86463 -800858 -2229505 -2669047 -1330400 601486 1199349
36288A199349j236641j693657n06354R86422J528896J091040L70650k04286n69191
$$ 1199349 -37292 -1730949 -2237303 -1250881 278015 1369055 1739705 1535419 966228
36279I66228n82561j81776K07931J42860o4645J67430N49790K83755m66461p17008
$$ 966228 383667 201891 409822 552682 488037 655467 1205257 1489012 1022551 305543
36269C05543m00412m54179q35681k52247J364088K062729Q17351o28722n12128
$$ 305543 -94869 -549048 -1384729 -1636976 -272888 1789841 2607192 1978470 1466342
36260A466342J91081j69562q32567k06502Q69560M62249q25113q18504K07285
$$ 1466342 1657423 1487861 655294 448792 1318352 1780601 955488 136984 344269
36251C44269l601j324477j137756Q95415J825133L75336q40302R5286J158547
$$ 344269 340668 -983809 -2121565 -1226150 598983 974319 134017 229303 1387850
36242A387850K37754r62475o3573J474854O85364j701562k224663j44019J693666
$$ 1387850 1625604 663129 599556 2074410 2759774 1058212 -1166451 -1310470 383196
36233C83196J421338L30681p178M7581j99707k76105K00289M61203j07915q72565
$$ 383196 1804534 2135215 2128037 2175618 1975911 1699806 1900095 2361298 2253383 1380818
36223A380818j063180q98025p86342m12273M97287J258742J022484P1505m59634
$$ 1380818 317638 -580387 -1366729 -1779002 -1281715 -22973 999511 1071016 611382
36214F11382m1424O38267O04319j56346o32219p6331Q82509R19728j94624j205079
$$ 611382 569958 1208225 1812544 1656198 1023979 947648 1830157 2749885 2555261 1350182
36204A350182j059357k11754K94828K90324K56043K68013O1340k67880m60136
$$ 1350182 290825 79071 373899 664223 920266 1188279 1249619 981739 521603
36195E21603o32652q66315o95803J44426Q94743O40048k90418p09662j53038P31880
$$ 521603 -111049 -977364 -1673167 -1528741 -633998 6050 -284368 -994030 -1147068 -415188
36185d15188J144689P69805k04863j014900p50782L78060Q31845k91040j759015
$$ -415188 729501 1499306 1294443 279543 -471239 -93179 738666 447626 -1311389
36176a311389j783822m25151Q27720J219511J052113M62732m80472r11619j31638
$$ -1311389 -3095211 -3520362 -2692642 -1473131 -421018 41714 -438758 -1350377 -1482015
36167a482015Q85937P29841n6862J63655J132810R47954n69414j330780m31607
$$ -1482015 -596078 133763 76901 240556 1373366 2321320 1751906 421126 -10481
36158a0481L82775k27261j027372n53915M21097M96234N6645K55331Q32066P15067
$$ -10481 372294 145033 -882339 -1436254 -1015157 -518923 -462278 -206947 625119 1340186
36148A340186q6972o79007o26082q36R91678J533875O23419j045965j255176M51481
$$ 1340186 1253214 574207 -51875 -52711 938967 2472842 3096261 2050296 795120 1246601
36138A246601J549508K92651j363322r12711N63248M19722q87413p33640Q47600
$$ 1246601 2796109 3088760 1725438 812727 1375975 1795697 908284 174644 1022244
36129A022244J111338n58434j510507l31811R36191M32935o52749n51183K39441
$$ 1022244 2133582 1575148 64641 -267170 669021 1101956 449207 -101976 137465
36120A37465M24574J86967J41142k46211j358704k027868j206132J91214P27340
$$ 137465 562039 749006 890148 643937 -714767 -2742635 -3948767 -3757553 -3030213
36111c030213N50087N44643O03035L06504J48006M77648M23586m81243q83940
$$ -3030213 -2480126 -1935483 -1332448 -1025944 -877938 -400290 23296 -457947 -1341887
36102a341887K80288J524717Q73903q56369j296207k61490L87828J57202L39332
$$ -1341887 -1061599 463118 1337021 480652 -815555 -1077045 -689217 -532015 -192683
36093a92683J045172P42597o82875j169347J62614J310594M67932j177242j357879
$$ -192683 852489 1595086 912211 -257136 -94522 1216072 1684004 506762 -851117
36084h51117J4884J153646R86203J498q72429j085670n75304J52450M07901J64542
$$ -851117 -836233 317413 1303616 1305114 432685 -652985 -1228289 -1075839 -667938 -503396
36074e03396l6054j08734l99516n82139O6808J041234Q79552m00461r35288M8644
$$ -503396 -539450 -648184 -1047700 -1629839 -1563031 -521797 357755 -42706 -977994 -929350
36064i29350Q37195O9337r00307l00790R79207Q49373n38155j193565n38345J16331
$$ -929350 -92155 -22818 -923125 -1223915 -244708 604665 66510 -1127055 -1665400 -1549069
36054a549069J38172L32685R43446R87927J19149o10119n05250k59627n02534
$$ -1549069 -1410897 -1078212 -134766 853161 972310 362191 -143059 -402686 -905220
36045i05220o23169P9802J048140J173986L10423o10362o88728N8332P26439M25576
$$ -905220 -1528389 -1448587 -400447 773539 1083962 473600 -215128 -156796 569643 995219
36035I95219n92133j010507j43204R39717Q15892k10156n87921J22864O86691
$$ 995219 403086 -607421 -750625 189092 1004984 794828 206907 329771 1016462
36026A016462J44464q58998j144805n52102N6794j05661q67428j121283o51J721742
$$ 1016462 1160926 301928 -842877 -1394979 -1338185 -1443846 -2311274 -3432557 -3433208 -1711466
36016a711466K145538P34971p01603n08594M87163N92240J9952N6128M20042q8709
$$ -1711466 434072 1169043 467440 -41154 446009 1038249 1058201 1114329 1534371 1445662
36006A445662r19672n03025O12014L59772j003718r57151Q05301J468417r7636
$$ 1445662 525990 22965 634979 994751 -8967 -966118 -160817 1307600 1209964
35997A209964j199450N0006J370154K74553j585192j330856K40538L32327r28737
$$ 1209964 10514 60520 1430674 1705227 120035 -1210821 -970283 -637956 -1566693
35988a566693j063795K10316P42545p9286n82437r3457K08256N198M25312J403926
$$ -1566693 -2630488 -2420172 -1677627 -1756913 -2339350 -2432807 -2224551 -2219353 -1794041 -390115
35978c90115J263217l18952j422910q14861M54812J135462J313277J138485J98998
$$ -390115 873102 554150 -868760 -1683621 -1228809 -93347 1219930 2358415 2557413
35969B557413r84463r65016J96707N93986m54597j185694m42616L14872l22461
$$ 2557413 1572950 607934 804641 1398627 944030 -241664 -684280 -369408 -691869
35960f91869j119269l24288J228932J402433P3010r72975q10128j27212L72756
$$ -691869 -1811138 -2135426 -906494 495939 568949 -404026 -1214154 -1341366 -968610
35951i68610O32573N52200Q8066j50158L74669J051275Q87995N6871m30220l07675
$$ -968610 -336037 216163 304229 154071 528740 1580015 2468010 2524881 2094661 1786986
35941A786986k30558n46841q72810p95520k70367M64191Q33611L06910o07193
$$ 1786986 1556428 1009587 136777 -658743 -929110 -464919 368692 675602 68409
35932F8409n58521O57267J306663Q7230j655499j615568K39859J816584J858299
$$ 68409 -490112 167155 1473818 1561048 -94451 -1710019 -1470160 346424 2204723
35923B204723R97986M6251q89108j432180r38476N6505N4012j082594j564081
$$ 2204723 3202709 3248960 2359852 927672 -10804 45701 99713 -982881 -2546962
35914b546962l02085J311601J389546J91718n31143q9737O07563P14562L83410
$$ -2546962 -2849047 -1537446 -147900 43818 -487325 -577062 30501 745063 1128473
35905A128473M6576k17787l88838k92299L1981K01501l9513m82716p03062m68250
$$ 1128473 1175049 957262 568424 276125 308106 509607 470094 -12622 -715684 -1183934
35895a183934R4158N49062M41652k11855p72617o23955L4194L96217J50103o7898
$$ -1183934 -1089776 -540714 -99062 -310917 -1083534 -1707489 -1673295 -1277078 -1126975 -1194873
35885a194873L56549R69309P87572k11804q95446n20947K29664L19133j36973
$$ -1194873 -838324 130985 918557 706753 -188693 -709640 -479976 -160843 -297816
35876b97816k67034L0801K7424m02949m16372L92892J201686J129487M07215k37011
$$ -297816 -564850 -534049 -506625 -909574 -1325946 -933054 268632 1398119 1805334 1568323
35866A568323o41540r48076r11461l28539K72534K28678k41298l97452j32170
$$ 1568323 926783 -21293 -932754 -1261293 -988759 -760081 -1001379 -1398831 -1531001
35857a531001K3219r5227o5369L17645O99718P32180M70214J40956r1003j28693
$$ -1531001 -1507782 -1603009 -1668378 -1350733 -651015 81165 551379 692335 601332 472639
35847D72639l0246L17l8930J40141N58165O89366J51500o84561j189383j168776
$$ 472639 442393 442710 403780 543921 1102086 1791452 1942952 1258391 69008 -1099768
35837a099768o82023K24126J076254J019918O4813m85863J93319J052345P51446
$$ -1099768 -1781791 -1557665 -481411 538507 603320 117457 310776 1363121 2114567
35828B114567j63134k65231K00672k21340j387047j439376R3872J254687O26118
$$ 2114567 1951433 1686202 1886874 1665534 278487 -1160889 -1067017 187670 813788
35819H13788n43686m75902M22897N39263l21446r11215n61809J97210P54871R72006
$$ 813788 270102 -205800 217097 756360 434914 -476301 -1038110 -840900 -86029 885977
35809H85977P63186R5912o21659q31225m37573K46944Q32178Q20537r9087j256306
$$ 885977 1649163 1745075 1123416 292191 -145382 101562 933740 1754277 1655190 398884
35799C98884j306675k2835J079502Q01100L7008K62630J039114O83628r00890
$$ 398884 -907791 -930626 148876 949976 986984 1249614 2288728 2972356 2071466
35790B071466j859025j083872K84819O68706J18081k40855M2267M37466M46592
$$ 2071466 212441 -871431 -586612 82094 200175 -40680 1587 439053 885645
35781H85645J74795o317N8661J73979M5191k76261l57679l8912J67759j82271
$$ 885645 1060440 1054123 1112784 1286763 1331954 1055693 698014 659102 826861 644590
35771F44590o20296l89312K57772L08137m04358q47360l82667K45698J22680m23070
$$ 644590 24294 -365018 -107246 200891 -203467 -1050827 -1433494 -1187796 -1065116 -1488186
35761a488186m25046K09683O77591N59327K98903L44473M73905K45767k67869
$$ -1488186 -1913232 -1703549 -1025958 -466631 -167728 176745 650650 896417 628548
35752F28548n31826k39849K65716L78616L595k55304J31511Q37893J055690N88442
$$ 628548 96722 -143127 122589 501205 504800 249496 381007 1218900 2274590 2863032
35742B863032O8588k3633k535l25726p95534r01134o26042l63618k21494J1543
$$ 2863032 2931620 2907987 2905452 2579726 1784192 883058 257016 -106602 -328096 -316553
35732c16553K69247J81716k35688m05250J6218N59568N49293N8313j90748J39411
$$ -316553 -47306 134410 -101278 -506528 -490310 69258 618551 676864 486116 625527
35722F25527N01535K35091m43182o52550o6726N42449L10925m82521p54984j45419
$$ 625527 1127062 1362153 918971 266421 199695 742144 1053069 570548 -184436 -329855
35712c29855M72766K81010l10600l68914J08768K65718j86498m90080m9604O35398
$$ -329855 142911 423921 113321 -255593 -146825 118893 -67605 -557685 -607289 28109
35702B8109P66366M34247L29030N38291M01526l63126j027181p12057M12513J173562
$$ 28109 794475 1228722 1557752 2096043 2497569 2134443 1107262 395205 807718 1981280
35692A981280O64735p05909j584409j124626Q7892P97569O19090L03423M03592
$$ 1981280 2646015 1940106 355697 -768929 -681037 116532 735622 1039045 1442637
35683A442637M22099k02430r20555p67563J12755O33876L58606q8861k64535m75602
$$ 1442637 1864736 1662306 741751 -25812 86943 720819 1079425 990564 726029 250427
35673B50427q25202p67594j30428M00194M34374N44065J009335R17712l77964
$$ 250427 -574775 -1342369 -1472797 -1072603 -638229 -94164 915171 1832883 1454919
35664A454919j725405j468808J63801J330641J047683J02123m79403o11091n72341
$$ 1454919 -270486 -1739294 -1575493 -244852 802831 904954 425551 -185540 -757881
35655g57881l22590K11212Q30862J239303J077265O1220j268058j494440q6055
$$ -757881 -1080471 -869259 -38397 1200906 2278171 2339391 1071333 -423107 -509162
35646e09162J352995R99940m94596r88720j93621J55790m74513n69056M02911
$$ -509162 843833 1843773 1349177 360457 166836 322626 -151887 -720943 -318032
35637c18032P46743l76019j149751k17244P46263n7050j113686n2152J959915
$$ -318032 428711 52692 -1097059 -1314303 -568040 -625090 -1738776 -1790928 168987
35628A68987J731521p01854j938478n04189J135402P53430n21599p49832k56347
$$ 168987 1900508 1198654 -739824 -1244013 -108611 644819 123220 -626612 -882959
35619h82959k53354l65998L40592J201697R04783k16016p10020l16410l2305j89737
$$ -882959 -1136313 -1502311 -1161719 39978 944761 728745 18725 -297685 -329990 -519727
35609e19727j09328L59091M78359P5694L2915P77520J306095N08309j101903j828316
$$ -519727 -629055 -269964 208395 284089 317004 1094524 2400619 2908928 1807025 -21291
35599b1291q92830N76877R50969Q0104o93880m35903K52240L98474J68216K88686
$$ -21291 -914121 -337244 613725 693829 -51 -435954 -183714 214760 382976 671662
35589F71662M94186j48684j417809j829250p36848O97914J217455R96694P15465
$$ 671662 1165848 1017164 -400645 -2229895 -2966743 -2268829 -1051374 -54680 660785
35580F60785K52560o19701j159573n73064N49818R65834N73620K68209K83464
$$ 660785 913345 293644 -865929 -1438993 -889175 76659 650279 918488 1201952
35571A201952k0429p59394j195215r97344o93684n54330j06588P70170J264958
$$ 1201952 1181523 422129 -773086 -1770430 -2464114 -3018444 -3125032 -2354862 -1089904
35562a089904Q26202J41349J30805N31080L60069n07812j128923q59241j56780
$$ -1089904 -263702 -122353 8452 539532 899601 391789 -737134 -1596375 -1753155
35553a753155K43479L61388P03310J273538J442397Q56965k011m67904n56454
$$ -1753155 -1509676 -1148288 -444978 828560 2270957 3127922 3125911 2658007 2101553
35544B101553p30896r86093p92993m6529N65922M82388L6561j44053o1656q4001
$$ 2101553 1370657 384564 -408429 -454958 110964 593352 629913 485860 424204 340203
35534C40203j19407J87015N85403L85858l93932q20292l18317M71361N88566N6711
$$ 340203 220796 407811 993214 1379072 985140 164848 -153469 317892 906458 963169
35524I63169k81473q930L55432J20765o96477j388062j267577l21173P47822J169896
$$ 963169 681696 672766 1028198 1148963 452486 -935576 -2203153 -2524326 -1776504 -606608
35514f06608R03177O15291O89136N54435m56635j733485j734914q4970J498551
$$ -606608 296569 911860 1600996 2155431 1698796 -34689 -1769603 -1854573 -356022
35505c56022J228797l05207q95335J72115J148004M79557q69098q99805M43361
$$ -356022 872775 567568 -327767 -155652 992352 1471909 602811 -296994 146367
35496A46367J247380L88670j062538j486730p02112K08782L69320j05602m35983
$$ 146367 1393747 1782417 719879 -766851 -1468963 -1260181 -890861 -996463 -1432446
35487a432446j4959Q52754J120067K94916p03267o77529J35698M86635R6263n0566
$$ -1432446 -1447405 -594651 525416 820332 117065 -560464 -424766 61869 158132 107566
35477A07566M59784P39191J94289m72734n62116m32435m42247j05093O72227P73927
$$ 107566 567350 1306541 1500830 1028096 465980 33545 -408702 -513795 158432 932359
35467I32359l82879j417954q54851N20083R01081L03981K01568P93755P98654
$$ 932359 549480 -868474 -1723325 -1203242 -302161 1820 203388 997143 1795797
35458A795797o4816n29795q5196J57014m40926q69133l01435M31309K71302l76170
$$ 1795797 1730981 1201186 1115990 1273004 832078 -37055 -338490 92819 364121 -12049
35448a2049m77527K3305M21387L61962m6972n75944p57690j92362N82927M95950
$$ -12049 -489576 -466271 -44884 317078 270106 -305838 -1063528 -1255890 -672963 -177013
35438a77013l39803n32256L31531P84195j54614j175922o83265O51162J061216
$$ -177013 -516816 -1049072 -717541 66654 -87960 -1263882 -1947147 -1295985 -234769
35429b34769M73883K28352O29193P37424L09848N4766L4834l69827q75960n13817
$$ -234769 239114 467466 1096659 1834083 2143931 2198697 2233531 1863704 987744 473927
35419D73927L87780L26252q39394j368133l59046Q10779P47409Q2543K9003L39152
$$ 473927 861707 1187959 348565 -1019568 -1378614 -567835 179574 262117 291120 630272
35409F30272J51152k58625r5938M01594M89142L26924M73612N72632j0728p50557
$$ 630272 781424 522799 426861 828455 1317597 1644521 2118133 2690765 2680037 1929480
35399A929480o89587k31573n64632j452997j333144J99175J608914J565385M94730
$$ 1929480 1239893 1008320 443688 -1009309 -2342453 -2143278 -534364 1031021 1525751
35390A525751m72308q23463m59252N39920J353890Q94584m92220j069200k09593
$$ 1525751 1053443 229980 -229272 310648 1664538 2559122 2066902 997702 788109
35381G88109N25866j64195j223825j033627p6453J1840p67820r42913j48624M53284
$$ 788109 1313975 1149780 -74045 -1107672 -1184125 -1172285 -1940105 -2883018 -3031642 -2578358
35371b578358L26121K41314N64470O35067K89146K99424P03392L84189q51141
$$ -2578358 -2252237 -2010923 -1446453 -811386 -522240 -222816 480576 864765 13624
35362A3624j436098m42088O83724K44985j036216j162450J34429J258532J173030
$$ 13624 -1422474 -1864562 -1180838 -935853 -1972069 -3134519 -3000090 -1741558 -568528
35353e68528L39000n24242j080595q81957K64477J365832J094640k64664j061685
$$ -568528 -229528 -753770 -1834365 -2716322 -2451845 -1086013 8627 -256037 -1317722
35344a317722o39307o474J36603M31784J248587J577403O01839q17213j377763
$$ -1317722 -1957029 -1963503 -1826900 -1395116 -146529 1430874 2032713 1215500 -162263
35335a62263j090775o71494j29385P18568J146455M66988m63258l01777N45024
$$ -162263 -1253038 -1924532 -2053917 -1335349 -188894 278094 -185164 -486941 58083
35326E8083M71929o21253j065091j97049N18826p643o29662O4318J294404J278760
$$ 58083 530012 -91241 -1156332 -1353381 -834555 -842198 -1471860 -1407542 -113138 1165622
35316A165622J972r81205j055202j050686j297119r64290K23877J164371J001691
$$ 1165622 1167594 186389 -868813 -1919499 -3216618 -4180908 -3957031 -2792660 -1790969
35307a790969L75239K41746M83290N54460N76682P79501O54743j86306r44277
$$ -1790969 -1415730 -1173984 -690694 -136234 440448 1219949 1874692 1688386 744109
35298G44109o68676J01230P9900o70710q61876j40990M35219L47688M37315J153641
$$ 744109 75433 176663 256563 -414147 -1276023 -1417013 -981794 -634106 -196791 956850
35288I56850J475435N69761o90721j041420o83080n55412n74144o1764O07051
$$ 956850 2432285 3002046 2311325 1269905 586825 31413 -542731 -604495 2556
35279B556M12349m11179m71989N84415J427291J031106K7831n61808p87049j084095
$$ 2556 414905 3726 -468263 116152 1543443 2574549 2602380 2040572 1253523 169428
35269A69428j087836k64233Q07738R71819J90604l36660Q9930P08133M92436l53980
$$ 169428 -918408 -1182641 -374903 596916 787520 450860 540790 1248923 1741359 1387379
35259A387379p85989m91767k78740p23055j136700m95133R36048J709065J020232
$$ 1387379 601390 109623 -169117 -892172 -2028872 -2524005 -1587957 121108 1141340
35250A141340l10174j022602r13970n93282l17677J14556N98486P10788M38418
$$ 1141340 831166 -191436 -1105406 -1698688 -2016365 -1901809 -1303323 -592535 -154117
35241a54117K04255J49019M5904p5638N2544K45862l820n30559m74111L72382
$$ -154117 50138 199157 245061 169423 221967 467829 464009 -66550 -540661 -168279
35231a68279R89107M64261p19500j356243j005374j94354M70689P36429N25224
$$ -168279 820828 1285089 565589 -790654 -1796028 -1990382 -1519693 -783264 -258040
35222b58040J8978j94248L06089J046370J067682J65073p64250q25476k25678
$$ -258040 -239062 -433310 -127221 919149 1986831 2151904 1387654 562178 336500
35213C36500M7359m82285j129197q57316L70936J390712J191945J85433l76810
$$ 336500 383859 -98426 -1227623 -2084939 -1714003 -323291 868654 1054087 677277
35204F77277j06798J27745l01689p39021l42966M03772L06508o07957r11413J40693
$$ 677277 570479 698224 396535 -342486 -685452 -281680 24828 -583129 -1494542 -1353849
35194a353849J336240J100091k61711r65268k56224O12966K97847p19944r89118
$$ -1353849 -17609 1082482 820771 -144497 -400721 212245 510092 -209852 -1198970
35185a198970k75930K39547j36050o62602m67441J90871N94101P19230Q82757
$$ -1198970 -1474900 -1235353 -1371403 -2034005 -2501446 -2310575 -1716474 -997244 -114487
35176a14487P91815j7403j004084r53012L20702J439165J088212l12499j071002
$$ -114487 677328 659925 -344159 -1297171 -976469 462696 1550908 1238409 167407
35167A67407k32388J244996J520258L2723j711576j885454n76296M97250M21256
$$ 167407 -64981 1180015 2700273 2732996 1021420 -864034 -1440330 -943080 -521824
35158e21824Q0485L39041N62327n2124p96586n24094L46934M68705k18971n11156
$$ -521824 -441339 -102298 460029 407905 -388681 -912775 -565841 -97136 -316107 -827263
35148h27263o651M19499K40456j01488l08184n63752o68140k31814K42131j602
$$ -827263 -833914 -414415 -173959 -275447 -583631 -1147383 -1815523 -2047337 -1805206 -1806808
35138a806808k92444O51716K135598J934890j38976j497391o28454O35866K11231
$$ -1806808 -2099252 -1447536 688062 2622952 2483976 986585 358131 993997 1205228
35129A205228j028371j098735k03590Q5603k98349j87240M48808N52579k8452
$$ 1205228 176857 -921878 -1125468 -1039865 -1338214 -1525454 -1076646 -524067 -552519
35120e52519m51353m31260l04074Q54N64729O80282k3954m47361K94777R74591
$$ -552519 -1003872 -1435132 -1739206 -1738352 -1173623 -493341 -517295 -964656 -669879 304712
35110C04712J09510j169876o45784J144028J483415j06635j058364J0281J168212
$$ 304712 414222 -755654 -1401438 -257410 1226005 1119370 61006 71287 1239499
35101A239499N18623q61466j023953k16315M4149m16413n71225r6519L99828N12507
$$ 1239499 1758122 896656 -127297 -343612 -299463 -715876 -1287101 -1383620 -983792 -471285
35091d71285K77986k02773n67400k86217L76250L78495m16773o74971L55616J368008
$$ -471285 -193299 -396072 -963472 -1249689 -873439 -494944 -911717 -1586688 -1231072 136936
35081A36936Q52341n30487r54226j69759M06453J06778j35305M04156R80785O06014
$$ 136936 989277 458790 -495436 -665195 -258742 -151964 -287269 116887 1097672 1703686
35071A703686l71140p32964j00160N40163J36469r90832j427509m23923J058035
$$ 1703686 1332546 599582 499422 1039585 1176054 185222 -1242287 -1666210 -608175
35062f08175J458108M94809o55074r22280m03226J82279L95039K45064J3247Q3584
$$ -608175 849933 1344742 689668 -232612 -635838 -453559 -58520 186544 199791 283375
35052B83375N20789Q10529M94648r9943l98981n59390j008359j286509n75276
$$ 283375 804164 1614693 2109341 2009398 1610417 1051027 42668 -1243841 -1819117
35043a819117O86951J103166L97411k38131j71290j31633m66689l15956N60401
$$ -1819117 -1132166 -29000 368411 130280 -41010 -172643 -639332 -955288 -394887
35034c94887Q04179l71374j477722q31058P71499J231372K65250m75458n0279
$$ -394887 409292 37918 -1439804 -2270862 -1499363 -267991 -2741 -478199 -528478
35025e28478P08985P66818J01069p48692j215756p65461N43357J583683J254720
$$ -528478 180507 947325 1048394 299702 -916054 -1681515 -1138158 445525 1700245
35016A700245O556p20378m85359j71272l25613m06614L1645N14816N02399J99493
$$ 1700245 1706801 986423 501064 329792 4179 -402435 -370790 144026 646425 845918
35006H45918m575k00220n27980o71494l56650N6198M8116k41242k08520L01537
$$ 845918 841343 641123 113143 -558351 -915001 -858803 -810687 -1051929 -1260449 -958912
34996i58912P78548Q01505N58368L64661O4335n57726r74545l58901R73040J490812
$$ -958912 -180364 621141 1179509 1544170 1608505 1050779 76234 -282667 690373 2181185
34986B181185M68527p82969p28606P4314q9499j258830j658082m82018R55623
$$ 2181185 2649712 1866743 1138137 1212451 1122952 -135878 -1793960 -2275978 -1320355
34977a320355J331536R15762L86077l40059j155467j152550j13580O78639K94023
$$ -1320355 11181 926943 1313020 972961 -182506 -1335056 -1448636 -769997 -475974
$$ [...]
##END NTUPLES=NMR SPECTRUM
##END=
