##TITLE=31Pdec_MTBDP0308
 CDCl3, 24 sc
 4.08.2021
##JCAMPDX= 6.0         $$ Bruker NMR JCAMP-DX V2.0
##DATA TYPE= NMR SPECTRUM
##DATA CLASS= NTUPLES
##ORIGIN= UXNMR, Bruker Analytische Messtechnik GmbH
##OWNER= root
$$ XWIN-NMR		Version 3.5
$$ Wed Aug  4 08:52:37 2021 Russian Standard Time (UT+4h)  she@DPX200
##.OBSERVE FREQUENCY= 81.013821
##.OBSERVE NUCLEUS= ^31P
##.ACQUISITION MODE= SIMULTANEOUS
##.ACQUISITION SCHEME= undefined
##.AVERAGES= 24
##.DIGITISER RES= 16
##SPECTROMETER/DATA SYSTEM= spect
##.PULSE SEQUENCE= zgpg30
##.SOLVENT NAME= CDCl3
##.SHIFT REFERENCE= (INTERNAL, CDCl3, 0, 248.564)
##AUDIT TRAIL= $$ (NUMBER, WHEN, WHO, WHERE, WHAT)
$$ ##TITLE= Audit trail, XWIN-NMR		Version 3.5
$$ ##JCAMPDX= 5.01
$$ ##ORIGIN= Bruker BioSpin GmbH
$$ ##OWNER= she
$$ F:/spectra/data/she/nmr/P31/1/pdata/1/auditp.txt
$$ ##AUDIT TRAIL=  $$ (NUMBER, WHEN, WHO, WHERE, WHAT)
(   1,<2021-08-04 08:51:01.71 +0400>,<she>,<DPX200>,
      <created by zg, POWCHK disabled, PULCHK disabled
       configuration hash MD5:
       00 E9 B6 7A A2 85 ED C7 34 08 36 98 17 FE 4E 26
       data hash MD5: 32K
       9C 59 13 35 EE D1 CF 3C 21 5E C9 2F CF 6C 78 6B>)
(   2,<2021-08-04 08:51:04.03 +0400>,<she>,<DPX200>,
      <Start of raw data processing
       efp BC_mod = 2 LB = 1 FT_mod = 6 PKNL = 1 PHC0 = -7702.42 PHC1 = 817.8745 SI = 64K 
       data hash MD5: 64K
       16 3B D9 B1 6F 4F 5D 65 E9 03 D8 9E 86 5C 41 EB>)
(   3,<2021-08-04 08:51:29.26 +0400>,<she>,<DPX200>,
      <pk PHC0 = 102.707 PHC1 = -220 
       data hash MD5: 64K
       90 4C D8 0A A2 50 E2 38 02 5C 9D EF 0D 5C D3 CD>)
(   4,<2021-08-04 08:51:38.57 +0400>,<she>,<DPX200>,
      <abs ABSG = 5 
       data hash MD5: 64K
       06 7A 08 35 98 A0 D2 16 27 7D 16 26 1F 74 E9 35>)
$$ ##END=
$$ 
$$ hash MD5
$$ E3 F9 40 1E B5 31 31 FF 58 88 43 28 8F 47 62 04
##$RELAX= 
##$RELAX= 
##$RELAX= 
##$RELAX= 
##$RELAX= 
##$RELAX= 
##$RELAX= 
##$RELAX= 
$$ Bruker specific parameters
$$ --------------------------
##$DU= <F:/spectra>
##$EXPNO= 1
##$NAME= <P31>
##$PROCNO= 1
##$TYPE= <nmr>
##$USER= <she>
##$AMP= (0..31)
100 100 100 100 100 100 100 100 100 100 100 100 100 100 100 100 100 100 
100 100 100 100 100 100 100 100 100 100 100 100 100 100 
##$AQSEQ= 0
##$AQ_mod= 1
##$AUNM= <au_zg>
##$AUTOPOS= <>
##$BF1= 81.014009
##$BF2= 200.13
##$BF3= 200.13
##$BF4= 200.13
##$BF5= 200.13
##$BF6= 200.13
##$BF7= 200.13
##$BF8= 200.13
##$BYTORDA= 1
##$CFDGTYP= 0
##$CFRGTYP= 5
##$CHEMSTR= <none>
##$CNST= (0..31)
1 1 145 1 1 1 1 1 1 1 1 1 1 1 1 1 1 1 1 1 1 1 1 1 1 1 1 1 1 1 1 1 
##$CPDPRG= <waltz16>
##$CPDPRG1= <>
##$CPDPRG2= <waltz16>
##$CPDPRG3= <>
##$CPDPRG4= <mlev>
##$CPDPRG5= <mlev>
##$CPDPRG6= <mlev>
##$CPDPRG7= <mlev>
##$CPDPRG8= <mlev>
##$CPDPRGB= <>
##$CPDPRGT= <>
##$D= (0..31)
0 1 0 0 0 0 0 0 0 0 0 0.03 2e-05 3e-06 0 0 0 0 0 0 0 0 0 0 0 0 0 0 0 0 
0 0 
##$DATE= 1628052661
##$DBL= (0..7)
120 120 120 11 120 120 24 19 
##$DBP= (0..7)
150 150 150 150 150 150 150 150 
##$DBP07= 0
##$DBPNAM0= <>
##$DBPNAM1= <>
##$DBPNAM2= <>
$$ [...]
##$SUBNAM3= <"">
##$SUBNAM4= <"">
##$SUBNAM5= <"">
##$SUBNAM6= <"">
##$SUBNAM7= <"">
##$SUBNAM8= <"">
##$SUBNAM9= <"">
##$SW= 501.771253377433
##$SWIBOX= (0..15)
0 1 3 0 0 0 0 0 0 0 0 0 0 0 0 0 
##$SW_h= 40650.406504065
##$TD= 32768
##$TD0= 1
##$TE= 0
##$TE2= 300
##$TE3= 300
##$TEG= 300
##$TL= (0..7)
0 120 53 12 22 120 120 120 
##$TP= (0..7)
150 150 150 150 150 150 150 150 
##$TP07= 0
##$TPNAME0= <>
##$TPNAME1= <>
##$TPNAME2= <>
##$TPNAME3= <>
##$TPNAME4= <>
##$TPNAME5= <>
##$TPNAME6= <>
##$TPNAME7= <>
##$TPOAL= (0..7)
0.5 0.5 0.5 0.5 0.5 0.5 0.5 0.5 
##$TPOFFS= (0..7)
0 0 0 0 0 0 0 0 
##$TUNHIN= 0
##$TUNHOUT= 0
##$TUNXOUT= 0
##$USERA1= <user>
##$USERA2= <user>
##$USERA3= <user>
##$USERA4= <user>
##$USERA5= <user>
##$V9= 5
##$VALIST= <valist>
##$VCLIST= <CCCCCCCCCCCCCCC>
##$VD= 0
##$VDLIST= <DDDDDDDDDDDDDDD>
##$VPLIST= <PPPPPPPPPPPPPPP>
##$VTLIST= <TTTTTTTTTTTTTTT>
##$WBST= 1024
##$WBSW= 4
##$XGAIN= (0..3)
0 0 0 0 
##$XL= 0
##$YL= 0
##$YMAX_a= 1357
##$YMIN_a= -2132
##$ZGOPTNS= <>
##$ZL1= 120
##$ZL2= 120
##$ZL3= 120
##$ZL4= 120
##$ABSF1= 248.5645
##$ABSF2= -253.2056
##$ABSG= 5
##$ABSL= 3
##$ALPHA= 0
##$AQORDER= 0
##$ASSFAC= 0
##$ASSFACI= 0
##$ASSFACX= 0
##$ASSWID= 0
##$AUNMP= <proc_1d>
##$AZFE= 0.1
##$AZFW= 0.5
##$BCFW= 0
##$BC_mod= 2
##$BYTORDP= 0
##$COROFFS= 0
##$CY= -3
##$DATMOD= 1
##$DC= 0
##$DFILT= <>
##$DTYPP= 0
##$F1P= 0
##$F2P= 0
##$FCOR= 1
##$FTSIZE= 65536
##$FT_mod= 6
##$GAMMA= 0
##$GB= 0
##$INTBC= 1
##$INTSCL= 5.30512e-09
##$ISEN= 30
##$LB= 1
##$LEV0= 0
##$LPBIN= 0
##$MAXI= 10000
##$MC2= 0
##$MEAN= 0
##$ME_mod= 0
##$MI= 50
##$NCOEF= 0
##$NC_proc= -8
##$NLEV= 6
##$NOISF1= 182.463
##$NOISF2= 159.3651
##$NSP= 0
##$NTH_PI= 0
##$NZP= 0
##$OFFSET= 248.5645
##$PC= 4
##$PHC0= -7599.713
##$PHC1= 597.8745
##$PH_mod= 1
##$PKNL= yes
##$PPARMOD= 0
##$PSCAL= 0
##$PSIGN= 0
##$REVERSE= no
##$SF= 81.014009
##$SI= 65536
##$SIGF1= 159.3651
##$SIGF2= -187.1042
##$SINO= 113.3802
##$SIOLD= 16384
##$SREGLST= <1H.CDCl3>
##$SSB= 0
##$STSI= 65536
##$STSR= 0
##$SW_p= 40650.406504065
##$SYMM= 0
##$S_DEV= 0
##$TDeff= 32768
##$TDoff= 0
##$TI= <>
##$TILT= no
##$TM1= 0
##$TM2= 0
##$TOPLEV= 0
##$USERP1= <user>
##$USERP2= <user>
##$USERP3= <user>
##$USERP4= <user>
##$USERP5= <user>
##$WDW= 1
##$XDIM= 65536
##$YMAX_p= 282342665
##$YMIN_p= -27193170
$$ End of Bruker specific parameters
$$ ---------------------------------
##NTUPLES= NMR SPECTRUM
##VAR_NAME=  FREQUENCY,     SPECTRUM/REAL,   SPECTRUM/IMAG
##SYMBOL=    X,             R,               I
##VAR_TYPE=  INDEPENDENT,   DEPENDENT,       DEPENDENT
##VAR_FORM=  AFFN,          ASDF,            ASDF
##VAR_DIM=   65536,         65536,           65536
##UNITS=     HZ,            ARBITRARY UNITS, ARBITRARY UNITS
##FACTOR=    0.620285442955139, 1,           1
##FIRST=     20137.2065510759, 0,            0
##LAST=      -20513.1999529892, 0,           0
##MIN=       -20513.1999529892, -27193170,   0
##MAX=       20137.2065510759, 282342665,    0
$$ Real data points
##PAGE= N=1
##DATA TABLE= (X++(R..R)), XYDATA
$$ [...]
13057A0821996k370895o361019m775272k5474K049713L97012j156424p66531j67985
13048b354879O2820J194141K092236L4848l362073k870259J982070M934558J984603
13039C698065k775586l515986l74725K775558M360501M904322L843649O77504
13031A3593302k618747l773744l321743k867973k097788k03538J531907J392612
13023A634288J0946r95888j659681k530295k538906o46559J701542K414144J963731
13014f46678K174745K703857J464881j676723m044336l428224p93346P78931n53950
13005d020843l070830k871491J435951O024172N864102J240640k496722k057896
12997D7083J47920O38466k90063m94267J04879K52854j7532m9201k75361j028402
$$ y = [10821996, 8451101, 2090082, -2685190, -2710664, -660951, -263939, -1420363, -2186894, -2354879, -2292059, -1097918, 994318, 1029166, -2332907, -5203166, -3221096, 1713462, 3698065, 922479, -2593507, -2968232, -192674, 4167827, 9072149, 12915798, 13593302, 10974555, 7200811, 3879068, 1011095, -1086693, -1290231, 241676, 1634288, 1645234, 649346, -1010335, -3540630, -6079536, -6726095, -5024553, -2610409, -646678, 1528067, 4231924, 5696805, 4020082, -24254, -3452478, -4245824, -3466893, -4020843, -7091673, -9963164, -8527213, -2503041, 3361061, 4601701, 2104979, 47083, 195003, 833469, 543406, 49139, 154018, 406872, 389340, 340139, 64778, -963624]
12987i63624j107977L17993J713562J152546p42137j600261k24725K452693M329862
12978E327932L430365k27292l673551l928831k018635j262300j619596N8995L388167
12969e24746L417671j230032m543338j602852L628159M133377m3803l206927k978471
12960b950962j773729p35465J559988M366075M392824J186399j650173j794980
12952B599977r30522r67913j095856j54735R14809P56075j99767o33895j86017
12943A02156M75877N49536k55753j266976j271641j05395Q56020O02046j26379
12934d40509k84149o5103M2307J89375L3440j403944l377148l202744k58142K171290
12924f595327J341791q88839j028697J064897K867189L008425J821322r8084j476092
$$ y = [-963624, -2071601, -1753608, -40046, 1112500, 370363, -1229898, -1454623, 998070, 5327932, 8758297, 8531005, 4857454, 928623, -1090012, -2352312, -3971908, -3912913, -524746, 2892925, 1662893, -2880445, -4483297, -855138, 3278239, 3234436, 27509, -2950962, -4724691, -5460156, -3900168, 465907, 4858731, 6045130, 4394957, 2599977, 1669455, 701542, -394314, -549049, 365760, 1121835, 922068, 288173, 102156, 578033, 1127569, 871816, -395160, -1666801, -1772196, -916176, -314130, -440509, -724658, -789761, -747454, -558079, -524639, -1928583, -5305731, -8508475, -8766617, -6595327, -5253536, -6142375, -7171072, -6106175, -3238986, -230561, 1590761, 1492677, 16585]
12915A6585o27596J535181J440226j566335k890525N07573M354862K731152l144733
12906B356390o799340n284206j229417K268215M019119L335736Q23848o16303
12898a125958M06686Q63656j693487m040534k357043O38237L3250k380692j001303
12889a0657188L464886M816742J718780q45855o80936p99359j828684k71542L627997
12880a455159M157123o86490n113638l973000N03378L326771K941702M38385k454429
12871b315357k940866J99963K861630M90020l338349j117582N367345N936981
12863E143785j501591o291868j748219M117371J877313m592872n619362p24032
12855i339475L260287L665598K633578N97372k535824l435987k86405K159565
$$ y = [16585, -611011, 924170, 2364396, 798061, -2092464, -1584891, 2769971, 5501123, 2356390, -4442950, -9727156, -10956573, -8688358, -4669239, -1333503, -509655, -1125958, -719272, 144384, -1549103, -5589637, -7946680, -7308443, -7275193, -9655885, -10657188, -7192302, -2375560, -656780, -1502635, -2183571, -2982930, -4811614, -5083156, -1455159, 2701964, 2015474, -3098164, -7071164, -6567786, -3241015, -299313, 139072, -2315357, -5256223, -5056260, -2194630, -1704610, -5042959, -6160541, -793196, 5143785, 3642194, -2649674, -4397893, -280522, 1596791, -2996081, -8615443, -9339475, -6079188, -2413590, 219988, 817360, -1718464, -5154451, -5440856, -3281291]
12847c281291j27186k572388L94592M526176K263760l609620l715046K350808
12839c770195N339163J397526k771759j695220J211444R18410j631842k650608
12831c653081r78012K004877M043959K875309q64918k539950K47404K611821m12627
12822C334782m526678k204553M128964M997553o27590l798304q51829J352838
12814A805183j193511k557566J218454L681736q73178o563247n042142J263893
12806h260378M105448K459889J536308K426251J753941m32275p10832P15696L28765
12797C922813j850701k194430q6599J274634P29764M23670J055403Q61126l29939
12788C805741n77890K60624K08809j046789j851423j914974k124905j533127J146340
$$ y = [-3281291, -3408477, -5980865, -5586273, -1060097, 1203663, -2405957, -6121003, -3770195, 1568968, 2966494, 194735, -1500485, -289041, 629369, -1002473, -3653081, -4631093, -2626216, 1417743, 4293052, 3428134, 888184, 1135588, 3747409, 3334782, -1191896, -3396449, 732515, 5730068, 5102478, 1304174, 452345, 1805183, 611672, -1945894, -727440, 2954296, 2081118, -4482129, -9524271, -8260378, -4154930, -1695041, -158733, 2267518, 4021459, 3589184, 2878352, 3594048, 3922813, 2072112, -122318, -208917, 1065717, 1795481, 2219151, 3274554, 4135680, 3805741, 3227851, 3488475, 3697284, 2650495, 799072, -1115902, -3240807, -4773934, -3627594]
12779c627594L448678J522299l130190m394682j72321M506292M674672J396214
12771D223368j480927k520954k179993n08860J862127K966181K090248J005458
12763E456648Q54886K94061j401819k109406k05389K155752J844633q31379l035418
12754C022569l353944k567066j711012j453040k187426k890561j343945K542108
12746i942317N319805M231796J167356k52664J24824r9295j108787p78244J202488
12737a35038K792879L080603K781855J405485k087366n468084m586369J34039
12729b081996K947388O98342k647218k228582Q36839K447628J967769J308802
12721C248972L68976j559216j880691K049334O683095N391924j774675p297794
$$ y = [-3627594, -178916, 1343383, -1786807, -6181489, -6353810, -1847518, 2827154, 4223368, 2742441, 221487, -1958506, -2467366, -605239, 2360942, 4451190, 5456648, 6311534, 6605595, 5203776, 3094370, 2888981, 5044733, 6889366, 6057987, 3022569, -331375, -2898441, -4609453, -6062493, -8249919, -11140480, -12484425, -9942317, -4622512, -390716, 776640, 523976, 648800, 549505, -559282, -1337526, -135038, 2657841, 5738444, 8520299, 9925784, 7838418, 2370334, -2216035, -2081996, 865392, 1563734, -1083484, -3312066, -2475227, -27599, 1940170, 3248972, 3617948, 2058732, 178041, 2227375, 8910470, 14302394, 12527719, 5229925]
12713E229925o419099k433240K15734K019914M018422L151902k360654p125136
12705c702232m709439K431496N747530K508272j610905k192502j545353k355729
12697e428862k219422J221472M348775K296659k829828m089129M46669N020759
12689a232907M307531K0033k583716j647303N42508J779145J855778J032288n12027
12680C561330j513958m30416J825384K141538n89172l473432l444137j298184
12672c221047J79835M49873P67165Q60087k81309r53438J502847N135695M577625
12663I017333n10005l489391n46320K753254k0897n338657m612646K231269O239375
12654E723315K805770k382037l166317j476334j847853l301029k317608R5392
$$ y = [5229925, -1189174, -3622414, -3406680, -1386766, 2631656, 5783558, 3422904, -3702232, -8411671, -5980175, -232645, 2275627, 664722, -1527780, -3073133, -5428862, -7648284, -6426812, -2078037, 218622, -2611206, -6700335, -6253666, -1232907, 3074624, 3094657, 510941, -1136362, -593854, 1185291, 3041069, 4073357, 3561330, 2047372, 1616956, 3442340, 5583878, 4994706, 1521274, -1922863, -3221047, -3041212, -2591339, -1824174, -964087, -1245396, -2198834, -695987, 4439708, 9017333, 8507328, 5017937, 4471617, 7224871, 7203974, 1865317, -2747329, -516060, 5723315, 8529085, 6147048, 2980731, 1504397, -343456, -3644485, -5962093, -5866701]
12646e866701L98042p37555L93547L591349M603720K091184l28834j15691N32133
12637D561194r97182l260971l215199q73631J067591J091900K65522L25979J829176
12628G94379L822563M366329J977796k310693m831436k707993K364901N086715
12620H562561K269823l131440n168559k099316J406226M28558l584454m897758
12612f214359j421708K748631L317537R95644r72484j507721j338602l35813J587312
12603c141563K518553Q56508j486336j533824K6530K76371m56224R67350M277469
12594B304834M868166Q63697l169403k405747J581236L551761J677574j391774
12586G880344l045199l115408k401499j437988p37518n84336o88692r34849j694956
$$ y = [-5866701, -5468659, -6206214, -5812667, -2221318, 2382402, 4473586, 4144752, 4029061, 4561194, 3564012, 303041, -2912158, -3785789, -2718198, -1626298, -1360776, -1034797, 794379, 4616942, 8983271, 10961067, 8650374, 3818938, 1110945, 3475846, 8562561, 10832384, 7700944, 2532385, 433069, 1839295, 2267853, -1316601, -6214359, -7636067, -4887436, -1569899, -574255, -1546739, -3054460, -4393062, -4728875, -3141563, -623010, 233498, -1252838, -2786662, -2760132, -2483761, -2939985, -1972635, 2304834, 7173000, 8036697, 4867294, 2461547, 4042783, 7594544, 9272118, 7880344, 4835145, 1719737, -681762, -2119750, -2857268, -3441604, -4130296, -5065145, -6760101]
12577f760101k613609k367692o24481J193795K046685K439950K563291J619697
12569b502465K60283P95079L105736L599327Q28713j432003l03520Q45413j737469
12560C459094m436870j320609N017175N796445n57075n607084l649981N51449
12552g47456O81913j462883q31340J736210J828060m54074j359268n96198j257039
12543b462075l242270k718201J166276M176445L305152J090877J219973K755060
12535E291237J800849k296182n421806m064328k31370J131286q33704j616862
12527f240880J303058L391007l15987n972190m936184L079516Q358270M920619
12519C587229j513997l441688k271038k946824m159902j969047J292442O41032
$$ y = [-6760101, -9373710, -11741402, -12365883, -11172088, -9125403, -6685453, -4122162, -2502465, -2242182, -1447103, 1658633, 5257960, 6086673, 4654670, 4351150, 5196563, 3459094, -977776, -2298385, 2718790, 8515235, 7958160, 2351076, -1298905, -747456, -65543, -1528426, -2359766, -623556, 1204504, 750430, -608838, -1205036, -2462075, -5704345, -8422546, -7256270, -3079825, 225327, 1316204, 2536177, 5291237, 7092086, 4795904, -625902, -4690230, -4921600, -3790314, -4624018, -6240880, -4937822, -1546815, -1862802, -7834992, -12771176, -9691660, -1333390, 3587229, 2073232, -1368456, -3639494, -6586318, -10746220, -12715267, -11422825, -10781793]
12511a0781793j839277p5709M718746N271071N61817k516387q80405O33311q89564
12502e798190j531131J028324K627074P32950k62850K730024M933756J664362
12494F124319l003348k511607J659550K790791p67787m525167m945749k077314
12486g256312K841613P302663P257093J969970l044483k882949m70042j384811
12478D332742m176442k762761K866464N743621K169267l624437o271265n082529
12470f805340j658821K838326N893033M093539j562513m651159j064479M830682
12462A913268N332934n85909n861194m306412J598320L956248k15411m900771
12454c068927l252571K678216M740063M82448l538659j808250K580963L894914
$$ y = [-10781793, -12621070, -12696779, -7978033, -2706962, -2145145, -4661532, -5541937, -4908626, -5798190, -7329321, -6300997, -3673923, -2940973, -3203823, -473799, 4459957, 6124319, 3120971, 609364, 2268914, 5059705, 4291918, -233249, -5178998, -7256312, -4414699, 2887964, 10145057, 12115027, 9070544, 6187595, 5717553, 4332742, 156300, -2606461, 260003, 6003624, 8172891, 4548454, -1722811, -6805340, -8464161, -5625835, 267198, 4360737, 2798224, -1852935, -2917414, 1913268, 7246202, 6660293, 799099, -3507313, -1908993, 2047255, 1831844, -3068927, -6321498, -3643282, 1096781, 1579229, -1959430, -3767680, -1186717, 2708197]
12446B708197K205910J104031J031430K84444m59069n3278n96859l686838n616339
12437c078371k428197K488997K565072j664051l379869j2391L790863L869053
12429B151106J135317j819423l304258j946442J327604J942287k049935m607317
12421g171061J78089P149700O589756p0536k285786J892323K927593k824666o250323
12412A35089j608638L125294L31444l908192q95579N095932M046562l072694o622728
12403c373510l695674o3616J270919L040132N589146N031186N74130l417506l696346
12394A258861j131792K342315M767388L295390k229217o106902l087818L257615
12386B365840M676821O7101l321320p59358M049369N155794J489818l579121o116523
$$ y = [2708197, 4914107, 6018138, 7049568, 7334012, 6874943, 6821665, 6224806, 2537968, -3078371, -5506568, -3017571, -452499, -2116550, -5496419, -5508810, -1717947, 2151106, 3286423, 1467000, -1837258, -3783700, -2456096, -513809, -2563744, -7171061, -6992972, 156728, 6746484, 6675948, 4390162, 6282485, 9210078, 6385412, 135089, -1473549, 1651745, 1983189, -1925003, -2820582, 2275350, 6321912, 3249218, -3373510, -7069184, -7132800, -5861881, -2821749, 2767397, 7798583, 8372713, 4955207, 1258861, 127069, 2469384, 7236772, 10532162, 8302945, 2196043, -891775, 2365840, 7042661, 7109762, 3788442, 3029084, 7078453, 12234247, 13724065, 10144944, 4028421]
12377D028421m318310j45029K057925R10721L0227J780651K414315j710555o438849
12368a390483m890853J889258O274373M832928R98296k036487m026240l878641
12360b227849n23944K428445K74336m276940l819212J897084N017150J995913
12352G64983j532227j002511L42677r69716k000059L92263K968106J498526j987938
12343a525896k739390l94427K102142L442590L684707K129842p04686j886501
12335D108381k74735J023847l70066j873915k54332K735572K895726l01626l559230
12326D129622m261175k513046K3903J519908J488303J633141L263579M087221
12318I371456R30248m441201o588229l948293m24890J088568J475632J073706
$$ y = [4028421, -289889, -434918, 1623007, 2533728, 2563955, 4344606, 6758921, 5048366, -1390483, -6281336, -4392078, 1882295, 6715223, 7713519, 5677032, 1650792, -2227849, -2751793, -323348, -49012, -4325952, -8145164, -6248080, -1230930, 764983, -767244, -1769755, -1427078, -2396794, -4396853, -4004590, -1036484, 462042, -1525896, -4265286, -4659713, -2557571, 885019, 4569726, 6699568, 5994882, 4108381, 3833646, 4857493, 4487427, 2613512, 2359180, 5094752, 7990478, 7688852, 4129622, -131553, -2644599, -2620696, -1100788, 387515, 2020656, 5284235, 9371456, 10301704, 5860503, -727726, -4676019, -5100909, -4012341, -2536709, -1463003]
12310a463003j209265l272328j169708L157283L017229j755496l127046J836625
12302c985709N109844P03217n363610n275220j433124J46665R38777M638585P145701
12293B625126K791266l930824m016801J671080M502403K349159R09886K043437
12285H944732J644120r20049j567469k96904j443823m279465l077184K000210
12277A004168L726042k86046l735595k392178J95758Q79127K030075M555234M065148
12268A0041733j171108n568798m412193n50829J442499J785738J890419K96980
12260C754441l087723m144626o53835L527564M437886L190962J560600j742833
12252F842436o011894n936799L48914O042046M581558q47466k853060o28976J210244
$$ y = [-1463003, -2672268, -5944596, -7114304, -3957021, -939792, -2695288, -5822334, -3985709, 1124135, 1827352, -3536258, -8811478, -10244602, -10097937, -9159160, -4520575, 2625126, 5416392, 1485568, -2531233, -860153, 3642250, 5991409, 6901295, 8944732, 10588852, 9668803, 8101334, 7804430, 6360607, 2081142, -996042, 1004168, 4730210, 4444164, 708569, -1683609, -1487851, -608724, 1421351, 5976585, 10041733, 8870625, 3301827, -1110366, -1661195, -218696, 1567042, 3457461, 3754441, 666718, -3477908, -4131743, -604179, 3833707, 7024669, 8585269, 6842436, 830542, -5106257, -4757343, 1284703, 5866261, 5018795, 2165735, 1536759, 2747003]
12243B747003R24488J70045r05898k742054k929167K74423L226279J594273k395464
12234c6072l366195j341617n60864j500291q95826J155640J029162j379774j957062
12225h852899M23240K010826R55547M60657K979424N876150N574568K699198N18584
12216A2645295M94369J429570J637069N62301j049301k185623l071904m714707
12208E747069o257718m853866m181M191675L826655L75222j833556j488258m03192
12199g00150L78964Q86593K62024j549698j747268J369938M002557J556054l331401
12190A127613l416256K367785O861110M849181l84623l194052l296265l730419
12182A184074m645489l424442L41184L476524L107411K43312j186761J155605
$$ y = [2747003, 3671491, 3841536, 2935638, 193584, -2735583, -2461160, 765119, 2359392, -36072, -3402267, -4743884, -5304748, -6805039, -7700865, -6545225, -5516063, -6895837, -8852899, -8429659, -6418833, -5463286, -5002629, -2023205, 3852945, 9427513, 12126711, 12645295, 13139664, 14569234, 16206303, 16768604, 15719303, 13533680, 10461776, 5747069, -510649, -5364515, -5368696, -1177021, 2649634, 3024856, 1191300, -296958, -700150, -321186, 565407, 827431, -722267, -2469535, -1099597, 2902960, 4459014, 1127613, -2288643, 79142, 6940252, 11789433, 11404810, 8210758, 4914493, 1184074, -3461415, -6885857, -6544673, -3068149, 39262, 282574, -904187, 251418]
12174B51418M787441M915358N85447l859745m848524m154538m568822m169001
12166a1060966K66146O028974O537371O62859n208791n360540p20709M095885
12158d759771N683036L106950j764923m553176k674767O47258P93819o49586J477512
12149b693648N975543N587299j016737n603812k651383K206091J630147k066771
12141A366729k299883N7368r83953m980876m885686J291943O525799M775494r85508
12132a18573l863373j997434R30854J572259J29855j266585j141911K60724J459277
12123d034907J362742O35869Q89890K400071L442920K334824m13947k509218k279474
12114A828770k48366J761355K533044J880722j63320k994334m387143k239511
$$ y = [251418, 5038859, 9954217, 10539664, 6679919, 1831395, -2323143, -6891965, -11060966, -10794820, -4765846, 1771525, 2434384, -2774407, -8134947, -8855656, -4759771, 923265, 4030215, 2265292, -2287884, -4962651, -4315393, -3521574, -4171160, -2693648, 3281895, 8869194, 7852457, 2248645, -402738, 1803353, 3433500, 1366729, -933154, -875786, -1859739, -6840615, -11726301, -10434358, -3908559, 866935, -118573, -3981946, -5979380, -5048526, -3476267, -3346412, -4612997, -5754908, -5494184, -4034907, -2672165, -2036296, -1146406, 1253665, 4696585, 7031409, 6617462, 4108244, 1828770, 1580404, 3341759, 5874803, 7755525, 7592205, 4597871, 210728, -2028783]
12106b028783J752250K954990J12800k343936j103622N34680j463409l922208
12098e507238j110344M641052N242759p7621k886055R14309M475426J511556l603978
12089C599866l734563m25298K82132j403195r19121J163508L06192k720987k232358
12080f083824K448043N186999K629184j134386j695669l95797m91609j837754
12072a374813k357983j520170P7549J983080L081289K064633m1606n11854Q99699
12063B299824J383723k61703j742569j543373j557644l176092m006544j583199
12055a0187577K078062L083361J348760K65775J321202K323668J284947o66033
12047H52165j218381J94233K482241M371542M510113J569240l657264p022130
$$ y = [-2028783, -276533, 2678457, 2791257, 447321, -656301, -121621, -1585030, -5507238, -6617582, -1976530, 3266229, 3188608, 302553, 1216862, 5692288, 7203844, 3599866, -134697, -559995, -277863, -1681058, -2600179, -1436671, -1130479, -3851466, -6083824, -3635781, 1551218, 4180402, 3046016, 1350347, 954550, 462941, -1374813, -3732796, -5252966, -5175417, -3192337, -111048, 1953585, 1911979, 1400125, 2299824, 3683547, 3421844, 1679275, 135902, -1421742, -4597834, -8604378, -10187577, -8109515, -5026154, -3677394, -3411619, -2090417, 233251, 1518198, 852165, -366216, -171983, 2310258, 6681800, 11191913, 12761153, 9103889, 2081759]
12039B081759m752599J101448L991138J292365j780343J82486M285495L668658
12031A0070407j452577l999111j612407k18146l167933m739371j38474M879927
12023c77685K549868l508555l203039L814185P232916K135332l971461l456675
12015A214886P24623J870164L17524P64834L095999K834253r13899l872197k972886
12006C063301l4226J557350Q51239p87778j876353j991841j452321l44820J569202
11997E53753L365904K601464j350297m518145k434553K934032M698420P23825
11989F574403l021677j569753J387063l22445n097184n792608q71535L234807
11981e478929J897790j304311p69800K688769L581162k0488l895964l379613J119508
$$ y = [2081759, -2670840, -1569392, 2421746, 3714111, 1933768, 2116254, 6401749, 10070407, 8617830, 4618719, 3006312, 2788166, -379767, -5119138, -5257612, -377685, 2172183, -1336372, -4539411, -725226, 6507690, 8643022, 4671561, 1214886, 1939509, 3809673, 4127197, 4892031, 7988030, 10822283, 9908384, 6036187, 3063301, 3029075, 4586425, 5437664, 4649886, 2773533, 781692, -670629, -1015449, 553753, 3919657, 6521121, 5170824, 652679, -1781874, 1152158, 5850578, 6574403, 3552726, 1982973, 3370036, 3047591, -2049593, -7842201, -8713736, -5478929, -3581139, -4885450, -5655250, -2966481, 614681, 594193, -3301771, -6681384, -5561876]
11972e561876N258094N772120L062448m38998k917510l835335l124512r85610
11964b771179J566185K973435K457609P14508q84367j458858j044101m13945n25313
11955F13974j538925k314188j530823N29155J999160J553600k6655q59639k37083
11946a811424O38656L90673m19673J59782K307494L081806J30944l944944l985226
11937c451912M02691L432846J090988k900471k512840J858526M611249L359301
11929E890378J094619K55825k16326j087514r36854K76593P1482j982973k468659
11920H96571N59785L986900M208766K073385K10050j370525l343231l719469j019145
11911B483087J351371q54810n268965n082382Q47224N502968L372748j995781
$$ y = [-5561876, -303782, 5468338, 8530786, 8091788, 5174278, 1338943, -1785569, -2771179, -1204994, 1768441, 4226050, 4940558, 4056191, 2597333, 1553232, 1139287, 613974, -924951, -3239139, -4769962, -4240807, -2241647, -688047, -714702, -1574341, -1811424, -1172768, -782095, -1201768, -1041986, 1265508, 4347314, 4478258, 533314, -3451912, -3049221, 383625, 1474613, -1425858, -3938698, -2080172, 2531077, 5890378, 6984997, 7240822, 7024496, 5936982, 5000128, 5276721, 5348203, 3365230, 896571, 1456356, 5443256, 9652022, 11725407, 11935457, 10564932, 7221701, 3502232, 2483087, 3834458, 2979648, -2289317, -7371699, -6524475, -1021507, 2351241, 355460]
11903C55460l448928L707L020336K013755q13731j736470l13212J444999K226496
11894B752412J771289l13422l678164n790438l910709J020126M501455L467327
11886a80124l07279k744506j996667O35178K854761L033856R96298j346143j335857
11877c90483R75873K213282L07023k092476j405590J369747K291895M74683j320649
11868B423305j524657j192479o89821Q18956K132089P05727k352772k583085P43320
11859a519417K531541l38333l602260k054163K195008K959938o05360l227596
11851c660642j772031O74946J67208k436804l353341j244225J647726L005850
11843f971313K982718K660932J528269j507395m752992m206155Q47080N201441
$$ y = [355460, -3093468, -3089761, -69425, 1944330, 1130599, -605871, -919083, 525916, 2752412, 4523701, 4210279, 532115, -5258323, -9169032, -8148906, -3647451, -180124, -487403, -3231909, -5228576, -4593398, -1738637, 1295219, 2291517, 945374, -390483, 585390, 2798672, 3105695, 1013219, -392371, 977376, 3269271, 3743954, 2423305, 898648, -293831, -983652, -164696, 1967393, 2673120, 320348, -2262737, -1519417, 1012124, 673791, -2928469, -4982632, -2787624, 172314, -433046, -3660642, -5432673, -4757727, -4590519, -7027323, -10380664, -11624889, -9977163, -6971313, -3988595, -1327663, 200606, -1306789, -6059781, -10265936, -9418856, -4217415]
11835d217415L881348q13273k535636j64220J290645o94055k396313p29148J527203
11826d850864Q35002j134967q40142J077434J424481j15089j265279j261782j057289
11817g188495p20698K48243J222928J587281J937878K015098L013l531866m279073
11808h705691l16453L768054L352670J066110K000753M524973K901606k326869
11800F265153m328754r01668K042028R5436l104368k430579Q82532K217049Q43220
11791A580049j13068Q94256K009466J009772j979344m595752m416834j713931
11783g325386L60964q7069m89335K234725N562900L922456k314964n872268k732622
11774f740599J925495J575064k246513l197954J80728L488462L836347K919169
$$ y = [-4217415, -336067, -1149340, -3684976, -3849196, -2558551, -3252606, -5648919, -6378067, -4850864, -4015862, -5150829, -5990971, -4913537, -3489056, -3604145, -4869424, -6131206, -7188495, -7909193, -7660950, -6438022, -4850741, -2912863, -897765, -894752, -4426618, -8705691, -9022144, -5254090, -1901420, -835310, 1165443, 5690416, 8592022, 6265153, 1936399, 1034731, 3076759, 3172195, 67827, -2362752, -1480220, 736829, 1580049, 1466981, 2361237, 4370703, 5380475, 3401131, -1194621, -5611455, -7325386, -6964422, -7051491, -7540826, -5306101, 256799, 4179255, 1864291, -4007977, -6740599, -4815104, -3240040, -5486553, -8684507, -8503779, -5015317, -1178970, 1740199]
11766A740199K617153K125910O27903p09624r55465j064620j903245k725697k843274
11757c090760k732497k161697M33897M601722O156797K216363l237749l159742
11749i73666K690251O257350K017075m837503n509770j89875K563633j306830
11741G10665n678564l775263K191690N121529L008895k2589n86277P03474J890222
11732C563782J664580o90187l947770m439279m62040L875158L358533o30496k020773
11723B71508N37373J868634r00628l573339j921698J507122J891188j96208n68053
11714a084101J187521J160292k391909o242504o601916l330424J053028M231660
11706a2018353N114782L888606K018156R82161M85958q32740k627923k537655
$$ y = [1740199, 4357352, 6483262, 7111165, 6401541, 5446076, 4381456, 2478211, -247486, -3090760, -5823257, -7984954, -7551057, -2949335, 3207462, 5423825, 2186076, -973666, 1716585, 7973935, 9991010, 5153507, -356263, -546138, 2017495, 710665, -4967899, -8743162, -6551472, -1429943, 1578952, 1556363, 970086, 1673560, 3563782, 5228362, 4538175, 590405, -3848874, -4310914, -435756, 2922777, 2292281, 271508, 808881, 2677515, 1776887, -1796452, -3718150, -2211028, -319840, -516048, -1084101, 103420, 1263712, -1128197, -7370701, -13972617, -17303041, -16250013, -12018353, -6903571, -3014965, -996809, -14648, 471310, -361430, -2989353, -5527008]
11698e527008L61408L414214L414568Q09692j098358p04867M20710P55112Q73027
11689B718498J182363L30069j907212k522805O40924M361627L631179j007061
11681G427582m216286l828704k849744k678026l79763M562992O740220K669162
11673G447433k679801k870582K76523L82517k803247l614437k38338K893022K782156
11664A575246J459187R05714K93270l66303O23512K258422J024867k682983l793633
11655A297299n08312K442527J409716o99415k80695P15605r04485l219106k458872
11646b205738L61520J311088j06188j363437j884224k737520k760294J8060L791430
11637e575303M611605K381273O91788P18960r255k198761k959421r26184J097425
$$ y = [-5527008, -5165600, -1751386, 1663182, 2472874, 1374516, 669649, 1090359, 1845471, 2718498, 3900861, 4230930, 2323718, -199087, 441837, 4803464, 8434643, 7427582, 3211296, -617408, -3467152, -6145178, -6524941, -1961949, 4778271, 7447433, 4767632, 1897050, 2173573, 2556090, -247157, -3861594, -4099932, -1206910, 1575246, 3034433, 3940147, 4233417, 3867114, 4490626, 6749048, 7773915, 5090932, 1297299, 788987, 3231514, 4641230, 3941815, 3661120, 4376725, 3472240, 253134, -2205738, -1844218, -533130, -639318, -2002755, -3886979, -6624499, -9384793, -9366733, -5575303, -963698, 1417575, 2109363, 2828323, 2819068, 620307, -2339114, -3265298, -2167873]
11628b167873P79698k32142k3499q4331j830830k445057J191264N952920N171700
11619F311850j625126o670140m004187K399083M311532M70716k686580q14948
11611b307800K916391L525517R47888j663371l022256l572510k592792N25848
11603e243085L296242K470638r13552k517877q37299J271189J617886J387302
11595E31444J641750R43579j338833k535319l92875K880333L333600P33591j587496
11586D209774j643221p08248k88409J18059J165775J576408j55733k761265l154527
11577a641387q92598N17218j431378l813657k071921K533375L786698j85250l460559
11568f659459j101212L284078L486869M89479R6791K900814L569060o9411l865952
$$ y = [-2167873, -1388175, -1620317, -1643816, -1728147, -3558977, -6004034, -4812770, 1140150, 6311850, 4686724, -1983416, -5987603, -3588520, 723012, 1193728, -1492852, -2307800, 608591, 4134108, 5081996, 3418625, 396369, -3176141, -5768933, -5243085, -1946843, 523795, -389757, -2907634, -3744933, -2473744, -855858, 531444, 2173194, 3116773, 1777940, -757379, -1150254, 1730079, 5063679, 5797270, 4209774, 2566553, 1858305, 1569896, 1687955, 2853730, 4430138, 4274405, 1513140, -1641387, -2533985, -2016767, -3448145, -7261802, -9333723, -6800348, -3013650, -3198900, -6659459, -7760671, -4476593, -989724, -500245, -403454, 2497360, 6066420, 5997009, 2131057]
11559B131057m324711k807709j203972J009528L291056K925115K8610j172170
11551a23196J031713K535184L0770l433954l320611k66165K114348K827030K837029
11542D232148J742868o42968j871400k82242J308422l22221k994980k099771J958165
11533A028021M202289K472609m25828k157231l671114n310332m442808L49383
11525g955011N522252O148788K125851j854074k311784n14901O94084J176033
11517C031238K273864K792517j539m906096o417600k090359L299112M130456J246321
11508C357914r65674j436091j393069K16116L884762M902829o48601p118037n519107
11499d718958K172851N080828L74513l169489j031370J1389l995798n389440J384671
$$ y = [2131057, -2193654, -5001363, -6205335, -5195807, -1904751, 1020364, 1048974, -123196, 908517, 3443701, 3474471, 40517, -3280094, -3546259, -1431911, 1395119, 4232148, 5975016, 5332048, 3460648, 3178406, 4486828, 4164607, 1169627, -930144, 1028021, 5230310, 7702919, 7277091, 5119860, 1448746, -3861586, -8304394, -7955011, -2432759, 3716029, 5841880, 3987806, 1676022, 1161121, 1855205, 3031238, 5305102, 8097619, 8096080, 3189984, -3227616, -5317975, -2018863, 2111593, 3357914, 2392240, 956149, -436920, -220804, 3663958, 8566787, 7918186, 800149, -4718958, -2546107, 2534721, 2909234, -260255, -1291625, -1280236, -5276034, -10665474, -9280803]
11490i280803Q120252N483604j599264k916436j491j231943n356902l995350K229071
11481h549262M111182l4280j949917J699718M463328K618697R62818K365597K225295
11472G913176j714747l537262Q29357N626553L892479j927855m448475k056085
11464D577141P03397N03030j810318l746962l448813j109698L86270j208035l134712
11455h288700p38421M535195N820696J151883l018219j551593K084655K325366
11447B320862p5543j133616p72435j359129k215220j027882J256691J834042R36296
11438b35934R59052J773414J049249j273915k581104j690646l49823l16587j247701
11429c913995j872617j620948p22535L37880J284653K243002L129868K996793
$$ y = [-9280803, -1160551, 4323053, 2723789, -192647, -194138, -1426081, -6782983, -10778333, -8549262, -4438080, -4472360, -6422277, -4722559, -259231, 2359466, 3322284, 5687881, 7913176, 6198429, 2661167, 3490524, 9117077, 13009556, 11081701, 6633226, 4577141, 5280538, 5783568, 3973250, 226288, -3222525, -4332223, -3945953, -5153988, -8288700, -9027121, -4491926, 1328770, 2480653, -537566, -2089159, -4504, 2320862, 2245319, 1111703, 339268, -1019861, -3235081, -4262963, -3006272, -1172230, -235934, 723118, 2496532, 3545781, 2271866, -309238, -1999884, -2349707, -2666294, -3913995, -5786612, -7407560, -8130095, -7792215, -6507562, -4264560, -1134692, 1862101]
11421A862101J022513j797291l167443j892974J108346L787111L958973N06409
11413E387745m554451o441592k579532L628419O469001M350017J24755l238829
11405C145533m083622j302664L507913N032786M76786m850292m010500J088847
11397i95213K680504m93898k200836l47966j63603l468283m293437M46078M588848
11388d247806K801411n08848R96296N167068N854853K707898n49694l207154n891778
11379C122246n783595r17536L857516K671789j973266k935941K88963J611197
11371e8627j124800l159965j082785K316698L075112J214025o85216q27450O89088
11362C56080J974949J002281j245994j363692Q12893P99217l069535n350303j659978
$$ y = [1862101, 2884614, 1087323, -2080120, -3973094, -2864748, 922363, 4881336, 5387745, 833294, -5608298, -8187830, -4559411, 1909590, 6259607, 6384362, 3145533, -938089, -2240753, 1267160, 6299946, 6776732, 1926440, -2084060, -995213, 1685291, 1191393, -1009443, -1357409, -1521012, -4989295, -9282732, -8836654, -4247806, -1446395, -1955243, -958947, 4208121, 10062974, 12770872, 12221178, 9014024, 3122246, -2661349, -3578885, 278631, 2950420, 977154, -1958787, -1669824, -58627, -1183427, -4343392, -5426177, -3109479, -34367, 1179658, 494442, -333008, 356080, 2331029, 3333310, 2087316, 723624, 1536517, 2335734, -733801, -6084104, -7744082]
11353g744082L416671L158333n43085j151668R79271K36421k917542k365626J930987
11344e000320K975501q23056k451902J255198L895450J113926j373760J871412
11336A462449N651079K532217m298725n839255j327533J754877J26035j757451
11328a696307q53307O89j188417j400262J394069L542753J414068k037364j332529
11319b156607K975636M839042J484906k984083l916988k043738o27077R4026J792083
11310e42800L224213J315154k846949l917574j1033L668269J950157k812988m247721
11301d221272q00400L077164L477171Q05109k546028m557005l590963M59117M487968
11292c409139M578813P82631k778107k874028j62231K607286L123124O55285k898320
$$ y = [-7744082, -4327411, -1169078, -1712163, -2863831, -1884560, -1648139, -4565681, -6931307, -5000320, -2024819, -2847875, -5299777, -4044579, -149129, 964797, -408963, 1462449, 7113528, 9645745, 5347020, -492235, -1819768, -64891, 61144, -1696307, -2549614, -2548925, -3737342, -5137604, -3743535, -200782, 1213286, -824078, -2156607, 819029, 5658071, 7142977, 4158894, 241906, -1801832, -2428909, -2334883, -542800, 2681413, 3996567, 1149618, -2767956, -2778989, 889280, 2839437, 26449, -4221272, -5021672, -1944508, 1532663, 2337772, -208256, -4765261, -8356224, -7897107, -3409139, 1169674, 1952305, -825802, -3699830, -3862061, -1254775, 1868349, 2523634, -374686]
11283c74686l754562p28745K067280M29288l230790l013134J158114L096658K83558
11274d067019j784794J770616P236117P443298J795016l496662l892236j290859
11266C713477l02042k447493m865371l920807K65335L487469K570285l16584p61366
11257b577097J431668K412656P26732p27391j36876K78546j153539k033361J49753
11248a628909L600907M752631K962952K44577j611014j711068j93037P17199j416939
11239E717299m852202m760324n40284K333569M76826k158592j017675J805608
11231b995775J985942L58293Q0312J43242j658507k374695J944234P719853P521436
11222A2724335J552802k577639j725101o04021k106082k676192k01036J277497
$$ y = [-374686, -4129248, -4857993, -2790713, -2361425, -5592215, -8605349, -7447235, -4350577, -4067019, -5851813, -4081197, 3154920, 10598218, 12393234, 8896572, 5004336, 3713477, 3411435, 963942, -3901429, -7822236, -7556901, -4069432, -1499147, -1815731, -2577097, -1145429, 1267227, 1993959, 1266568, 1129692, 1408238, 254699, -1778662, -1628909, 1971998, 6724629, 9687581, 9932158, 8321144, 6610076, 6417039, 7134238, 5717299, 865097, -3895227, -4435511, -2101942, -1625116, -3783708, -4801383, -2995775, -1009833, -651540, -571228, -427986, -2086493, -4461188, -2516954, 5202899, 12724335, 14277137, 11699498, 9974397, 9370376, 7264294, 4588102, 4387066, 5664563]
11214E664563j152747l867842l129121j187861j239650j473197P46365L262265
11206b377225K902456R49380j23875j343502l444378k794266K523267O572560
11198B864417L131727l560263m103393J694928M911230J853127j301157j36162
11190E354454J139301j375188l707184j295301K530721K092636j180757j782572
11182A776110M93978J194912n04478j013571M79253M16087k497246m519037k735103
11173f909095M76474J186197q17888k605522j889692J257359M706024N366632
11165G70489J978108k442686l244701q1207K484766J535550j98591Q52259L318823
11156D972810L416400J178505k6507O53399N99219j076487j738117j47902Q06911
$$ y = [5664563, 4511816, 643974, -2485147, -3673008, -4912658, -6385855, -5639490, -2377225, 525231, 1474611, 1350736, 7234, -3437144, -6231410, -3708143, 2864417, 5996144, 2435881, -1667512, 27416, 4938646, 6791773, 5490616, 5354454, 6493755, 5118567, 1411383, 116082, 2646803, 4739439, 3558682, 1776110, 2270088, 3465000, 2960522, 1946951, 2426204, 2842291, 345045, -4173992, -6909095, -6432621, -5246424, -6064312, -8669834, -10559526, -9302167, -4596143, 770489, 2748597, 305911, -2938790, -3019997, -535231, 1000319, 801728, 1653987, 4972810, 8389210, 9567715, 9541208, 10194607, 10793826, 9717339, 7979222, 7831320, 8638231]
11147H638231j066251l061885j859679L95700j047715n488719o619791j384264
11139a1494373N467725P816740N481889K218225m19638l243821n389821m623528
11131d186602j450072Q98954J036008Q45223J827488K982861L068253K223960
11123G246073O17139j782011l376948k034394R49291J409823j516116l408096
11115a895239j209497J724669P99258k490747k866299O88870L766356L083106
11107A600477J60661j966832k382220j757780p48114N8204J58201l09756r28300
11098f115459j601444j872759o67236J947437L961401L844160K290109K27115
11090B013324k488472m472150k286958M052062Q349614N681214k57906k747678
$$ y = [8638231, 7571980, 4510095, 2650416, 3046116, 1998401, -3490318, -10110109, -11494373, -6026648, 1790092, 7271981, 9490206, 9070568, 5826747, 436926, -4186602, -5636674, -4737720, -3701712, -2856489, -1029001, 1953860, 5022113, 7246073, 7863212, 6081201, 2704253, 669859, 1619150, 3028973, 1512857, -1895239, -3104736, -1380067, -580809, -3071556, -5937855, -5248985, -1482629, 1600477, 1761138, -205694, -2587914, -4345694, -5093808, -5035604, -4877403, -5187159, -6115459, -7716903, -9589662, -10256898, -8309461, -4348060, -503900, 1786209, 2013324, -475148, -4947298, -7234256, -3182194, 5167420, 10848634, 10590728, 7843050]
11082G843050k214822l741420o382881l965625L060298O132389J865087k133046
11074D63030M01412M312414K065562l633973m570011k80393K100552l71494k877095
11065b389996j418216J659792K350142M29382j563340j668807L04384K785654
11057D88995L438599J901839O69926J236848J190647j747517m718157l144226
11049f83046J758934L747090K14355m318580m666183j307217J534860J541576
11041b178211J53112Q7952K080312L635738J561373l372154n997447l124922J531941
11032e622306K102291j261040l099616p73140K798653M565390M612151L122889
11024F445272q51066n575677o278879j647306L071504K823911m94494j651535
$$ y = [7843050, 5628228, 1886808, -4496073, -8461698, -5401400, 730989, 2596076, 463030, 864442, 5176856, 7242418, 3608445, -961566, -1241959, 858593, 487099, -2389996, -3808212, -2148420, 201722, 631104, -932236, -2601043, -2296659, 488995, 3927594, 5829433, 6499359, 7736207, 8926854, 7179337, 2461180, -683046, 1075888, 4822978, 5037333, 718753, -3947430, -5254647, -3719787, -2178211, -2025099, -1937147, 143165, 3778903, 5340276, 1968122, -4029325, -7154247, -5622306, -3520015, -4781055, -7880671, -8653811, -5855158, -1289768, 3322383, 6445272, 5594206, 18529, -6260350, -7907656, -4836152, -2012241, -2506735, -4158270]
11016d158270J63563J341240J7582j963394k720562k244962o06710K372159N091383
11007b707971M803673J382470j817041k032907j91247J142028J032946j2946j722365
10998a23360l434434l053009O67872N012716N308958Q99342l335081l000573L11438
10989g46131J808380K49340j081295L00694K863429L768992K341058r9159j973591
10980G431717k289707j408180j223773k589609k824165R79450N956063N336713
10972I368509j810843p495187n114269J286246L140667l48924k412726R5092K659636
10963f31799J327793j242701r17537J275284J518594m44769j288875M36124K101887
10954B134001Q55401k258847l379124p23446K851862L266558N23992j518448q79240
$$ y = [-4158270, -3994707, -2653467, -2635885, -4599279, -7319841, -9564803, -10171513, -7799354, -2707971, 2095702, 3478172, 1661131, -371776, -563023, 579005, 1611951, 1599005, -123360, -3557794, -6610803, -5942931, -930215, 4378743, 5278085, 1943004, -1057569, -746131, 1062249, 1311589, 230294, 530988, 3394417, 7163409, 9504467, 9405308, 7431717, 5142010, 3733830, 2510057, -79552, -2903717, -1924267, 4031796, 9368509, 7557666, 62479, -5051790, -3765544, -624877, -973801, -3386527, -3291435, -631799, 695994, -546707, -1464244, -188960, 1329634, 884865, -404010, 32114, 2134001, 2989402, 730555, -2648569, -3372015, -520153, 2746405, 3270397, 1751949, 872709]
10945H72709K8322q91168j526177M70829K618428R66924l072006m243582j392465
10936f168186J119008N01883p70591J20277J971383K321333J326980O15490O18975
10927A656552Q01593O71162l28482j897321j819513J185168L753210J332142m169761
10918A184750n505341o36221L607043J774545j928418q09165L416095L593002
10910D696290j455479n425244m040112j9267K186600J639785k80337k169394k343494
10901g210652K64222L692219M391086K003918k30901n60473p91099k133602k666361
10892c241643j030702O34269K25566n10997J037470L438176K926494o92649l277875
10883d91891j831428J805285L483590J353706k579946m443384k028069K672777
$$ y = [872709, 901031, 9863, -1516314, -1045485, 1572943, 2539867, -532139, -4775721, -6168186, -5049178, -4547295, -5317886, -5197609, -3226226, -904893, 422087, 1037577, 1656552, 2458145, 3129307, 2800825, 903504, -916009, 269159, 4022369, 5354511, 1184750, -4320591, -4956812, -1349769, 424776, -1503642, -2312807, 1103288, 4696290, 3240811, -2184433, -6224545, -6243812, -4057212, -2417427, -2697764, -4867158, -7210652, -6946430, -3254211, 1136875, 3140793, 2909892, 2349419, 1558320, -575282, -3241643, -4272345, -3638076, -3412510, -3923507, -2886037, 552139, 3478633, 2785984, -491891, -2323319, -518034, 2965556, 4319262, 1739316, -2704068, -4732137, -2059360]
10875b059360M927352K470206j639015l118128k203882k310565l634729k376122
10867i944243K540769O234331M191750j309382m530817l680136j242494J134356
10859f605866L515367M391802J634101k713462l314210J188175N730618N580736
10851I407261J944166j338072l103548l925391k984622L24059L554341L623911
10843G502105J063316j087580j602171j548393j603694j780498k730393m222266
10835f009574l416029J606781P096030O674936j36088o332682o005806j242366
10827g764798J848300J354515N39660J766333L111641K060145n4039J27327K493890
10818E482974K928476n50691l972539k703405J354969K153542j434283l998063
$$ y = [-2059360, 2867992, 5338198, 3699183, 581055, -1622827, -3933392, -7568121, -9944243, -7403474, -1169143, 3022607, 1713225, -2817592, -6497728, -7740222, -6605866, -3090499, 1301303, 2935404, 221942, -3092268, -1904093, 3826525, 9407261, 11351427, 10013355, 6909807, 2984416, -206, 323853, 3878194, 7502105, 8565421, 7477841, 5875670, 4327277, 2723583, 943085, -1787308, -6009574, -9425603, -7818822, -722792, 5952144, 5816056, -516626, -6522432, -7764798, -5916498, -4561983, -4022323, -2255990, 855651, 2915796, 2861757, 2989084, 5482974, 8411450, 7860759, 3888220, 1184815, 2539784, 4693326, 3259043, -739020]
10810g39020k123125P24960N16291j061511p00826K89347j005823k877087j515076
10801h491870K034434L238321J527085O77060J908299K290832P26063L9908J544581
10792E494713K442497Q28257j043569j078894j085007k964441m235471j363620
10784c005535L879015N406387O64010n370317n792748j75684M932979M361318
10776D899425O65503k83141J918608K308420q74580l356795k289815p81771j623701
10767E82153k062395M29851K412193N37176j384561J306745M751535K154388m002783
10758D724302m971850Q6302K928888j26031l211191j785064O38845J15516j313384
10749b913667q18747L13656P03062J726728L182288K170482r29112j888870n88821
$$ y = [-739020, -2862145, -2137185, -1620894, -2682405, -3383231, -3093884, -4099707, -6976794, -8491870, -6457436, -3219115, -1692030, -1014970, 893329, 3184161, 3910224, 3950132, 5494713, 7937210, 8765467, 7721898, 6643004, 5557997, 2593556, -1641915, -3005535, 873480, 6279867, 6943877, 1573560, -4219188, -4394872, 538107, 4899425, 5564928, 5281787, 7200395, 9508815, 8634235, 5277440, 2987625, 2205854, 582153, -1480242, -1050391, 1361802, 1898978, 514417, 1821162, 6572697, 8727085, 4724302, -247548, -161246, 2767642, 2641611, -569580, -2354644, -1715799, -1600283, -2913667, -3732414, -3418758, -2715696, -988968, 2193320, 4363802, 3434690, 1545820, 956999]
10740I56999j992801o069491n440728K144457P911667N156458k13086k25222J994281
10731D222534m63126m353923j499059N867116P341362J029510l674026j242747
10723G227641K625570J883729q48915q48851M19731o82839k707065j855493R27616
10714F141124J274998j308525k547763l00265J937753N52718k251578j655849
10706A842613J948543K959499p22105l906147k246851L70166j879207o273158
10698g906647m792338L003428Q272333N396579j046696m271466l642488j920069
10690f907364j82078Q90150q8614j694023j57941L895466N027190K093141P64078
10681C640005L228360L380612k200841o568433l161554K919686L153891r25194
$$ y = [956999, -1035802, -7105293, -12546021, -10401564, -2489897, 2666561, 2453475, 2228253, 4222534, 3759408, -594515, -2093574, 3773542, 11114904, 12144414, 8470388, 7227641, 9853211, 11736940, 10888025, 10039174, 10458905, 9776066, 7069001, 5213508, 6141124, 7416122, 6107597, 3559834, 3259569, 5197322, 5750040, 3498462, 1842613, 3791156, 6750655, 6028550, 2122403, -124448, 245718, -1633489, -7906647, -12698985, -9695557, -1423224, 3973355, 2926659, -1344807, -4987295, -6907364, -7089442, -6199292, -6287906, -7981929, -8139870, -4244404, 782786, 2875927, 3640005, 6868365, 10248977, 8048136, 1479703, -1681851, 1237835, 4391726, 3466532]
10673C466532k106920l78990r39179k869356p67438M109252M980254J240337j041028
10664E693464l15549j234308m315575m035271O01032L165156P62019j022078J584612
10655H83502L500474k94981n545125n097711P8346K963535R95043j584879r76957
10646e078753J646226L298530L218328K477309J610127J88619j691796k691482
10638B977108j756982L1741M30139r82288k266870j980982q19477J41352P95587
10629c430672R46534J82612n74760J6584R82681N19996J32332K520588N096655
10620F392550K106761n097446p494372j678177M089855K452032k049246j655523
10612b933566J871597K043908k60876O17020L947228L885547R700k525751k198662
$$ y = [3466532, 1359612, 980622, 41443, -2827913, -3595351, 513901, 5494155, 6734492, 5693464, 5377915, 4143607, -171968, -4207239, -3606207, -441051, 320968, -701110, 883502, 4383976, 4088995, -1456130, -6553841, -6475495, -3511960, -2516917, -4101796, -5078753, -3432527, -133997, 3084331, 5561640, 7171767, 7360386, 5668590, 2977108, 1220126, 1251867, 1682006, 699718, -1567152, -3548134, -4367611, -4226259, -3430672, -2484138, -2301526, -2876286, -2859702, -1877021, -1357025, -1224693, 1295895, 6392550, 8499311, 3401865, -4092507, -5770684, -1680829, 771203, -1278043, -2933566, -1061969, 981939, 721063, 1338083, 5285311, 9170858, 9180558, 6654807, 4456145]
10603D456145k091056k627742j411234M75590j69339j698497K67754M330138M628543
10594F160302L74933l378576m183076m042896l278363j80947L343438L352080
10586a833105J049856R72522K374540N24340l454199k909443K912365O376733
10578F013609K887649k672128l925717j266097Q28194K3678k571017m004404j825163
10569f511396K366120L311610m57831k961265L77202M581071K840157k036411
10561A509257k616308N63411J407329J27968J582496L884013P11340n664084n918094
10552d412672R46982N479592K757035j499135j954946m94136M32433J798563K967850
10543F021566J183879k260089l132095j753162j493850j216759J739719L521598
$$ y = [4456145, 2365089, -262653, -1673887, -1198297, -1367636, -3066133, -2798379, 1531759, 6160302, 6535235, 3156659, -1026417, -5069313, -8347676, -8528623, -5185185, -1833105, -783249, 189273, 2563813, 3088153, -366046, -3275489, -363124, 6013609, 8901258, 6229130, 2303413, 1037316, 1865510, 1889188, -681829, -4686233, -6511396, -4145276, -833666, -1291497, -4252762, -3875560, 705511, 3545668, 1509257, -1107051, -543640, 863689, 991657, 2574153, 6458166, 7169506, 1505422, -4412672, -3465690, 2013902, 4770937, 3271802, 1316856, 822720, 1255153, 3053716, 6021566, 7205445, 4945356, 1813261, 60099, -1433751, -2650510, -910791, 2610807]
10535B610807n91292n281740k220361M701921M938929l24556p76802L632732K895617
10526I585255l537289n187178j299K321857j119995k157556J254425J218820l399932
10517a022892m025664O23402K254506K87980K737133P721096M432052n116400
10509G891213o980045k05717K267104p41512K061774Q066429L151532p447685
10501H063093m216616P581913K739707j4727374j2615598R585571J4204057n010522
10493E604231o916258J7436650J8536682j5146161j0108314P1911785J34424491
10486B15743106O6599559p8764531j40910491p1651089J4213317J9990067j4544618
10479A0675320j4816765R055169Q790826r000491q151796N450190K925814q794379
$$ y = [2610807, 2019515, -3262225, -5482586, -780665, 4158264, 3833708, 3056906, 6689638, 9585255, 6047966, 860788, 859489, 3181346, 2061351, -96205, 1158220, 2377040, -1022892, -5048556, -4425154, -2170648, -1882668, 854465, 8575561, 13007613, 7891213, 911168, 705451, 2972555, 2231043, 4292817, 12359246, 15510778, 8063093, 3846477, 11428390, 14168097, -559277, -13174875, -3589304, 10614753, 5604231, -1312027, 16124623, 34661305, 19515144, 9406830, 81318615, 215743106, 282342665, 203578134, 62667643, -8983446, 5229871, 25219938, 10675320, -4141445, 4913724, 13704550, 4704059, -3447737, 2002453, 4928267, -3866112]
10471c866112m309628Q439153M802398p833630m890032Q106275P135038m646898
10463B936564m681647N739326N666335n264735p850916J98452K971950j877631
10455b162302j789020L014650M78878o702490m086232O326648Q271962O48729
10447D000823j790975L304889L207582l681135m623527K399395M866890j95474
10439G488468j649512K911374K507483m837021p065175o67244K629904k307355
10431i89078n326829o08977L782904K757114K655495N834136M340052l201063
10423I243754n376493K387213P868881J747398p014934o287857R23124M240026
10415G731112K026511n47170j604938j915656p98460N55550j627291n904975m891533
$$ y = [-3866112, -8175740, 263413, 5065811, -2767819, -7657851, 448424, 7583462, 2936564, -1745083, 3994243, 9660578, 4395843, -3455073, -3256621, -284671, -2162302, -3951322, -936672, -457794, -7160284, -11246516, -4919868, 3352094, 4000823, 2209848, 5514737, 8722319, 5041184, 417657, 2817052, 7683942, 7488468, 5838956, 8750330, 11257813, 6420792, -644383, -1311627, 1318277, -989078, -6315907, -6924884, -3141980, -384866, 2270629, 8104765, 12444817, 9243754, 3867261, 6254474, 14123355, 15870753, 8855819, 2567962, 3491086, 7731112, 9757623, 9210453, 7605515, 5689859, 4891399, 5446949, 3819658, -2085317, -6976850]
10406f976850K689110P732073M061723k412309l756964j146003L12389M10657
10398I13826J048812R74126p87119j721546o70407l13252j337958o01348J778027
10389g16839J022263l129257m078676O06221M346091K612107J51297J450278K670696
10380D934181j21140k882538j368523N64030j351866k822554J153853N630014
10372C735457L118519k909465k808315L408543N835977J99635o172955n941788
10364a534392j483759L78856j910243l964190j989323K679727N157146K565499
10356a00679k132441l290370P5948K897437J511749r06459M91476M412930N139047
10347H098638J024314l026933k372662J134564J731290k420515o147601l454380
$$ y = [-6976850, -4287740, 3444333, 7506056, 5093747, 1336783, 190780, 503169, 913826, 1962638, 2936764, 2149645, 428099, -242308, -555560, -1893518, -2494866, -716839, 305424, -2823833, -6902509, -6296288, -1950197, 661910, 813207, 2263485, 4934181, 4813041, 1930503, 561980, 1126010, -225856, -3048410, -1894557, 3735457, 6853976, 3944511, 1136196, 4544739, 10380716, 10580351, 4407396, -1534392, -3018151, -2639295, -4549538, -8513728, -10503051, -7823324, -2666178, -100679, -2233120, -5523490, -5447542, -2550105, -1038356, -1944815, -1453339, 2959591, 8098638, 9122952, 6096019, 3723357, 4857921, 6589211, 4168696, -1978905, -5433285]
10339e433285M022070P759313K920568m967139p046718k255292K951332M182007
10331B132856L036071J920432N31376j471492k818753l002920k918108k610328
10323e200866j527889o15541o31434M68196M066776O343041K770680m006335p082497
10314e415869n208558k909348j495844J875539N998373N499130N94286j896020
10306b958311K56237J366303j170251j873511K291404N366916K321197k345797
10298C254187k414879M40533J380818N82428K19786j020388m002228n083430k152276
10289h795449O40717Q6910j24949K997245M806416J256432k421139j98379L433842
10280A681646P57748n275539n534783m174K869899P36987j12951K914208M585235
$$ y = [-5433285, -1411215, 6348098, 9268666, 4301527, -2745191, -5000483, -2049151, 2132856, 5168927, 7089359, 7620735, 6149243, 3330490, 327570, -2590538, -5200866, -6728755, -7344296, -7975730, -7507534, -3440758, 2902283, 5672963, 1666628, -5415869, -10624427, -13533775, -15029619, -13154080, -7155707, -1656577, -1062291, -2958311, -2702074, -1335771, -2506022, -4379533, -2088129, 3278787, 5599984, 3254187, 839308, 1279841, 2660659, 3243087, 3462873, 2442485, -1559743, -6643173, -8795449, -8154732, -8067822, -8192771, -5195526, -389110, 867322, -1553817, -1752196, 1681646, 2439394, -2836145, -8370928, -8375102, -5505203, -4768216, -4881167, -1966959, 2618276]
10271B618276J988427o08500R0998J363578O85861J88906J644418K657548R84747
10262A1614259j814216l435300l726951k977587j013462R29097R82493j97319
10254C61014n47884n25143j772372k617578o3765M048382M637113J486163k58021
10245D747909J298393J906314j084320m048412l258625p26758k01625j239994
10237b607118j121505J17881L08487p98997j223279J36186K174378L169261K552123
10228B707417J114499k08620j525713l198570m028640k256478J078053K549749
10220c768303J334435M14125J077429N51537k041366k439556J546166M563314
10212A237781J408367m231696n562339l097084j537973k80123L628642O323566
$$ y = [2618276, 4606703, 3998203, 4089201, 5452779, 6138640, 6327546, 7971964, 10629512, 11614259, 9800043, 6364743, 2637792, -339795, -1353257, -424160, 558333, 361014, -186870, -712013, -2484385, -5101963, -5165728, -1117346, 3519767, 5005930, 4747909, 6046302, 7952616, 6868296, 2819884, -438741, -1165499, -1367124, -2607118, -3728623, -3610742, -3302255, -4101252, -5324531, -5188345, -3013967, 155294, 2707417, 3821916, 3613296, 2087583, -1110987, -5139627, -7396105, -6318052, -3768303, -2433868, -2019743, -942314, -390777, -2432143, -4871699, -3325533, 1237781, 2646148, -1585548, -7147887, -10244971, -11782944, -12063067, -8434425, -2110859]
10204b110859J939974n036169m217598L723631P050176J843974k073642J652335
10196B771822N533394J946487l996739m022551j45868Q01498r56870r99295J61772
10187A093650m02595j095428M11771R42366k511769n371102k290293K792994K626369
10178c804037j008772r18273K334843J872292k038120j510574M799769Q053611
10170G780739L038154l833391m807749j213903J405422J957790K044849P49905
10162G121816k977881o223304n625576k544507l40065J094503L609493N680206
10154b05315M071552j75388k363226j126912k19260j873965k784511J18006L293172
10145a265847J068595m676513n356954K044948R198300P230299j005803n606589
$$ y = [-2110859, -170885, -5207054, -9424652, -5701021, 1349155, 3193129, 1119487, 2771822, 8305216, 10251703, 6254964, 2232413, 2086545, 2888043, 1931173, 931878, 1093650, 691055, -404373, 7398, 949764, -1562005, -6933107, -9223400, -6430406, -3804037, -4812809, -5731082, -3396239, -1523947, -3562067, -5072641, -272872, 7780739, 10818893, 6985502, 2177753, 963850, 2369272, 4327062, 6371911, 7121816, 4143935, -2079369, -7704945, -10249452, -10589517, -9495014, -5885521, -205315, 3866237, 3690849, 1327623, 200711, -18549, -1892514, -4677025, -4559019, -1265847, -197252, -4873765, -10230719, -8185771, 1012529, 8242828, 7237025, 1630436]
10137A630436l738461j296654j294370J44259L973685L853801k853867p658176
10129g239347k470122P020586Q606537R59621n618778m627295k65471J841497
10121a792772K138993K665758K213569k06853k173558j752453p22181q62932n42280
10112a034709J874238M136506L012734o46783k729632j220004J216537L77150
10104D986037m070195o919210k960483N310966Q873759L555532l608197l949939
10096A218270N39847J346816k520079l537352R47328L817105J9924n007569m114059
10087g289769Q09450L103014J673117M79289P43503J42224j630564k143010p75398
10078d888144M37014N35780O98962J470471J746711P29346j022401k343471k104446
$$ y = [1630436, -2108025, -3404679, -4699049, -4554790, -581105, 3272696, 418829, -7239347, -9709469, -2688883, 5917654, 6877275, 1258497, -3368798, -3634269, -1792772, 346221, 3011979, 5225548, 5018695, 2845137, 1092684, 370503, -492429, -1034709, 839529, 4976035, 7988769, 7341986, 4612354, 3392350, 4608887, 4986037, 915842, -6003368, -8963851, -3652885, 5220874, 8776406, 5168209, 1218270, 1758117, 3104933, 584854, -2952498, -2005170, 1811935, 1831859, -3175710, -7289769, -6480319, -3377305, -1704188, -1224899, -481396, -339172, -1969736, -4112746, -4888144, -4451130, -3915350, -3216388, -1745917, 794, 730140, -292261, -2635732, -4740178]
10069d740178k4395K209649K278053O98478O18637K733905L397995J96952l520527
10060C848569l057501Q18466L201148J956716k96740p39887K13596M46724p87416
10051E603675j856721n25931K666877L476932j058257o957874o832833k01013
10043e685145M720437K233741k963723l423238K73275K278462J442004J476294
10035C52107L059747L071346J372151J348204K870728J380316m017115p570791
10027A866693n080484j56994J369723n28639j680180o53696J72942o31194j405325
10018f727154j57829K867026N678336O165632L333059j649937n485055n220552
10010a196474j478979J580660O10727k888315m262844j658808J687162K328511
$$ y = [-4740178, -4764573, -2554924, -276871, 421607, 1040244, 3774149, 7172144, 7369096, 3848569, 791068, 1609534, 4810682, 6767398, 6470658, 5730771, 5944367, 6391091, 5603675, 3746954, 3221023, 5887900, 9364832, 8306575, 1348701, -5484132, -5685145, -964708, 1269033, -1694690, -5117928, -4844653, -2566191, -1124187, 352107, 3411854, 6483200, 7855351, 9203555, 12074283, 13454599, 9437484, 1866693, -3213791, -3370785, -2001062, -2529701, -4209881, -4863577, -4690635, -5321829, -6727154, -6884983, -4017957, 1660379, 7826011, 11159070, 9509133, 4024078, -1196474, -2675453, -1094793, -484066, -3372381, -7635225, -9294033, -7606871, -5278360]
10002e278360J380961J647082K197312L93241j859443M854M439911L882431l418386
9993C389603q484742l750984N460484Q243537K836341l216377m811742l453723
9985c787603j165779J819197L335190P57819k931139j619670L948778N685015
9977F041808J14599n823262m648784J506700N041298L073875r70419l150600k335783
9968a150568M64785K813166K099292j461823m127135k742574J376367L950582
9960A222092K307097k139696n136088l514624J085250L521136J691518m74180
9952a437495O28877K014297p76718m840046l315556L058479N783383J372855l484304
9943i96228k526534J385257K388266M62871p38453k66300O89559K039277L284149
$$ y = [-5278360, -3897399, -2250317, -53005, 340236, -1519207, -1514353, 2925558, 6807989, 3389603, -5095139, -8846123, -3385639, 4857898, 7694239, 4477862, -333880, -3787603, -4953382, -3134185, 201005, 958824, -1972315, -3591985, 356793, 6041808, 6156407, 333145, -4315639, -2808939, 2232359, 5306234, 4335815, 1185215, -1150568, -685783, 2127383, 4226675, 2764852, -1362283, -4104857, -2728490, 1222092, 3529189, 1389493, -3746595, -7261219, -6175969, -2654833, -963315, -1437495, -808618, 1205679, 428961, -4411085, -7726641, -4668162, 1115221, 2488076, -996228, -3522762, -2137505, 250761, 713632, -24821, -291121, 398438, 2437715, 5721864]
9934E721864K198614j258360l256219j813485l11460j668158l315335k194945
9926e897484l14258l34908N5177L413029N906638K324270m652568p309690l996345
9917a0806139n25385m64270o12809K298522N870952N803814K130438r53614k00772
9908B540737L132395M538007J173212m312997o206461k558121K433783L881760
9900D622315J611364j318600k798846k412741m48180J758372K447262J726438
9892E187384J085356L29942j617096k899172o30543K991861K625377j186580k265733
9883C620796K25182m7995m315572m896347J000310M675459Q24670k441968J113406
9874b42059K312234p200097j5465392n906421J3546793J8290240L131585j0579878
$$ y = [5721864, 7920478, 6662118, 3405899, 1592414, 1280954, -387204, -3702539, -5897484, -6211742, -6546650, -6491473, -3078444, 2828194, 5152464, 499896, -6809794, -10806139, -11331524, -11795794, -12408603, -10110081, -4239129, 1564685, 3695123, 2741509, 2540737, 5673132, 10211139, 11384351, 7071354, 864893, -1693228, 740555, 4622315, 6233679, 4915079, 2116233, -296508, -744688, 1013684, 3460946, 5187384, 6272740, 6602682, 4985586, 2086414, 1455871, 4447732, 7073109, 5886529, 3620796, 3845978, 3797983, -517589, -5413936, -4413626, 261833, 1086503, -1355465, -242059, 2070175, -5129922, -20595314, -26501735, -12954942, 5335298, 8466883, -2112995]
9866b112995p355392K885460N025749P40298n08785J430978J466067O18193K035138
9857D224711K829283m12746m034997l570848j696167k252704k435539J170352
9849f178655M581886K658252j687207k468073k16520R95886J434792K851540K502611
9840D474512j623047l995225R22512P816260O774627j830456q121233p092793
9832b674843l056627j69747K391478M853927M567297J279103j591483k388849
9824C210256k523358j875089J254398M993244M754993M72473k588619j649819
9816F048479J41888m06153k157288k923612k728154k037441n96851N60905l20195
9807d418422j996216r71424K750354M662175K222753j390020k115263m29008M64782
$$ y = [-2112995, -9468387, -6582927, -1557178, -816880, -1325665, 105313, 1571380, 2189573, 4224711, 7053994, 6641248, 2606251, -964597, -2660764, -4913468, -7349007, -6178655, -1596769, 1061483, -625724, -3093797, -3310317, -2314431, -879639, 1971901, 4474512, 2851465, -1143760, -221248, 7595012, 14369639, 12539183, 4417950, -2674843, -5731470, -5901217, -3509739, 1344188, 5911485, 7190588, 5599105, 3210256, 686898, -1188191, 66207, 5059451, 9814444, 10286917, 7698298, 6048479, 6190367, 5784214, 3626926, 703314, -2024840, -4062281, -4659132, -4098227, -4418422, -6414638, -7386062, -4635708, 26467, 2249220, 859200, -1256063, -1685071, -1220289]
9798a220289m90561j527602r92650P46858J889703J181893l99468n92970R16750
9789d88336J832584R63613J36794M11331l77028l022969l527057P64672M794528
9780A488132K145541m274288n574916l92539L226170O89802k703468j332513K278264
9771d449815L178901J956538J554201J075465j353187l213774j155171K463783
9763E6941K432290j196649l252234j314600J429814J624850n0457j126092p18595
9754b114732M73015J447798J384176L18217m49560K9368O28903l10421k138152
9745g31388k629180j355931J8187R88899K976408N653190N248555p08664q257484
9736A202592j0023071l973419L556073N222665J076985k725271k270775K94429
$$ y = [-1220289, -1710850, -3238452, -4231102, -3484244, -1594541, -412648, -812116, -1405086, -488336, 1344248, 2307861, 2444655, 2855986, 2478958, -544011, -4071068, -3306396, 1488132, 3633673, -640615, -6215531, -6608070, -3381900, -2692098, -5395566, -6728079, -4449815, -1270914, 685624, 2239825, 3315290, 1962103, -1251671, -2406842, 56941, 2489231, 1292582, -1959652, -3274252, -1844438, -219588, -270045, -1396137, -2114732, -1641717, -193919, 1190257, 1508474, 1058914, 1088282, 1717185, 1406764, -731388, -3360568, -4716499, -4698312, -3709413, -733005, 4920185, 10168740, 9460076, 1202592, -8820479, -12793898, -9237825, -4015160, -2938175, -5663446, -7934221, -7639792]
9728g639792J345937P72137P15299J679520K173791J161648q73844k649804k789219
9719f104327p47415K047938L098116J658170n67604j882995j885065k37381K844453
9710a776110M457748J462532l645308m286933L51826K835046j067610m806210
9702f475019j476851M057455K645961l641329m600985J021662L661700m17958
9694e225364k765094K428182Q034065N610625j338977m103205k317744j782546
9686a460058l032470j353287L543087O121205L440061j338804m332272m793093
9678c205631l218229k7966L139779M109312K653498K36176j966246k788812p68542
9669a836661K960074L637696j333668p204317o886193l57168N244722M761680
$$ y = [-7639792, -6293855, -5521718, -4806419, -3126899, -953108, 208540, -665304, -3315108, -6104327, -6851742, -4803804, -1705688, -47518, -615122, -2498117, -4383182, -4620563, -1776110, 2681638, 4144170, 498862, -3788071, -3436245, -601199, -1668809, -6475019, -7951870, -3894415, -1248454, -4889783, -9490768, -8469106, -4807406, -5225364, -7990458, -5562276, 2471789, 8082414, 6743437, 2640232, 322488, -1460058, -4492528, -5845815, -2302728, 3818477, 7258538, 5919734, 1587462, -3205631, -6423860, -6451826, -3312047, 797265, 3450763, 3686939, 1720693, -1068119, -1836661, 1123413, 4761109, 3427441, -3776876, -10663069, -11020237, -5775515, -1013835]
9661a013835L01984k843906k030142J595807M910109N111900K171781r03389j591770
9652E708539o76720r2921L6441o6483j742333m963391n891097j702560L936405
9643e454120N083533J999083J75282J504569K153151k07592k653561k232460l18820
9634D9065L82465m06073j554221k167505r27888K931763O772352O134436P59443
9625A1973837m126768m165082o79191K169673K133899m74071l889280n285338
9617b342321k909294R76066K139973K11330r29058N10170J573166p4467k225534
9608c069969k023264k18352J061672J661293K052072J615873N30951L57650P90572
9599B758498o22615l481672l567444K95278L017264P43228k783083k057359J768429
$$ y = [-1013835, -711851, -3555757, -5585899, -3990092, 920017, 6031917, 8203698, 7300309, 5708539, 5031819, 4938898, 4975339, 4908856, 3166523, -1796868, -7687965, -9390525, -5454120, -370587, 1628496, 1803778, 3308347, 5461498, 5253906, 2600345, 367885, 49065, 431530, 25457, -1528764, -3696269, -4624157, -1692394, 5079958, 11214394, 11973837, 7847069, 3681987, 3002796, 5172469, 7306368, 6832297, 2943017, -2342321, -5251615, -4275549, -2135576, -1924246, -2853304, -2343134, -769968, -844435, -3069969, -5093233, -5311585, -4249913, -2588620, -536548, 1079325, 1610276, 1967926, 2758498, 2135883, -1345789, -4913233, -4617955, -1600691, -857463, -3640546, -5697905, -3929476]
9590c929476L584337K353549R02155J04518j110897j771615l29688J306733L21886
9581A431502j873003j980902m90990J59153Q48505L227292M253853M04489m497864
9572A482035l806700O66126J020536l073061l314368K696798O505258K635451
9564D812075k579837k096041Q15857J65221j819406j79162K394933L40138l809818
9555a956040l100357J751809L642761J178077j37369J180828J09598m628569o721471
9546h680733k229953L891339N534976L815868L029234L000028P78450k962850
9538F176359m344784k045360J122405K141507Q47342q16858j102021j11988M08501
9529B275103m71350j068971N55043K881376K274206j604524m577354l225181R94155
$$ y = [-3929476, -345139, 2008410, 2910565, 3015083, 1904186, 132571, -197117, 1109616, 1431502, -441501, -2422403, -2913393, -2754240, -1905735, 1321557, 5575410, 5979899, 1482035, -2324665, -1658539, -638003, -3711064, -7025432, -4328634, 2176624, 4812075, 2232238, 136197, 952054, 1117275, -702131, -881293, 1513640, 1853778, -1956040, -5056397, -3304588, 338173, 1516250, 1378881, 2559709, 2669307, -1959262, -8680733, -10910686, -7019347, -1484371, 2331497, 5360731, 8360759, 9139209, 6176359, 1831575, -213785, 908620, 3050127, 3897469, 3080611, 1978590, 1866602, 2275103, 1803753, 734782, 1289825, 4171201, 6445407, 4840883, 263529, -2961652, -1967497]
9520a967497M053782L752859Q53479k194602k807142m01806K433504K731846J079455
9511G533878L05178N45233p95175l757777m750195k315066M6577p73984k759966
9502f721297k200122R03782L626620M059606K112471j302620l747582k549038
9494e818180J146894K544835q5061k243060J5341L649502L334819l13178k334918
9485a03006j313058k64525o11639n94082L84869P62283N75969J611509L055039
9476C503359J574821k809058n194319k454238J931216K536689p05619k838131
9468d455280p37870K876868L046055r09656m076594k137114K493263L666759M61727
9459B28158j334632J483618L917444P52123m310991l930624J292471M006948J804308
$$ y = [-1967497, 2086285, 5839144, 6692623, 4498021, 1690879, 1289073, 3722577, 6454423, 7533878, 7839056, 8384289, 7589114, 3831337, -918858, -3233924, -3187347, -3961331, -6721297, -8921419, -8017637, -4391017, -331411, 1781060, 478440, -3269142, -5818180, -4671286, -2126451, -2211512, -4454572, -4439231, -789729, 2545090, 2231912, -103006, -1416064, -1680589, -2292228, -2886310, -2501441, -1739158, -1163189, 448320, 3503359, 5078180, 2269122, -2925197, -5379435, -3448219, -911530, -1617149, -4455280, -5193150, -2316282, 729773, -179883, -4256477, -6393591, -3900328, -233569, 228158, -1106474, 377144, 4294588, 5046711, 735720, -3194904, -1902433, 2104515, 3908823]
9450C908823k35502O95774Q79101j948151l736024j280079J834971J212136j288258
9441D2791j501262r8587m97385k414231k675007p52634J021906J571503J521155
9432c781751O97478j198556k420133j038644J832395L527782L415746K300664
9424C334981n3423l482281n120450k506690J914220L364448J363782j34302Q41402
9415d78313J775051L04105k243268l300418k323306l14912J718726K746422K061569
9406e4344O41110M77141J677112J833292o45322l799455m010100l21503L956944
9397b45125M459785P42650k733383j893855J410888J852353j385483l079126j15865
9388i87161L288231K168487j279569j584524R67012J473976p01321j065443J609486
$$ y = [3908823, 3673321, 4369095, 5248196, 3300045, -435979, -1716058, 118913, 1331049, 42791, -1458471, -1557058, -2054443, -4468674, -7143681, -7896315, -6874409, -5302906, -3781751, -3084273, -4282829, -6702962, -7741606, -5909211, -2381429, 1034317, 3334981, 3281558, -200723, -5321173, -7827863, -5913643, -2549195, -1185413, -1319715, -478313, 1296738, 1600843, -642425, -3942843, -6266149, -6581061, -4862335, -2115913, -54344, 586766, 1063907, 2741019, 4574311, 3928989, 129534, -3880566, -4202069, -245125, 4214660, 4957310, 2223927, 330072, 1740960, 3593313, 2207830, -871296, -987161, 2301070, 4469557, 3189988, 1605464, 2572476, 4046452, 3345131, 2279688, 3889174]
9379C889174K777417m3390k937029k088855M53492J061362K88495L96075O17300
9370D414041p96050k328054j303439J368690K462718J403845M61475O23629M26261
9361F733116j252397l587875m833239l484521N51041M543718M553443M68487k727077
9352I64696j378183J491887Q69983k305356k720212O75736K987870J114616j757305
9343e6268j483247J076827K223534R69041m80779m82514K44858K84718m73725
9334A822445p09984O35931K498567K381314k37257k623917k662874k198363l559789
9325d653927m570605j598929L246489L762232o68767l199614J29842M111859K638207
9316h03213j893982k983659K7667K681484L453179M331764M691282J638417l274120
$$ y = [3889174, 6666591, 6623201, 3686172, 1597317, 2050809, 3112171, 3400666, 3796741, 4414041, 3617991, 1289937, -13502, 1355188, 3817906, 5221751, 5683226, 6306855, 6733116, 5480719, 1892844, -2940395, -6424916, -5873875, -1330157, 3223286, 3691773, 964696, -413487, 1078400, 1948383, -356973, -3077185, -2401449, 586421, 1701037, -56268, -1539515, -462688, 1760846, 2729887, 2249108, 1766594, 2011452, 2296170, 1822445, 1112461, 1748392, 4246959, 6628273, 6391016, 3767099, 1104225, -1094138, -4653927, -9224532, -10823461, -7576972, -3814740, -4483507, -7683121, -7553279, -3441420, -803213, -2697195, -5680854, -5653187, -2971703, 481476, 4813240, 9504522, 11142939, 7868819]
9307G868819m397237o40903K146444p7723l577539k865889J391295M200845L160051
9298G208163O6419k513833l278253k014783K19121J544618J360153R51645J138158
9289D681408R93025j14084j112232r89091j69237P00183J396707J111361p10321
9280E787719k229519j165576P47797n03604m077092m110051J044087M998150K509612
9271C001523k690857m052579j567064O10540J775061L457158L923078R31692k413652
9262B974900j750129N81488p18867l801108j938600M457492P305273L548248o96896
9253I961801j132688j412563m343597n516583j406707L228904K556212j199510
9245G35269k273474m97560M96473L81595R40631Q78320j619848l552842r34817
$$ y = [7868819, 3471582, 2830679, 4977123, 4899400, 1321861, -1544028, -152733, 4048112, 7208163, 7274582, 4760749, 1482496, -532287, -313166, 1231452, 2591605, 3543250, 4681408, 5674433, 5560349, 4448117, 3459026, 3289789, 3989972, 5386679, 6498040, 5787719, 3558200, 2392624, 3140421, 2636817, -1440275, -5550326, -4506239, 491911, 3001523, 310666, -3741913, -5308977, -4698437, -2923376, 533782, 4456860, 5388552, 2974900, 1224771, 1806259, 1087392, -2713716, -4652316, -194824, 7110449, 10658697, 9961801, 8829113, 7416550, 3072953, -2443630, -3850337, -621433, 1934779, 735269, -1538205, -2035765, -1539292, -1157697, -217066, 661254, -958594, -4511436, -5446253]
9236e446253L643237L799758j009914m763175l714521l88362J622736J700975
9228d555519L61458j850950k597634P18376O234315Q305829M599838o98079k492005
9219H025629q42927M91153m72806k019890j513912J202481L301391K054335j486760
9210H738694l230283j328976J226674J094856n47262n95159L70488p83103l628567
9201A317362l862735j40831K931418J131700k902941k930181K119009O074037
9193C736838L496954k587333l994209J671740P104510M817829k570849o228511
9185E446969l528148l56688p91875j542689O92184L034396K138700M97602J478443
9176G068894K664911L71010k933414k462673M21159N99629j894908k490084m46089
$$ y = [-5446253, -1803016, 1996742, 986828, -3776347, -7490868, -7879230, -6256494, -4555519, -4194061, -6045011, -8642645, -7924269, -1689954, 6615875, 11215713, 10517634, 8025629, 7182702, 7673855, 7201049, 5181159, 3667247, 4869728, 8171119, 10225454, 8738694, 5508411, 4179435, 5406109, 6500965, 5953703, 5358544, 5729032, 4945929, 1317362, -2545373, -2686204, 245214, 1376914, -1526027, -4456208, -2337199, 3736838, 7233792, 4646459, 652250, 2323990, 9428500, 14246329, 11675480, 5446969, 1918821, 1562133, 770258, -772431, -80247, 2954149, 5092849, 5590451, 7068894, 9733805, 10104815, 7171401, 4708728, 5129887, 5729516, 3834608, 1344524, 898435]
9167H98435M57692q01505j311054l48646k07485p47237M32792K165708Q11729
9158A350429k308156j753881K558824M165380M95508k840067j409791J268244
9150A526490N26783j790194j364804J361559K758699J687607k26122j503451j301381
9141A675186M32765J559598l31478l448136l327222P3892J867461L33615l23696
9132a488015K261789M252184K411298o18703j794284k668950m518494m297854
9124f461029o85084J423449j445927m234943q01243N593827O710148J518568l320474
9115a702708l547272j187449P15923J284370K61320j635821j565588J749221M520133
9106a107871K658507j572231k554267N31398L497999L686165J805525j206001
$$ y = [898435, 1356127, 554622, -756432, -1105078, -1312563, -2059800, -1627008, 538700, 1350429, -957727, -2711608, -152784, 4012596, 4508104, 1668037, 258246, 1526490, 2053273, 263079, -1101725, 259834, 3018533, 4706140, 4480018, 2976567, 1675186, 2107951, 3667549, 3336071, -112065, -3439287, -3365395, -1497934, -1164319, -1488015, 773774, 5025958, 7437256, 6818553, 5024269, 2355319, -2163175, -6461029, -7146113, -5722664, -7168591, -11403534, -12204777, -6610950, 99198, 1617766, -1702708, -5249980, -6437429, -5721506, -4437136, -4175816, -5811637, -7377225, -5628004, -1107871, 1550636, -21595, -2575862, -2044464, 1453535, 5139700, 6945225, 5739224]
9098E739224m116274l907921K12887L094970r470m993615l811698K912751O003198
9089A124052J356211m224220l487282J509911L996249K041601p65858j345464
9081B05200p2080J119424J150841N50241M84814Q21838j8598k294199l643712
9072a696231k355057p9471R06764R59423J088954N00529p80128j04042L019848
9063A460589L986201j1373l882751j797479K923687K715005j942448l796411j077605
9054a422585Q18853q1064L11641K713962J936177l141079n834938k176772K440059
9045d435746J963268j453709k344330k71123J672453K309127J970673M20562j303572
9036a472397o97450J784255K243076l26059j940077l03036J611881J281060M21931
$$ y = [5739224, 1622950, -2284971, -2072084, 1022886, 1013416, -3980199, -7791897, -4879146, 1124052, 2480263, -1743957, -5231239, -3721328, 274921, 2316522, 1550664, 205200, 133120, 1252544, 2403385, 2953626, 3438440, 4260278, 4241680, 1947481, -1696231, -4051288, -4130759, -3223995, -2264572, -1175618, -675089, -1455217, -1559259, 1460589, 5446790, 5435417, 1552666, -244813, 2678874, 5393879, 3451431, -344980, -1422585, -603732, -684796, -373155, 2340807, 4276984, 1135905, -4699033, -6875805, -4435746, -2472478, -3926187, -6270517, -6541640, -4869187, -2560060, -589387, -168825, -1472397, -2169847, -385592, 1857484, 1531425, -408652, -711688, 900193, 2181253, 2603184]
9027B603184L17629o93170k151634o40926K526893N21414p192273j0411187k525902
9018a7645972Q102349R593266L212797r24810J08481R24564k46568M47778L040241
9009F612126K442697k086906m693586k206495J380387J887031L86171n25241p54262
9000B441922q71192l94664M13976M04603j25544k57275j311510m696001p260124
8991a1655809m015205L813109Q640708O070628P6483l270608l044500j897823
8983e283017q53651R15972L006475L681954K609692J640201K240057L055176J333688
8974A2346547k734528m828556j970488K204609J739328k516537l624779N67431
8966A183027L881540K016734p28066K28385J592177r29966l745400j625720K199635
$$ y = [2603184, 2920813, 2227643, 76009, -564917, 1961976, 2483390, -4708883, -15120070, -17645972, -9543623, 49643, 3262440, 2337630, 2446111, 3370675, 3124107, 3571885, 6612126, 9054823, 6967917, 2274331, 67836, 1448223, 3335254, 3721425, 3196184, 2441922, 1570730, 1176066, 1590042, 1994645, 1869101, 1611826, 300316, -4395685, -11655809, -15671014, -11857905, -3217197, 2853431, 2929914, -340694, -3385194, -5283017, -6136668, -5220696, -2214221, 1467733, 4077425, 5717626, 7957683, 11012859, 12346547, 9612019, 4783463, 2812975, 5017584, 6756912, 4240375, 615596, 1183027, 5064567, 7081301, 6353235, 6581620, 8173797, 7243831, 3498431, 1872711, 4072346]
8957D072346J463913j704958r52569J900189j0876m860803l909104K845116N458139
8948D301393N38807l541967j571771O75482j165825j795843K380477M685364Q10
8939D506927m507308r72663M975160L376679k937108l369240K052147K985215
8931F109809l139311o604236j588541M620484L645385j642380l181063j2129K251518
8922D59536Q92232j195236j266036l46414m50532j242291q65638J151596L085110
8913B22327L106876J409295l92330j395215j696775j029610P46605J766389k51514
8904B486048l565564l047497K440047O654713L675382l413564o165507k076849
8896c012791K685971K397630j046787k284693l31096J248645N03229m21360L84751
$$ y = [4072346, 5536259, 3831301, 2878732, 4778921, 4768045, -92758, -4001862, -1156746, 4301393, 4840200, 1298233, -273538, 401944, -763881, -2559724, -179247, 4506117, 4506927, -381, -973044, 4002116, 7378795, 4441687, 1072447, 3124594, 6109809, 2970498, -3633738, -5222279, -601795, 3043590, 1401210, -1779853, -1791982, 459536, 1351768, 156532, -1109504, -1455918, -1906450, -3148741, -4014379, -2862783, 222327, 3329203, 4738498, 4346168, 2950953, 1254178, 224568, 971173, 2737562, 2486048, -1079516, -4127013, -1686966, 4967747, 8643129, 5229565, -935942, -3012791, -326820, 2070810, 1024023, -1260670, -1591766, -343121, 160108, -261252, 123499]
8887A23499J015687r46142l427980k130058K180107L316934j160566n049036k122894
8878h200449M194612N981534K977843J730361L479599K159389l704125o529673
8870B089091j713397M082619L050507k050530l708350j805497j604861l310647
8862d971065k459858J045942K638920J369560J004081K627368L006132R95116
8854E256196p41016j269082k617211m402847l248120P73819K802950N71134j936111
8845d810288p90932K264095L236359J318125j591556l747864l841350j180457
8837i143868K640455M666124M193632K901480J239113j610266l927262k459255
8829a499847J530217K433979j154792l275773N01112N671363M957621j444261
$$ y = [123499, 1139186, 193044, -3234936, -5364994, -3184887, 132047, -1028519, -6077555, -8200449, -4005837, 1975697, 4953540, 6683901, 10163500, 12322889, 8618764, 2089091, 375694, 4458313, 7508820, 5458290, 1749940, -55557, -1660418, -4971065, -7430923, -6384981, -3746061, -2376501, -1372420, 1254948, 4261080, 5256196, 4515180, 3246098, 628887, -3773960, -7022080, -6248261, -3445311, -2874177, -4810288, -5601220, -3337125, -100766, 1217359, -374197, -4122061, -7963411, -9143868, -6503413, -1837289, 2356343, 5257823, 6496936, 4886670, 959408, -1499847, 30370, 2464349, 1309557, -1966216, -1465104, 4206259, 9163880, 7719619]
8821G719619o710970o404171k064189K750762N523292M565331J00532m060218
8813A419988l468768J342273M762935K753868k274707m540947j792061K338853
8805E41434L027566K27975j524502N44818L485399K958244k92816j801039n31870
8796F635209k71084k884203m610344j794937K994451M217350R55082k344210k257221
8787F40093m10619l16020k133118k372909R69660M425325K608273l814544p233129
8778g636988l017884L099363K765901k299932k754277L492804P557854L478961
8770D685802k625695k662165J325168K342950K85804J26372J733210N27538l035937
8761B703047l431176J58301K158090K11297j116197J143776L114580J193782j506660
$$ y = [7719619, 1008649, -5395522, -7459711, -4708949, 814343, 5379674, 5480206, 1419988, -2048780, -706507, 4056428, 6810296, 4535589, -5358, -1797419, 541434, 3569000, 3796975, 2272473, 2817291, 6302690, 9260934, 8968118, 7167079, 6635209, 6364125, 3479922, -1130422, -2925359, 69092, 4286442, 5241524, 2897314, 640093, 229474, -86546, -2219664, -4592573, -3622913, 802412, 3410685, -403859, -7636988, -10654872, -7555509, -4789608, -7089540, -9843817, -6351013, 1206841, 4685802, 2060107, -602058, 723110, 3066060, 3351864, 3478236, 5211446, 5738984, 2703047, -728129, -569828, 1588262, 1799559, 683362, 1827138, 4941718, 6135500, 4628840]
8752D628840o53513J901561J502911j594006l219828k266934j591350k442432
8744c734751k531307l19644K290152K880496J781699R64662J083695J030595l5504
8735C410093j291305j299942k01900J3684j772498l543177k346351J270775L299626
8726b460995J598689j206144j908368j461286k519711l879914j712614L452725
8718a0097618N648096J770416k799049r93028N626879Q445214L610015k961953
8710H248972m326548j541836j58046j181772q99661J657070K792401M07739k717177
8701B281142l700225l477058l534351k416159J185132M558551M044891O19474
8693d38603j109682R27528L885447L860403K45717l800792m300149n26284L435051
$$ y = [4628840, 3975327, 5876888, 7379799, 5785793, 2565965, 299031, -1292319, -3734751, -6266058, -6585702, -4295550, -1415054, 366645, 1331307, 2415002, 3445597, 3410093, 2118788, 818846, 616946, 630630, -1141868, -4685045, -7031396, -5760621, -2460995, -862306, -2068450, -3976818, -5438104, -7957815, -11837729, -13550343, -10097618, -4449522, -2679106, -5478155, -6471183, -844304, 7600910, 11210925, 8248972, 3922424, 2380588, 2222542, 1040770, 141109, 1798179, 4590580, 4998319, 2281142, -1419083, -4896141, -8430492, -10846651, -9661519, -5102968, -1058077, -438603, -1548285, -620757, 3264690, 7125093, 7370810, 3570018, -730131, -1256415, 2178636]
8684B178636K928973j004476k569621M07749L138848J599465r84799p3620J839700
8675G460855n90997n596672o221027j569439J773712N39897p63312J364239L471731
8666a31013J917375o53384l93117J171587O92942r40659j159520q71758j994703
8657b362250k819999r86243J471453J187908o55104o16687J045954K004900L074873
8648A344805N707972O447252J206984n965215o545468m62497K976600q11982m930791
8639a032340k365418L266137M135952n6032l246842k524097l69892P00429N30441
8630i61662n49470j877963j835676l27351j00146k292802l159156N49589N256238
8621e298399M745333p10733m711579l595475J95275L369289N112734M753889J396022
$$ y = [2178636, 5107609, 4103133, 1533512, 1941261, 5080109, 6679574, 5694775, 5621155, 7460855, 6869858, 1273186, -4947841, -6517280, -4743568, -4203671, -4966983, -3602744, -131013, 1786362, 1132978, 739861, 1911448, 2604390, 1663731, 504211, -367547, -2362250, -5182249, -6168492, -4697039, -3509131, -4164235, -4780922, -3734968, -1730068, 1344805, 7052777, 13500029, 14707013, 8741798, 2196330, 1733833, 4710433, 3898451, -1032340, -3397758, -131621, 4004331, 3948299, 701457, -1822640, -2192532, -1492103, -961662, -1511132, -3389095, -5224771, -5552122, -5652268, -7945070, -11104226, -10554637, -5298399, -553066, -1263799, -5975378, -9570853, -9375578, -6006289, -893555, 3860334, 5256356]
8612E256356k792589l532411k86668K769504K848849J508878K96896j894280n006693
8603h32158n786012k498878J780463L347952K337258P63906n83257r66239R85346
8594a451619M032050L985717k77149l942774k773323R31457K498721J504962K01262
8585D709304j132470k616265j931138J740995M045306J381012k492313k087093
8577A617338N02823n83505m134802l628223R84947K698214m97525k518169m48433
8568f007335O79653j668177j714553L903467P919872L047549n386592o515582
8560e741698J36839M930218K675765j679577k294402J7937J364680M77196j422072
8551a535114k832150k350558M92648L654083L996672J066428k185895k776342
$$ y = [5256356, 2463767, -1068644, -1355312, 1414192, 4263041, 5771919, 6068815, 4174535, -832158, -6618170, -9117048, -7336585, -3988633, -1651375, -887469, -1470726, -2436965, -1451619, 2580431, 6566148, 6288999, 2346225, -427098, 504359, 3003080, 4508042, 4709304, 3576834, 960569, -970569, 770426, 4815732, 6196744, 3704431, 1617338, 2120161, 1536656, -2598146, -6226369, -5241422, -2543208, -3040733, -5558902, -6007335, -5327682, -6995859, -8710412, -4806945, 3112927, 6160476, 773884, -5741698, -5604859, -674641, 2001124, 321547, -1972855, -1954918, -590238, -113042, -1535114, -4367264, -6717822, -6225174, -2571091, 1425581, 2492009, 306114, -2470228]
8543b470228n56438K076721K398106K6806k027270o14936K711910K914828j259592
8534C199907m852577l804675n53606P56450O33064J439993K051982P24900K9897
8525c74665K591999M514493L77332o616902p433660l58688O276257N907763J238428
8516F122357k146283k988083k304442j01508K415337K294296l33147j482964j09451
8507A366112l92449l813399m636883J535901R251792R450662J647482n923377
8499H485841p016299l166430O06685J392433n70742l082143l511417r51935K969586
8490d844421N944450O549077M031825p28844l755485j536062K806254K069793
8482A0536587l977788o344657o6329O687968L854738n246960q926611m468470
$$ y = [-2470228, -3026666, -949945, 1448161, 1474967, -552303, -1167239, 1544671, 4459499, 3199907, -1652670, -5457345, -6010951, -5254501, -4621437, -3181444, -1129462, -404562, -374665, 2217334, 6731827, 7109159, 492257, -6941403, -7300091, -1023834, 4883929, 6122357, 3976074, 987991, -1316451, -1417959, 997378, 3291674, 2958527, 1475563, 1366112, 973663, -2839736, -7476619, -5940718, 3311074, 12761736, 14409218, 8485841, 1469542, -1696888, -1090203, 302230, -268512, -3350655, -6862072, -7814007, -4844421, 1100029, 7649106, 11680931, 10952087, 7196602, 5660540, 8466794, 10536587, 6558799, 214142, 147813, 6835781, 10690519, 5443559, -3483052, -7951522]
8474g951522l44697j547111l041471j16091L979470M884096M084408M142462L215600
8465G305144l10676k923190j447647P76280q81049m298356m021442l25045J613921
8456d512060L73595k77893J442191K672800J376881p07593j995088l280282m272230
8447i179679k307989K915682O919946N721827R95968k641147l275840k147286
8439b998518o21400M63271M0256j795905k768568j226812J170037J936645J556680
8430d244314J992694K672854J433536j090070j770936o6152P40514j434210m106356
8421e872440l600579J34248L663783L939027J164940j435476p56398K370855L549854
8412C157814Q09690j619354R24147N506384M695966k285080p649838o024521j160494
$$ y = [-7951522, -8296219, -9843330, -12884801, -13000892, -9021422, -4137326, -52918, 4089544, 7305144, 6994468, 4071278, 2623631, 3399911, 2518862, -1779494, -5800936, -6125981, -4512060, -4138465, -4416358, -2974167, -301367, 1075514, 367921, -1627167, -4907449, -9179679, -11487668, -8571986, -1652040, 4069787, 5065755, 2424608, -851232, -2998518, -3619918, -3156647, -3116391, -4912296, -7680864, -8907676, -7737639, -5800994, -4244314, -2251620, 421234, 1854770, 764700, -1006236, -1072388, -331874, -1766084, -5872440, -9473019, -9338771, -5674988, -1735961, -571021, -2006497, -2762895, -392040, 3157814, 3967504, 2348150, 3272297, 8778681, 13474647, 11189567, 3539729, -2484792, -3645286]
8403c645286J461334K555879M642112N163698P08468n359081o531313k609652
8395c613841R41874J750974K101217K534711Q48981k071391k064737J250671L165248
8386D843707J410189n55851K4793P75458r68668l405895l534214j631209L80528
8377b661162K067219L552168M041198L134092J274979j851469o243109q704958
8369e391042n550946J001487M274400K407424O36499K324214L956334K269664
8361E928034L3028K57980M87322j793679l310008o46579K768869J923432j227059
8352D421340j276012J543277K719158J560034R43115P72200j246497l501752k241057
8343C693806J105409J261120k235135m315111k714087o45854l88472k85564P07186
$$ y = [-3645286, -2183952, 371927, 5014039, 10177737, 10886205, 5527124, -1004189, -3613841, -2671967, -920993, 1180224, 3714935, 4563916, 2492525, 427788, 1678459, 4843707, 6253896, 5698045, 5722838, 6498296, 5529628, 2123733, -1410481, -3041690, -2661162, -593943, 2958225, 6999423, 10133515, 11408494, 9557025, 3313916, -5391042, -10941988, -9940501, -5666101, -3258677, -2622178, -297964, 3658370, 5928034, 5961062, 6219042, 6706364, 4912685, 1602677, 956098, 3724967, 5648399, 4421340, 3145328, 4688605, 7407763, 8967797, 9910912, 10683112, 9436615, 5934863, 3693806, 4799215, 6060335, 3825200, -489911, -3203998, -3849852, -4238324, -4523888, -3816702]
8334c816702J068593N20637P24658J328086L31262j141856R5023K940886K653167
8325D703754j179490l393084j426706J267690J753103J576380K134419J896709
8317G332775N36843K45941Q26467p30008l818740l809860k81912J432055l28123
8308A405438n02990K542440K561990l257180p213784k973725L226898K496564
8300a714349k047431j101728M956317P327975L455478n95603j548638k313806
8292F418215l787634l065030q06604j171794l130893j037055M411021N396836
8284C227062N4179l417952j48137L244727J20542m760617l214738L033548N571076
8275C709690K142751j776129k234333n36410J286398K610727K150848j142512
$$ y = [-3816702, -2748109, -2227472, -1502814, -174728, 156534, -985322, -890299, 2050587, 4703754, 3524264, 131180, -1295526, -27836, 1725267, 3301647, 5436066, 7332775, 7869618, 8115559, 8942026, 8212018, 4393278, 583418, 301506, 1733561, 1405438, 902448, 3444888, 6006878, 2749698, -4464086, -7437811, -4210913, -1714349, -3761780, -4863508, 92809, 7420784, 10876262, 10280659, 8732021, 6418215, 2630581, -434449, -1241053, -2412847, -5543740, -6580795, -2169774, 3227062, 3281241, -136711, -284848, 2959879, 3080421, -1680196, -4894934, -1861386, 3709690, 5852441, 4076312, 1841979, 1305569, 2591967, 5202694, 7353542, 6211030]
8267F211030n081467o018276l298840R20874M725276O290926L425003k502214
8259D672312n011062l33432N624914M539772j956927m758003j455246P82541j997515
8250A07354m036047m14994L957039K401089k405496k879913J569323M689896L549668
8241F537919J332901M73039l43636j693080j785984n54423l29717j261900r84491
8232A390628L9605j530269m719168l389740L689531Q211621L639290l976132m164368
8223h09002K251854M678374p13865n565275k837962K906690L702560l5203k337252
8214A240919j761559j599492k404293j231781K135852M097777K829706K70061
8206C577190j791389l214759l049557l61632K232594J147182j482129J19349N111336
$$ y = [6211030, 1129563, -4888713, -8187553, -7266679, -2541403, 3749523, 7174526, 4672312, -338750, -672182, 4952732, 9492504, 7535577, 2777574, 1322328, 2104869, 107354, -3928693, -4343687, -386648, 2014441, -391055, -3270968, -1701645, 2988251, 6537919, 7870820, 8343859, 8000223, 6307143, 4521159, 3966736, 3637019, 2375119, 1390628, 1430233, -100036, -4819204, -8208944, -4519413, 3692208, 7331498, 3355366, -809002, 1442852, 6121226, 5407361, -157914, -2995876, -89186, 3613374, 3578171, 1240919, -520640, -2120132, -4524425, -5756206, -3620354, 477423, 3307129, 3577190, 1785801, -1428958, -4478515, -4840147, -2607553, -1460371, -2942500, -2823151, 2288185]
8197B288185N224774k161494p707379l239337N186068N960396o28837l771050
8189A151326O67223N043563L341762m72944j268585j113765l287841n005507k710613
8180c655381O32383L55486j758207r32312K058837K696083Q08817p4273J69911
8171C01344j064913k393655N773M251144M118709m49532k293215J283915L878994
8162G638564P09255l752562l976467k262269l040699m183799j515662K442354
8154g941285K343857l80608j08299K649147K138753j908263l221853K21396K765446
8145c441709R57954r60034O76721K206940n82935m517180l989358K994K048596
8136g598011J117594R99317L009101M035987K183232l89040j279617q71808m21244
$$ y = [2288185, 7512959, 5351465, -2355914, -5595251, -409183, 5551213, 4922376, 1151326, 1818549, 6862112, 10203874, 9730930, 8462345, 7348580, 4060739, -944768, -3655381, -3022998, -2667512, -4425719, -5358031, -3299194, -603111, 205706, 131433, 301344, -763569, -3157224, -3151451, 1099693, 5218402, 4768870, 2475655, 3759570, 7638564, 8347819, 4595257, 618790, -1643479, -4684178, -8867977, -10383639, -7941285, -5597428, -5978036, -6086335, -3437188, -1298435, -3206698, -6428551, -6207155, -3441709, -2483755, -3443789, -2767068, -560128, -1143063, -5660243, -9649601, -9646607, -7598011, -6480417, -5481100, -2471999, 1563988, 3747220, 3358180, 2078563, 1206755, 785511]
8127G85511m406M90334N73204L51561P73146J947594K650762J916742q4634k647145
8117F752669m535000l819323J24911M380994M589265P2983m889115n693399j954450
8108d970465K940355N200835L185570j526392m873455l847592o2564J925302M82213
8099a546193j200714k44348J518072O25095k515352m208917k558833R24703M254138
8090d952349O517615O529478L112828k239239n503817m445601j177172P54006
8082a404251L17409j075096k015491j985515r42179M98980J201246R32370Q39828
8073c632699J592518K205341J856532J519135K139749K378343K89884l314089
8065E034714n271697l779815j09490L183429M274785K701155k77775k097606j286281
$$ y = [785511, 781105, 1271439, 1844643, 2196204, 2969350, 4916944, 7567706, 9484448, 9399814, 6752669, 2217669, -1601654, -1476743, 2904251, 7493516, 7566499, 2677384, -3016015, -4970465, -2030110, 3170725, 6356295, 4829903, -43552, -3891144, -3953708, -2028406, -1546193, -2746907, -2991255, -1473183, -848088, -3363440, -7572357, -10131190, -9206487, -4952349, 1565266, 8094744, 11207572, 8968333, 3464516, -981085, -2158257, -1404251, -1086842, -2161938, -4177429, -6162944, -7105123, -6606143, -5404897, -4472527, -3632699, -2040181, 165160, 2021692, 3540827, 5680576, 8058919, 8348803, 5034714, -236983, -4016798, -4126288, -942859, 3331926, 6033081, 5755306, 3657700, 2371419]
8056B371419O78969J282458J93007j034252j611316j686376o98724J636094L184973
8047D316252J478766k044862l282537j322616N40693L07889k88823j89148j394008
8038a878394m456074n739810k661263J731030L235891K588092K840203L325077
8030a015248J302437j992642k344890P41404L211283K580964M83873j358344l314984
8021a706147m973084m224940q79817K198518L107754K911729K280689k14215m227050
8012e726563n541377j236652N217029P523149M196283l46824j780570j43870J933787
8003D094392K643272J623106r72909m297653o220118m635153j50156L499607L146286
7994a269326R6691j332728N41524K730309K233166L09408j04971Q57801R71364
$$ y = [2371419, 3050388, 4332846, 4525853, 3491601, 1880285, 193909, -504815, 1131279, 4316252, 5795018, 3750156, 467619, -854997, -314304, -6415, -295238, -484386, -1878394, -6334468, -12074278, -14735541, -13004511, -9768620, -7180528, -4340325, -1015248, 287189, -1705453, -4050343, -3308939, -97656, 2483308, 2967181, 1608837, -1706147, -6679231, -10904171, -11783988, -9585470, -6477716, -3565987, -1285298, -1499513, -5726563, -11267940, -12504592, -7287563, 235586, 4431869, 4085045, 2304475, 2160605, 4094392, 6737664, 8360770, 7387861, 3090208, -3129910, -7765063, -7915219, -4415612, -1269326, -1172635, -2505363, -1963839, 766470, 2999636, 3309044, 3204073, 4061874, 5033238]
7985E033238K48914O29319J895174J756047J53230l71525P04095P99467r46501
7976I901458j736637j31507P63247j731427m767195l823838J87726J961820n65964
7967E7683l593858l087440K41838K984249L588284K903252J648725l45034k536406
7958A861293l253380j740644L96159Q96078m05678j594405j280557K3003J241101
7949c857030K081365K524327K239823J221990l6736j402615k783879k842713k72815
7940c128283L090218L412463M71740j232601Q36316L166844K087559j19434K10810
7931H795632Q54275k556008p506325o801675J63534N608469M417036M13944q95978
7922B492904J27417L86058k90036n15285o47570j208157j110894k96390q30309
$$ y = [5033238, 5282152, 5911471, 7806645, 9562692, 9715922, 9344397, 10048492, 10847959, 9901458, 8164821, 8033314, 8796561, 7065134, 2297939, -1525899, -1338173, 623647, 57683, -3536175, -6623615, -6381777, -3397528, 190756, 3094008, 4742733, 4397699, 1861293, -1392087, -3132731, -2736572, -1840494, -2246172, -3840577, -5121134, -5098131, -3857030, -1775665, 748662, 2988485, 4210475, 4173739, 2771124, -12755, -2855468, -3128283, -38065, 3374398, 3846138, 2613537, 3449853, 6616697, 8704256, 8584822, 8795632, 9649907, 7093899, -412426, -7214101, -7050567, -1442098, 2974938, 3388882, 2492904, 2620321, 3006379, 2716343, 2201058, 1553488, 345331, -765563, -1061953, -1892262]
7913a892262k718384k387285J514094M647896L156236k29684o88927J083612Q69505
7904C354801j460039j772330J318001M065504K989104p64685l481934l130356
7896A118066p98888Q68836M38347o73668m1735K051072K497894k16148l524047
7887A719729m038649j564179J363673K298878M45411k631356l345801L20984N108663
7878c22647N467680Q50999l621314m447684l225559j729796J048312M495465M513663
$$ y = [-1892262, -4610646, -6997931, -5483837, -835941, 2320295, 2090611, 1401684, 2485296, 3354801, 1894762, 122432, 1440433, 5505937, 8495041, 7730356, 4248422, 1118066, 319178, 1188014, 1626361, 952693, 910958, 2962030, 5459924, 5243776, 1719729, -2318920, -3883099, -2519426, -220548, 224863, -2406493, -5752294, -5431310, -322647, 5145033, 5996032, 2374718, -2072966, -5298525, -7028321, -5980009, -1484544, 3029119]
$$ [...]
##END NTUPLES=NMR SPECTRUM
##END=
