##TITLE=31Pdec_MTBDP-5-0208
 CDCl3, 24 sc
 3.08.2021
##JCAMPDX= 6.0         $$ Bruker NMR JCAMP-DX V2.0
##DATA TYPE= NMR SPECTRUM
##DATA CLASS= NTUPLES
##ORIGIN= UXNMR, Bruker Analytische Messtechnik GmbH
##OWNER= root
$$ XWIN-NMR		Version 3.5
$$ Tue Aug  3 09:06:17 2021 Russian Standard Time (UT+4h)  she@DPX200
##.OBSERVE FREQUENCY= 81.013821
##.OBSERVE NUCLEUS= ^31P
##.ACQUISITION MODE= SIMULTANEOUS
##.ACQUISITION SCHEME= undefined
##.AVERAGES= 24
##.DIGITISER RES= 16
##SPECTROMETER/DATA SYSTEM= spect
##.PULSE SEQUENCE= zgpg30
##.SOLVENT NAME= CDCl3
##.SHIFT REFERENCE= (INTERNAL, CDCl3, 0, 248.564)
##AUDIT TRAIL= $$ (NUMBER, WHEN, WHO, WHERE, WHAT)
$$ ##TITLE= Audit trail, XWIN-NMR		Version 3.5
$$ ##JCAMPDX= 5.01
$$ ##ORIGIN= Bruker BioSpin GmbH
$$ ##OWNER= she
$$ F:/spectra/data/she/nmr/P31/1/pdata/1/auditp.txt
$$ ##AUDIT TRAIL=  $$ (NUMBER, WHEN, WHO, WHERE, WHAT)
(   1,<2021-08-03 09:05:12.96 +0400>,<she>,<DPX200>,
      <created by zg, POWCHK disabled, PULCHK disabled
       configuration hash MD5:
       00 E9 B6 7A A2 85 ED C7 34 08 36 98 17 FE 4E 26
       data hash MD5: 32K
       C6 AD E8 54 1F BD 0B A4 72 C7 D2 E1 18 95 83 49>)
(   2,<2021-08-03 09:05:15.28 +0400>,<she>,<DPX200>,
      <Start of raw data processing
       efp BC_mod = 2 LB = 1 FT_mod = 6 PKNL = 1 PHC0 = -7535.972 PHC1 = 471.6743 SI = 64K 
       data hash MD5: 64K
       DA 02 D8 88 2C 68 A9 2B 3B 37 90 D6 4D 7B AE AC>)
(   3,<2021-08-03 09:05:37.96 +0400>,<she>,<DPX200>,
      <pk PHC0 = -54.29462 PHC1 = 118.4 
       data hash MD5: 64K
       59 9A 1B 33 D1 1E 85 2F 6B C6 4E 4C 1A D9 21 51>)
(   4,<2021-08-03 09:05:40.85 +0400>,<she>,<DPX200>,
      <abs ABSG = 5 
       data hash MD5: 64K
       88 F0 9F 3F 25 F8 C2 8C 25 2D 1C 99 6E 9B 35 35>)
$$ ##END=
$$ 
$$ hash MD5
$$ BF 85 9F 09 E0 2C 59 F2 36 67 CF 5B 4E D1 BA 77
##$RELAX= 
##$RELAX= 
##$RELAX= 
##$RELAX= 
##$RELAX= 
##$RELAX= 
##$RELAX= 
##$RELAX= 
$$ Bruker specific parameters
$$ --------------------------
##$DU= <F:/spectra>
##$EXPNO= 1
##$NAME= <P31>
##$PROCNO= 1
##$TYPE= <nmr>
##$USER= <she>
##$AMP= (0..31)
100 100 100 100 100 100 100 100 100 100 100 100 100 100 100 100 100 100 
100 100 100 100 100 100 100 100 100 100 100 100 100 100 
##$AQSEQ= 0
##$AQ_mod= 1
##$AUNM= <au_zg>
##$AUTOPOS= <>
##$BF1= 81.014009
##$BF2= 200.13
##$BF3= 200.13
##$BF4= 200.13
##$BF5= 200.13
##$BF6= 200.13
##$BF7= 200.13
##$BF8= 200.13
##$BYTORDA= 1
##$CFDGTYP= 0
##$CFRGTYP= 5
##$CHEMSTR= <none>
##$CNST= (0..31)
1 1 145 1 1 1 1 1 1 1 1 1 1 1 1 1 1 1 1 1 1 1 1 1 1 1 1 1 1 1 1 1 
##$CPDPRG= <waltz16>
##$CPDPRG1= <>
##$CPDPRG2= <waltz16>
##$CPDPRG3= <>
##$CPDPRG4= <mlev>
##$CPDPRG5= <mlev>
##$CPDPRG6= <mlev>
##$CPDPRG7= <mlev>
##$CPDPRG8= <mlev>
##$CPDPRGB= <>
##$CPDPRGT= <>
##$D= (0..31)
0 1 0 0 0 0 0 0 0 0 0 0.03 2e-05 3e-06 0 0 0 0 0 0 0 0 0 0 0 0 0 0 0 0 
0 0 
##$DATE= 1627967112
##$DBL= (0..7)
120 120 120 11 120 120 24 19 
##$DBP= (0..7)
150 150 150 150 150 150 150 150 
##$DBP07= 0
##$DBPNAM0= <>
##$DBPNAM1= <>
$$ [...]
##$SUBNAM3= <"">
##$SUBNAM4= <"">
##$SUBNAM5= <"">
##$SUBNAM6= <"">
##$SUBNAM7= <"">
##$SUBNAM8= <"">
##$SUBNAM9= <"">
##$SW= 501.771253377433
##$SWIBOX= (0..15)
0 1 3 0 0 0 0 0 0 0 0 0 0 0 0 0 
##$SW_h= 40650.406504065
##$TD= 32768
##$TD0= 1
##$TE= 0
##$TE2= 300
##$TE3= 300
##$TEG= 300
##$TL= (0..7)
0 120 53 12 22 120 120 120 
##$TP= (0..7)
150 150 150 150 150 150 150 150 
##$TP07= 0
##$TPNAME0= <>
##$TPNAME1= <>
##$TPNAME2= <>
##$TPNAME3= <>
##$TPNAME4= <>
##$TPNAME5= <>
##$TPNAME6= <>
##$TPNAME7= <>
##$TPOAL= (0..7)
0.5 0.5 0.5 0.5 0.5 0.5 0.5 0.5 
##$TPOFFS= (0..7)
0 0 0 0 0 0 0 0 
##$TUNHIN= 0
##$TUNHOUT= 0
##$TUNXOUT= 0
##$USERA1= <user>
##$USERA2= <user>
##$USERA3= <user>
##$USERA4= <user>
##$USERA5= <user>
##$V9= 5
##$VALIST= <valist>
##$VCLIST= <CCCCCCCCCCCCCCC>
##$VD= 0
##$VDLIST= <DDDDDDDDDDDDDDD>
##$VPLIST= <PPPPPPPPPPPPPPP>
##$VTLIST= <TTTTTTTTTTTTTTT>
##$WBST= 1024
##$WBSW= 4
##$XGAIN= (0..3)
0 0 0 0 
##$XL= 0
##$YL= 0
##$YMAX_a= 14374
##$YMIN_a= -15079
##$ZGOPTNS= <>
##$ZL1= 120
##$ZL2= 120
##$ZL3= 120
##$ZL4= 120
##$ABSF1= 248.5645
##$ABSF2= -253.2056
##$ABSG= 5
##$ABSL= 3
##$ALPHA= 0
##$AQORDER= 0
##$ASSFAC= 0
##$ASSFACI= 0
##$ASSFACX= 0
##$ASSWID= 0
##$AUNMP= <proc_1d>
##$AZFE= 0.1
##$AZFW= 0.5
##$BCFW= 0
##$BC_mod= 2
##$BYTORDP= 0
##$COROFFS= 0
##$CY= -3
##$DATMOD= 1
##$DC= 0
##$DFILT= <>
##$DTYPP= 0
##$F1P= 0
##$F2P= 0
##$FCOR= 1
##$FTSIZE= 65536
##$FT_mod= 6
##$GAMMA= 0
##$GB= 0
##$INTBC= 1
##$INTSCL= 5.30512e-09
##$ISEN= 30
##$LB= 1
##$LEV0= 0
##$LPBIN= 0
##$MAXI= 10000
##$MC2= 0
##$MEAN= 0
##$ME_mod= 0
##$MI= 50
##$NCOEF= 0
##$NC_proc= -5
##$NLEV= 6
##$NOISF1= 182.463
##$NOISF2= 159.3651
##$NSP= 0
##$NTH_PI= 0
##$NZP= 0
##$OFFSET= 248.5645
##$PC= 4
##$PHC0= -7590.267
##$PHC1= 590.0743
##$PH_mod= 1
##$PKNL= yes
##$PPARMOD= 0
##$PSCAL= 0
##$PSIGN= 0
##$REVERSE= no
##$SF= 81.014009
##$SI= 65536
##$SIGF1= 159.3651
##$SIGF2= -187.1042
##$SINO= 113.3802
##$SIOLD= 16384
##$SREGLST= <1H.CDCl3>
##$SSB= 0
##$STSI= 65536
##$STSR= 0
##$SW_p= 40650.406504065
##$SYMM= 0
##$S_DEV= 0
##$TDeff= 32768
##$TDoff= 0
##$TI= <>
##$TILT= no
##$TM1= 0
##$TM2= 0
##$TOPLEV= 0
##$USERP1= <user>
##$USERP2= <user>
##$USERP3= <user>
##$USERP4= <user>
##$USERP5= <user>
##$WDW= 1
##$XDIM= 65536
##$YMAX_p= 336040691
##$YMIN_p= -3930203
$$ End of Bruker specific parameters
$$ ---------------------------------
##NTUPLES= NMR SPECTRUM
##VAR_NAME=  FREQUENCY,     SPECTRUM/REAL,   SPECTRUM/IMAG
##SYMBOL=    X,             R,               I
##VAR_TYPE=  INDEPENDENT,   DEPENDENT,       DEPENDENT
##VAR_FORM=  AFFN,          ASDF,            ASDF
##VAR_DIM=   65536,         65536,           65536
##UNITS=     HZ,            ARBITRARY UNITS, ARBITRARY UNITS
##FACTOR=    0.620285442955139, 1,           1
##FIRST=     20137.2065510759, 0,            0
##LAST=      -20513.1999529892, 0,           0
##MIN=       -20513.1999529892, -3930203,    0
##MAX=       20137.2065510759, 336040691,    0
$$ Real data points
##PAGE= N=1
##DATA TABLE= (X++(R..R)), XYDATA
$$ [...]
40575i87294O73240R32745L17151l67285k32389L33241L07498k77677m13793J33313
$$ -987294 -314054 618691 935842 568557 336168 669409 976907 699230 285437 418750
40565D18750M05599p6788m76353j28791K74639o7635o05414l69303L53169N30866
$$ 418750 824349 747561 271208 142417 417056 349421 -255993 -625296 -272127 258739
40555B58739J06581q4749J35112R3002m06331p22828m86367o1981K38055M90586
$$ 258739 365320 280571 415683 508685 102354 -620474 -1106841 -1168822 -930767 -440181
40545d40181N71980J55804m91686o01482o1601L39661J31361j85131o6406K47897
$$ -440181 131799 287603 -204083 -805565 -867166 -527505 -396144 -581275 -647681 -399784
40535c99784K93147J16559j7279j24175k63815k63362o4162P2494K6980N3734
$$ -399784 -106637 9922 -7357 -131532 -395347 -658709 -722871 -650377 -623397 -569663
40525e69663K58154L20477P6102j14836K3439J52521j34397n87881o18184j28780
$$ -569663 -311509 8968 85070 -29766 -6327 146194 11797 -576084 -1194268 -1323048
40515a323048L95061N31511L42331J87313K87595M51458K67377k92248o41256
$$ -1323048 -927987 -396476 -54145 133168 420763 872221 1139598 847350 206094
40506B06094l12932K63844K89205k03729l95963J0823L63369J88799q6993j3714
$$ 206094 -106838 157006 446211 242482 -153481 -142658 220711 409510 322517 308803
40496C08803P5605k19146m91365j62751M52301N53202Q4649k38872p2715J23397
$$ 308803 384408 165262 -326103 -488854 -36553 516649 601298 362426 289711 413108
40486D13108j00988n06266n24886k730N94238O39276M6025m90933k34369N49487
$$ 413108 312120 -194146 -719032 -721762 -127524 511752 557777 66844 -167525 381962
40476C81962P72820K1497p38924n20977J85117J63774n92822q24521L1701R31034
$$ 381962 1154782 1176279 437355 -83622 101495 265269 -327553 -1152074 -1120373 -189339
40466a89339P70237n9631m32079j58152L5172j31826j77121P5621J06731k85918
$$ -189339 580898 521267 89188 -68964 -33792 -165618 -342739 -267118 -160387 -446305
40456d46305m48727N9719N65650K63221l92716k91014N53255R55743M03825k29266
$$ -446305 -895032 -835313 -269663 -6442 -399158 -690172 -136917 818826 1222651 993385
40446I93385k30246j56720o26738j004508m21764N73952P01187n7647m83226j04683
$$ 993385 763139 606419 -20319 -1024827 -1446591 -872639 -171452 -229099 -712325 -817008
40436h17008J86136k10984n82204j49438O17039P33458J59688k47114M1809O37972
$$ -817008 -630872 -841856 -1424060 -1573498 -956459 -223001 -63313 -310427 -268618 369354
40426C69354P90222K05187o32891q92189l06126M35166N27492R1626j65546j08506
$$ 369354 1159576 1364763 731872 -160317 -466443 -31277 496215 587841 422295 313789
40416C13789j83268l55098o5417N58966N46487l81044j109044o73843L21482O53393
$$ 313789 130521 -224577 -289994 268972 815459 434415 -674629 -1348472 -1026990 -373597
40406c73597J82889k65618k49342l8434J12276K18269K39955J44000J48799L85118
$$ -373597 -190708 -456326 -705668 -744102 -631826 -413557 -173602 -29602 119197 504315
40396E04315N21693K35227j93635k72473l5325J30839J40637J52969J02461j56952
$$ 504315 1026008 1261235 1067600 795127 759802 890641 1031278 1184247 1286708 1129756
40386A129756m40215m81048l85466l43718j60113L62664Q24728O64478M6268l18500
$$ 1129756 689541 208493 -176973 -520691 -680804 -318140 506588 1171066 1217334 898834
40376H98834j63320J05155J29498o189j20339j75307j23779Q5185L06907L23288
$$ 898834 735514 840669 970167 963978 843639 668332 544553 629738 936645 1259933
40366A259933J58410J7953k1325m0706j03771k19597l26203k36607J08716L16875
$$ 1259933 1418343 1436296 1414971 1374265 1270494 1050897 724694 488087 596803 913678
40356I13678l7163o05660n71675P5343M31744J64931N0160M41517M08846n99534
$$ 913678 876515 270855 -300820 -225477 206267 371198 421358 862875 1271721 672187
40346F72187j375222o47786P03632Q13954l20338r58114l84827K79080K03386
$$ 672187 -703035 -1350821 -647189 166765 -153573 -1111687 -1496514 -1217434 -1014048
40337a014048K515K60475M70777J81625r1474J00755K62994q8574m92734l50983
$$ -1014048 -1011533 -751058 -280281 -98656 -190130 -89375 173619 85045 -407689 -758672
40327g58672P3225J77075q3803m00780n95654m28667L47082J244388J181088n620
$$ -758672 -685447 -508372 -592175 -992955 -1588609 -2017276 -1670194 -425806 755282 749662
40317G49662r89751o58242L52756O81315J53788l10936k54918q5051j01207p7015
$$ 749662 -240089 -898331 -545575 135740 289528 -21408 -276326 -361377 -462584 -539599
40307e39599J32084K85907K01444J1556j07461j33807j10199q6063r2629m0154
$$ -539599 -407515 -121608 79836 91392 -16069 -149876 -260075 -346138 -438767 -478921
40297d78921J91957M67684M72978J81925r2409j90310k33918k16440j009K03711
$$ -478921 -286964 180720 653698 835623 743214 552904 318986 102546 101537 305248
40287C05248K0465l40755k70469J62237K50882j6178J77076Q43654P79995m13674
$$ 305248 325713 -15042 -285511 -123274 127608 111430 288506 1132160 1912155 1498481
40277A498481j272608o19767M71430L90373m01726l30772M84120N17012l76635
$$ 1498481 225873 -393894 77536 467909 66183 -264589 219531 736543 359908
40268C59908o81213R7814O05239M4341n39597k27927K71266J58450K2427N09373
$$ 359908 -321305 -223491 381748 426089 -113508 -341435 -70169 88281 110708 620081
40258F20081Q40404J31675q23873o68944L13043O69168M6418n09939l61093J9444
$$ 620081 1460485 1592160 768287 99343 412386 1081554 1127972 618033 256940 276384
40248B76384J80916K82079L60107J01528l91838n24634j49610K14263K82347L06504
$$ 276384 457300 739379 1099486 1201014 809176 284542 134932 349195 631542 938046
40238I38046L21831l655n13453n02401R3199L74971j16990n89472k87641K36974
$$ 938046 1259877 1256222 742769 240368 333567 708538 591548 2076 -285565 -48591
40228d8591P2325m96829m79355J37356L49465k43305q18727n57609L19108J040319
$$ -48591 23734 -473095 -952450 -815094 -465629 -708934 -1527661 -2085270 -1766162 -725843
40218g25843J186149Q00859J29045m38867n48343k82358r0945j74222k76162k00526
$$ -725843 460306 1261165 1390210 951343 403000 120642 29697 -144525 -420687 -621213
40208f21213j01354p7603P2164M07647N49743J78532m37474p32208m87214L5503
$$ -621213 -722567 -800170 -728006 -320359 229384 407916 -29558 -761766 -1248980 -1213477
40198a213477M23000M16297J00433j02669J05045M03999K27418l18898m88515
$$ -1213477 -790477 -374180 -273747 -376416 -271371 132628 360046 41148 -447367
40189d47367n2372K58394j03064n78776l78310K66546N08083J81147j37587j57083
$$ -447367 -499739 -241345 -344409 -923185 -1301495 -1034949 -526866 -345719 -483306 -640389
40179f40389j26345j44096q829K23218K47318J18327J77070L47171K05709j99753
$$ -640389 -766734 -910830 -919659 -696441 -449123 -330796 -153726 193445 399154 199401
40169A99401l39744r8921O8286l489K2636J71992J2670l93721l32117L29524O81230
$$ 199401 -140343 -239264 -170978 -174467 -151831 20161 32831 -360890 -693007 -363483 317747
40158C17747J69824m33491k61899K52724J98123k46571k03697L23386M65754k4104
$$ 317747 487571 54080 -207819 44905 243028 -3543 -207240 116146 581900 557796
40148E57796m32769l25569j01499q6007p953K63632K96326j11317l98853o9173
$$ 557796 125027 -200542 -302041 -388048 -396001 -132369 163957 52640 -346213 -415386
40138d15386M73564M95364k5539m97419o01303n09319l43927J5881N25804Q19028
$$ -415386 58178 553542 528003 30584 -570719 -1080038 -1423965 -1408084 -882280 -63252
40128f3252O47631K28453k7997O326J14640P0721r8654j94044j06096N7922J08304
$$ -63252 584379 812832 784835 791161 905801 976522 877868 683824 577728 635650 743954
40117G43954n527j48757j84084j60591k49872m60848n10563j45316M13022N96626
$$ 743954 738427 589670 405586 244995 -4877 -465725 -976288 -1121604 -708582 -111956
40107a11956K15413k14275j59250J58330J49346j40098q1584M16489O05481O5517
$$ -111956 103457 -110818 -270068 -111738 37608 -102490 -184074 232415 837896 903413
40097I03413n31177m21391O0451P6028l35048m03234o263J19491k92721m63744
$$ 903413 372236 -49155 11296 87324 -247724 -650958 -657221 -537730 -830451 -1294195
40087a294195J95491J001385Q36935k97911j224489r88686J26552J010534Q75791
$$ -1294195 -1098704 -97319 739616 441705 -782784 -1771470 -1644918 -634384 241407
40078B41407k7315p19256n23641K21523O26319L53042p7521j20008R5468J24917
$$ 241407 214092 -505164 -1028805 -807282 -180963 172079 94558 -25450 70018 194935
40068A94935j02422k92416k42194R528L00336L84403R1552l28498l26104J94703
$$ 194935 92513 -199903 -442097 -432569 -132233 252170 343722 15224 -310880 -116177
40058a16177N89412L30840k00321l06971m9947n1215l86860m61569n0902K87345
$$ -116177 473235 804075 603754 296783 246836 195621 -191239 -652808 -703710 -416365
40048d16365R2540l44582n30889m21099j54745L32945R69249J241808P86182J0280
$$ -416365 -323825 -668407 -1199296 -1620395 -1775140 -1442195 -472946 768862 1555044 1565324
40038A565324l67440k09030N8061J41762R1537l7392k25435k80745n6397J92640
$$ 1565324 1197884 988854 1046915 1188677 1280214 1242822 1017387 736642 680245 872885
40028H72885J16661j51120k02939m7215l4279j51684n0489J81317R287n66655
$$ 872885 989546 838426 635487 588272 553993 402309 351820 533137 542424 -24231
40018b4231p61905j51504N73190N43344p9894m48195k29210J63614L29189K51512
$$ -24231 -786136 -937640 -364450 178894 99000 -349195 -578405 -414791 -85602 165910
40008A65910J0065l17647m67543j93528K89245M77731K57685L4272J05896K58605
$$ 165910 175975 -141672 -609215 -802743 -513498 -35767 221918 256190 362086 620691
39998F20691J37519k37563n19143m73224k23405n6145m7301J2550K34998L34855
$$ 620691 758210 520647 1504 -471720 -695125 -751270 -798571 -786021 -551023 -216168
39988b16168J1624m52825m35538J19605N47118L98923O50j94191k07053j21426
$$ -216168 -204544 -657369 -1092907 -973302 -426184 -27261 -26611 -220802 -427855 -549281
39978e49281K55548P69868O65404k75561r86935m98744M74913N10401l32839o65247
$$ -549281 -293733 476135 1141539 865978 -120957 -619701 -144788 365613 32774 -632473
39968f32473o897O03388M54444J54181K45990J85471m82500j038525o72054J66117
$$ -632473 -639370 -35982 418462 572643 818633 1004104 521604 -516921 -1188975 -1022858
39958a022858M90406K53549J34095L03164L33213P0688j99354k99476k65104j10327
$$ -1022858 -532452 -278903 -144808 158356 491569 562257 362903 63427 -201677 -312004
39948c12004L0696j37200n02317m11836L25223Q53607M36032l19304l12449L65541
$$ -312004 -281308 -418508 -920825 -1332661 -1007438 -153831 282201 -37103 -349552 15989
39938A5989O44860J58458l80713m79619m71434o05646m87537J56184Q53453R78552
$$ 15989 660849 819307 438594 -41025 -512459 -1118105 -1605642 -1449458 -596005 382547
39928C82547N15872q5178m53172m69495k22702M0711J45251J77870K23028Q3117
$$ 382547 898419 813241 360069 -109426 -332128 -291417 -146166 31704 254732 337849
39918C37849l47792o56315m07219J08679K68980J19835K17367N27056L80196l17994
$$ 337849 -9943 -666258 -1073477 -964798 -695818 -575983 -358616 168440 548636 230642
39908B30642p37769l42791L18369M93965K38308L2776k9200j12552j35916L1057
$$ 230642 -507127 -849918 -531549 -37584 200724 233500 204300 91748 -44168 -13111
39898a3111J64352j1077l17186l40994j0256L56813M35192J35587l28646m98547
$$ -13111 151241 140164 -177022 -518016 -528272 -171459 263733 399320 70674 -427873
39888d27873j03576M59366M94330k5154l80770j85858J07669R8245R6641L61220
$$ -427873 -531449 -72083 422247 397093 16323 -169535 -61866 36379 133020 494240
39878D94240L96936j95880p64398m72370K61788K97369m02942o51457R9098Q90714
$$ 494240 891176 695296 -69102 -541472 -279684 17685 -385257 -1036714 -937616 -46902
39868d6902P26322l7478m37123l28597k51288l15685j24015L21304M56303N5818
$$ -46902 679420 641942 204819 -123778 -375066 -690751 -814766 -493462 -37159 18659
39858A8659l44057k28444J40967J41280l01145o32528m39879N8201L61939K82621
$$ 18659 -325398 -553842 -412875 -271595 -572740 -1205268 -1645147 -1586946 -1225007 -942386
39848i42386N5087Q706K47630N64780N97774J89134l37386m37899j8876L65448
$$ -942386 -887299 -878593 -630963 -66183 531591 720725 383339 -54560 -73436 292012
39838B92012K15972k23399l34888k7847K09392J29009L0585R9741K0157l95485
$$ 292012 507984 284585 -50303 -78150 131242 260251 290836 390577 410734 15249
39828A5249o76989l26877L30821N19164Q9882l33433k85195O107J22164K7723
$$ 15249 -661740 -988617 -657796 -138632 -48750 -382183 -667378 -661271 -539107 -511384
39818e11384o8485p8904l6490L3859P0784L552o5828N6644K95230L20058P3611
$$ -511384 -579869 -658773 -695263 -661404 -590620 -587068 -652896 -596252 -301022 19036 92647
39807I2647n8398J49598L29630O8828l74656l97959K1673K63558j9872m11198
$$ 92647 34249 183847 513477 582305 207649 -190310 -168637 94921 75049 -336149
39797c36149l43607J68894O53518P41868L82180k36013p01111n79013O5228N30059
$$ -336149 -679756 -510862 142656 884524 1266704 1030691 329580 -249433 -184205 345854
39787C45854K42439m52269o75294j51754M82075N85712K83413R9050J78714K22797
$$ 345854 588293 136024 -539270 -691024 -208949 376763 660176 759226 937940 1160737
39777A160737J4952l14948n22379n08605l37302j36656J204R0791J91440K50183
$$ 1160737 1175689 860741 338362 -170243 -507545 -644201 -642997 -552206 -360766 -110583
39767a10583J24676j63846l45487k10860R2499K25079O4903j73689k02692L9959
$$ -110583 14093 -149753 -495240 -706100 -613601 -388522 -323619 -497308 -700000 -660041
39757f60041L21540L18309k5757l35705j65461M25730Q57617O95971J27046l74351
$$ -660041 -338501 -20192 -45949 -381654 -547115 -121385 736232 1432203 1559249 1184898
39747A184898o10946o71360n90244l24121K6175K62832L35246L22145K32862M4793
$$ 1184898 573952 -97408 -687652 -1011773 -985598 -722766 -387520 -65375 167487 212280
39737B12280j36171j88383j77515k06514j53493J43106M94968N05153J26566k40569
$$ 212280 76109 -112274 -289789 -496303 -649796 -506690 -11722 493431 619997 379428
39727C79428k82185j11794J9302P8153J63681K70268L03253K16384L8704j39565
$$ 379428 97243 -14551 4751 82904 246585 516853 820106 1036490 1075194 935629
39717I35629j82244m4652R5995J7991k26062l60683k68949r6269M8950K15831
$$ 935629 753385 708733 804728 822719 596657 235974 -32975 -129244 -80294 135537
39707A35537L48162K17266j87217m70896l17056L2458J00939j22262j72658J65185
$$ 135537 483699 700965 513748 42852 -274204 -241746 -140807 -263069 -435727 -270542
39697b70542M87762L33147j40891l67724j77583q310j92470m01261j48978L68484
$$ -270542 217220 550367 409476 41752 -135831 -144141 -336611 -737872 -886850 -518366
39687e18366M54610m8358m53999k30742J90058J08099k79704j22268O88298J118346
$$ -518366 -63756 -112114 -566113 -796855 -606797 -498698 -778402 -900670 -212372 905974
39677I05974L77831q21295j028830O2492J142044Q95884l79281j224641q54485
$$ 905974 1283805 462510 -566320 -503828 638216 1534100 1154819 -69822 -924307
39668i24307M4060M27974K12459L7859J42202J42660j45300l54608k07577L9240
$$ -924307 -880247 -452273 -239814 -201955 -59753 82907 -62393 -417001 -624578 -585338
39658e85338P4862K4354J31668K96176K72614Q5126o2717r1976k8120J13096K34785
$$ -585338 -510476 -486122 -354454 -58278 214336 299462 236745 144769 116649 229745 464530
39647D64530J91326L9296m3663j47424m77450p45033l75444M49300P46751J66054
$$ 464530 655856 695152 651489 504065 26615 -718418 -1093862 -644562 102189 268243
39637B68243l69451q7842M10212K41278k24069o2409N25639N41839j00551n05797
$$ 268243 -101208 -189050 221162 462440 238371 175962 701601 1243440 1142889 637092
39627F37092l38545j67065k32312j22604J68816P8651l69114m03480J55975N20254
$$ 637092 298547 131482 -100830 -223434 -54618 24033 -345081 -748561 -592586 -72332
39617g2332K82310L9398J97871K55868j46005n00678m07577k85509m26550l09426
$$ -72332 209978 249376 447247 703115 557110 56432 -351145 -636654 -1063204 -1372630
39607a372630L62383Q56355N17059j38562l20449j88346k48280k76034J23962
$$ -1372630 -1010247 -153892 363167 224605 -95844 -284190 -532470 -808504 -684542
39598f84542N26781L36838r4750p3633J88894L0003l75082l36913L6112L3965
$$ -684542 -157761 179077 84327 10694 199588 229591 -145491 -482404 -446292 -412327
39588d12327l21923l16269J42150L77129J77830R7127L59595M67194J41203k11962
$$ -412327 -734250 -1050519 -908369 -531240 -353410 -256283 103312 570506 711709 499747
39578D99747k44600j27725m0665J08047K55748J33789j93106l40052k44535j79687
$$ 499747 255147 127422 86757 194804 450552 584341 391235 51183 -193352 -373039
39568c73039j22713J63583M13391P9276o15793p63135j48078L76031K54890M4332
$$ -373039 -495752 -332169 81222 160498 -455295 -1218430 -1366508 -990477 -735587 -691255
39558f91255L14440O08953K59169m02147n01095M8159M67037K52893k36080l72491
$$ -691255 -376815 232138 491307 89160 -411935 -363776 103261 356154 120074 -252417
39548b52417j9011L88807L36733j93690o31668m61741Q0676K95342j205k51122
$$ -252417 -271428 117379 454112 260422 -371246 -832987 -752311 -456969 -458174 -709296
39538g09296k9313L78584N13908L60937J01684k63346o28912n56509J20454P55563
$$ -709296 -738609 -360025 153883 514820 616504 353158 -275754 -832263 -711809 43754
39528D3754N58753k93755p75174k90778O01661R15655L68593m34063p81106n55629
$$ 43754 602507 308752 -466422 -757200 -155539 760116 1128709 694646 -86460 -642089
39518f42089j28931J98295L91055L97936Q1810l93572n03572n7416L67996J83580
$$ -642089 -771020 -572725 -181670 216266 298076 -95496 -599068 -656484 -288488 -104908
39508a04908k82467k48735K74698M81903O2332l29987j78469R8750o0532m04452
$$ -104908 -387375 -636110 -361412 120491 182823 -147164 -325633 -226883 -287415 -691867
39498f91867l21930J68240N21950N07591L41904J34645k26726o37682p10326k84842
$$ -691867 -1013797 -845557 -323607 183984 525888 660533 433807 -203875 -914201 -1199043
39488a199043K82212M78350J64107l02265m24269q2962L22602L69060J70058J77448
$$ -1199043 -916831 -438481 -274374 -576639 -1000908 -1083870 -761268 -392208 -222150 -44702
39478d4702M61619N89842K98547j51888m54781o24977o53883l12826L11415N67799
$$ -44702 416917 1006759 1305306 1153418 698637 73660 -580223 -893049 -581634 -13835
39468a3835O6602o07206o10617j9970L60508K24510Q3482L09542N38615K96485
$$ -13835 52767 -554439 -1165056 -1185026 -824518 -600008 -516526 -206984 331631 628116
39458F28116k67618o10276m69873l9943L37551M27247J82983k28149n23059n14482
$$ 628116 360498 -249778 -719651 -759594 -422043 5204 188187 -39962 -563021 -1077503
39448a077503k15183K25883N92058O77896M80176K68046K64138L05669P7410l49140
$$ -1077503 -1292686 -1066803 -474745 203151 683327 951373 1215511 1521180 1598590 1249450
39438A249450n42629l36009o5449k9032o3496O8435J87503n261l48176m12231
$$ 1249450 706821 370812 305363 276331 212835 281270 468773 463512 115336 -296895
39428b96895j96104j09328k16303o9291M71493Q15883M91685m8353r7760J44538
$$ -296895 -492999 -602327 -818630 -887921 -416428 399455 891140 842787 745027 889565
39418H89565j07295q32907j051276l05546N60230O35191K41118K54823O31592
$$ 889565 782270 -50637 -1101913 -1407459 -847229 -212038 29080 283903 915495
39409I15495N27794k56114q58719n61309K58616O80209L26981l65354p12232m32776
$$ 915495 1443289 1187175 328456 -232853 25763 705972 1032953 667599 -44633 -477409
39399d77409J13817L10975J9680k27322j66L37085J71943l41111m52121M5189
$$ -477409 -363592 -52617 -32937 -260259 -260425 76660 248603 -92508 -544629 -499440
39389d99440N33175N37106L03264J78376M1307k73691m91521k81872J86729M55565
$$ -499440 33735 570841 874105 1052481 1093788 820097 328576 46704 233433 688998
39379F88998L28984k9150l36290l57802p5486J99023J58840j6219R8407M34068
$$ 688998 1017982 988832 652542 294740 219254 418277 577117 560898 659305 1093373
39369A093373M69426J00849j63556r0007j11821m90050p68733n47462j61868l2131
$$ 1093373 1562799 1663648 1500092 1410085 1298264 808214 39481 -507981 -669849 -701980
39359g01980N9270L81412N26993P5209m78833l63125K03422L22762j52683m52257
$$ -701980 -642710 -261298 265695 340904 -137929 -501054 -297632 25130 -127553 -579810
39349e79810j64215K27660K61160J47606K13245L35744K70749N6830j74026l80320
$$ -579810 -744025 -516365 -255205 -107599 105646 441390 712139 768969 594943 214623
39339B14623m19111r9912L84229N10596J23732l13434l65457j36380O4875J70356
$$ 214623 -204488 -304400 79829 590425 714157 400723 35266 -101114 -36239 134117
39329A34117K09243Q6401j85383l13372r1319K61275L76255J82039j25202l67600
$$ 134117 343360 429761 244378 -68994 -160313 100962 477217 659256 534054 166454
39319A66454m47667l06645k7078J60721J45468Q6686J71754L57211M61724L72683
$$ 166454 -281213 -587858 -614936 -454215 -308747 -222061 -50307 306904 768628 1141311
39309A141311P8748l22165n68738m22073k9354J43975q3219l19354j46019K70621
$$ 1141311 1220059 897894 329156 -92917 -122271 21704 -61515 -380869 -526888 -256267
39299b56267M22411J70267j37241k21852k00851k59256k84974m8959L81664O41162
$$ -256267 166144 336411 199170 -22682 -223533 -482789 -767763 -816722 -435058 206104
39289B06104M87191O9044k84532m24008m20888l46067j80010O5263K99048M52259
$$ 206104 693295 762339 477807 53799 -367089 -713156 -893166 -827903 -528855 -76596
39279g6596M81785K88206j49046n41307n09758j43175K0980k21428l80860m9569
$$ -76596 405189 693395 544349 3042 -506716 -649891 -628911 -850339 -1231199 -1280768
39269a280768L67650K50966k03803k67643J23937K72186o9702k26147K63738P81847
$$ -1280768 -913118 -662152 -865955 -1133598 -1009661 -737475 -807177 -1033324 -769586 12261
39259A2261N38050j88670m84667j81110L4145j66863k74793P2200L75053P7501
$$ 12261 550311 361641 -123026 -304136 -269991 -436854 -711647 -639447 -264394 -186893
39249a86893m21667k76278M67533Q02943J94539n91270n38340K10316O49502L89588
$$ -186893 -608560 -884838 -417305 385638 580177 -11093 -549433 -339117 310385 699973
39239F99973M7751R0677J24948k28337m79870m5116N90457M16543n18034j025482
$$ 699973 747724 838401 963349 735012 255142 210026 800483 1217026 698992 -326490
39229c26490m54927M25372O17391K15769m1128L3422N2859r7460j34696K381N3017
$$ -326490 -781417 -356045 261346 477115 435987 469409 522268 424808 290112 292493 345510
39218C45510l2781j7731R9380O250l31262m77044j63142K64519L28580O0092j51772
$$ 345510 312729 294998 394378 400628 69366 -407678 -570820 -306301 22279 82371 -69401
39207f9401j38465n1944n773M9756J01558J4775k08181l16876j19107J95046K12405
$$ -69401 -207866 -259810 -265583 -215827 -114269 -99494 -307675 -624551 -743658 -548612 -336207
39196c36207j79534n48836l47495M03430J010848Q27190j556o72859o01239J4444
$$ -336207 -515741 -1064577 -1412072 -1008642 2206 829396 827840 154981 -446258 -431814
39186d31814N15767M83965L8629l71882l45678J39593O00404M21190m03552j040877
$$ -431814 83953 567918 606547 234665 -111013 28580 628984 1050174 646622 -394255
39176c94255o82475L91755J023276N75544k85060n11004k8727L34654J31029j46827
$$ -394255 -1076730 -684975 338301 913845 628785 117781 89054 423708 554737 407910
39166D07910K4885K93759n5613r33959j390953q08767L08125R83425Q92593M93356
$$ 407910 432795 726554 670941 -263018 -1653971 -2462738 -2154613 -1171188 -278595 214761
39156B14761K23120L1660k14937k99456K9380M96820M91235j17343p01192o45388
$$ 214761 437881 469541 254604 -44852 -15472 481348 972583 855240 154048 -491340
39146d91340j46570J03843q4546j79834J92465O13166M80584n6106l16967j45727
$$ -491340 -637910 -534067 -618613 -798447 -605982 7184 487768 431662 114695 -31032
39136c1032j03083m43695n63787L3204P26865N14364m32531q34550r6904Q08522
$$ -31032 -134115 -577810 -1141597 -1108393 -381528 132836 -299695 -1134245 -1231149 -422627
39126d22627P36073m0800l63980R9846N53079L72006j22369l66404l30015k68470
$$ -422627 313446 272646 -91334 8512 561591 933597 811228 444824 114809 -153661
39116a53661k18656j11409j8828L3397J89555M23799M12676N8821j98597J2746
$$ -153661 -372317 -483726 -502554 -469157 -279602 144197 556873 615694 417097 429843
39106D29843L69756K80631k50093o54348o10081l62981k22587j38061R0307M25498
$$ 429843 799599 1080230 830137 175789 -434292 -797273 -1019860 -1157921 -1067614 -642116
39096f42116N82581L56492p6574k48710N9558M29630K73568k98080n42680j66148
$$ -642116 -59535 296957 220383 -28327 31231 460861 734429 436349 -106331 -272479
39086b72479K26122R7104j84043k5246L53305K87825k18248n02544k44617K07332
$$ -272479 -46357 50747 -133296 -158542 194763 482588 264340 -238204 -482821 -275489
39076b75489M55082M13403J19407k79809m35528j90145R9229J06543Q5562K84823
$$ -275489 179593 592996 712403 432594 -2934 -193079 -93850 12693 98255 383078
39066C83078K77480k86293p30163k66358N06454L73806m12738m04905N92030J071675
$$ 383078 660558 374265 -355898 -622256 -115802 258004 -154734 -559639 32391 1104066
39056A104066L07708m56965j62952L41534o7654q12813p20185m7298J46124j10930
$$ 1104066 1411774 954809 791857 1133391 1065737 252924 -467261 -514559 -368435 -479365
39046d79365l443L97930L10112k08717l29442M9413K03454n6308j68101J0456
$$ -479365 -482808 -84878 225234 16517 -312925 -263512 -60058 -116366 -284467 -274011
39036b74011n15k44837j85159K34565M14916J58765n9554l0056n6642j25307J83271
$$ -274011 -274526 -519363 -704522 -469957 -55041 103724 44170 14114 -42528 -167835 15436
39025A5436P25574P21976k3990p21799p53748m22604k13163j03549L7187J04173
$$ 15436 741010 1462986 1438996 717197 -36551 -459155 -672318 -775867 -738680 -634507
39015f34507J35454L37424M91825J13601n64347o52467J2389M74940J13282m39302
$$ -634507 -499053 -161629 330196 443797 -120550 -773017 -760628 -285688 -172406 -611708
39005f11708m12081n9174K0604l7180K08478N74665N75125K56111l05j39371k69334
$$ -611708 -1023789 -1082963 -1062359 -1099539 -891061 -316396 258729 514840 514535 375164 105830
38994A05830k22840R3792K92389O2878k27194j06126K05039K09954r743l4037
$$ 105830 -117010 -23218 269171 332049 104855 -1271 203768 413722 403979 369942
38984C69942J18974J34651L2881m300j24707m30264m60564J33274P19186M50515
$$ 369942 488916 623567 656448 652148 527441 97177 -363387 -230113 489073 939588
38974I39588l01539l68989L73953P60111J66755n39452m30074J00777J42045k79424
$$ 939588 638049 269060 643013 1403124 1569879 1030427 600353 701130 843175 563751
38964E63751m24258p3493L03839L78382K23011r5274n03535o17973j53278M03177
$$ 563751 139493 66000 369839 748221 971232 875958 372423 -245550 -398828 4349
38954D349K72808l84406n25669K25168Q96724N51199l61062p49033m39038j03142
$$ 4349 277157 -107249 -632918 -407750 488974 1040173 679111 -69922 -508960 -612102
38944f12102J5427K74767O14949M42662k53556o51520l43829L9935o6880l03427
$$ -612102 -596675 -321908 293041 735703 482147 -169373 -513202 -473267 -540147 -843574
38934h43574k17483j20230l26282l27184L02193Q41017M20294m10143m04012L76457
$$ -843574 -1061057 -1181287 -1507569 -1834753 -1532560 -691543 -271249 -681392 -1085404 -708947
38924g08947O71553J07768k69324J78928O75693L91437l09809o41569n06369k05823
$$ -708947 -37394 70374 -198950 -20022 655671 1047108 737299 95730 -410639 -616462
38914f16462J64161M27697J83732m61540p20401k43034L08800L58237K72340M68585
$$ -616462 -452301 -24604 159128 -302412 -1022813 -1265847 -957047 -598810 -326470 142115
38904A42115N28633N6886l73253j43819K16910r5818o50954m14743M39320P13136
$$ 142115 670748 727634 354381 210562 427472 331654 -319300 -734043 -294723 418413
38894D18413J12593l50193p9805K45960N480k91749J7796N20707L50199m05470
$$ 418413 531006 180813 101008 346968 352448 60699 78495 599202 949401 543931
38884E43931p78263l04696L71178M32314o4469m00815k20973P3799K0870j92681
$$ 543931 -234332 -539028 -167850 264464 199995 -200820 -421793 -347994 -327124 -519805
38874e19805n9327M03405O18554K80507k44899m77027l46633j5509L67833N34034
$$ -519805 -579132 -175727 442827 723334 478435 1408 -345225 -360734 7099 541133
38864E41133K15292l29301m28194L8886L50149K7618l87179k16495K50432K68087
$$ 541133 756425 427124 -1070 37816 387965 415583 28404 -188091 62341 330428
38854C30428j63301m03741k29694m878P2299J64434K80593K10752j6052j37641
$$ 330428 167127 -236614 -466308 -471186 -398887 -234453 46140 256892 240840 103199
38844A03199j00944m5888M6285K29678K78256q936l53623l56626j21726K49N2812
$$ 103199 2255 -43633 2652 232330 510586 501650 148027 -208599 -330325 -330076 -277264
38833b77264K63770M35476K29026j24592j19150J47946J29252k20378l94273k10846
$$ -277264 -13494 421982 651008 526416 407266 555212 684464 464086 69813 -141033
38823a41033o787N1043J30499J95436J6650k47829j88678J13444J94639N5003
$$ -141033 -147820 -96777 33722 229158 245808 -2021 -190699 -77255 117384 172387
38813A72387J24282L62927K53776k01288l58311r370K68991J07921j32509j27669
$$ 172387 296669 659596 913372 712084 353773 344403 613394 721315 588806 461137
38803D61137p5674j10522k5517R9573j59522o32271m71211M74813J111686O05993
$$ 461137 385463 274941 249424 348997 189475 -442796 -914007 -439194 672492 1278485
38793A278485l66359o63395k69222L3297P764J1550O8616j23675m07779k71523
$$ 1278485 912126 248731 -20491 12806 20570 32120 100736 -22939 -430718 -702241
38783g02241K44471M87119J44661l38638m51598k42882o6484l7344L4494K98134
$$ -702241 -457770 29349 174010 -164628 -616226 -859108 -925592 -962936 -928442 -630308
38773f30308O00306O18756K86185l6568j8367J23792o8319n16097o28059j88332
$$ -630308 -30002 588754 874939 838371 820004 943796 875477 359380 -268679 -457011
38763d57011K97763L35584L4463k47369l71019k97426P291K94379J67400k51480
$$ -457011 -159248 176336 210799 -36570 -407589 -705015 -697724 -403345 -235945 -487425
38753d87425l50089P154K06368m3463j17421M51944J008412O76449k76242q28793
$$ -487425 -837514 -830360 -623992 -667455 -784876 -332932 675480 1351929 1075687 246894
38743B46894o16738j36602J90237L32955K09786k30498n36638j57585O26417Q88949
$$ 246894 -369844 -506446 -316209 16746 226532 -3966 -540604 -698189 -71772 817177
38733H17177K99545m49209o25840l08190j5924L9424L0582J08766J90591R8653
$$ 817177 1116722 667513 41673 -266517 -282441 -243017 -212435 -103669 86922 185575
38723A85575j54444k51592Q6873O00450O61676J34147l53285l02128m9277j01152
$$ 185575 31131 -220461 -133588 466862 1128538 1262685 909400 607272 557995 456843
38713D56843k35594L7178M61999L44240k45143m53058M7462N29077K91146l65472
$$ 456843 221249 258427 720426 1064666 819523 366465 413927 943004 1234150 868678
38703H68678o51596l51911M3481N9933k33373l86845j39910K14160J64599k65351
$$ 868678 217082 -134829 -91348 -31415 -264788 -651633 -791543 -577383 -412784 -678135
38693f78135m25498M7371N98366N06958m2365k70630L282K07874K8088j83907
$$ -678135 -1103633 -1056262 -457896 49062 6697 -263933 -260651 -52777 -24689 -208596
38683b08596j43728p6065j58388j41054J31051L32400J80704o5926l2701J75643
$$ -208596 -352324 -428389 -586777 -727831 -596780 -264380 -83676 -149602 -182303 -6660
38673f660J94604k4720k29530k89465k72925j96046J2371L05349M72969L48629
$$ -6660 187944 163224 -66306 -355771 -628696 -824742 -812371 -507022 -34053 314576
38663C14576J6413j90949K0681N10491P11177K65327m31845o41515k17052K25531
$$ 314576 330989 140040 160721 671212 1382389 1647716 1215871 574356 357304 582835
38653E82835J42779k83583m94148k70265J12246K80928J24247j85637m13298m86486
$$ 582835 725614 442031 -52117 -322382 -210136 70792 195039 9402 -403896 -890382
38643h90382m72184l52434l5041L26764L54637M0373m4139M36572R00893O02838
$$ -890382 -1362566 -1715000 -1750041 -1423277 -1068640 -1028267 -1072406 -635834 265059 867897
38633H67897j87111n27880k24697Q825j03617Q2202Q40983J264894N15326p76099
$$ 867897 680786 152906 -71791 -62966 -166583 -84381 756602 2021496 2536822 1760723
38623A760723j263697o82242j942N2083k21909k59184m981L00882N34949N85886
$$ 1760723 497026 -185216 -187158 -135075 -356984 -616168 -621149 -320267 214682 800568
38613H00568K77662k79457n87132l40802J14247K28484k2039j93926o4626J21093
$$ 800568 1078230 798773 211641 -129161 -14914 213570 191531 -2395 -67021 54072
38603E4072J20583L9283N1228P6635j9799j34711j18368r1330k40488m24445l54819
$$ 54072 174655 213938 265166 341801 322002 187291 68923 -22407 -262895 -687340 -1042159
38592a042159q6998Q1175J28817K38400K60127j02440n15213k15359P39386J258712
$$ -1042159 -1129157 -1047982 -919165 -680765 -420638 -523078 -1038291 -1253650 -514264 744448
38582G44448P33463o3332k37712r6269l11676n54630j54235M44935K71087m35703
$$ 744448 1477911 1414579 1176867 1080598 768922 214292 60057 504992 776079 340376
38572C40376n33317O5529K73957k06487l95233J06871L64330j18035m09600J17752
$$ 340376 -192941 -127412 146545 -59942 -455175 -348304 16026 -102009 -511609 -393857
38562c93857N18661m9956o55087q4632R73014R36837j14391o57387k08080J53795
$$ -393857 124804 74848 -580239 -664871 308143 1244980 1130589 473202 265122 418917
38552D18917j89640m73685o0953M86152M42174N870k43763j98639k6892K18060
$$ 418917 229277 -244408 -305361 180791 622965 628835 385072 186433 159541 377601
38542C77601L82132J99905j66437j67799K64840N18231K56556p5112n5151P2217
$$ 377601 759733 959638 793201 625402 890242 1408473 1665029 1589917 1534766 1606983
38532A606983j7378j36308p2455q3903l54386m83852j38449K44805P9569l90793
$$ 1606983 1589605 1453297 1380842 1296939 942553 458701 320252 565057 644626 253833
38522B53833m48057j3107L06489J95177j4653Q21J29488J67830J16922K666j96657
$$ 253833 -194224 -207331 99158 294335 279682 280503 409991 577821 694743 697409 500752
38511E00752l20833j16980K75968K98977l16561j067730j188905n07999M23695
$$ 500752 179919 62939 338907 637884 321323 -746407 -1935312 -2443311 -2019616
38502b019616R51732Q58515L65240j42114l38184j24196K69194M28663J69809
$$ -2019616 -1067884 -209369 155871 13757 -324427 -448623 -179429 249234 419043
38493D19043k04171k02195K55569O85821N95712P0666l51412l29022m9835R1144
$$ 419043 214872 12677 268246 954067 1549779 1620445 1269033 940011 890176 981320
38483I81320l8247k43482k95688j77801n8027p2949j59972j27387J09851M12528
$$ 981320 943073 699591 403903 226102 168075 95126 -64846 -192233 -82382 330146
38473C30146N39675L26713k17543q27567j008602m37189N27350J016542N96230
$$ 330146 869821 1196534 978991 151424 -857178 -1294367 -767017 249525 845755
38464H45755j76813m36239n6693L31952K45148j53566m18272l04378J33895N89442
$$ 845755 668942 232703 176010 507962 753110 599544 181272 -123106 10789 600231
38454F00231O28947J11877m97687n85016j67844J57670Q7217l2927J39331L83202
$$ 600231 1229178 1341055 843368 258352 90508 248178 335395 302468 441799 825001
38444H25001K89482j34161n26578o25757m26053o5422K49687L51560K73647J77770
$$ 825001 1114483 980322 453744 -172013 -598066 -663488 -413801 -62241 211406 389176
38434C89176R8962k4769r3748N3667K72106K40844K1388J8377K59422K39390k72908
$$ 389176 488138 463369 369621 423288 695394 936238 957626 976003 1235425 1474815 1201907
38423A201907p87305p90538m25713r2235J70343M30454M29618r037m38399k87071
$$ 1201907 414602 -375936 -801649 -893884 -723541 -293087 136531 127494 -310905 -597976
38413e97976K51588M26978j5587n18629m95383j5712L71113K39272k96682o18604
$$ -597976 -346388 80590 65003 -453626 -949009 -964721 -593608 -354336 -651018 -1269622
38403a269622k10134O19957R32370L46050l67106l16844K71657M78886O1210l41576
$$ -1269622 -1479756 -859799 72571 418621 51515 -265329 6328 485214 546424 204848
38393B04848k71611J4232J45403J30768J05585R8101J61458K98199K43083j80732
$$ 204848 -66763 -52531 92872 223640 329225 427326 588784 886983 1130066 949334
38383I49334n27504j84591N96930Q49379K52174l81871l15397J10022J64623j54592
$$ 949334 421830 237239 834169 1683548 1935722 1553851 1238454 1348476 1513099 1358507
38373A358507l09164j33985N8929R0030O5603n000k68266o60669q25520n06136
$$ 1358507 1049343 915358 974287 1064317 1129920 1124920 856654 195985 -629535 -1135671
38363a135671J27309N95588N33192N4664l13426j95901J90081L70898K96179L12754
$$ -1135671 -1008362 -412774 120418 175082 -138344 -334245 -144164 226734 522913 835667
38353H35667M88926M59024P6618k63214k09842M4273J36767L6540j30573l90614
$$ 835667 1324593 1783617 1860235 1597021 1387179 1431452 1568219 1604759 1474186 1083572
38343A083572o96127p17325k71863K74930M37494K44444O9035J7854q9993k60020
$$ 1083572 387445 -329880 -601743 -326813 110681 355125 424160 442014 352021 92001
38333I2001k82565j41878p9866j90580k50601n7711K58429L77631J66263j45750
$$ 92001 -190564 -332442 -412308 -602888 -853489 -911200 -652771 -275140 -108877 -254627
38323b54627j83669J39950M73342M37870J14718j14277j44443k13449l79600l73672
$$ -254627 -438296 -298346 174996 612866 727584 613307 468864 255415 -124185 -497857
38313d97857j11296Q5364K3331j003K99213O69552O55222K52616j32979k44181
$$ -497857 -609153 -523789 -500458 -501461 -202248 467304 1122526 1375142 1242163 997982
38303I97982j93205k04879l35636m04904j72857K85845M89699J51293k61915j03209
$$ 997982 804777 599898 264262 -140642 -313499 -27654 462045 613338 351423 248214
38293B48214L75254K61035n62957j050452m86954M31605O09187j576o15574p44523
$$ 248214 623468 884503 321546 -728906 -1215860 -784255 -175068 -176644 -792218 -1536741
38283a536741m36733J51273P44815Q91494N12227J23096J2564k18231p09980p14558
$$ -1536741 -1973474 -1822201 -1077386 -185892 326335 449431 461995 243764 -466216 -1180774
38273a180774K12503J126760R21905M3969k79302k2583j28311o06362m99229K48015
$$ -1180774 -968271 158489 1080394 1124363 845061 822478 694167 87805 -411424 -163409
38263a63409N28944r953l49141Q7188M37862m0758o91545o00136J6065M45783
$$ -163409 365535 355582 6441 93629 531491 490733 -200812 -800948 -784883 -339100
38253c39100O15679P06669M58187k10117n81779j24351M68703J97883o93050j058837
$$ -339100 276579 983248 1441435 1231318 649539 525188 993891 1191774 498724 -560113
38243e60113m99483K44136M67337K89619J79666K55770K39971j08577n62569m99190
$$ -560113 -1059596 -815460 -348123 -58504 121162 376932 616903 508326 -54243 -553433
38233e53433K97921J023232O76552m53660r85783l72597L45758K07120k95231
$$ -553433 -255512 767720 1444272 990612 4829 -367768 -22010 185110 -110121
38224a10121k89099m056j02024k94359J16044P96845P79683N6604m20735k39684
$$ -110121 -399220 -403276 -505300 -799659 -683615 113230 892913 949517 528782 289098
38214B89098R4901K36265L41586L09450k07406q62751p73506R7213P20022N17941
$$ 289098 383999 620264 961850 1271300 1063894 201143 -572363 -475150 244872 762813
38204G62813J25681J65381K24073k62338q82510q41982k04824K48554J52237j27127
$$ 762813 888494 1053875 1277948 1015610 133100 -708882 -913706 -665152 -512915 -640042
38194f40042j80132p692J91797K76170J84264k7463j89325k17872k07542j94038
$$ -640042 -820174 -827866 -636069 -359899 -175635 -203098 -392423 -610295 -817837 -1011875
38184a011875k6045L24184N27993K68189k70135n62059l65098N8362L35368L65261
$$ -1011875 -1037920 -713736 -185743 82446 -187689 -749748 -1114846 -1056484 -721116 -355855
38174c55855K51501P3366j02838j14291J38905M06366K44084l51671p09469k40757
$$ -355855 -104354 -30988 -133826 -248117 -109212 297154 541238 189567 -519902 -760659
38164g60659O79391J047427M97745k44526l73109m230J72316j17009n22620o41639
$$ -760659 -81268 966159 1463904 1219378 846269 842039 1014355 897346 374726 -266913
38154b66913l87973Q4307M88354N28253J86312k08970l81649l82612l03598m2978
$$ -266913 -654886 -570579 -82225 446028 632340 423370 41721 -340891 -644489 -687467
38144f87467L74991O00396M31217J54396M4048r1577m08023n10541o7756M33431
$$ -687467 -312476 287920 719137 873533 917581 826004 417981 -92560 -160316 273115
38134B73115L03343k26928l21459J37581M06134R8701k85116k48675K1034J37385
$$ 273115 576458 349530 28071 165652 571786 670487 385371 136696 157730 295115
38124B95115P0126o3769k43851l26829o5474M12152N94541K91397p6428j09254
$$ 295115 365241 301472 57621 -269208 -334682 77470 672011 963408 886980 777726
38114G77726O2302J22913L4921q2046j98894k90351k71769j58142l8115J28485
$$ 777726 840028 962941 997862 915816 716922 426571 154802 -3340 -41455 87030
38104H7030L74555M54590J49882k25575j82162J17397O2780l26624l30219K44752
$$ 87030 461585 916175 1066057 840482 658320 775717 838497 511873 181654 426406
38094D26406O04246J82342m43996m71966q9210k9940l28905l28203K04906O80096
$$ 426406 1030652 1212994 768998 297032 207822 177882 -151023 -479226 -274320 405776
38084D05776N09340j28825n20550k15414M86644Q22104M08914k55097l89624K8150
$$ 405776 915116 786291 265741 50327 536971 1359075 1767989 1512892 1123268 1151418
38074A151418K54189j23731o02762n30303J5184M57874M75272J63746k42448m80277
$$ 1151418 1405607 1281876 679114 148811 163995 621869 1097141 1260887 1018439 538162
38064E38162l44063L7088K40604J00811o3342J7368J55506J01931k5514l5243
$$ 538162 194099 231187 471791 572602 509260 526628 682134 784065 758551 723308
38054G23308l0820j26634j32527P9193K06437l3151l43355k32218K05280L78195
$$ 723308 692488 565854 433327 512520 718957 685806 342451 110233 315513 693708
38044F93708L7428l93634l87615O6684N02248N02089J28348j93490k30594k00809
$$ 693708 731136 337502 -50113 16571 518819 1020908 1149256 955766 725172 524363
38034E24363k86048j87189L46826P83494L71771n61276p84217R2317R31839O36995
$$ 524363 238315 51126 397952 1181446 1553217 991941 207724 300041 1231880 1868875
38024A868875l91769j009915q58959l87382R1797N09712N99226K08528j66986
$$ 1868875 1477106 467191 -391768 -779150 -687353 -177641 421585 630113 463127
38015D63127N2301N92355O67935J28089m36439o22839n54802l45447P3037N15492
$$ 463127 515428 1107783 1775718 1903807 1467368 844529 289727 -55720 17317 532809
38005E32809N50847R2897m42803o46380m49840r970L97690M69016J99796k1927
$$ 532809 1083656 1176553 733750 87370 -362470 -372440 25250 494266 694062 672135
37995F72135L2780N8096k22106m63111k02809L51377O26717N04050K39096j17342
$$ 672135 704915 763011 540905 77794 -125015 226362 853079 1357129 1596225 1478883
37985A478883n42628o17216p9462M64975K74074l02723l03009K76908M76067l8810
$$ 1478883 936255 319039 239577 704552 978626 675903 372894 649802 1125869 1087059
37975A087059n01790l74147n8325M0696J27944K67804L3900n41840o26704J29949
$$ 1087059 585269 211122 152797 193493 321437 589241 623141 81301 -545403 -415454
37965d15454Q30815O20347k2428j54317J21163K7044m34266m86749P8957N43505
$$ -415454 415361 1035708 1013280 858963 980126 1007170 572904 86155 165112 708617
37955G08617L54103j70211m30691k82120M5596L35643M60136L35599P525l23374
$$ 708617 1062720 892509 461818 179698 225294 560937 1021073 1356672 1364197 1040823
37945A040823m39044k42762J66975M94853M56852J03524j95274j87387o390P7553
$$ 1040823 601779 359017 525992 1020845 1477697 1581221 1385947 1198560 1192170 1269723
37935A269723k7029k56216m85404m85672o5680N71672Q81889N92514L5966l09182
$$ 1269723 1242694 986478 501074 15402 -50278 521394 1403283 1995797 2031763 1722581
37925A722581l57618l00746k15945n5336J46223K66758J96328j17785n22389n83079
$$ 1722581 1364963 1064217 848272 792936 939159 1205917 1402245 1284460 762071 178992
37915A78992m9684N74069M72638k95927o89075j19185O42127N91343k6280j72099
$$ 178992 129308 703377 1176015 880088 191013 71828 713955 1305298 1279018 1106919
37905A106919L68270P30788L20802m06973p20806n24664k01184q983L8413r302
$$ 1106919 1475189 2205977 2526779 2119806 1399000 874336 673152 664169 702582 693280
37895F93280o3751j1787J27881J99883J37678K6620r0103k52440l81893k77978
$$ 693280 629529 617742 745623 945506 1083184 1109804 1019701 767261 385368 107390
37885A07390Q5760M61985O25445N92249M58009K16316j19127l71725l72245k05569
$$ 107390 193150 655135 1280580 1872829 2330838 2547154 2428027 2056302 1684057 1478488
37875A478488j17159j76642j83718K2514K72814K49750m6102k28831o0735J66108
$$ 1478488 1361329 1184687 1000969 1023483 1296297 1546047 1499945 1271114 1210379 1376487
37865A376487P7039j20679R7209O27572O63586j32642r27938p48335J43910O02257
$$ 1376487 1453526 1332847 1430056 2057628 2721214 2588572 1660634 912299 1056209 1658466
37855A658466J90728l34366k49226J71706K87208Q7108j2872L23k15538n99968
$$ 1658466 1849194 1514828 1265602 1437308 1724516 1811624 1798752 1799075 1583537 983569
37845I83569o36738j68702K89344L02023J19609J71244L19729J22998l52008n40452
$$ 983569 346831 178129 467473 769496 889105 1060349 1380078 1503076 1151068 610616
37835F10616k16391J96848K89912J79508J31019R0830p3222j95571o2482J92039
$$ 610616 394225 591073 880985 1060493 1191512 1282342 1209120 1013549 951067 1143106
37825A143106L03790K91028K96463K39217L0324q1914J37073L85701J96155k85372
$$ 1143106 1446896 1737924 2034387 2273604 2303928 2222014 2359087 2744788 2940943 2655571
37815B655571m68902k16856M4933J10070K13353L75935K32480k56019n60621l60216
$$ 2655571 2186669 1969813 2014746 2124816 2338169 2714104 2946584 2690565 2129944 1769728
37805A769728j27J12840K7670j04629l05959m02935m6876N44199N95157j8045
$$ 1769728 1769601 1882441 1910111 1805482 1499523 1096588 1049712 1593911 2189068 2171023
37795B171023l70294Q2499N17800N9175o94028n74742K66663O56987K79725o0953
$$ 2171023 1800729 1883228 2401028 2460203 1766175 1191433 1458096 2115083 2394808 2333855
37785B333855J4354j7348l39157l43145J79308N17781K44050m9750J72782M55412
$$ 2333855 2348209 2330861 1991704 1648559 1827867 2345648 2589698 2539948 2712730 3168142
37775C168142K00497k80961l53240j15176p5554j95702n0513L25178M85505L23989
$$ 3168142 3368639 3087678 2734438 2619262 2543708 2348006 2297493 2622671 3108176 3432165
37765C432165J50484J07717L8822j28122k91687l80635l06434Q1465O22403P18522
$$ 3432165 3582649 3690366 3729188 3601066 3309379 2928744 2622310 2703775 3326178 4044700
37755D044700P9893o57092o38272N2620N62510M87551K52504K47154K56087l6821
$$ 4044700 4124593 3467501 2829229 2881849 3444359 3931910 4184414 4431568 4687655 4650834
37745D650834m80000o48081l02238M41041J105054J056458J54891q08241q46402
$$ 4650834 4170834 3522753 3220515 3661556 4766610 5823068 5977959 5169718 4323316
37736D323316j6944O38671M98847N3415l8449J37058K23861L30094O39561P77510
$$ 4323316 4306372 4945043 5443890 5497305 5458856 5595914 5819775 6149869 6789430 7566940
37726G566940L21081l42457m31615Q3122M77955L94390K36699L54228N22250M81979
$$ 7566940 7888021 7545564 7113949 7197071 7675026 8069416 8306115 8660343 9182593 9664572
37716I664572M02068M69576N00335L17612J30810J76585L12516L19955K98196
$$ 9664572 10066640 10536216 11036551 11354163 11484973 11661558 11974074 12294029 12592225
37707A2592225L79958L56023K9623k99486k14657J06785J13797k22542l01517
$$ 12592225 12972183 13328206 13357829 13058343 12843686 12950471 13064268 12841726 12540209
37698A2540209J95156P83918Q32965L89159N1434K00119N95620O85376K08602
$$ 12540209 12735365 13519283 14352248 14741407 14792841 14992960 15588580 16273956 16482558
37689A6482558m58230o11076l4673O11999N63798K1817o5309O15073J211806R41300
$$ 16482558 16024328 15413252 15378579 15990578 16554376 16576193 16510884 17125957 18337763 19279063
37679A9279063K64850J91476P87581J197607J036810Q77863J153424J403345J112631
$$ 19279063 19543913 19735389 20522970 21720577 22757387 23635250 24788674 26192019 27304650
37670B7304650O70101P99123J399826J725510J589977J614272K142373K645875
$$ 27304650 27974751 28773874 30173700 31899210 33489187 35103459 37245832 39891707
37662C9891707K595045K355027K645620L434762L999479M004882L945590M413326
$$ 39891707 42486752 44841779 47487399 50922161 54921640 58926522 62872112 67285438
37654F7285438N370322O324749O916026P185518P529402Q458954J0087269J1776126
$$ 67285438 72655760 78980509 85896535 93082053 100611455 109070409 119157678 130933804
37646A30933804J2702943J2937643J3484852J4975727J6820377J8092322J8737694
$$ 130933804 143636747 156574390 170059242 185034969 201855346 219947668 238685362
37639B38685362J9224157J9359102J8339564J5898269J2531538Q499993L502706
$$ 238685362 257909519 277268621 295608185 311506454 324037992 332537985 336040691
37632C36040691k326387p919199j2306988j5525889j7936108j9271092j9153671
$$ 336040691 333714304 325795105 313488117 297962228 280026120 260755028 241601357
37625B41601357j8129643j7252831j6745157j5911995j4432456j2907223j1872445
$$ 241601357 223471714 206218883 189473726 173561731 159129275 146222052 134349607
37618A34349607j1002069r754346q299797p257415o782527o431926n834639n067430
$$ 134349607 123347538 113593192 105293395 98035980 91253453 84821527 78986888 73919458
37610G3919458m366341l822735l446773l264248l215756l120461k867010k551324
$$ 73919458 69553117 65730382 62283609 59019361 55803605 52683144 49816134 47264810
37602D7264810k331896k217427k082847j838244j492344j100322p60007o15256
$$ 47264810 44932914 42715487 40632640 38794396 37302052 36201730 35441723 34826467
37594C4826467p00280p80523n56035r7262J54237j4970k29358m9390L37539L71440
$$ 34826467 34126187 33345664 32789629 32692367 32846604 32831634 32602276 32552886 32890425 33261865
37584C3261865j132k01379J07957M91747L69386j74345n66164n32391l62370m60468
$$ 33261865 33260733 33059354 33167311 33659058 34028444 33854099 33287935 32755544 32393174 31932706
37574C1932706q93882j365062j502002j245811r89871j137954j490361j415793
$$ 31932706 31038824 29673762 28171760 26925949 25936078 24798124 23307763 21891970
37566B1891970p67220j83186j89355m72270n06732m53527p61497j190064j064265
$$ 21891970 21124750 20941564 20752209 20279939 19773207 19319680 18558183 17368119 16303854
37557A6303854m31604j01816l88661o35409l30074N2468j47337p02570q79129
$$ 16303854 15872250 15770434 15381773 14746364 14416290 14468758 14321421 13618851 12739722
37548A2739722n35642j94394j92176l70773n57617p70209q67733n46530P9842
$$ 12739722 12204080 12009686 11817510 11446737 10889120 10118911 9251178 8704648 8784490
37539H784490L35935j97210r73556j044361k76137M55207M31727K474p7147J29760
$$ 8784490 9120425 8923215 7949659 6905298 6629161 7084368 7516095 7518569 7441422 7571182
37529G571182j12222q48502j076977k09646Q26699P55641k18516p31274k63266
$$ 7571182 7458960 6610458 5533481 5323835 6150534 6906175 6687659 5956385 5693119
37520E693119K66666R6395k91073k19342j2421k95219p62214o34792k431K83427
$$ 5693119 5959785 6056180 5765107 5545765 5533344 5238125 4475911 3841119 3838688 4122115
37510D122115l6274l02661p3967K36968J39975j80094k71983j11781N93o0912
$$ 4122115 4085841 3783180 3709213 3946181 4086156 3906062 3634079 3522298 3522891 3461979
37500C461979j71047j78068n540K81708M01417R8674m22973o19233l06646P1154
$$ 3461979 3290932 3112864 3107324 3389032 3790449 3889123 3466150 2846917 2540271 2611425
37490B611425Q1827j07503o4534K35352M09085K21282j44225l36856j95051J15978
$$ 2611425 2693252 2585749 2521215 2756567 3165652 3386934 3242709 2905853 2710802 2826780
37480B826780K54029P7105j40883p1704J34647M3474l07420l44505J47974O04543
$$ 2826780 3080809 3157914 3017031 2945327 3079974 3123448 2816028 2471523 2619497 3224040
37470C224040N09752J43935K337m9935l72316o72988l70528L27911N74018J38289
$$ 3224040 3733792 3877727 3880064 3830129 3457813 2784825 2414297 2742208 3316226 3454515
37460C454515k88272j96633J11617K36401K70428L33628K05558j58833l69698
$$ 3454515 3166243 2969610 3081227 3317628 3588056 3921684 4127242 3968409 3598711
37451C598711k95772l81092p58637p25730J85415J191853J191186L36356k29109
$$ 3598711 3302939 2921847 2163210 1437480 1622895 2814748 4005934 4342290 4113181
37442D113181j20M29986M66614J89510j37016m29086n06955j57926L52256M60584
$$ 4113181 4113061 4543047 5009661 5199171 5062155 4633069 4126114 3968188 4320444 4781028
37432D781028J36249r2457l0015k5039j63390n5142L17398L69470p6195l50014
$$ 4781028 4917277 4824820 4794805 4769766 4606376 4551234 4868632 5238102 5161907 4811893
37422D811893m640M43841M45712L52435O78441J070012Q85518L42081J87366N36423
$$ 4811893 4807253 5251094 5696806 6049241 6727682 7797694 8683212 9025293 9212659 9749082
37412I749082Q73603R64269R65156Q66945O31241O36333J142373J586287J369704
$$ 9749082 10622685 11586954 12552110 13419055 14050296 14686629 15829002 17415289 18784993
37403A8784993J072146J695959K839713L029677K033973J341512J814899K349535
$$ 18784993 19857139 21553098 24392811 27422488 29456461 30797973 32612872 34962407
37395C4962407J766301P02150L63390M53716j26249j185366j522234j066925j084252
$$ 34962407 36728708 37430858 37794248 38247964 38121715 36936349 35414115 34347190 33262938
37386C3262938k050714k832988k506883j732002j565221j899204j962079j639061
$$ 33262938 31212224 28379236 25872353 24140351 22575130 20675926 18713847 17074786
37378A7074786j356443j141340p44224m16216o39453j173882j239992p11332l18974
$$ 17074786 15718343 14577003 13832779 13416563 12777110 11603228 10363236 9651904 9332930
37369I332930m85399p28062n66313l11340m22928o48681m84770j19797j50158
$$ 9332930 8847531 8119469 7553156 7241816 6818888 6170207 5685437 5565640 5415482
37360E415482n17573n38552n7677K17705j63741o26940m22119K49724N78331L14892
$$ 5415482 4897909 4359357 4301680 4519385 4355644 3728704 3306585 3556309 4134640 4449532
37350D449532m9087j53776j68842k55534k22031N6865L17015K75918J7286k19472
$$ 4449532 4400445 4246669 4077827 3822293 3600262 3657127 3974142 4250060 4267346 4047874
37340D047874l44883l08821j5024L77401L98537j03263n44884k90207M19803P36297
$$ 4047874 3702991 3394170 3379146 3756547 4155084 4051821 3506937 3216730 3636533 4372830
37330D372830L34595k73044n85023o63364o51481l65870K13888N57236K58935
$$ 4372830 4707425 4434381 3849358 3185994 2534513 2168643 2382531 2939767 3198702
37321C198702k37461k27175J72493K45882j14404k61118K6546J11843l38751o06727
$$ 3198702 2961241 2734066 2906559 3152441 3038037 2776919 2803465 2915308 2576557 1969830
37311A969830m4883P03754N46318l70082q33026l39096L16214L61425J7791j77333
$$ 1969830 1924947 2628701 3175019 2804937 1971911 1632815 1949029 2310454 2328245 2150912
37301B150912j76285j06424J20232L83162K11449l89903o44285j71177K46732
$$ 2150912 1974627 1868203 1988435 2371597 2583046 2193143 1548858 1377681 1624413
37292A624413j16629o13213k10146O91722P47177j90171q13489m21530J38464
$$ 1624413 1507784 894571 684425 1376147 2123324 1933153 1119664 698134 836598
37283H36598O3466j48269J76290N66299K50970m20355n18730m7647J81306m4112
$$ 836598 900064 751795 928085 1494384 1745354 1324999 806269 758622 939928 895816
37273H95816j21570J80721L15761m7155m28053k84461K24558N57165M55987M5886
$$ 895816 774246 954967 1270728 1223573 795520 511059 735617 1292782 1748769 1794655
37263A794655l80150m85807j42149K99465L26308l9544k55642p0052J59257J30791
$$ 1794655 1414505 928698 786549 1086014 1412322 1372778 1117136 1047084 1206341 1337132
37253A337132N2319J25404J06875j71943l14672M3194N02269M20613n3874j84702
$$ 1337132 1389451 1514855 1621730 1449787 1135115 1178309 1680578 2101191 2047317 1862615
37243A862615J91088M44307K07108o5097J17690N17436O07306L36810Q721k84626
$$ 1862615 2053703 2498010 2705118 2640021 2757711 3275147 3882453 4219263 4227984 3943358
37233C943358o22798q55883p20622l00630J4630L0479q2096j00228J3707J63650
$$ 3943358 3320560 2464677 1744055 1443425 1458055 1488534 1406438 1306210 1319917 1483567
37223A483567K03992L5566k03339j85979J37637L31472O0257l25733k52740J67381
$$ 1483567 1687559 1723125 1519786 1333807 1471444 1802916 1863173 1537440 1284700 1452081
37213A452081K52912k17985o72705n84927j33707J98130K42194J17764k8650k4155
$$ 1452081 1704993 1487008 814303 229376 95669 293799 535993 653757 625107 600952
37203F00952K33511M79961K70321l38063p16493n06986o7909J81150L20606M82009
$$ 600952 834463 1314424 1584745 1246682 530189 23203 -44706 136444 457050 939059
37193I39059M24009N8823j48180Q9436K67282p8663m29351n7830O37814O23620
$$ 939059 1363068 1421891 1273711 1363147 1630429 1551766 1122415 1064585 1702399 2326019
37183B326019j18504n33968j44578L30938K64817K6036J62564N21466O96647O68961
$$ 2326019 2207515 1673547 1528969 1859907 2124724 2150760 2313324 2834790 3531437 4200398
37173D200398N19564J42427k87999k11700M34412Q81297O65471M15010P35083
$$ 4200398 4719962 4862389 4574390 4362690 4797102 5678399 6343870 6758880 7493963
37164G493963R72608J49120j277204j803363j009295j22731j83279p00596o98613
$$ 7493963 8466571 8615691 7338487 5535124 4525829 4403098 4219819 3519223 2820610
37155B820610k33526o0535l16978m45141k53218j98250m95596o68452l22259J68417
$$ 2820610 2587084 2526549 2209571 1764430 1511212 1312962 817366 148914 -173345 -4928
37145d928K19921o0860q9727K42387M22683J58817j93566k40666r9049l8741k423
$$ -4928 214993 154133 64406 306793 729476 888293 694727 454061 355012 316271 313848
37134C13848J41453K18947N4029j36065r4430j323j13116k06917K9797L03919
$$ 313848 455301 674248 728277 592212 497782 496459 383343 176426 206223 510142
37124E10142J15519l04033k53034K61084M54898J8436m13356l14576P094J22635
$$ 510142 625661 321628 68594 329678 784576 803012 389656 75080 82174 204809
37114B04809J65010L17134L04881k6672k31226K0305K67879j5736m88493m63960
$$ 204809 369819 686953 991834 965162 733936 754241 1022120 1006384 517891 53931
37104E3931j8217K12451J07873J24422L56506L38353r7361m40207k44371K23427
$$ 53931 35714 248165 356038 480460 836966 1175319 1077958 637751 393380 616807
37094F16807L72227M1382l82837m79495k53159o6718j44821k63733j14829J45305
$$ 616807 989034 1030416 647579 168084 -85075 -151793 -296614 -560347 -675176 -529871
37084e29871J04818j55039p2672M62596P95550M73011m4726j25440Q8778N8931
$$ -529871 -425053 -580092 -652764 -190168 605382 1078393 1033667 908227 997005 1055936
37074A055936k42680m28500l76995k16982N7579L56467K29574m69795r83441n14403
$$ 1055936 813256 384756 7761 -209221 -151642 204825 434399 -35396 -1018837 -1533240
37064a533240N25160R76963N23956m9848j54496n6756j24330k24818j27548J22105
$$ -1533240 -1008080 -31117 492839 442991 288495 231739 107409 -117409 -244957 -122852
37054a22852M14982O34666M68295k30295r03835q33181k19298Q0218q1783n349
$$ -122852 292130 926796 1395091 1164796 260961 -572220 -791518 -711300 -793083 -798432
37044g98432M64619N19505j87461p59561m02692L49673N92835M51863N37019O17994
$$ -798432 -333813 185692 -1769 -761330 -1164022 -814349 -221514 230349 767368 1385362
37034A385362K7269q96036r88862O777R39708Q15695M0701l89426l01296k77863
$$ 1385362 1412631 516595 -472267 -465490 474218 1289913 1330614 941188 639892 362029
37024C62029n13100m85928J37383Q58456R63133M65833j1915j69857k93187n31566
$$ 362029 -151071 -636999 -499616 358840 1321973 1787806 1775891 1606034 1312847 781281
37014G81281n40945j73633O4822j91210m18530j1484N44395K88055n74423p69421
$$ 781281 240336 66703 131525 -59685 -478215 -489699 54696 342751 -231672 -1001093
37004a001093J23523R59696P12254j03399l76313n105K56894N3103k73223l38528
$$ -1001093 -877570 82126 794380 690981 314668 309563 566457 619560 346337 7809
36994G809n2495M62401P97795M45828m55889r81532n68300J48685K95006M2062
$$ 7809 -44686 417715 1215510 1661338 1205449 223917 -344383 -195698 99308 141370
36984A41370Q9059L06380l404o63304o52743K32691Q66643M10814m53106n58239
$$ 141370 230429 536809 533405 -129899 -782642 -549951 316692 727506 274400 -283839
36974b83839J27938O43406M13472j99123n80711n27490k05811J25101K44559P4463
$$ -283839 -155901 487505 900977 701854 121143 -406347 -612158 -487057 -242498 -168035
36964a68035k29899l81411k01308K32789O15274O11473J89462k18782j04787M53160
$$ -168035 -397934 -779345 -980653 -747864 -132590 478883 668345 449563 344776 797936
36954G97936P38292K35170o36819r59038m64809J25882J01955k67956j96251L69647
$$ 797936 1536228 1771398 1134579 175541 -289268 -163386 -61431 -329387 -525638 -155991
36944a55991N97123L6447o15100n17670N5500K14768j08495j67213K05725K78960
$$ -155991 441132 477579 -137521 -655191 -599691 -384923 -493418 -660631 -454906 -175946
36934a75946k08302m22249J92785Q40619N60288k20917l78383J35723L65886j7026
$$ -175946 -384248 -806497 -613712 226907 787195 566278 187895 323618 689504 672478
36924F72478l43167k31661j14852k34346j58332K83793N04809J39970k48833o4963
$$ 672478 329311 97650 -17202 -251548 -409880 -126087 378722 518692 269859 204896
36914B04896L62934L73078J6490j73208q3200k3472p6054n8946K9207O8438J61859
$$ 204896 567830 940908 957398 784190 700990 677518 601464 542518 571725 640163 802022
36903H02022M09783N09975J34801m13121n06379j22231J10041j50433n15014n15554
$$ 802022 1211805 1721780 1856581 1443460 937081 814850 924891 774458 259444 -256110
36893b56110k13676O5710K17898K98494K60615M7368j96135k43506p8822P3448
$$ -256110 -469786 -404076 -186178 112316 372931 420299 224164 -19342 -98164 -24716
36883b4716J3159j86153k15654J14715N56809O32190K41696j73534k52766j97916
$$ -24716 -11557 -197710 -413364 -298649 258160 890350 1132046 958512 705746 507830
36873E07830l28800m72711k83729N5426O4619j89776j59422K24607L58658n5126
$$ 507830 179030 -293681 -577410 -521984 -457365 -647141 -806563 -581956 -223298 -278424
36863b78424m98486m28955N008M02536O83674P95958M46817k99839o98125k83099
$$ -278424 -776910 -1205865 -1200857 -798321 -114647 681311 1128128 828289 130164 -152935
36853a52935K84873J21504m92003n29710J56578O30209L42747j42083j74831N8942
$$ -152935 131938 253442 -238561 -768271 -611693 18516 361263 219180 44349 103291
36843A03291Q0386o4754m1405J48011K37451J38088l0742j54143j53362k779J68164
$$ 103291 183677 118923 77518 225529 462980 601068 570326 416183 262821 260042 428206
36832D28206K03134J56652J30211j7466l71481n38968j54762L16290J04889n49825
$$ 428206 631340 787992 918203 900737 529256 -9712 -164474 151816 256705 -293120
36822b93120o10022P7628M48399k0493m20790J7661O36007N83087K65120L62217
$$ -293120 -903142 -825514 -377115 -397608 -818398 -800737 -164730 418357 683477 1045694
36812A045694L61208m53796j280313p76140O18494J109815K51404n26943l03143
$$ 1045694 1406902 953106 -327207 -1103347 -484853 624962 876366 349423 46280
36803D6280J41513K1478j67935J26160L78740O1774k61204K4845L66916q509o37570
$$ 46280 187793 209271 41336 167496 546236 608010 346806 371651 738567 730058 92488
36792I2488m96300L10515O99690K65364k62704k49787L5874O7234j24772j21173
$$ 92488 -403812 -93297 606393 871757 609053 359266 395140 462374 337602 216429
36782B16429J95196M21110J43104m12854m92356J89255Q53391O01152k68260o61629
$$ 216429 411625 832735 975839 562985 70629 259884 1113275 1714427 1446167 784538
36772G84538l26259q2267k96417k89836K86054O54869K34999k97210j79698J40775
$$ 784538 458279 376012 79595 -210241 75813 730682 965681 668471 488773 629548
36762F29548n4349l67617o0406M69673L35979k10192k21051J99021P3686o18800
$$ 629548 575199 207582 147176 616849 952828 742636 521585 720606 794292 175492
36752A75492q05693j55775L69625J54449j76978n212K84032J58273j48366k12234
$$ 175492 -630201 -785976 -416351 -261902 -438880 -444092 -160060 -1787 -150153 -362387
36742c62387j36480j18739R495K98136L83894J47303J2720J53220J02337l49237
$$ -362387 -498867 -617606 -608111 -309975 73919 221222 233942 387162 489499 140262
36732A40262o13572k72519J21334n8871m26394k22037M07418O45868K71039j25258
$$ 140262 -473310 -745829 -624495 -683366 -1109760 -1331797 -924379 -278511 -7472 -132730
36722a32730p6704K67117N38532N02084Q9244m49925n70620p1367M71109L93584
$$ -132730 -209434 57683 596215 1098299 1187543 737618 166998 95631 566740 960324
36712I60324j29870m02783k48824r9444j53526j53906k8068o0355k75665k84642
$$ 960324 830454 427671 178847 79403 -74123 -228029 -256097 -316452 -592117 -876759
36702h76759K1039J91955n0582l15869j60536K09652L00368R0712l7902M7729
$$ -876759 -855720 -663765 -714347 -1030216 -1190752 -981100 -680732 -590020 -627922 -580193
36692e80193J23143P9880P4937J78408K40853J91490J51214J47673K6130k08234
$$ -580193 -457050 -377170 -302233 -123825 117028 308518 459732 607405 633535 425301
36682D25301k67190k7739J73419J2370k71228k02250J69773L13050L5882k17107
$$ 425301 158111 130372 303791 316161 44933 -157317 12456 325506 361388 144281
36672A44281n1094L21405M51183K27823j72779n75304p50869m32387K48856O71628
$$ 144281 93187 414592 865775 1093598 920819 345515 -405354 -837741 -588885 82743
36662H2743M84834J27837J14287J83639j58805n89263l73996K69561K80481n49573
$$ 82743 567577 695414 809701 993340 834535 245272 -128724 140837 421318 -128255
36652a28255j033446l01856Q13321R21488J2147o65430l75030L45264O63959M19888
$$ -128255 -1161701 -1463557 -650236 271252 283399 -382031 -757061 -411797 252162 672050
36642F72050n1155m42289n63330l16990J40643M54331M56174L12052J96307N2500
$$ 672050 620895 178606 -384724 -701714 -561071 -106740 349434 661486 857793 910293
36632I10293j98745m26428m38556k46788l9128M8084L6958L4328J13869K35227
$$ 910293 711548 285120 -153436 -400224 -439352 -391268 -354310 -319982 -206113 29114
36622B9114K51682N1117k79372m82648l75778m9303K15545K40122J37963J70819
$$ 29114 280796 331913 52541 -430107 -805885 -855188 -639643 -399521 -261558 -90739
36612i0739M11097O25736N59829K48460q3181l47203n93351o96876l70863L35254
$$ -90739 320358 946094 1505923 1754383 1671202 1323999 730648 33772 -337091 -1837
36602a837Q18224N29717k88675q05429n63400M0459L37986J81921n1254n1918
$$ -1837 816387 1346104 1057429 252000 -311400 -270941 67045 248966 197712 145794
36592A45794J24215K76483K80136P8217k57668m15715j31794K97749K03450m95841
$$ 145794 270009 546492 826628 904845 647177 231462 99668 397417 600867 105026
36582A05026r56650m86436M30662Q02909N18378K64301K43790j7516n11759n22000
$$ 105026 -851624 -1338060 -907398 -104489 413889 678190 921980 904464 392705 -129295
36572a29295N8967K92427k69294o60836l2974Q38130P38032m8715l52092j09257
$$ -129295 -70328 222099 -47195 -708031 -741005 97125 835157 786442 434350 325093
36562C25093j92366n46234k20293O69332P70823k44092r00942k03925P56815N55093
$$ 325093 132727 -413507 -633800 35532 806355 562263 -338679 -542604 214211 769304
36552G69304l94784o80907p6244M49935M10274K32399K15378J32437j23475l11575
$$ 769304 374520 -306387 -382631 67304 477578 709977 925355 1057792 934317 622742
36542F22742k96056j58279N6932K43261J17281l15828n06449j13420L56826K79987
$$ 622742 326686 168407 225339 468600 585881 270053 -236396 -349816 7010 286997
36532B86997j05756j61309P4144Q0587j39252j23398J41418K29375R9890Q2196
$$ 286997 181241 19932 94076 174663 35411 -87987 53431 282806 382696 464892
36522D64892J13178j46125m68007k57831L34412M56359q7328m52121p7708M70957
$$ 464892 578070 431945 -36062 -293893 40519 496878 409550 -42571 -120279 350678
36512C50678M62540M9028k06619k34202k66654k18636R2964M04712L03774o5949
$$ 350678 813218 862246 655627 421425 154771 -63865 29099 433811 737585 671636
36502F71636j37468K40674N41563K69353l47701o03335k02797L20868K65253k95453
$$ 671636 534168 774842 1316405 1585758 1238057 634722 431925 752793 1018046 722593
36492G22593o05826l16062M5593l3794k47113q5609K31314J77448q3006K4909
$$ 722593 116767 -199295 -153702 -187496 -434609 -520218 -288904 -111456 -194462 -169553
36482a69553M09436M25962P003k43654j24811p9821k51683k35987L7418J26820
$$ -169553 239883 665845 672848 429194 304383 224562 -27121 -263108 -225690 -98870
36472i8870J2878K07070O33453N07786k24738n14652P0645M50285k19064j009937
$$ -98870 -85992 121078 754531 1262317 1037579 522927 593572 1043857 824793 -185144
36462a85144o47686M17958P46498J21796l81547k17107J08315J91399J54614n3692
$$ -185144 -832830 -414872 331626 453422 71875 -145232 -36917 154482 309096 255404
36452B55404n95925r59850m06034O90393J089675M71088j54893q3754J73322L2674
$$ 255404 -340521 -1300371 -1706405 -1016012 73663 544751 389858 306104 479426 512100
36442E12100k05976j36337l1835j89309k79919j4918K47300J97763J90851M95460
$$ 512100 306124 169787 137952 -51357 -331276 -346194 -98894 98869 289720 785180
36432G85180O18732J34816m41260m48771j90407l17420n85686k92285L44026L95846
$$ 785180 1403912 1538728 1097468 648697 458290 140870 -444816 -737101 -393075 2771
36422B771k19659n27697l4520N37470M38989m4737k45990j48431j57878l10500
$$ 2771 -216888 -744585 -779105 -241635 197354 152617 -93373 -241804 -399682 -710182
36412g10182l33870k22447j83921j56438J03319M80335N19502R3675l09889j92544
$$ -710182 -1044052 -1266499 -1450420 -1606858 -1503539 -1023204 -503702 -410027 -719916 -912460
36402i12460K81177M95207K17078q8812O6641M67615M89676L4877l06321j55268
$$ -912460 -631283 -136076 81002 -7810 58831 526446 1016122 1050999 744678 589410
36392E89410R1477n9933l96753l94801j03835L191j04284j6740K67954K64127
$$ 589410 680887 620954 224201 -170600 -274435 -271244 -375528 -392268 -124314 139813
36382A39813q9630k11511J18751K93863q5788m10621n706O64449O12597j48389
$$ 139813 50183 -161328 -42577 251286 165498 -245123 -250829 413620 1026217 877828
36372H77828o36167l91758j2082k4632j09483J41662M08858J88088l15756m89719
$$ 877828 241661 -150097 -162179 -186811 -296294 -154632 254226 442314 126558 -363161
36362c63161k61376j27328l09217m45258k02984K49765N44788N51528L46338K1827
$$ -363161 -624537 -751865 -1061082 -1506340 -1709324 -1459559 -914771 -363243 -16905 4922
36352D922k70667l01858j5900L25918M38952L33058J63014p4289m20029o45942
$$ 4922 -265745 -567603 -583503 -257585 181367 514425 677439 603150 183121 -462821
36342d62821m34727J06253M61703L49259K7317j74923k73881l37243j59009L46641
$$ -462821 -897548 -791295 -329592 19667 46984 -127939 -401820 -739063 -898072 -551431
36332e51431P08921M11966k68933n23937j27551K80928J86094j09931r2205J60101
$$ -551431 157490 569456 300523 -223414 -350965 -70037 116057 6126 -86079 74022
36322G4022K13451K32j66496j24303m362O4556Q0091P2226J17035L07634M98477
$$ 74022 287473 287705 121209 -3094 -7456 57100 137191 209417 326452 634086 1132563
36311A132563L04472l41407q53214o15548J80291P16110N09207j37756n87092
$$ 1132563 1437035 1095628 242414 -373134 -192843 523267 1032474 894718 307626
36302C07626m51990J88963Q38212R09062L17560l39706m83744k62978k15313m39405
$$ 307626 -144364 44599 882811 1791873 2109433 1769727 1285983 1023005 807692 368287
36292C68287n90098n38007m53869l00906J34060O61428P57909L52543j2989K7559
$$ 368287 -221811 -759818 -1213687 -1514593 -1380533 -719105 38804 391347 378358 405917
36282D05917K43923L41743L67884L65117J60879k21975m30871l38836k65570l77918
$$ 405917 649840 991583 1359467 1724584 1885463 1663488 1232617 893781 628211 250293
36272B50293l73274p2515J83529R8898j01213j44806j69706k80439j63958L33044
$$ 250293 -122981 -195496 -11967 86931 -14282 -159088 -328794 -609233 -773191 -440147
36262d40147P17559N26648P8490n9172M3240k2487j95266j87220k05487n72664
$$ -440147 277412 804060 882550 823378 866618 844131 648865 461645 256158 -316506
36252c16506q46307k89380P96259J197551M62578m49430n55388j01042P8194j83780
$$ -316506 -1162813 -1452193 -655934 541617 1004195 554765 -623 -101665 -23471 -207251
36242b07251l88647k50788L3789K21971K55980J44666l6641q7943J05316L67123
$$ -207251 -595898 -846686 -812897 -590926 -334946 -190280 -226921 -314864 -209548 157575
36232A57575M45357L34192J79216o258k58921l93995j67204K51916L25201j33862
$$ 157575 602932 937124 1116340 1110082 851161 457166 289962 541878 867079 733217
36222G33217n67176l43616L28138O13710K03104k80942k64201n7777k00277m31460
$$ 733217 166041 -177575 150563 764273 967377 686435 422234 364457 164180 -267280
36212b67280j18776N23784O06617J2432l28751O7064M48318J01075m73545m39682
$$ -267280 -386056 137728 744345 756777 428026 495090 943408 1044483 570938 131256
36202A31256L6214K39882J40395J82095K71132J6631l09393j49083J76423j60077
$$ 131256 167470 407352 547747 729842 1000974 1017605 708212 559129 735552 575475
36192E75475r64053j073519j54547P16480O70967J92298R1410K79431K56850P3576
$$ 575475 -388578 -1462097 -1616644 -900164 -229197 -36899 54511 333942 590792 664368
36182F64368M4493N6230j33049l22017k26244m2504o7826r8500K05235O42409
$$ 664368 708861 765091 632042 310025 83781 41277 -26549 -125049 80186 722595
36172G22595P27070L94430n1043m48533p37981o67712j25588M15787L80476o8636
$$ 722595 1449665 1844095 1793052 1344519 606538 -61174 -186762 229025 609501 540865
36162E40865k34111R6411L95858K36962j31810k46360p4756N6057l5962j96585
$$ 540865 306754 403165 799023 1035985 904175 657815 583059 639116 603154 406569
36152D06569j92472k6448M8829j45394m22636m16409p5013K54728L31876L34280
$$ 406569 214097 187649 236478 91084 -331552 -747961 -822974 -568246 -236370 97910
36142I7910M61428M91087P8613o23258j005164o92211M9736O46196P66428M84959
$$ 97910 559338 1050425 1129038 505780 -499384 -1191595 -1141859 -495663 270765 755724
36132G55724N6722l13176m88546l52284P3701M59723L80542j33169m89409k52422
$$ 755724 812446 499270 10724 -341560 -267859 191864 572406 439237 -50172 -302594
36122c02594K47901L89046J41842o861J01860J25343r7089l00536l48692m26872
$$ -302594 -54693 334353 476195 469334 571194 696537 599448 298912 -49780 -476652
36112d76652n11367k78078K04792L40132p8709m26134j66166L55690N45877M42737
$$ -476652 -988019 -1266097 -1061305 -721173 -799882 -1226016 -1392182 -1036492 -490615 -47878
36102d7878L82692K88509l6705l06787j57295J42140P6491k50403l23433q7033
$$ -47878 334814 623323 586618 279831 122536 264676 341167 90764 -232669 -319702
36092c19702P4674N9551O6306M8871j39809k06824K02692O88876N14438j69644
$$ -319702 -245028 -185477 -119171 -70300 -210109 -416933 -214241 474635 989073 819429
36082H19429m40009o5545J27304l22330o96306k85287M30945N48109R1994k07408
$$ 819429 379420 313875 441179 118849 -577457 -862744 -431799 116310 208304 896
36072H96j06692J7540K4900J78373M45798L69130j72948o31033m85907R5346N38202
$$ 896 -105796 -88256 -63356 115017 560815 929945 756997 125964 -359943 -264597 273605
36061B73605M96619K4058n76255q46619m38853L98732Q59819M90043j55817k37664
$$ 273605 770224 794282 218027 -628592 -1067445 -668713 191106 681149 525332 287668
36051B87668J60185J92742l61493o72001j47710N86806O23303R5635k11600j43245
$$ 287668 447853 640595 279102 -392899 -540609 46197 669500 765135 553535 410290
36041D10290j26431j26468K47117O43985K09585q32907j087887m1579R58456O27638
$$ 410290 283859 157391 404508 1048493 1258078 425171 -662716 -704295 254161 881799
36031H81799l76040o04156m3128J51444l15293n43223p8958M06729L14239o5614
$$ 881799 505759 -98397 -141525 9919 -305374 -848597 -927555 -520826 -206587 -272201
36021b72201k52698k34983r7819K41456N92047M77099p9907l83983n4661L94373
$$ -272201 -524899 -759882 -857701 -616245 -24198 452901 372994 -10989 -65650 328723
36011C28723L55842j9826k09560j05969L5105Q1976K4707k27898o21653p45200
$$ 328723 684565 664739 455179 349210 384315 466291 490998 263100 -358553 -1103753
36001a103753k73902M76132Q08692M66923p0546j83713J42966L08488j17737p24838
$$ -1103753 -1377655 -901523 -92831 374092 303546 119833 262799 571287 453550 -271288
35991b71288o84272R0633O61445K89821m77936n47679J70927O92664L84754k86993
$$ -271288 -955560 -864927 -203482 86339 -391597 -939276 -768349 -75685 309069 22076
35981B2076n71728l24118J42733N15878N31493O6851n36901o55578j27396N22714
$$ 22076 -549652 -873770 -731037 -215159 316334 383185 -153716 -809294 -936690 -413976
35971d13976P39355M51149j18443o76285q22122l27580M10457P08301M84037K55157
$$ -413976 325379 776528 658085 -18200 -840322 -1167902 -757445 -49144 434893 690050
35961F90050K15025L0577l22334l61848j5227J18770j86597l29451M0574L39001
$$ 690050 905075 935652 613318 251470 236243 355013 168416 -161035 -120461 218540
35951B18540O7584k92246j46187J92085J64664k3556N2606J24826j62011l20794
$$ 218540 286124 -6122 -152309 39776 204440 180884 233490 358316 196305 -124489
35941a24489J82432O93935K10946q31005r85434P226Q15588N52322p4719j35328
$$ -124489 57943 751878 962824 131819 -853615 -846389 -30801 521521 446802 311474
35931C11474J38334O8973k28482j88503J40188J86709k02276n58275m84375j09093
$$ 311474 449808 518781 290299 101796 241984 428693 226417 -331858 -816233 -925326
35921i25326J87240K29515J61331K01868L52669M15821L09670J72410O0038j60319
$$ -925326 -738086 -508571 -347240 -145372 207297 623118 932788 1105198 1165236 1004917
35911A004917m22215l63338M0962K08648j59987m06371J21841Q50108P16399j05088
$$ 1004917 582702 219364 260326 468974 308987 -97384 24457 874565 1590964 1485876
35901A485876l99951J31189L88314k77873r49736o00515L06189N95661R4495l90144
$$ 1485876 1085925 1217114 1605428 1327555 377819 -222696 83493 679154 773649 383505
35891C83505l95860j98980p1513N0904J67567J03928j23625k59834j70353L3948
$$ 383505 -12355 -211335 -282848 -231944 -64377 39551 -84074 -343908 -514261 -480313
35881d80313J92922K02727M1904j29096p8721J35219J90337L7110K4543K65949
$$ -480313 -287391 -84664 -42760 -171856 -250577 -115358 74979 112089 136632 402581
35871D02581L52819N4168j91448K2085L16792R9259m46036o13063k39434J47655
$$ 402581 755400 809568 618120 640205 956997 1056256 610220 -2843 -242277 -94622
35861i4622J72960o788j50312k13418j60382L2843J69326M2316j68195j18049
$$ -94622 78338 71550 -78762 -292180 -452562 -419719 -250393 -208077 -376272 -494321
35851d94321J37465K26034M2892j70012k46490j68284J51024O59884Q95990M98325
$$ -494321 -356856 -130822 -87930 -257942 -504432 -672716 -521692 138192 1034182 1532507
35841A532507j29232l06735j19884k18749o16097n81375R9735O58097M92398l525
$$ 1532507 1403275 1096540 976656 757907 141810 -439565 -339830 318267 810665 807140
35831H07140k06242j37636o8979Q5490L87035M48047K2771m36009m28902k01643
$$ 807140 600898 463262 394283 479773 866808 1314855 1337626 901617 472715 271072
35821B71072k50671m22370k09691L18040N79293L28474j53882n69601p49006m72415
$$ 271072 20401 -401969 -611660 -293620 285673 614147 460265 -109336 -858342 -1330757
35811a330757K56996Q88673Q45427K73957k20662m00942m10643k21520K32858
$$ -1330757 -1073761 -185088 660339 934296 713634 312692 -97951 -319471 -86613
35802h6613N54644K96023k09074k29511J85945K83352j05310l04508l8688M6172
$$ -86613 468031 764054 554980 325469 511414 794766 689456 384948 346260 392432
35792C92432m67301r66564p39978l3189M15721L64961P4049j88491j81005K59156
$$ 392432 -74869 -1041433 -1781411 -1814600 -1398879 -1033918 -959869 -1148360 -1329365 -1070209
35782a070209P66354O23205j54635n78471j04515M47363J71285m49632l80325
$$ -1070209 -303855 319350 164715 -413756 -518271 -70908 100377 -349255 -729580
35773g29580K15709L10931j80370k71360L66206Q16228M05702l16135n84963m86454
$$ -729580 -513871 -202940 -383310 -654670 -288464 527764 933466 617331 32368 -454086
35763d54086m17884k59645K11320O43525N68880J78526p009J5762j63089n61499
$$ -454086 -871970 -1131615 -920295 -276770 292110 470636 463627 479389 316300 -245199
35753b45199o94081k85571L48108P08206O00489J70856k87074m93460l45936j6406
$$ -245199 -939280 -1224851 -876743 -168537 431952 602808 315734 -177726 -523662 -540068
35743e40068J98374J63602Q522m9420N3795J69760J30815j4469n7961N1185J28492
$$ -540068 -341694 -178092 -169570 -218990 -165195 4565 135380 120911 62950 114135 242627
35732B42627R9059J73512M44723N62552J89292l95625n99474l33820n1760j9281
$$ 242627 341686 515198 959921 1522473 1711765 1316140 716666 382846 331086 311805
35722C11805p8640j45189l42765n23857k71961L65898P14631L74457k04126m10377
$$ 311805 233165 87976 -254789 -778646 -1050607 -684709 29922 404379 200253 -210124
35712b10124k69737j34248j7448K46137M92296M09629N9733k10346k30444n4995
$$ -210124 -479861 -614109 -631557 -385420 106876 516505 576238 365892 135448 80453
35702H0453K34193M44384K65897k61898n56480k09531L57891M50412P5561j94066
$$ 80453 314646 759030 1024927 763029 206549 -2982 354909 805321 880882 686816
35692F86816j58248j48355k92345k72712N6198L55206L16401Q6366l1795J4138
$$ 686816 528568 380213 87868 -184844 -128646 226560 542961 629327 597532 611670
35682F11670R6516J38465J14654o793k13552m32292n63209m67945p0149L96248
$$ 611670 708186 846651 961305 954512 740960 308668 -254541 -722486 -792635 -396387
35672c96387M80414J02763k24856j08930J08157p2064m05674k65318K60397M21024
$$ -396387 84027 186790 -38066 -146996 -38839 -110903 -516577 -781895 -521498 -100474
35662a00474K418l37325j63815O4229j58754n03865l35122K97030P55877O86440
$$ -100474 -98056 -435381 -599196 -534967 -693721 -1197586 -1532708 -1235678 -479801 206639
35652B06639L11156q775j19999n4010N3050N0260n9138j20115p0356j1344J4838
$$ 206639 517795 509020 389021 335011 388061 438321 379183 259068 188712 177368 192206
35641A92206O8335P6739j10632l39828k24209K28470M85567K37092j43612j96468
$$ 192206 260541 337280 226648 -113180 -337389 -108919 376648 613740 470128 273660
35631B73660k2670L6155k4623n6771j68120m41034n30138j00742N16468O60710
$$ 273660 250990 287145 262522 205751 37631 -403403 -933541 -1034283 -517815 142895
35621A42895K32779k37033l28033q6139K53928M45684K37349l27183p16836m99939
$$ 142895 375674 138641 -189392 -275531 -21603 424081 661430 334247 -382589 -882528
35611h82528M145J72606J2331K2116K60193K98105P6749l265P8937j01512m61145
$$ -882528 -878383 -705777 -693446 -671330 -411137 -113032 -36283 -39548 39389 -62123 -523268
35600e23268l24520L50373O22535J1433o12546l44397L41148M27635k4594j71144
$$ -523268 -847788 -497415 125120 136553 -475993 -820390 -479242 -51607 -76201 -247345
35590b47345J34900K98513K00873L02541N51367L26677l61335o93201l70738j10791
$$ -247345 -112445 186068 386941 689482 1240849 1567526 1206191 512990 142252 31461
35580C1461l62500m99382O2065P57643O97222J5014m28493l11636k8577J45468
$$ 31461 -331039 -830421 -768356 -10713 686509 701523 273030 -38606 -67183 78285
35570G8285K91376L47338Q4189l65129n09801j49928L67668O02000M21329k8060
$$ 78285 369661 716999 801188 436059 -73742 -223670 143998 745998 1167327 1139267
35560A139267m52257n42668k62769M4491O9051p5056j23030j13774k16085k94768
$$ 1139267 687010 144342 -118427 -73936 -4885 -79941 -202971 -316745 -532830 -827598
35550h27598q4308L17426N48386M94170L22841J27586p3573j35307j2801n493
$$ -827598 -911906 -594480 -46094 448076 770917 898503 824930 689623 676822 671329
35540F71329k83633m06553N4825O21358M32309l92653q07074l69698J81404J73258
$$ 671329 387696 -18857 35968 657326 1089635 696982 -110092 -479790 -298386 -125128
35530a25128o0736M6714L45245L86052K09173R9602j420k70409n33601n24929
$$ -125128 -185864 -139150 206095 592147 801320 900922 899502 629093 95492 -429437
35520d29437l21549j29725M1295J77300J49022R7588L82712Q03389N74585l99120
$$ -429437 -750986 -880711 -839416 -662116 -513094 -415506 -32794 770595 1345180 946060
35510I46060j010767m77268L68411L17228l16462k90489M59982P52528J76091
$$ 946060 -64707 -541975 -173564 143664 -172798 -463287 -3305 749223 925314
35501I25314k60642J43265O71686M38542k49023n34612l18671j59009l11895n33633
$$ 925314 664672 807937 1479623 1918165 1669142 1134530 815859 656850 344955 -188678
35491a88678n71010l60311M3943M01792M18138J97358K05209N15110N59142J4956
$$ -188678 -759688 -1119999 -1076056 -674264 -256126 -58768 146441 661551 1220693 1235649
35481A235649n37124l91449K06237M02716k0753m04513k21123K51729M48017K66537
$$ 1235649 698525 307076 513313 916029 895276 490763 269640 521369 969386 1235923
35471A235923K1697j03810k23839m03937m34402j14042L53389M92898J44676l07655
$$ 1235923 1257620 1153810 929971 526034 91632 -22410 330979 823877 968553 660898
35461F60898m34085k59543o1551Q1402K14435K06321m2610k55445j34005P2336
$$ 660898 226813 -32730 -94281 -12879 201556 407877 365267 109822 -24183 48153
35451D8153o5614l16486n6402N64296N86625k89694j028759o45970L68169P56855
$$ 48153 -17461 -333947 -390349 173947 760572 470878 -557881 -1203851 -835682 -78827
35441g8827K12569m10294m08791j705K39439J27873j09383j46342J90683P06504
$$ -78827 133742 -276552 -685343 -687048 -447609 -319736 -429119 -575461 -384778 321726
35431C21726Q80274M14756l01686o01252l66520j01554j68097l34911k13676J71037
$$ 321726 1202000 1616756 1315070 713818 347298 245744 77647 -257264 -470940 -299903
35421b99903M62327M46830K32444k940k52280n67536p83333n73721P1782O12011
$$ -299903 162424 609254 841698 838758 586478 18942 -764391 -1338112 -1266330 -654319
35411f54319N05232o0323l52159m2885M23220N18538K52820r2261l98761n75106
$$ -654319 -149087 -209410 -561569 -604454 -181234 337304 590124 497863 99102 -476004
35401d76004m06078N7533L18931R3187j79789J7662M24039L96756m3600k60446
$$ -476004 -882082 -824549 -505618 -412431 -592220 -574558 -150519 246237 202637 -57809
35391e7809l3133J68643M0583r6141O2562K65589J56028j60380l47308l17091
$$ -57809 -90942 77701 118284 22143 84705 350294 506322 345942 -1366 -318457
35381c18457j50849J63288N38339N76045Q350p28874q31760j41564N60989N12247
$$ -318457 -469306 -306018 232321 808366 816716 87842 -743918 -885482 -324493 187754
35371A87754o1244k94714J11269N27930L73845m8485j22629M9240j29186o10722
$$ 187754 126510 -168204 -56935 470995 844840 796355 673726 722966 593780 -16942
35361a6942o23547O7333O33851M00833j30193j66764P0949j42371o21015m71720
$$ -16942 -640489 -573156 60695 461528 331335 164571 235520 93149 -527866 -999586
35351i99586L49018Q07672L64834k51787k96752j05665k77785n15481j47877O36511
$$ -999586 -650568 157104 521938 270151 -26601 -132266 -410051 -925532 -1073409 -436898
35341d36898R64683N06755k17115o62223p15164l90539K18108O31961L30842m13911
$$ -436898 527785 1034540 817425 155202 -559962 -950501 -732393 -100432 230410 -183501
35331a83501o87017j70601L77177K57138j57633j15603K73692K55134l07071o77587
$$ -183501 -870518 -1041119 -663942 -406804 -564437 -680040 -406348 -151214 -458285 -1135872
35321a135872l65331J85834L10512J8409k00515j18528R5775K86108M48538N20426
$$ -1135872 -1501203 -1315369 -1004857 -986448 -1186963 -1305491 -1209716 -923608 -475070 45356
35311D5356L58103k6878l93976m78786k11811K11438M43912L04349J6968o1375
$$ 45356 403459 376581 -17395 -496181 -707992 -496554 -52642 251707 268675 207300
35301B07300L6553k2547j98696j9750N26445O48667j20082r62578p68995K16511
$$ 207300 243853 221306 22610 2860 529305 1177972 1057890 95312 -673683 -457172
35291d57172P07698K64508j78125J10278N57692K98898m90698r31049o24815O0202
$$ -457172 250526 515034 336909 447187 1004879 1303777 813079 -117970 -742785 -682583
35281f82583N53526N02511k6490m43831j53041N53252O82868k6439n85203k12037
$$ -682583 -129057 373454 346964 -96867 -249908 303344 986212 959773 374570 162533
35271A62533M34764K96794m36294p18806k89355J38583J41519K4474K3047j0755
$$ 162533 597297 894091 457797 -261009 -550364 -411781 -270262 -245788 -222741 -233496
35261b33496p4148J9794J09576j02768l34458o5001M29687L50239k59724m81349
$$ -233496 -307644 -287850 -178274 -281042 -615500 -680501 -250814 99425 -160299 -641648
35251f41648n2646J97461j67303m23320j8234M13335J95397j73466M5181M46685
$$ -641648 -694294 -496833 -664136 -1087456 -1105690 -692355 -496958 -670424 -625243 -178558
35241a78558J86664m64548n04076J23255M44236O0007k94326j8613M83346N82765
$$ -178558 8106 -456442 -960518 -837263 -393027 -333020 -627346 -645959 -162613 420152
35231D20152L21299R4401O496l6618j5399N4855m452k20364l31356k05974o7996
$$ 420152 741451 835852 842348 805730 790331 845186 840734 620370 289014 83040 15044
35220A5044o7899r581J90354J74273k79285o75340l73376M13275P90774L74766
$$ 15044 -52855 -62436 127918 302191 22906 -652434 -1025810 -612535 178239 553005
35210E53005k55870m31660j89334O8155K29112L68852L27651q2383n84895o51328
$$ 553005 297135 -134525 -323859 -255704 -26592 342260 669911 587528 2633 -648695
35200f48695k10931K59567L93115K95988J84052M4811j78131l74220m12602k72316
$$ -648695 -859626 -600059 -206944 89044 273096 317907 139776 -234444 -647046 -919362
35190i19362N2833M98007P32222M10747k61119o41464m86771j99458n1383K27712
$$ -919362 -866529 -368522 363700 774447 513328 -128136 -614907 -814365 -865748 -638036
35180f38036P11445P88953O0462p93156q24340j68466K45829J15854P81J94266
$$ -638036 73409 862362 922824 129668 -694672 -863138 -617309 -501455 -500674 -306408
35170c06408K85858J8690k29053j31374O4186L9322r3376j11276o8607p3656m6113
$$ -306408 -20550 -1860 -230913 -362287 -298101 -258779 -352155 -463431 -532038 -605694 -651807
35159f51807O4029J37091J34618J74262K43327J76154p063r8128p7350j08604
$$ -651807 -587778 -450687 -316069 -141807 101520 277674 270611 172483 95133 -13471
35149a3471j65620r7198j3309r3730j05185K44866N59445J80180o07132p49687
$$ -13471 -179091 -276289 -289598 -383328 -488513 -243647 315798 495978 -111154 -860841
35139h60841k3917N47355K78129j78558k6579L85793K90470j86447l24157L3437
$$ -860841 -884758 -337403 -59274 -237832 -264411 121382 411852 225405 -98752 -65315
35129f5315M14544M92688K71560j77137n92109n12622O4142M35402J48049k80723
$$ -65315 349229 841917 1113477 936340 344231 -168391 -104249 331153 479202 198479
35119A98479j96275J67898K01119m6472j20862k9186m3580l6164J71382J97250
$$ 198479 2204 170102 371221 324749 203887 174701 131121 94957 266339 463589
35109D63589k77207o67527k60715M95351N68647K98j91749K63145M67647j19790
$$ 463589 186382 -481145 -741860 -246509 322138 322436 130687 393832 861479 741689
35099G41689q19576p95811j63635L73526L86972n6667n35245n06591J12601O41463
$$ 741689 -77887 -873698 -1037333 -663807 -276835 -333502 -868747 -1375338 -1262737 -621274
35089f21274M61807l2117m1145L14580K48597k43911l45501R7167K67221j43838
$$ -621274 -159467 -191584 -232729 81851 330448 86537 -258964 -161797 105424 -38414
35079c8414l48338J48900O66010M85554n4178k84283k12034j46547n9588M9760
$$ -38414 -386752 -237852 428158 913712 859534 575251 363217 216670 157082 206842
35069B06842j34902n67729o03194m9402L24353J3964l11702N2857O09626N31519
$$ 206842 71940 -495789 -1098983 -1148385 -824032 -810068 -1121770 -1068913 -459287 72232
35059G2232P9386M4400L18332J91845k85959m21858j44236k4607j37105J318L52721
$$ 72232 151618 196018 514350 706195 420236 -1622 -145858 -170465 -307570 -306252 46469
35048D6469L06651j59965k95620J90756O21853M29069m9952k49691j94482k17489
$$ 46469 353120 193155 -102465 88291 710144 1139213 1089261 839570 645088 427599
35038D27599l70805m91047m75678k50879J71345M71408K97242j27906j89591J79645
$$ 427599 56794 -434253 -909931 -1160810 -989465 -518057 -220815 -348721 -538312 -358667
35028c58667L34527n7912m37240k14972K88868L32634j25539l77653J6725O25816
$$ -358667 -24140 -82052 -519292 -734264 -445396 -112762 -238301 -615954 -599229 26587
35018B6587O96647R0221n21233m32919K12715N68561J92256l47072l02416J64736
$$ 26587 723234 813455 292222 -140697 72018 640579 832835 485763 183347 348083
35008C48083L02874m6630l09753j87251k7795o9516q4014k4167k40209o64983
$$ 348083 650957 604327 294574 107323 79528 10012 -74002 -98169 -338378 -1003361
34998a003361n75296K62189R26151N69295k61361m01843K26637O35338K98699
$$ -1003361 -1578657 -1316468 -390317 178978 -82383 -484226 -257589 377749 676448
34989F76448k77112n28335m97836l50483K309M85142O70378L50582j37712m14779
$$ 676448 399336 -128999 -626835 -977318 -975009 -489867 180511 531093 393381 -21398
34979b1398m70248l76565o0166L70649N13110K16815j25880j57381o6282j74200
$$ -21398 -491646 -868211 -928377 -557728 -44618 172197 46317 -111064 -177346 -351546
34969c51546l54307k74719L6838K83589L58430L36877K04738k6962j20197P5071
$$ -351546 -705853 -980572 -943734 -660145 -301715 35162 239900 212938 92741 167812
34959A67812K64677Q4195l11032m58866k66267k1454J43219K90996K84873n4891
$$ 167812 432489 516684 205652 -253214 -519481 -540935 -397716 -106720 178153 123262
34949A23262m17968k78053K21155L45771o4179k43754K93094Q86287O65714j58585
$$ 123262 -294706 -572759 -351604 -5833 -70012 -313766 -20672 865615 1531329 1372744
34939A372744o45639m44625m3690J47298K36298L32259K35952j37756m89142n41289
$$ 1372744 727105 282480 238790 386088 622386 954645 1190597 1052841 563699 22410
34929B2410m16070l78643m22916l28082j4349L36379N00985M58115L60256K77488
$$ 22410 -393660 -772303 -1195219 -1523301 -1537650 -1201271 -700286 -242171 118085 395573
34919C95573R2446k17260l35824J9295N13741M47161k62547q25311o03408O0754
$$ 395573 488019 270759 -65065 -45770 467971 915132 652585 -172726 -776134 -715380
34909g15380M39085M12226L49585L49888K24643K3960l9734o0129k55262m55202
$$ -715380 -276295 135931 485516 835404 1060047 1084007 1044273 984144 728882 273680
34899B73680l55687j27560j29696j77467J45828N62725L82679k60585m30133J32630
$$ 273680 -82007 -209567 -339263 -516730 -370902 191823 574502 313917 -116216 16414
34889A6414N30101J33627m36501l69720P9907J55338j61476k76273r065K37406
$$ 16414 546515 680142 243641 -126079 -46172 109166 -52310 -328583 -337648 -100242
34879a00242J70348r3017l02638k65119O2623L82320K55824k31244m24120m1644
$$ -100242 70106 -22911 -325549 -590668 -528045 -145725 110099 -121145 -545265 -586909
34869e86909L40981J79000k15790k81858j09335p8821q4778J34432L11736J07178
$$ -586909 -245928 -66928 -282718 -564576 -673911 -752732 -837510 -703078 -391342 -284164
34859b84164j16580J46499N18800K47272m55188o22023m7449M58269M11483K12318
$$ -284164 -400744 -254245 264555 511827 56639 -565384 -612833 -154564 256919 469237
34849D69237J57895o2729n26652o92368l33217l085o0563n2399L40460N52344
$$ 469237 627132 564403 37751 -654617 -987834 -990919 -1051482 -1103881 -763421 -211077
34839b11077Q0129n06894l77950K45303M97944K37609N3015R9984q7983n77198
$$ -211077 -130948 -637842 -1015792 -770489 -272545 -34936 18079 118063 30080 -547118
34829e47118p28346j92297M88817O49102L63241J60322K38062L58464L21083J80477
$$ -547118 -1275464 -1467761 -978944 -329842 33399 193721 431783 790247 1111330 1291807
34819A291807M5477q6021k53914m09952m17509j98206J08345K17381K7262k12228
$$ 1291807 1337284 1251263 997349 587397 169888 -28318 80027 297408 324670 112442
34809A12442k06124p517R0096q904j21750j37667j62845k40794k12971k3235Q1912
$$ 112442 -93682 -101199 -11103 -20007 -141757 -279424 -442269 -683063 -896034 -919269 -837357
34798h37357j01470l55173k85937J26907N14501O30501N85060N15617L34927j8833
$$ -837357 -938827 -1294000 -1579937 -1453030 -938529 -308028 277032 792649 1127576 1108743
34788A108743l23716l18934q3193O2194m0130k58341l75895k52164J09475M66192
$$ 1108743 785027 466093 382900 445094 404964 146623 -229272 -481436 -371961 94231
34778I4231M64096J04147j22197R6608L28580K5293m89189m04121K18699L84019
$$ 94231 558327 662474 540277 636885 965465 990758 501569 97448 316147 700166
34768G00166k60907p38149k26934O05621O37753J4925k33420Q2284J56398l12379
$$ 700166 439259 -298890 -525824 79797 717550 732475 499055 581339 737737 425358
34758D25358o30848l37160R8882J73424Q0555J05121N5457j86290k34377J03844
$$ 425358 -205490 -542650 -443768 -270344 -189789 -84668 -29211 -215501 -449878 -346034
34748c46034L07565m1088m48561k44433K91283L51974q6488k48675J55700M55969
$$ -346034 -38469 -79557 -528118 -772551 -481268 -129294 -215782 -464457 -308757 147212
34738A47212Q1491n36326n48306J57432P91502N90124l24937j060868q87394j4549
$$ 147212 228703 -307623 -855929 -698497 93005 683129 358192 -702676 -1590070 -1604619
34728a604619O56544N65110O3040j60608M2357K69909K50210J19036K8974j15236
$$ -1604619 -948075 -382965 -319925 -480533 -438176 -168267 81943 200979 229953 114717
34718A14717l71900m95008k08894L39578O29805L39471k34637m65387j28590L07849
$$ 114717 -257183 -752191 -961085 -621507 8298 347769 113132 -352255 -480845 -172996
34708a72996K78433j26268k89383O1846M75428M22877K1102j76550N8423L76488
$$ -172996 105437 -20831 -310214 -248368 227060 649937 671039 494489 552912 929400
34698I29400L28902j10864n42910n79243k68934m3140j60377l33455j47087K71885
$$ 929400 1258302 1147438 604528 25285 -243649 -286789 -447166 -780621 -927708 -655823
34688f55823M08092J63913n269J18076J72847m5699j19815K34822M91854O6305
$$ -655823 -247731 -83818 -89087 28989 201836 156137 36322 271144 762998 829303
$$ [...]
##END NTUPLES=NMR SPECTRUM
##END=
