##TITLE=31Pdec_MTBDP-3-2907
 CDCl3, 124 sc
 30.07.2021
##JCAMPDX= 6.0         $$ Bruker NMR JCAMP-DX V2.0
##DATA TYPE= NMR SPECTRUM
##DATA CLASS= NTUPLES
##ORIGIN= UXNMR, Bruker Analytische Messtechnik GmbH
##OWNER= root
$$ XWIN-NMR		Version 3.5
$$ Fri Jul 30 08:43:27 2021 Russian Standard Time (UT+4h)  she@DPX200
##.OBSERVE FREQUENCY= 81.013821
##.OBSERVE NUCLEUS= ^31P
##.ACQUISITION MODE= SIMULTANEOUS
##.ACQUISITION SCHEME= undefined
##.AVERAGES= 124
##.DIGITISER RES= 16
##SPECTROMETER/DATA SYSTEM= spect
##.PULSE SEQUENCE= zgpg30
##.SOLVENT NAME= CDCl3
##.SHIFT REFERENCE= (INTERNAL, CDCl3, 0, 248.564)
##AUDIT TRAIL= $$ (NUMBER, WHEN, WHO, WHERE, WHAT)
$$ ##TITLE= Audit trail, XWIN-NMR		Version 3.5
$$ ##JCAMPDX= 5.01
$$ ##ORIGIN= Bruker BioSpin GmbH
$$ ##OWNER= she
$$ F:/spectra/data/she/nmr/P31/1/pdata/1/auditp.txt
$$ ##AUDIT TRAIL=  $$ (NUMBER, WHEN, WHO, WHERE, WHAT)
(   1,<2021-07-30 08:42:10.35 +0400>,<she>,<DPX200>,
      <continue with go, POWCHK disabled, PULCHK disabled
       configuration hash MD5:
       00 E9 B6 7A A2 85 ED C7 34 08 36 98 17 FE 4E 26
       data hash MD5: 32K
       3C 71 D2 4B B7 5E 9D 7A C0 C0 3A D5 9B 4A BD 91>)
(   2,<2021-07-30 08:42:22.35 +0400>,<she>,<DPX200>,
      <Start of raw data processing
       efp BC_mod = 2 LB = 1 FT_mod = 6 PKNL = 1 PHC0 = -7406.16 PHC1 = 149.0744 SI = 64K 
       data hash MD5: 64K
       84 50 32 90 A8 F6 91 F9 DF 3E D0 9C A3 58 A8 14>)
(   3,<2021-07-30 08:42:46.59 +0400>,<she>,<DPX200>,
      <pk PHC0 = -41.82703 PHC1 = 120.8 
       data hash MD5: 64K
       80 2F E7 62 36 42 D4 B5 EC D5 59 69 91 CB 04 E7>)
(   4,<2021-07-30 08:42:50.51 +0400>,<she>,<DPX200>,
      <abs ABSG = 5 
       data hash MD5: 64K
       22 13 A8 01 C6 3B D1 40 26 AC E3 B2 EE 6A 1D 3F>)
$$ ##END=
$$ 
$$ hash MD5
$$ FE BF 45 04 58 61 3C 3B 46 43 57 34 B4 4A 11 79
##$RELAX= 
##$RELAX= 
##$RELAX= 
##$RELAX= 
##$RELAX= 
##$RELAX= 
##$RELAX= 
##$RELAX= 
$$ Bruker specific parameters
$$ --------------------------
##$DU= <F:/spectra>
##$EXPNO= 1
##$NAME= <P31>
##$PROCNO= 1
##$TYPE= <nmr>
##$USER= <she>
##$AMP= (0..31)
100 100 100 100 100 100 100 100 100 100 100 100 100 100 100 100 100 100 
100 100 100 100 100 100 100 100 100 100 100 100 100 100 
##$AQSEQ= 0
##$AQ_mod= 1
##$AUNM= <au_zg>
##$AUTOPOS= <>
##$BF1= 81.014009
##$BF2= 200.13
##$BF3= 200.13
##$BF4= 200.13
##$BF5= 200.13
##$BF6= 200.13
##$BF7= 200.13
##$BF8= 200.13
##$BYTORDA= 1
##$CFDGTYP= 0
##$CFRGTYP= 5
##$CHEMSTR= <none>
##$CNST= (0..31)
1 1 145 1 1 1 1 1 1 1 1 1 1 1 1 1 1 1 1 1 1 1 1 1 1 1 1 1 1 1 1 1 
##$CPDPRG= <waltz16>
##$CPDPRG1= <>
##$CPDPRG2= <waltz16>
##$CPDPRG3= <>
##$CPDPRG4= <mlev>
##$CPDPRG5= <mlev>
##$CPDPRG6= <mlev>
##$CPDPRG7= <mlev>
##$CPDPRG8= <mlev>
##$CPDPRGB= <>
##$CPDPRGT= <>
##$D= (0..31)
0 1 0 0 0 0 0 0 0 0 0 0.03 2e-05 3e-06 0 0 0 0 0 0 0 0 0 0 0 0 0 0 0 0 
0 0 
##$DATE= 1627619962
##$DBL= (0..7)
120 120 120 11 120 120 24 19 
##$DBP= (0..7)
150 150 150 150 150 150 150 150 
##$DBP07= 0
##$DBPNAM0= <>
##$DBPNAM1= <>
$$ [...]
##$SUBNAM3= <"">
##$SUBNAM4= <"">
##$SUBNAM5= <"">
##$SUBNAM6= <"">
##$SUBNAM7= <"">
##$SUBNAM8= <"">
##$SUBNAM9= <"">
##$SW= 501.771253377433
##$SWIBOX= (0..15)
0 1 3 0 0 0 0 0 0 0 0 0 0 0 0 0 
##$SW_h= 40650.406504065
##$TD= 32768
##$TD0= 1
##$TE= 0
##$TE2= 300
##$TE3= 300
##$TEG= 300
##$TL= (0..7)
0 120 53 12 22 120 120 120 
##$TP= (0..7)
150 150 150 150 150 150 150 150 
##$TP07= 0
##$TPNAME0= <>
##$TPNAME1= <>
##$TPNAME2= <>
##$TPNAME3= <>
##$TPNAME4= <>
##$TPNAME5= <>
##$TPNAME6= <>
##$TPNAME7= <>
##$TPOAL= (0..7)
0.5 0.5 0.5 0.5 0.5 0.5 0.5 0.5 
##$TPOFFS= (0..7)
0 0 0 0 0 0 0 0 
##$TUNHIN= 0
##$TUNHOUT= 0
##$TUNXOUT= 0
##$USERA1= <user>
##$USERA2= <user>
##$USERA3= <user>
##$USERA4= <user>
##$USERA5= <user>
##$V9= 5
##$VALIST= <valist>
##$VCLIST= <CCCCCCCCCCCCCCC>
##$VD= 0
##$VDLIST= <DDDDDDDDDDDDDDD>
##$VPLIST= <PPPPPPPPPPPPPPP>
##$VTLIST= <TTTTTTTTTTTTTTT>
##$WBST= 1024
##$WBSW= 4
##$XGAIN= (0..3)
0 0 0 0 
##$XL= 0
##$YL= 0
##$YMAX_a= 2231
##$YMIN_a= -6574
##$ZGOPTNS= <>
##$ZL1= 120
##$ZL2= 120
##$ZL3= 120
##$ZL4= 120
##$ABSF1= 248.5645
##$ABSF2= -253.2056
##$ABSG= 5
##$ABSL= 3
##$ALPHA= 0
##$AQORDER= 0
##$ASSFAC= 0
##$ASSFACI= 0
##$ASSFACX= 0
##$ASSWID= 0
##$AUNMP= <proc_1d>
##$AZFE= 0.1
##$AZFW= 0.5
##$BCFW= 0
##$BC_mod= 2
##$BYTORDP= 0
##$COROFFS= 0
##$CY= -3
##$DATMOD= 1
##$DC= 0
##$DFILT= <>
##$DTYPP= 0
##$F1P= 0
##$F2P= 0
##$FCOR= 1
##$FTSIZE= 65536
##$FT_mod= 6
##$GAMMA= 0
##$GB= 0
##$INTBC= 1
##$INTSCL= 5.30512e-09
##$ISEN= 30
##$LB= 1
##$LEV0= 0
##$LPBIN= 0
##$MAXI= 10000
##$MC2= 0
##$MEAN= 0
##$ME_mod= 0
##$MI= 50
##$NCOEF= 0
##$NC_proc= -9
##$NLEV= 6
##$NOISF1= 182.463
##$NOISF2= 159.3651
##$NSP= 0
##$NTH_PI= 0
##$NZP= 0
##$OFFSET= 248.5645
##$PC= 4
##$PHC0= -7447.987
##$PHC1= 269.8744
##$PH_mod= 1
##$PKNL= yes
##$PPARMOD= 0
##$PSCAL= 0
##$PSIGN= 0
##$REVERSE= no
##$SF= 81.014009
##$SI= 65536
##$SIGF1= 159.3651
##$SIGF2= -187.1042
##$SINO= 113.3802
##$SIOLD= 16384
##$SREGLST= <1H.CDCl3>
##$SSB= 0
##$STSI= 65536
##$STSR= 0
##$SW_p= 40650.406504065
##$SYMM= 0
##$S_DEV= 0
##$TDeff= 32768
##$TDoff= 0
##$TI= <>
##$TILT= no
##$TM1= 0
##$TM2= 0
##$TOPLEV= 0
##$USERP1= <user>
##$USERP2= <user>
##$USERP3= <user>
##$USERP4= <user>
##$USERP5= <user>
##$WDW= 1
##$XDIM= 65536
##$YMAX_p= 355934482
##$YMIN_p= -194799131
$$ End of Bruker specific parameters
$$ ---------------------------------
##NTUPLES= NMR SPECTRUM
##VAR_NAME=  FREQUENCY,     SPECTRUM/REAL,   SPECTRUM/IMAG
##SYMBOL=    X,             R,               I
##VAR_TYPE=  INDEPENDENT,   DEPENDENT,       DEPENDENT
##VAR_FORM=  AFFN,          ASDF,            ASDF
##VAR_DIM=   65536,         65536,           65536
##UNITS=     HZ,            ARBITRARY UNITS, ARBITRARY UNITS
##FACTOR=    0.620285442955139, 1,           1
##FIRST=     20137.2065510759, 0,            0
##LAST=      -20513.1999529892, 0,           0
##MIN=       -20513.1999529892, -194799131,  0
##MAX=       20137.2065510759, 355934482,    0
$$ Real data points
##PAGE= N=1
##DATA TABLE= (X++(R..R)), XYDATA
$$ [...]
##PAGE= N=2
##DATA TABLE= (X++(I..I)), XYDATA
12788A5885157J3890491o150126j9708444j9095875q600714L579604O094641o525138
12780b0630404j8295460n229261K6507111L8619331J1134539k6445064l2995297
12773b7334505p469675J7893848K2732739J4240899M892224l037039j0051310
12766A1867181j3292050j1945127q746160l354359P783294K1682359K5701728
12759B9696866J1066443j1871743j9978223m226824J5726948J4147169o782767
12752B7777869k0417861j3873908l770024o740597j4441441j1321971P18637J1511523
12744c0557773J9636734K3297300J2584710r336000j7409995r64330J2674503
12737I925149j54395j7254396p266331J3303119O819013j7554593j7584956P275032
$$ y = [15885157, 29775648, 23625522, 3917078, -15178797, -23779511, -20199907, -14105266, -20630404, -38925864, -44155125, -17648014, 20971317, 32105856, 5660792, -27334505, -34804180, -16910332, 5822407, 20063306, 24955530, 21918491, 11867181, -1424869, -13369996, -22116156, -25470515, -17687221, 3995138, 29696866, 40763309, 28891566, 8913343, 4686519, 20413467, 34560636, 27777869, 7360008, -6513900, -10283924, -17024521, -31465962, -42787933, -42069296, -30557773, -10921039, 12376261, 24960971, 15624971, -1785024, -2749354, 9925149, 9770754, -7483642, -14749973, -1446854, 5372159, -12182434, -29767390, -22492358]
12729b2492358J4519876n114480j2000606Q588849J9294432R84026r980308J0849473
12721D648904K6831730K890984l0136035k5670532K079674Q435563l548900L454768
12713a1013844K5881449K1198744j5569553l5613288r867919K8059035L3007529
12706C6082153P640355j2700627j1317301k445850k875544j0712309j3002811
12699i331934n143751L137252K814411O60076Q117345J7707738R507043j4890958
12691A2577222k7663761j4893122J968540J297743n182907L099822J7761606J6367577
12683E332720J185548o428613k145240j117619q501443j2991194q529915r69071
12675c4164827N869505J2360861J3637802M896134o896199j1431207j0078804
$$ y = [-22492358, -7972482, -13086962, -25087568, -16498719, 2795713, 3779739, -6200569, 4648904, 31480634, 34371618, 4235583, -21434949, -19355275, -10919712, -14468612, -11013844, 14867605, 36066349, 20496796, -15116492, -24984411, 3074624, 36082153, 43722508, 31021881, 19704580, 17258730, 14383186, 3670877, -9331934, -14475685, -11338433, -8524022, -7863946, 253399, 17961137, 27468180, 12577222, -15086539, -29979661, -28011121, -26713378, -31896285, -28796463, -11034857, 5332720, 6518268, 89655, -2055585, -3173204, -11674647, -24665841, -33195756, -34164827, -28295322, -15934461, -2296659, 2599475, -4296724, -15727931, -25806735]
12668b5806735q884922n048507M720459J2604516J2508799J2523845J7354467
12661A9971922J3455323o607845k1040259p823256J6012569J5778014q072371
12654B1674097k1481612q481235J0617107J4680888O615140k059694p147441o936084
12646G481166q74578M078436J748790j144436K317237K100598j2073140k5650144
12638b2016071j6868680O799612J7363067P305225n223025p879083l341882P426950
12630a6433887K1773989K1744998l495717k8294688k0250020O649611J0656336
12623g649378r596693j4613868N105040J2062532r976160k4542284m644711K1561028
12615c2294494J9424887J321593l721961J030986j280460l069092Q328214J7053930
$$ y = [-25806735, -34691657, -39740164, -35019705, -22415189, -9906390, 2617455, 19971922, 33427245, 26819400, 5779141, -2044115, 13968454, 29746468, 21674097, 192485, -8288750, 2328357, 17009245, 23624385, 21564691, 14417250, 7481166, 6606588, 10685024, 12433814, 11289378, 13606615, 15707213, 3634073, -22016071, -38884751, -32085139, -14722072, -7416847, -12639872, -20518955, -23860837, -16433887, 5340102, 27085100, 23589383, -4705305, -24955325, -18305714, -7649378, -17246071, -31859939, -26754899, -14692367, -24668527, -49210811, -53855522, -32294494, -12869607, -11548014, -15269975, -14238989, -15519449, -18588541, -10260327, 6793603]
12607F793603L096375j8332114j8685660k208503N182785K62606P37897Q857695
12599a4295316J0820735O137193N784772N905523n820804k0506243j5373783Q417004
12591a8930919K3446500J5470658N95143k649196K833673M487856l18325m651630
12583B0283760k770461L630458N363744n338289k1114768k3078725o151651J0221576
12575a8954356Q218486l313555m783970M375195R723356O923822L889638L346628
12567I425244P43664m276288q860283j4231654j9246910j5049927N8097J1171154
12559d0266903Q200516M230298J3029648K1565330R706079j3270254k0269893
12552a7075179q086254K140402K985768P762561J7868647J5321865l859762j7760090
$$ y = [6793603, 9889978, -8442136, -27127796, -29336299, -24153514, -23890908, -23153011, -14295316, -3474581, 2662612, 8447384, 14352907, 8532103, -11974140, -27347923, -18930919, 4515581, 19986239, 20581382, 17932186, 20765859, 25253715, 24935390, 20283760, 17513299, 21143757, 26507501, 21169212, 54444, -23024281, -29175932, -18954356, -10735870, -14049425, -18833395, -14458200, -4734844, 2188978, 6078616, 9425244, 10168908, 5892620, -2967663, -17199317, -36446227, -51496154, -51438057, -40266903, -32066387, -27836089, -14806441, 6758889, 16464968, 3194714, -17075179, -25161433, -23021031, -20035263, -12272702, 5595945, 20917810, 17058048, -702042]
12544g02042j2432970k936498n976171j2851212o962474P624612J3212182M785072
12536a6239501n677717o330421L212473J4109945J5933808N899957o919835j1272071
12528g283362o919061j328803L251029Q208891P900120l599120j6211450j2701256
12520b8683012L937484J1151150K33503j0495328m856303P537292R414458J477507
12512a0283249n127784q653109j2244340r889079M477695J9553048J7118130r38689
12504e987377j2734659n913293P562830J1271991O052237K661295J871889m985605
12496b00692j7585638k1847293q899371J0072043J6713318Q647787j43746k33457
12488a3477049L114237J998867l295740r498835j5572398j7340678p938269R133511
$$ y = [-702042, -13135012, -16071510, -22047681, -34898893, -41861367, -34236755, -21024573, -16239501, -21917218, -28247639, -25035166, -10925221, 5008587, 10908544, 3988709, -7283362, -14202423, -15531226, -12280197, -4071306, 3828814, 229694, -15981756, -28683012, -24745528, -13594378, -13360875, -23856203, -28712506, -21175214, -11760756, -10283249, -15411033, -24064142, -36308482, -46197561, -41719866, -22166818, -5048688, -5987377, -18722036, -24635329, -17072499, -5800508, 251729, 2913024, 4784913, -200692, -17786330, -39633623, -48532994, -38460951, -21747633, -13099846, -13243592, -13477049, -10362812, -8363945, -11659685, -21158520, -36730918, -54071596, -62009865, -52876354]
12480e2876354J8403911J2867131N070346P128704J1186120L925317r389202j2431707
12472a6115734l082437N756702O684171L525703M4001k258648P58722P897865
12464C210345N350703j4917659l4545829k7127739M629597L0503966L1280236
12457a616380J5883893N22554p714540n184007P836379J7337658P921911j1011077
12449B3976391j3626377L483401J5309985Q064653j657953J328172N970431j667410
12441D1181293j2809078j2665309m604978L98423K161064K323593n897387k0979198
12433a0891577k3589089m439188J4796069J1557282j777078J125991J6056552
12426B838962J5906266k767586j3437023k684017J0129806N855325o186829p175834
$$ y = [-52876354, -34472443, -21605312, -16534966, -9406262, 1779858, 5705175, -3684027, -16115734, -19198171, -13441469, -6757298, -3231595, -3187594, -5446242, -4687520, 3210345, 8561048, -6356611, -40902440, -68030179, -63400582, -32896616, -1616380, 14267513, 14790067, 7075527, 1891520, 9727899, 27065557, 34987468, 23976391, 10350014, 13833415, 29143400, 37208053, 35550100, 36878272, 42848703, 41181293, 28372215, 15706906, 11101928, 11500351, 13661415, 15985008, 10087621, -10891577, -34480666, -38919854, -24123785, -12566503, -14343581, -13217590, 2838962, 18745228, 15977642, 2540619, -143398, 9986408, 15841733, 9654904, 2479070]
12418B479070J661137N137137k89439l393813J718563N644736j964982j5205078
12410d212669j6952095j583085J4884514J4117887J71283o049285L845942J4868581
12402A9091073J0693004n516969j8347307j8297987p110822N907628Q956363m80501
12394e105518o843581O149970K6977431K5191707l911837k6700967j7580278M572997
12386B749924P216689p656761j2340342J951081J6710507J6825499N469285q842325
12378B2083557j9092633j6302256J131003J6863659J3609228j987526r012415
12371G292617k925408K336694k76640l392051k285788j072381j426422q20506
12363b569885j110712m795341o146822j18954O065945N412257O019958J5110842
$$ y = [2479070, 4140207, 9277344, 8987905, 5594092, 7312655, 12957391, 10992409, -4212669, -21164764, -22747849, -7863335, 6254552, 6425835, 376550, 4222492, 19091073, 29784077, 24267108, 5919801, -12378186, -19489008, -13581380, -4625017, -5105518, -11949099, -5799129, 21178302, 46370009, 42458172, 15757205, -1823073, 2749924, 9966613, 2309852, -10030490, -8079409, 8631098, 25456597, 30925882, 22083557, 2990924, -13311332, -12180329, 4683330, 18292558, 16305032, 7292617, 4367209, 6703903, 6427263, 3035212, 749424, -322957, -1749379, -2569885, -3680597, -8475938, -14622760, -14741714, -8675769, -3263512, 2756446, 17867288]
12355A7867288J9442680N177386j3017039j0679337O229888J0526626j707754
12348C3839738q974663m916122n673293j4055714j2288106K172274Q071621k045039
12340c869304q251090P67954R481284O667068M481255J1525449J5488954P797394
12332D4088964j544691o964700j6462756k5610204j5313342R923879J7734065
12325E851215J63154q802435Q793041K1359321L700959j5447301l128016J7909863
12317C0399801Q375249j8381685k1098320k940788r45742j5571812j0798475J6769983
12309a4191789K6604353J346596k5046216k1652997j498661Q922083O362006M8895
12301a9105730p245933j1958378o525422N398887J0278854O338258L244996M90785
$$ y = [17867288, 37309968, 42487354, 29470315, 18790978, 25020866, 35547492, 33839738, 24865075, 19948953, 14275660, 219946, -12068160, -9895886, -1824265, -3869304, -12120394, -11352440, -1871156, 4795912, 9277167, 20802616, 36291570, 44088964, 42544273, 35579573, 19116817, -6493387, -21806729, -11882850, 5851215, 6014369, -2788066, 6004975, 27364296, 31065255, 15617954, 12489938, 30399801, 38775050, 20393365, -704955, -3645743, -4591485, -20163297, -30961772, -14191789, 12412564, 13759160, -11287056, -32940053, -34438714, -25516631, -19154625, -19105730, -26351663, -38310041, -44835463, -39436576, -29157722, -22819464, -19574468, -19083683]
12293a9083683q319641j1574782P901402L5143395L3368675j232988k9893607
12286F308771k6008358n561258P820973J3146003J3599572K694834j3886421j5025482
12278a6911366r8090M397952q623064j0320505J1934527K5347201N746206j6513534
12270e040673m954959J9852496J3516633j6872407k3328994M702371K3918994
12263A1793461N073014k5962591l0306544p657733J2775330J2986033P43675o552682
12255b7108037p15147J1560318J7607911J3431024O033219O92506m329975p466951
12247I704868k672251M998499J76124j6169980k0598143k431590J5615448J1472826
12239I5801k314880k994138L729120l80312p642985K502173K1389870J9620214
$$ y = [-19083683, -27403324, -38978106, -31076704, 4066691, 37435366, 36202378, 6308771, -19699587, -25260845, -17439872, -4293869, 9305703, 12000537, -1885884, -16911366, -17009456, -12611504, -21234568, -31555073, -19620546, 5726655, 11472861, -5040673, -9995632, 9856864, 23373497, 6501090, -16827904, -12125533, 11793461, 16866475, -9096116, -39402660, -47060393, -34285063, -21299030, -20555355, -27108037, -27823184, -16262866, 1345045, 14776069, 20809288, 21501794, 17171819, 9704868, 7032617, 12031116, 12207240, -3962740, -24560883, -26992473, -11377025, 95801, -2219079, -5213217, -1484097, -1864409, -9507394, -7005221, 14384649, 34004863]
12231C4004863m179633j9030848r839149L152754J422056m791780R30006J4411117
12223A6079386K0027105J1185406p164966k3937987k5755087q462942J3198881
12216d830204J9981365J1186745O70587m943432q047752p186128j718250j558242
12208C554689j0848697j2296825O018989K0649240L919492k5268201k4263965
12201c8535278M419388J6034168j513176r947455Q452669J8611938k017400j9133412
12193b3628558q58250K4555067J6625018r010099j1704879L448770J522465j4903393
12185a3953859j2051294J0149744J6120326j650173j0103015M836253J4981589
12178H329571Q92390j6970562j7081197r413837q021142m508492P364056J0411101
$$ y = [34004863, 29825230, 10794382, 955233, 4107987, 5530043, 738263, 1668269, 16079386, 36106491, 47291897, 40126931, 16188944, -9566143, -18029085, -4830204, 15151161, 26337906, 27008493, 22065061, 14017309, 6831181, 5112931, 3554689, -7294008, -19590833, -13571844, 7077396, 10996888, -14271313, -38535278, -34115890, -18081722, -19594898, -29542353, -21089684, -2477746, -4495146, -23628558, -24486808, 68259, 16693277, 7683178, -4021701, -572931, 949534, -13953859, -26005153, -15855409, 264917, -1385256, -11488271, -6652018, 8329571, 9221961, -7748601, -24829798, -34243635, -42264777, -46773269, -39409213, -28998112]
12170b8998112n475018j6528058Q17708K7696166K6965965j598585k2374821j6126011
12162c5620766o44507L896574K567624P699556J4265369R784771k565301p709114
12154h325794j906296L061345J026334K519534J5267879K4110559P861136k4762883
12146A8851814l6217619p224668L3192296M1503149J3213601j7245861k4218260
12139B1854452j5038622o117986J79055N676207M484120m721924r541379j760231
12131d986308P186784L284619p489337r236622j063981M320740J890888j773761
12123g866978l014385m608844o304274n458430n330858r308488r803633J670434
12115e0025456J6296537J8168731J0957682J2454906K1531983J6759821n217445
$$ y = [-28998112, -34473130, -51001188, -50183480, -22487314, 4478651, 2880066, -19494755, -35620766, -36265273, -32368699, -29801075, -22101519, -7836150, 1948621, -616680, -8325794, -10232090, -7170745, -6144411, -3624877, 11643002, 35753561, 43614697, 18851814, -17365805, -24590473, 8601823, 50104972, 63318573, 46072712, 21854452, 6815830, 697844, 876899, 6553106, 11037226, 6315302, -3226077, -4986308, 2200476, 5485095, -2004242, -11240864, -12304845, -7984105, -6093217, -7866978, -10881363, -15490207, -21794481, -27252911, -32583769, -41892257, -51695890, -50025456, -33728919, -15560188, -4602506, 7852400, 29384383, 46144204, 40926759]
12108D0926759j8510557r244994N18633q469892j7221662j798180K0747833J7427052
12100B4374992n140541j2791609k973174m394812j7482758p681949K8394192M2505649
12092D4809990Q150775l1318063k5867339O821798J4964256o786978k0202230
12085i427791j0701366j150906l629791l964885L615698P204859O703501J5097108
12077C746427K5651732J5053107j3793841k8701941j7240069l339719m115453
12070b2739757n962400K409591Q353007L773070K177203R054873P491065p395848
12062b839196j2399593L892492J7988747J1997830L684011R134556J0330087p216383
12054C4572551j8570276p37803K0452083J0026960j4736613j2455447J1214293
$$ y = [40926759, 22416202, 13171208, 13689841, 5219949, -12001713, -13799893, 6947940, 24374992, 19234451, 6442842, 3469668, -925144, -18407902, -26089851, 2304341, 44809990, 52960765, 21642702, -4224637, 2597161, 17561417, 10774439, -9427791, -20129157, -21280063, -24909854, -28874739, -25259041, -18054182, -11350681, 3746427, 29398159, 44451266, 30657425, 1955484, -15284585, -18624304, -22739757, -28702157, -26292566, -17939559, -14166489, -11989286, -2934413, 4556652, -2839196, -15238789, -11346297, 6642450, 18640280, 22324291, 31458847, 41788934, 34572551, 16002275, 15264472, 35716555, 45743515, 31006902, 18551455, 29765748]
12047B9765748J3650012j3091088l3120910k7555521j5913676j3457529j1238139
12040g0961103m535690j784362J89575J3161860K7073345K0347969J892898J420465
12032a3195043J5425494R139154k0028817l0523805l890162K3898972K0774547
12025A600340M074142Q38038L280097m532663j0710091n46620J0995755N086161
12017A0085159o893490o162943n44748m912142r550606R5678J1608202N871150
12009d03740p569803p116911L635336O204408J567237L775824J0521823Q932606
12001A9546780O11998n104126j0667005j7911023j2198538J2502240L0025937
11994A6806263J6329279r087819j2562340j339638p181046k6950762k7272437
$$ y = [29765748, 43415760, 30324672, -2796238, -30351759, -46265435, -59722964, -70961103, -75496793, -77281155, -77091580, -63929720, -36856375, -16508406, -14615508, -13195043, 2230451, 11369605, -8659212, -39183017, -43073179, -19174207, 1600340, 5674482, 6512520, 9792617, 5259954, -5450137, -5996757, 4998998, 10085159, 3191669, -2971274, -3516022, -8428164, -17978770, -17883092, -6274890, -403740, -7973543, -15090454, -11455118, -5250710, -3683473, 92351, 10614174, 19546780, 20158778, 15054652, 4387647, -13523376, -25721914, -13219674, 16806263, 33135542, 24047723, 11485383, 10145745, 2964699, -23986063, -51258500]
11987e1258500m298246J0245273N845743P733054K4882880K9914463Q007749j4821473
11979A6250943j3253268J775137R626517J0810965J0189688j329494k4792219
11972I278269l7567841k3306509J896240J2914178O936412m365342j3419718j2531665
11964f0165976N870678K8993944K8808892M271917j0043834K663033J2548525
11957A2947179m677479k1645577m914137K3149229J7588401j3611441k1926268
11950a3090093J952577J6837429K501396j2040669n138132K696959p077527j5594972
11942b8953032m021283R579381L542997o278767N620124K7485323K8956098J1737551
11934D7668392K960726N907373k742608k5384878l1961789p786550J8963151J6572877
$$ y = [-51258500, -55556746, -45311473, -39465730, -31732676, -6849796, 23064667, 31072416, 16250943, 2997675, 4772812, 14399329, 25210294, 35399982, 34070488, 9278269, -28289572, -51596081, -49699841, -36785663, -29849251, -34214593, -47634311, -60165976, -54295298, -25301354, 3507538, 7779455, -2264379, 398654, 12947179, 8269700, -13375877, -18290014, 4859215, 22447616, 8836175, -13090093, -11137516, 5699913, 8201309, -3839360, -8977492, -6280533, -13358060, -28953032, -32974315, -23394934, -19851937, -26130704, -20510580, 6974743, 35930841, 47668392, 50629118, 56536491, 53793883, 28409005, -3552784, -11339334, 7623817, 24196694]
11926B4196694n996892j5921725l365763J0817202Q762547k893563p644930j810736
11918F142834M156006J908961l531117j239645Q129643R081016p896468k7783876
11910a1032646k6474926m192875J2911358R532440J407176O758441J5183546N934240
11902A0026754j4121018j7367149J589925J6271283P603028j0475802j5599984
11895b2072963p287168J732212Q009077J3900263J3873980L028233q488525p479458
11887d784349J079712J617200p507586j3887970j2016662o834336R75569J3965124
11879b7393298K2952401J4317423m828353j0365229L476712J3709612L574558
11872A5443826j2371005j2361039P48508Q744348N606569j823899r703249j5636118
$$ y = [24196694, 18199802, 2278077, -1087686, 9729516, 18492063, 15598500, 7953570, 6142834, 10298840, 12207801, 8676684, 7437039, 15566682, 24647698, 16751230, -11032646, -37507572, -41700447, -28789089, -19256649, -17849473, -11091032, 4092514, 10026754, -4094264, -21461413, -19871488, -3600205, 4002823, -6472979, -22072963, -29360131, -27627919, -19618842, -5718579, 8155401, 11183634, 2695109, -4784349, -3704637, -2087437, -9595023, -23482993, -35499655, -42333991, -41358422, -27393298, -4440897, 9876526, 5048173, -5317056, -1840344, 11869268, 15443826, 3072821, -9288218, -8539710, 204638, 5811207, 3987308, -5715941, -21352059]
11864b1352059j0648957P690738K0775553Q447455j9506449l1365291j4069919
11857f0028929J1706693J9842077P008998j0531925j5140172j22648K3858426
11850b3407480L3095368J4389371j4563843k2724601n351877J0690100N760294
11843b112668p095573n946924O931459J1560383R63010j0278284o518907R895533
11835b601971K1013835J1885858j1399468k4190698j1190007J1327829J4867400
11828I712778j404682j0295389L68782R443506l12390j2148024m383692J1425189
11820B406078J0120523l700151m768841P675701Q719048p654127j7234392o663433
11812a1099594N718956L167981l576169o86826L740602j1561J05185J5803461
$$ y = [-21352059, -32001016, -24310278, -3534725, 4912730, -14593719, -45959010, -60028929, -48322236, -28480159, -21471161, -32003086, -47143258, -47265906, -23407480, 9687888, 24077259, 9513416, -13211185, -18563062, -7872962, -2112668, -9208241, -15155165, -8223706, 3336677, 4299687, -5978597, -12497504, -2601971, 18411864, 30297722, 18898254, -5292444, -16482451, -5154622, 9712778, 8308096, -1987293, -1618511, 7824995, 7512605, -4635419, -9019111, 2406078, 12526601, 8826450, 4057609, 11733310, 20452358, 12798231, -4436161, -11099594, -5380638, -2212657, -5788826, -6475652, -2735050, -2746611, -2641426, 13162035]
11804A3162035K9829914J8084382r485274j9558123m227911Q876596j180752k1075627
11796A4425240k6901960j5949710k659690L771717M814846L117307q24517m424113
11788b4630880k781533O078553J7181931K0362813R413533p818823j4129582l828290
11780a52278Q011105O883725J072017O219919J4230974K280873k5124239l2082530
11772a8660434l497693K5072943J4982119j7331903k3579688L367463J9210174
11765d37019k302811k8069588j6462021J9541462L3389870J3656191n649791j283905
11757A2382388R538138N736524l560821j542264M058392k909881j4573119j0906897
11749a777540M432669Q547959l010143j0595966m344310L139538L308990M266734
$$ y = [13162035, 42991949, 61076331, 51591057, 32032934, 27805023, 36681619, 35500867, 14425240, -12476720, -28426430, -31086120, -27314403, -22499557, -19382250, -20206767, -24630880, -27412413, -21333860, -4151929, 16210884, 25624417, 17805594, 3676012, -152278, 7858827, 14742552, 15814569, 22034488, 36265462, 38546335, 13422096, -18660434, -22158127, 2914816, 17896935, 565032, -23014656, -19647193, -437019, -2739830, -30809418, -47271439, -27729977, 5659893, 19316084, 13666293, 12382388, 21920526, 27657050, 24096229, 22553965, 26612357, 23702476, 9129357, -1777540, 2655129, 11203088, 8192945, -2403021, -6747331, -3607793, -298803, 3967931]
11741C967931P987523J923938j3323888j4842790N413986J9907964O387598j3681160
11733C741102q237580J2292127J1609624j3288454k8569965j7256369J015426
11726c8694089P805941Q133974P155588j333270j1433730l075022K1056349K8095173
11718A7710914L998367k0286302j5614624J145624m11679j2944316r229491O946823
11710b8684684Q792504l858638m836488R307501J1586279o770199j8282499m862663
11702c7608887J2073844Q668489j554405P693301K9162024L0592348K979692k6384124
11694B5622282l0989872j5033168k20276L017229J869022N338720J1134904R986876
11686A0725717r4434q673131n496142N004154Q976313K047337o110547p421383
$$ y = [3967931, 11955454, 13879392, 555504, -14287286, -8873300, 11034664, 17422262, 3741102, -4496478, 7795649, 19405273, 6116819, -22453146, -39709515, -38694089, -30888148, -22754174, -15598586, -16931856, -28365586, -31440608, -10384259, 17710914, 21709281, 1422979, -14191645, -13046021, -13457700, -26402016, -35631507, -28684684, -19892180, -23750818, -28587306, -19279805, -7693526, -14463725, -32746224, -37608887, -25535043, -16866554, -18420959, -10727658, 18434366, 49026714, 52006406, 25622282, -5367590, -20400758, -20621034, -17603805, -15734783, -10396063, 738841, 10725717, 10631283, 1958152, -3537990, 1466164, 10442477, 12489814, 6379267, -1042116]
11678a042116n059027l350778O73961P772384Q569827l513226j7801879j6966273
11670c0717127N98800J9082801K4054872J4351351j931433j3968597j3475361
11663b004694l381611J508208o956951j5340981o483366J1310786J2785022m921337
11655a3484924j4413780J135784K1334802J9070708m67446j2211151q986785k785941
11647a0808733K490750J2662785K1178926J3144196o420566j4698578o876587
11640A0672193l779345j5025473k1334065q028606Q634698Q162223j941218k941887
11632b5581480L197246K970348r00825L598463J2245099J1088677K499158J104144
11624A0220830Q109967J1767463R147886O133116J126911r061525j3839068m020620
$$ y = [-1042116, -6101143, -9451921, -8777960, -1005576, 7564251, 4051025, -13750854, -30717127, -30118327, -11035526, 13019346, 27370697, 25439264, 11470667, -2004694, -5386305, -3878097, -10835048, -26176029, -32659395, -21348609, -8563587, -13484924, -27898704, -26762920, -5428118, 13642590, 13175144, 963993, -8022792, -10808733, -8317983, 4344802, 25523728, 38667924, 32247358, 17548780, 10672193, 6892848, -8132625, -29466690, -37495296, -28860598, -20698375, -22639593, -25581480, -22384234, -19413886, -20314711, -16716248, -4471149, 6617528, 9116686, 10220830, 18330797, 30098260, 39246146, 45379262, 46506173, 37444648, 23605580, 19584960]
11616A9584960M945201o539137k5056830k0725333K749080J2137397k10550o226701
11608a9341913N969022J2773008J569372n773725M143749J0400291l39609n548217
11600C851978R297127J6712190n665826k8213427j3644519J9248438K4441822
11593B6027783J361193j1621720l907929j765996j4903423k2669898j6182615
11586d3662605j0362428q639120L509180K2440605K2741951J07650j7362391j1771496
11578d2998654K912340J1413456J6541413J7728180M353116j5955491j5979245
11571b1984885P465053K0792544L987192j7260018j2991539N584970R420973k408066
11563g393776r494244o723877n295179o649687q58118J2912448K3254852K1701059
$$ y = [19584960, 24530161, 17991024, -7065806, -27791139, -25042059, -12904662, -13115212, -19341913, -13372891, -599883, 969489, -4804236, -660487, 9739804, 9400195, 3851978, 13149105, 29861295, 24195469, -4017958, -17662477, 1585961, 26027783, 27388976, 15767256, 11859327, 10093331, -4810092, -27479990, -43662605, -54025033, -62664153, -59154973, -36714368, -13972417, -13864767, -31227158, -42998654, -40086314, -28672858, -12131445, 5596735, 9949851, -6005640, -21984885, -14519832, 6272712, 10259904, -7000114, -19991653, -14406683, -4985710, -7393776, -16888020, -23611897, -28907076, -35556763, -36414881, -23502433, -247581, 21453478]
11555B1453478R473767n993969j4011744q812502L48908j85249n270912K288611
11547g09612J7861638J4526004j2631811l0911723j6949634Q696410J7232185
11540b886543J4615326J9044984K0168930j223859k8881509k7932274j80189J6538509
11532I263375N116059j0786180r545287j247949k119479o278312p0602J2846929
11524b821446J6914429O155055j0381296j9501885j5227203l597594L164197J369805
11516b3925938O33059P802551J4171660R370804n95829l498473j410515m456524
11508a909205j0590988j0153186n267790m545665l056604R257661K1588211J1496162
11500F818596j6651236k9948825j2951833J0044244J2751709L719788N490854
$$ y = [21453478, 30927245, 24933276, 10921532, 2109030, 2457938, 2272689, -2998223, -709612, 17152026, 31678030, 19046219, -11865504, -28815138, -20118728, -2886543, 11728783, 30773767, 50942697, 49718838, 20837329, -7094945, -7275134, 9263375, 14379434, 3593254, -5952033, -7199982, -9319461, -15597773, -15668375, -2821446, 14092983, 20248038, 9866742, -9635143, -24862346, -28459940, -25295743, -23925938, -23292879, -15490328, -1318668, 8052136, 7456307, 3957834, 2547319, -1909205, -12500193, -22653379, -27921169, -32466834, -35523438, -26265777, -4677566, 6818596, -9832640, -39781465, -52733298, -42689054, -29937345, -26217557, -20726703]
11493b0726703J5033814J0665242r492362k1794250j2185628L537423L863946
11486c1098518p519358q578941Q119809K3868108J9392740O86058j1151743r019230
11478a5301075l897971j779823M761103J6538279J8455333L126149j1754053o886006
11470C261936Q815502J0853208n344576k0591905k0087266p760779N832468J3935155
11462a1086257J2576339L149436m751590m383953j925201m483898o047996J68022
11454a6785098N083342j869538j0990593o904576L636938L963827o1507J0025118
11446a3902087K7089438K4490409J937623j0731753k862791N23077j4837135k5104253
11438a3397472q731720J5679011J7646937r67343j4792424j1668440Q74192J2116006
$$ y = [-20726703, -5692889, 4972353, -4520009, -26314259, -38499887, -34962464, -31098518, -38617876, -47196817, -39077008, -15208900, 4183840, 4869898, -6281845, -15301075, -19199046, -20978869, -16217766, 320513, 18775846, 21901995, 10147942, 3261936, 12077438, 22930646, 17586070, -3005835, -23093101, -30853880, -25021412, -11086257, 1490082, 4639518, -112072, -4496025, -6421226, -10905124, -16953120, -16785098, -11701756, -13571294, -24561887, -31466463, -27829525, -23865698, -23927205, -13902087, 13187351, 37677760, 39615383, 28883630, 26020839, 26543916, 11706781, -13397472, -22129192, -6450181, 11196756, 10229413, -4563011, -16231451, -15357259, -3241253]
11430c241253J3653853K041023j0782124o726237P808970M406787k0202576k9522880
11422d2564437k402027K8226355K3392644k535786r283389M380535P527511n000808
11414A740598q674912J581526L994797o339146q671825K475793P089098j094227
11406g898298k702000R130698J4952509O102386J67315M666358J316421j5297546
11398A0437843k0123603k347804Q322515r601643k7599421j1798813J8014432
11391c4696494J8428408o853056j4449318P630136K3958409J0627433j2079115
11384g433597j7270972o763938N176086J3834520J5022053O61155k0512364k2219643
11376c9506700J621298K1017592J1592411r438762j2719925k282260j458394p673231
$$ y = [-3241253, 10412600, 12453623, 1671499, -5054738, 2754232, 7161019, -13041557, -42564437, -44966464, -16740109, 6652535, 4116749, -5166640, -786105, 6741406, 1740598, -6934314, -5352788, -1357991, -7697137, -16368962, -13893169, -6804071, -7898298, -10600298, -1469600, 13482909, 19585295, 19752610, 24418968, 25735389, 10437843, -9685760, -12033564, -3711049, -13312692, -40912113, -52710926, -34696494, -16268086, -23121142, -37570460, -29940324, -5981915, 4645518, -7433597, -24704569, -31468507, -26292421, -12457901, 2564152, 3225307, -17287057, -39506700, -37885402, -16867810, -5275399, -14714161, -27434086, -29716346, -31174740, -38847971]
11368c8847971K132582K4600943K6660708k150451k7604882j9050490O463024
11361b7796537J2510680k432922q026245Q095356K3052866J5249919n977379j8236393
11353c560655j6450141j1162076p481507j667615N622098P596636L878183L076118
11345b0148959R230253J4705278J1506062K507574m534590q247738j1356588j1357295
11337a7696003l151649R530243J4892853P796910m251312j2956514j8182840j9695763
11329d3714075j0557678R761912K3580216J3208553j0441970j5879523P244632
11322b6797933L1721085K8584377M438729j2156744j0183510k627466M98468L429749
11314A6906755P511426L737935r518207j7605528r569829M240678N960589n905816
$$ y = [-38847971, -36715389, -12114446, 14546262, 12395811, -15209071, -34259561, -27796537, -15285857, -17718779, -25745024, -17649668, 5403198, 20653117, 14675738, -3560655, -20010796, -31172872, -38654379, -40321994, -34699896, -27103260, -23225077, -20148959, -10918706, 3786572, 15292634, 17800208, 13265618, 5017880, -6338708, -17696003, -20847652, -11317409, 3575444, 11372354, 7121042, -5835472, -24018312, -43714075, -54271753, -44509841, -20929625, -7721072, -18163042, -34042565, -26797933, 4923152, 33507529, 37946258, 25789514, 15606004, 12978538, 13477006, 16906755, 24418181, 28156116, 18637909, 1032381, -8537448, -4296770, 1663819, -4241997]
11306d241997j6681649j4499216n37475J5535781K3150090J7602467N094735k633452
11298B2789284k235730j342482m497947o425712m692438p014473j6406017k0524407
11290d0349922q524875J0872270K1549115K1118349J5841432N527645q181946
11283A7852068r550401J0997377L1808767K3395443o078782j9512848o149953
11276D2761671O114458N81172l751632O473624J0707328o668369k2880955j5388795
11268A7948502m809639j8882560l7263250k0801831J8348937K9826591N440461
11261a0192789r424731O479178J7369284k394006k0268678r58997L0989951K8535576
11253D0134788n151169k6995280k0311609o416414J017044R942681J9346504J4465274
$$ y = [-4241997, -20923646, -35422862, -35960337, -20424556, 2725534, 20328001, 25422736, 22789284, 20553554, 19211072, 14713125, 8287413, 3594975, -3419498, -19825515, -40349922, -48874797, -38002527, -16453412, 4664937, 20506369, 26034014, 17852068, 8301667, 19299044, 51107811, 74503254, 68424472, 48911624, 42761671, 48876129, 49457301, 45705669, 52179293, 62886621, 56218252, 33337297, 17948502, 13138863, -5743697, -43006947, -63808778, -45459841, -15633250, -10192789, -19617520, -13138342, 4230942, 1836936, -18431742, -19390739, 11599212, 40134788, 34983619, 7988339, -12323270, -18739684, -17722640, -7779959, 11566545, 26031819]
11245B6031819k157593q967750j729426k12429j0500788j2222727L995845J6301258
11237A0538209O825176q327704n987128P065472P858233n293922j2871708n388781
11229e582153N677954O621112l315748j4753582j6548229l858804J5017371K4356632
11221G614553J9107406J0144873O299154K164752p677833j4538590q944354J094376
11213A5264337J08896j1882787k0277493j6501601n618814M360740J0145296J1686574
11205a2714852J1486686J3466178J6436542J2816655m59876j5256828k1583968
11198D190537j6989171l660872J2763891J8448007K568304j9581308j6319452
11191a8580064J4101961L1013297O839795k8566149k9812275k671525R991444
$$ y = [26031819, 23874226, 14906476, 13177050, 12964621, 2463833, -9758894, -5763049, 10538209, 17363385, 9035681, 3048553, 10114025, 17972258, 12678336, -193372, -5582153, 95801, 6716913, 3401165, -11352417, -27900646, -31759450, -16742079, 7614553, 26721959, 36866832, 43165986, 45330738, 37652905, 23114315, 14169961, 15264337, 15373233, 3490446, -16787047, -33288648, -38907462, -34546722, -24401426, -12714852, -1228166, 12238012, 28674554, 41491209, 41031333, 25774505, 4190537, -12798634, -16459506, -3695615, 14752392, 17320696, -2260612, -18580064, -4478103, 26535194, 33374989, 4808840, -25003435, -27674960, -17683516]
11184a7683516k779170r770538M393640J6169651Q152769l104134r16156M400342
11176a137112J489702M72975Q318615R505580n162225j5190958j621755J9324416
11168A5999238K0403114L370067j1549707j9378776k5009154j9097806P925833
11161b7337191L6379899L4944652N721095j7703450j7431720q798926q352483
11154b578124j1391260q695750l288591j301176k059352l063004j748767P960498
11146b6165526K5294560L1945686J3062357j3220124j4272022O948805J2185397
11139C5779133j2142192k9706933r726902K3475327K7406107N219325n181249
11132C5122616N774454Q028495j4345939l5300496k6327864L337386K3432813
$$ y = [-17683516, -20462686, -30233224, -25839584, -9669933, -1517164, -4621298, -5537454, -1137112, 352590, 825565, 9144180, 18649760, 13487535, -1703423, -3325178, 15999238, 36402352, 39772419, 28222712, 8843936, -16165218, -35263024, -27337191, 9042708, 43987360, 49708455, 32005005, 14573285, 5774359, -2578124, -13969384, -22665134, -25953725, -27254901, -29314253, -32377257, -34126024, -26165526, -870966, 31074720, 44137077, 30916953, 16644931, 23593736, 35779133, 23636941, -6069992, -15796894, 7678433, 35084540, 40303865, 35122616, 40897070, 48925565, 34579626, -720870, -27048734, -23711348, -278535]
11125b78535K1144553O271957q315871j5231029j1251678j793059P40578n547449
11117a4260533n865257P533093J7782328P558487j0262763r935062N980378J1347772
11109I878443J533253J013770J7681369K3216404j835637l2308678l3903018j1754017
11101b6478111N885984J3273770K2075923K5230074O337418k0361977k1246359
11094D716722K778485J4053209k195015j6447307p314168M722075j903518j1883655
11086a3473172m812647N829091j269747j4395960q923731J0052518J9395878J7020336
11078I422566J5390804R949132r653213k7635496j9741236L697623J0624632j056922
11070i002110m420035N737167O454294n360592m223142J3365384J5655178p544622
$$ y = [-278535, 20866018, 27137975, 18822104, 3591075, -7660603, -9453662, -8713084, -14260533, -20125790, -12592697, 5189631, 12748118, 2485355, -7449707, -1469329, 9878443, 11411696, 12425466, 30106835, 53323239, 51487602, 19178924, -14724094, -26478111, -20592127, -7318357, 14757566, 39987640, 46325058, 25963081, 4716722, 7495207, 21548416, 19353401, 2906094, -4408074, 314001, -1589517, -13473172, -18285819, -12456728, -13726475, -28122435, -37046166, -26993648, -7597770, 9422566, 24813370, 34762502, 25109289, -2526207, -22267443, -18569820, -7945188, -9002110, -13422145, -7684978, -1230684, -6591276, -10814418, 2550966, 18206144, 10661522]
11062A0661522j9139666N421890L1963986J8578966j7891389k9204632r038172
11055h647495O198790j97205p017193k94779M522004l870637j0726520l328657
11047b3361692N123749o26136r372139j256409J7212323J9759562N8025j6662144
11039i124861q311453J3704976K1134401O803135r326029j0052391j280146K221435
11031E769067j956329o277022p394249o786019l576382K716401P497006Q578728
11023a428799J1403357J6537975J1868534p932469k4287951j7130771K993282
11016g976842Q709038k822501q987661j533544K300811n923688r856720J502035
11008b4589072J3406036J0026202j777496p913413p320280l627306M547111J2491326
$$ y = [10661522, -8478144, -3056254, 28907732, 47486698, 29595309, 390677, -8647495, -2448705, -2645910, -9663103, -9957882, -5435878, -9306515, -20033035, -23361692, -18237943, -18864079, -28236218, -29492627, -12280304, 7479258, 7537283, -9124861, -17436314, -3731338, 17403063, 24206198, 14880169, 4827778, 3547632, 5769067, 3812738, -2464284, -9858533, -16644552, -20220934, -17504533, -10007527, -1428799, 9974558, 26512533, 38381067, 30448598, 6160647, -10970124, -7976842, 732196, -2090305, -11077966, -12611510, -10310699, -16234387, -26091107, -24589072, -11183036, -1156834, -2934330, -10847743, -18168023, -21795329, -17248218, -4756892]
11000d756892Q231696n443553r083829J338977N409581m366468n439959J3889811
10992b20636K6786933R264392j8005972k2208334q711527k555484j629900R960980
10984g319548J9475266L440285k2365165j9723077Q492076K0438031L316555j0116084
10976d361661k046831K724503j2484718k3142411o987451J6579155J9577044Q410187
10968a732183M986021R190746Q347172M030866K619067l518997j9557102k8720452
10960b4354862j5279050O480662J2260936N091115N947513J6225892J7806106
10953B4178312O278554l278801l871097m684774q049057j940269J5773340K4878314
10945D9284522P923331k3383537l9766007k7891870k704238J2460160J0149814
$$ y = [-4756892, 3474804, -1968749, -11052578, -9713601, -4304020, -8670488, -14110447, -220636, 26566297, 35830689, 17824717, -4383617, -13095144, -15650628, -17280528, -7319548, 12155718, 15596003, -6769162, -26492239, -18000163, 2437868, 5754423, -4361661, -6408492, -3683989, -16168707, -39311118, -46298569, -29719414, -10142370, -1732183, 3253838, 12444584, 20791756, 24822622, 27441689, 23922692, 4365590, -24354862, -39633912, -33153250, -20892314, -15801199, -9853686, 6372206, 24178312, 30456866, 27178065, 23306968, 18622194, 10573137, 8632868, 24406208, 49284522, 57207853, 33824316, -5941691, -33833561, -36537799, -24077639, -13927825]
10938a3927825O69295m559685m056193q48982M736592J0929663J0880998K480073
10930F303936m444349j785143K635042j256836n018748N501324K0887135J6633824
10922C9456185p439914k2742386j3940683Q82801L569104K976187J1153034J6024881
10914B9939209J527750k1082520k6397859j0424049P159600J0287800N55143r889688
10906a8324614p766573J0837440L0283291K7565877L223603j5820849j3707805
10899A6290370n335317n899755n715136M918893J1106851m93j0740854j857412
10891B767147J0491392J566924j5703168j1097610Q903688J0960308p192539j3358262
10883a2662120L375164J6739357J0090349j001862l456225o635583j4390727j1853600
$$ y = [-13927825, -13258530, -17818215, -21874408, -22723390, -17986798, -7057135, 3823863, 6303936, 1859587, 74444, 2709486, 1452650, -3566098, 1935226, 22822361, 39456185, 32016271, 9273885, -4666798, -3783997, -214893, 2761294, 13914328, 29939209, 31466959, 10384439, -16013420, -26437469, -19277869, -8990069, -8434926, -18324614, -26091187, -15253747, 15029544, 42595421, 45819024, 29998175, 16290370, 10955053, 5055298, -659838, 4259055, 15365906, 15365413, 4624559, 2767147, 13258539, 14825463, -877705, -11975315, -3071627, 7888681, 696142, -12662120, -9286956, 7452401, 17542750, 16540888, 13084663, 6449080, -7941647, -19795247]
10875a9795247M201327J3089715M441512m425503j247652K21172j0231762j7210968
10867c0957406p908419L435516J508530k944211M515627J3271264O422331q094093
10859b0750861r857244K544573J4020562J6959795J4128476P105151k034075o563927
10851A5552450n235386n827421r523522p198875K91985p88460q963455k901330
10843b4594014J9082258K4872832j778849k6999967j4870949J5708778K1332079
10836A2752168J607194p763388K539510O949757l491866p089220M999178J2666878
10828B3170211N520906O54647P252112P069136j1452507k8914125k5934426j3687190
10820c6321236j0379059q042307J0257138L3631391L2912617M332474k1042402
$$ y = [-19795247, -15593920, -2504205, 1937307, -2488196, -3735848, -3514676, -13746438, -30957406, -38865825, -35430309, -33921779, -36865990, -32350363, -19079099, -12656768, -20750861, -30608105, -28063532, -14042970, 2916825, 17045301, 24150452, 22116377, 15552450, 10317064, 4489643, -5033879, -12232754, -11940769, -12729229, -21692684, -24594014, -5511756, 19361076, 17582227, -9417740, -24288689, -8579911, 12752168, 14359362, 6595974, 9135484, 16085241, 12593375, 5504155, 10503333, 23170211, 28691117, 29345764, 36597876, 43667012, 32214505, 3300380, -22634046, -36321236, -46700295, -54742602, -44485464, -10854073, 22058544, 26391018, 5348616]
10813E348616j7057819N365884J5361036K029741j4510339j1517636P269936J8769837
10805A1059256J1897003p48499m138772j69909J278280j516728m813832p943075
10797D903724r157869l688125M306305J652158j0243487r623095J0645314K2701953
10789A1496878L628785k3170658j9801483P154812J8939015P827094L434447J5215643
10781B4724533J5895528o239704k3039766j4223459l38892l807808j1697923n127143
10773b3854634M785067J285812l922478N721982J5835327M386272j6156962j6863595
10765b8783209p11670M517026n089275n914270Q798173J7578634R497263J114228
10757A006900M167192N526617n850690j6225426r528189N173589P946468j287644
$$ y = [5348616, -11709203, -6343319, 9017717, 11047458, -3462881, -14980517, -7710581, 11059256, 22956259, 22207760, 18068988, 17899079, 19177359, 17660631, 12846799, 4903724, -4254145, -7942270, -3635965, -1983807, -12227294, -21850389, -11205075, 11496878, 15125663, -8044995, -27846478, -20691666, -1752651, 6074443, 9508890, 24724533, 40620061, 34380357, 11340591, -2882868, -3221760, -7029568, -18727491, -23854634, -19069567, -17783755, -21706233, -15984251, -148924, 4237348, -11919614, -28783209, -29494879, -24977853, -30067128, -35981398, -27183225, -9604591, -107328, 1006900, 5174092, 10700709, 4850019, -11375407, -20903596, -15730007, -7783539, -9071183]
10749i071183m687880N562166J6672217J3257158l867175j9278445j8767675k488965
10741b2669782J5414154K0005851R245800n488956j1897931q522455m055343n570284
10733a3538946q735535l491659Q956297J2682118n37500j2882074j658443K3529498
10725D323756K7776768J224743k2426593j3415346J0556023J2509145q467892
10718A2080604k0190886q106631Q480508J1599701O490453J757294n458843j3251011
10710f598811p726823J2568281K4689239J1864422r639919j4197051m724832l389892
10702B844614j1853701q339235J2904234K5476168P657831k3047758l1536237
10695b5894084j2239449O313245L830261n305301K453199K2770055K8981210J0206917
$$ y = [-9071183, -13759063, -8196897, 8475320, 21732478, 17865303, -1413142, -20180817, -22669782, -7255628, 12750223, 21996023, 16507067, 4609136, -3913319, -7968662, -13538946, -22274481, -25766140, -16809843, -4127725, -4665225, -17547299, -19205742, 4323756, 32100524, 33325267, 10898674, -2516672, 8039351, 20548496, 12080604, -8110282, -16216913, -7736405, 3863296, 10353749, 12111043, 6652200, -6598811, -14325634, -1757353, 22931886, 34796308, 25156389, 10959338, 6234506, 2844614, -9009087, -17348322, -4444088, 21032080, 28689911, 5642153, -25894084, -38133533, -31820288, -27990027, -33295328, -30842129, -8072074, 20909136, 31116053]
10687C1116053j3354833j7501971l591938P868870N787371l89619K653341J3247513
10679B5834787J7094954N688554j2174643j9621436j1114749J743286N608119
10672A3058872J181292j819111m48884J73631o64696K830494J0492824J2808339
10664C7612761N235725l512730m526350k383189p122149j7234311j9874746p774396
10656a9579385J0212709J7577256P918994p032906j0190394j332894M52171j6057508
10648a8031957l2631093k2578228R716848L0045707J9289080k635243p714648
10641b4539534L149206R537893M491202j183955j183458j309270m475146l155107
10633a8668169Q277104K2092212K3568369P211045j4998736k3259401j0726674
$$ y = [31116053, 17761220, 259249, -3332689, 4536181, 10323552, 9933933, 12587274, 25834787, 42929741, 48618295, 36443652, 16822216, 5707467, 7450753, 13058872, 14240164, 12421053, 11972169, 12145800, 11481104, 14311598, 24804422, 37612761, 42848486, 39335756, 34809406, 32426217, 25304068, 8069757, -11804989, -19579385, -9366676, 8210580, 16129574, 9096668, -1093726, -2426620, -1974449, -18031957, -50663050, -73241278, -63524430, -33478723, -14189643, -16824886, -24539534, -21390328, -11852435, -7361233, -8545188, -9728646, -11037916, -15513062, -18668169, -10391065, 11701147, 35269516, 42480561, 27481825, 4222424, -6504250]
10626f504250P566655J2265805K952171n557866o588937o507715o800489R9991
10618i074635J2089162J3113518k921265j9847085k1409910j1673160l052358
10611d2775733J968747O454985R861468J3334892K0281323K3201273P665415k0183885
10603A9808485l0942551j1693220J2176447J2972204j585127p497772j838099
10596h599633L372826P410073J4354086J4548363m58201j6511872j6558960r339344
10588a1782662j1446136j4244642M60837K2977259K7465839J3958278N501053
10581C2889826Q169753O518970m192735j2744080j6159246j8836375j2418051
10574a6771938J0667322K9195616J6010723j4026680j9327856M430485J8234595
$$ y = [-6504250, 1062405, 13328210, 16280381, 10722515, 4133578, -2374137, -9174626, -9074635, 3014527, 16128045, 13206780, -6640305, -28050215, -39723375, -42775733, -40806986, -34352001, -24490533, -11155641, 9125682, 32326955, 39992370, 19808485, -11134066, -22827286, -10650839, 2321365, 736238, -6761534, -8599633, -5226807, 2183266, 16537352, 31085715, 30627514, 14115642, -2443318, -11782662, -23228798, -37473440, -37012603, -14035344, 13430495, 27388773, 32889826, 41059579, 47578549, 43385814, 30641734, 14482488, -4353887, -16771938, -6104616, 23091000, 39101723, 25075043, 5747187, 10177672, 28412267]
10567B8412267L095159j4449683j1684519j854133J37747M518314J7306898J8932644
10559D4414694k797112k6004216k4871787m514719J3445846J9117835J2077827
10552C0868368o962039k6341317k6520620p493568P130024M589687j172711J944818
10544b3957358N716401L126508J828760M259828J345194l488961N689253K2478854
10536A6998479J7897408j0882035k8663342j6995189j851770m534366o190155
10529c4220970R271959J7186688n007537l0543918k1146207J2920375L1403315
10522b0136295K3182673Q919757J038286l505154l916095J75957j505469j0493048
10514f239388q298074J0885310K0013693L05978k2831092j7589304M869966J3636464
$$ y = [28412267, 31507426, 17057743, 5373224, 3519091, 3656838, 8175152, 25482050, 44414694, 41617582, 15613366, -9258421, -13773140, -327294, 18790541, 30868368, 23906329, -2434988, -28955608, -36449176, -29319152, -24729465, -25902176, -23957358, -18240957, -15114449, -13285689, -9025861, -7680667, -11169628, -5480375, 16998479, 34895887, 24013852, -4649490, -21644679, -23496449, -28030815, -34220970, -24949011, -7762323, -12769860, -43313778, -64459985, -51539610, -20136295, 3046378, 11966135, 13004421, 9499267, 5583172, 5759129, 4253660, -6239388, -14537462, -3652152, 16361541, 16667519, -6163573, -23752877, -18882911, -5246447]
10506e246447P314334L558605J499690p376571j0738524M538968K1827737J8877346
10498C4255138L526520n191841p065544l585812J4669227L3195834J4168702k8175904
10490E5796320j6446902O2047824Q7238027l3669554j92350722j95244919l3340096
10483b65970022J02182534Q6067516L144896j6987519J9170413L1023501P770786
10476c3597895m367521K598173L225721R21042J3109731K2411315L811754k3323331
10468a5211011k3382478k419800Q758059O508725N661550K319671j1701960j9170966
10460d8638210l388113J6857665J6634318O761996Q159651Q948226j0465079l1637023
10452c6766569k2877177O528894K0570017J2059401K854880M46468n065398r824819
$$ y = [-5246447, 2067887, 5626492, 7126182, -250389, -10988913, -6449945, 15377792, 34255138, 37781658, 32589817, 25524273, 21938461, 36607688, 69803522, 83972224, 55796320, 39349418, 101397242, 188635269, 154965715, -37385007, -232629926, -265970022, -163787488, -77719972, -74575076, -91562595, -72392182, -41368681, -33597895, -37965416, -35367243, -32141522, -31220480, -18110749, 4300566, 8112320, -15211011, -38593489, -41013289, -32255230, -25746505, -20084955, -17765284, -29467244, -48638210, -52026323, -35168658, -18534340, -11772344, -3612693, 5335533, -5129546, -36766569, -59643746, -53114852, -32544835, -20485434, -17630554, -17184086, -22249484, -32074303]
10444c2074303j037360J3136128J3015679O34721o862921p912252j1078034j0745574
10436d2923916R39387J0369012K307204r598051m242948R258342R127018Q69165
10428b3894787K869803P210043m305206j7890764o078267K0191802K3934748L112924
10420E150296o714723P994310K0911133J3321336j261294q024240j0037550q925876
10412A2413392M7251P678272j592530j7698940j4662337M200867P957756r022542
10404a0678811j5364165M347631K2786846J3356092j1496232k3850925j6337354
10397c7236918J105707J7735020K2839126J1178774l921517l952554N118236J857872
10389A4723746j1562080j1637681K403187M398931j1154870j7238462k883099
$$ y = [-32074303, -33111663, -19975535, -6959856, -6325135, -13188056, -21100308, -32178342, -42923916, -41984529, -31615517, -29308313, -38906364, -43149312, -33890970, -24763952, -23894787, -21024984, -13814941, -18120147, -36010911, -42089178, -21897376, 2037372, 5150296, -1564427, 6429883, 27341016, 40662352, 39401058, 31376818, 21339268, 12413392, 12460643, 20138915, 18546385, 847445, -13814892, -9614025, -1656269, -10678811, -26042976, -21695345, 1091501, 14447593, 2951361, -20899564, -37236918, -36131211, -18396191, 4442935, 15621709, 11700192, 7747638, 12865874, 14723746, 3161666, -8476015, -6072828, -1673897, -12828767, -30067229, -32950328]
10382c2950328P084554j243737m956579J1344723K3652054R517180j2884283j7010832
10374a7447248q886436n017328J119622J7121234K3630825M687517j7332987j4151442
10366a6276243K096570K721517p489722n053463M788852L1748j1086481j918213
10358c2185435K0115431K0444262l392020j6069025l404237Q297436K281590l118209
10350g030207M641899P038354p392665j6088960j091266J6062335R064196q432273
10342c228587o963925Q118649P185126j1826784j9232316k034890J6256892J2774015
10334A048180l646895j1331630o832941k374008m018458o480800m159756L125353
10326c4670955J2537289J9304032J8111519Q910190j207225n981378o358542n172167
$$ y = [-32950328, -25865774, -27109511, -32066090, -20721367, 2930687, 12447867, -436416, -17447248, -26333684, -31351012, -30231390, -13110156, 10520669, 15208186, -2124801, -16276243, -14179673, -11458156, -18947878, -24001341, -19212489, -19180741, -30267222, -32185435, -12070004, 8374258, 4982238, -11086787, -14491024, -6193588, -3911998, -7030207, -2388308, 4650046, -2742619, -18831579, -19922845, -3860510, 5203686, -3228587, -10192512, -2073863, 5111263, -6715521, -25947837, -27982727, -11725835, 1048180, -2598715, -13930345, -20763286, -23137294, -27155752, -33636552, -37796308, -34670955, -22133666, -2829634, 15281885, 24192075, 22984850, 17003472, 10644930, 5472763]
10318E472763p17494Q220464J5338936J2687061J358447j0790125j9414216k3344352
10310a1188516j7311711K264118K3534477K5765156N819770j4340327j5658240
10303a115273o421089o332724j4892348j2566912Q025319K8399728K7251635O991500
10295B9339836j0449066j0319949q29518m11398j2060983j7151661l97093K5016572
10287B736740L0514186R791751j3288591j8869316j3963804j1141786n562837
10280a9783657Q323729J5870201L332280j3337698r290195Q450715J2080684k0138
10272E625921k064984J1964493J6634706L54966j2729552l679559Q781623q2038
10264B4805576k0557848k5347445j0453359N388916J0788229R020708L733926
$$ y = [5472763, 4755269, 12975733, 28314669, 41001730, 42360177, 31570052, 12155836, -11188516, -28500227, -26236109, -2701632, 23063524, 28883294, 14542967, -1115273, -7536362, -13869086, -28761434, -41328346, -33303027, -4903299, 22348336, 29339836, 18890770, 8570821, 7741303, 7329905, -4731078, -21882739, -22279832, 2736740, 33250926, 43042677, 29754086, 10884770, -3079034, -14220820, -19783657, -11459928, 4410273, 7742553, -5595145, -14885340, -6434625, 5646059, 5625921, 3560937, 15525430, 32160136, 32515102, 19785550, 16105991, 24887614, 24805576, 4247728, -21099717, -31553076, -26164160, -15375931, -6355223, -2621297]
10257b621297k637043k492339P334195J5154405R142960l521556p413626k784705
10249A0160994k639707r764392j2743520m848282N946639Q070357r9192r260253
10241a5177356q925298O41248P298957L268395j686543M827239J4439815Q889582
10233A3576039p338550j0751667J117844L418365j1721269j7297334K740689K1307059
10225d948824R593253j6023656k1336586p195613Q10727r36170M125098J5019359
10217b0892412J5468767P581052O683022P379319p276256k5235300j5287267J8502374
10209a3076701L3230346R324236k0924975k2972891n249193N083803L983363M816168
10201e785844R912213J0291774L616157l488404n301535j797983L74797p864105
$$ y = [-2621297, -5258340, -7750679, -416484, 14737921, 23880881, 20359325, 12945699, 10160994, 7521287, -2243105, -14986625, -19834907, -13888268, -5817911, -5917103, -15177356, -24102654, -23461406, -16162449, -12894054, -14580597, -9753358, 4686457, 13576039, 6237489, -4514178, -3396334, 22031, -11699238, -28996572, -26255883, -4948824, 4644429, -11379227, -32715813, -39911426, -39100699, -40036869, -35911771, -20892412, -5423645, 2157407, 8840429, 16219748, 8943492, -16291808, -31579075, -13076701, 20153645, 29477881, 8552906, -14419985, -19669178, -14585375, -10602012, -5785844, 4126369, 14418143, 18034300, 14545896, 9244361, 7446378, 7821175, -42930]
10193d2930k2706864k2950656J331251K4069059J3685604j7494320k7456090o807365
10185e8372311J1339081Q127516K969398Q437996N928004j1321235j3800292J3993383
10177c2698460L6401232J8556403j4779795j5944923J2111979K5405771R134760
10170C8186967q109499o983663j218228m173246q158419o327685n752641q486024
10162a1022438l787344J0671032K0038734J4435659L121358k322323m384031r801164
10154A6949483j4744570j0380687J802247Q460013k94424j5802860j6240229O113570
10146b4137457K7838824K0040003r660054k3036086n359289J2961842M166876
10139B814659j4265806r956485J2916895K3489109J1906501l892675j0604833
$$ y = [-42930, -22749794, -45700450, -44369199, -20300140, -6614536, -24108856, -51564946, -58372311, -47033230, -38905714, -35936316, -27498320, -21570316, -32891551, -46691843, -32698460, 3702772, 22259175, 7479380, -8465543, 3646436, 29052207, 38186967, 30077468, 23093805, 21875577, 17702331, 9543912, 3216227, -2536414, -11022438, -14809782, -4138750, 15899984, 30335643, 33457001, 31134678, 26750647, 16949483, 2204913, -8175774, -6373527, 2086486, 1792062, -14010798, -30251027, -24137457, 3701367, 23741370, 14081316, -8954770, -14314059, -1352217, 2814659, -11451147, -21407632, -8490737, 14998372, 26904873, 23012198, 12407365]
10132A2407365r907145l131205P146272P294571q325046j7186670K185990K9388087
10124A9872219K5638615o801056k6840161j6109540J047634L967863K389352O035880
10116I200806M609152o390375j1760446m180588K699285J866795M340961J0718342
10108A1103932L946381j4545828j6603681N106250J7335703m32317j8404122n103496
10100a7597178J8295257J2662856j3949293k0430924J802692K0942470J7333196
10093A9059076M277137l999656r856766j3477728p180089M826970O366432m304083
10085d288707r634762k37643J2116725J4365633P667848j629996j0356458j3313778
10077e311138m770817R774733J5950484Q864627j406200m975745k759259n06018
$$ y = [12407365, 2500220, -630985, 6515287, 13809858, 5484812, -11701858, -9515868, 19872219, 45510834, 38709778, 11869617, -4239923, -3192289, 775574, 3164926, 9200806, 13809958, 7419583, -4340863, -8521451, -5822166, -3955371, 385590, 11103932, 15050313, 504485, -16099196, -10992946, 6342757, 5910440, -12493682, -17597178, 698079, 13360935, -588358, -21019282, -19216590, 1725880, 19059076, 23336213, 19336557, 9479791, -3997937, -11178026, -6351056, 15376, -4288707, -13923469, -14161112, -2044387, 12321246, 19989094, 18359098, 8002640, -5311138, -10081955, -307222, 15643262, 24507889, 23101689, 18125944, 15366685, 14860667]
10069A4860667j378642n204245p986389m099310M838796R071153N872367N816631
10061B1791028J3371766J4065424k582255j9856012j5864782L81271J334888j4738749
10053b097421k0536559l506433J4648578J1044574q447692k3358172k4501755
10046e6754880j4543866K088197J8144069K3324107J5118923L042960k812827
10039a2393317n06251O884891J3052090Q303175r143377k2948571j5781699L968291
10031b8564768J1761865M175351L331758J7917268K5060061N762841k2375694
10024A7068682k7708753o762502J5445042J9708044R974000p9704l427140k390132
10016B1827537l436241r361595j3886579q583211L101446P437567k14858p741772
$$ y = [14860667, 13482025, 8277780, 291391, -3807919, 1030877, 10102030, 15974397, 21791028, 35162794, 49228218, 46645963, 26789951, 10925169, 11306440, 12641328, -2097421, -22633980, -26140413, -11491835, -447261, -8894953, -32253125, -56754880, -71298746, -69210549, -51066480, -27742373, -12623450, -9580490, -12393317, -12899568, -6014677, 7037413, 15340588, 6197211, -16751360, -32533059, -28564768, -16802903, -12627552, -9295794, 8621474, 33681535, 39444376, 17068682, -10640071, -17402573, -1957531, 17750513, 27724513, 27644809, 24217669, 21827537, 18391296, 9029701, -4856878, -13440089, -10338643, -2901076, -3115934, -10857706]
10008a0857706l823085O858145J2975462J1324115M270822p528127j9660602j9861096
10000b6302072j903066K1007320K8215079J5200187l713565j4394130j5642660
9993B467093j2781600p359454J798709J0971353J1652615J552238q189096m284451
9985d172593R783977J5662457M906988r094812j1521080o404750m879804n299962
9977a1019579j160464J890257l593451q627984j943923O080864n14236j0294071
9969b9182587J285296K7021039L2278689Q150093j5089796j6562437j1116825
9962c216528j3263626j0613646O159238J9092887J3152034K805159L399509K773497
9954B0288524j1429194k2175063j1616255M251825L006739l499018P193247K2315807
$$ y = [-10857706, -14680791, -7822646, 5152816, 16476931, 20747753, 13219626, -6440976, -26302072, -28205138, -7197818, 21017261, 36217448, 32503883, 18109753, 2467093, -10314507, -17673961, -15875252, -4903899, 6748716, 8300954, 111858, -4172593, 5611384, 21273841, 26180829, 17086017, 5564937, -839813, -5719617, -11019579, -12180043, -10289786, -13883237, -22511221, -24455144, -18374280, -18888516, -29182587, -27897291, -876252, 31402437, 39552530, 24462734, 7900297, -3216528, -16480154, -27093800, -20934562, -1841675, 11310359, 14115518, 17515027, 20288524, 8859330, -13315733, -24931988, -20680163, -17673424, -21172442, -13979195, 8336612]
9946H336612J3382302j0842583j4941899M560494J4623291J032706j3045375j0413263
9938g307715l227669k347330J219489J0018797P717620r535168j8337153n099199
9930b6898328P827871k728543k0880408j5731529Q420851J7654478R67379j3202229
9922d4570458p02280K2730607K6110743P865235n908011k385898K805712l442032
9914B503618q672163J606925J5459442J2394686k080753o183758J027490J607004
9906A7662491n760439n052732J933819l672674j7064399j0429515J4671481J9695735
9898A1983767p319033k5806937p069000J9601577J8675894L721380J741904L069860
9890A8599412q355581j3348220M735690J7880948J817372j2114222P583421K6204292
$$ y = [8336612, 21718914, 10876331, -4065568, 494926, 15118217, 16150923, 3105548, -7307715, -10535384, -12882714, -11663225, -1644428, 6073192, -3461976, -21799129, -26898328, -19070457, -21799000, -42679408, -58410937, -49990086, -32335608, -31368229, -44570458, -45272738, -22542131, 3568612, 11433847, 5525836, 3139938, 5945650, 2503618, -6168545, -4561620, 10897822, 23292508, 21211755, 15027997, 16055487, 17662491, 11902052, 6849320, 8783139, 5110465, -11953934, -22383449, -7711968, 11983767, 4664734, -21142203, -28211203, -8609626, 10066268, 13787648, 15529552, 18599412, 10243831, -3104389, 1631301, 19512249, 21329621, 9215399, 16798820, 43003112]
9882D3003112J440672l1999902j8058128J7810992J6042203j826098J9734192
9875D6147043L3723760n5212178j94471589k00774015k4773109J49296978J51481440
9868i4581670M4991514o862711J9599476L1741631L241725r780578M414953J646924
9860e588736j7375453p325297K5666333K7596706m870249k0019152n353895l14795
9852g584538j3429694j0957740P537955N009349j4860766p561383K4325628K6795124
9844I273935o756070j7207460J6554404L9070637J5194759j3987941j0920240
9837C1222024k357519j5008216j9878266O807620K8320091R403966j8754488j2590226
9829G164986J0293921Q956448r105005j1461804k330227m316665p866158N797265
$$ y = [43003112, 44443784, 12443882, -5614246, 12196746, 28238949, 26412851, 46147043, 79870803, 24658625, -169812964, -370586979, -395360088, -246063110, -94581670, -49590156, -56452867, -36853391, -5111760, -1870035, -11650613, -7235660, -5588736, -22964189, -30289486, -4623153, 22973553, 18103304, -1915848, -7269743, -7584538, -21014232, -31971972, -24434017, -19424668, -34285434, -41846817, -17521189, 9273935, 2517865, -14689595, 1864809, 40935446, 56130205, 42142264, 31222024, 28864505, 13856289, -6021977, 785643, 29105734, 38509700, 19755212, 7164986, 17458907, 26415355, 17310350, 5848546, 3518319, -798346, -8664504, -2867239]
9821b867239J7187645p41736k6654903k0680756Q161348J8753500O620049J177768
9813I55676O358165j41341j4838761j0887180Q393607J0783492p226928j4026643
9805b0629913K76275R304176K127138K006494J8406340K4374881K830481k1613888
9797A7081984k0562548k226709Q362392N591610o22155n311490p247445l091018
9789h025379L926801M149671j305376n70868O006681M213319o338403q022745
9781e966299J736569J097853j7464155k7182239p637666J9031483J9619291p72585
9773a7537748j0305414N51907J1468288Q467137j76251m335297m419791q39797
9765a7126966Q138732J4581222O566354r188238r624179J1205259K8641973J9898383
$$ y = [-2867239, 14320406, 13578670, -13076233, -33756989, -25595641, -6842141, -222092, 955676, 7313841, 7172500, -7666261, -18553441, -10159834, 623658, -6603270, -20629913, -20353638, -11049462, -8922324, -6915830, 11490510, 35865391, 38695872, 17081984, -3480564, -5707273, 2655119, 8246729, 7624574, 2313084, -4934361, -8025379, -4098578, 51093, -1254283, -1825151, 4181530, 8394849, 2056446, -5966299, -4229730, -3131877, -20596032, -47778271, -55415937, -36384454, -16765163, -17537748, -27843162, -27291255, -15822967, -7355830, -7532081, -11867378, -16287169, -17126966, -8988234, 5592988, 12159342, 2971104, -6653075, 4552184, 33194157, 53092540]
9757E3092540m318404j6360463r492140o57016o70208k562059j448488n074877
9749A2508885j5142177j6285380L15719J5754298O929361j6085658k0830864l77415
9741c3213231J5907404P281455q383407n706861Q716457J0958921p41835p507991
9733a2689088l663301k271506p380831o073186O216440J4126649O147676o203746
9725a1790893m799430R776221K0182902J4503666j117480j0448399n208484M515622
9717A5613725J490723j4407952k2156513q284741J1146078J2289481j805680q124591
9709a4239470O65782J0671403J4203964J6781332J5525533q17222k3553652k5121337
9701e883667j167199J6433453O101441j0366772m197936J4152668J4009593o545633
$$ y = [53092540, 48774136, 32413673, 22921533, 22264517, 21594309, 19032250, 17583762, 12508885, -2633292, -18918672, -18602953, -2848655, 4080706, -12004952, -32835816, -33213231, -17305827, -10024372, -18407779, -24114640, -15398183, -4439262, -5181097, -12689088, -16352389, -18623895, -26004726, -32077912, -25861472, -11734823, -5587147, -11790893, -16590323, -6814102, 13368800, 27872466, 26754986, 16306587, 11098103, 15613725, 17104448, 2696496, -19460017, -27744758, -16598680, -4309199, -6114879, -14239470, -13573688, -2902285, 11301679, 28083011, 43608544, 42791322, 19237670, -5883667, -7050866, 9382587, 15484028, 5117256, 919320, 15071988, 29081581, 22535948]
9693B2535948k1428414j7233220m359232P262448J6008784J4605152m158504k5766570
9685a2533608k3612971L631977K5868802K0254626k390100j7545813j6264747
9678b2591834m966879R249238K0828939K2294960J0117306q553147k0876463j9170925
9670a3668805o619553N018689N689636j237195k496733N317313R000116L98651
9662A402119p402447l33460J1849331J0800141q8390m268025k912254q914578
9654A32437j5295308l433794J6817749J3441896j3209354k2563605K163462K2254533
9646C08016L811861k5814246k0025113J4508455L0936439J3658380o821995o483466
9638D078331M189447P887654L202188o055769j7145740j9579888m641504J3849165
$$ y = [22535948, 1107534, -16125686, -20484918, -13222470, 2786314, 17391466, 13232962, -12533608, -36146579, -32514602, -6645800, 13608826, 11218726, -6327087, -22591834, -27558713, -18309475, 2519464, 24814424, 34931730, 26378583, 5502120, -13668805, -20288358, -15269669, -9580033, -10817228, -13313961, -7996648, 1003468, 1402119, -6000328, -6333788, 5515543, 16315684, 16227294, 11959269, 9047015, 132437, -15162871, -18596665, -1778916, 11662980, -1546374, -24109979, -21946517, 308016, 4119877, -21694369, -41719482, -27211027, 3725412, 17383792, 10561797, 4078331, 8267778, 16155432, 19357620, 13301851, -3843889, -23423777, -28065281, -14216116]
9630a4216116J3225830k465315q027984N62579J683801q696184n784547J8038747
9622e679189L1791159J3022259j4563645j8505733o596671o122093j4700904r042084
9614c0396901R243909J5162860M363492r93727O494270P157684p207217j4808888
9606a0984518q86021J3726419M440020j5732140j4029557J1959418K9410761J6214090
9598C4118472j1177805k3293113j3920859M74728O472904N328827L264400K519747
9590C787301K999106M097669K581192m715049j3588337j4375996n180897K622916
9582b1772095j873681j3576314j6517648l702815J3954133J9657793Q502112p771502
9574b3100017j2783437k435060J1119082J4581908R489113O456964O686639J781720
$$ y = [-14216116, -990286, -3455601, -11483585, -10921006, -9237205, -17933389, -23717936, -5679189, 26111970, 39134229, 24570584, 6064851, -531820, -6653913, -21354817, -30396901, -21152992, -5990132, -1626640, -2620367, 3873903, 11031587, 3824370, -10984518, -11870539, 1855880, 6295900, -9436240, -23465797, -11506379, 17904382, 34118472, 22940667, -352446, -14273305, -13798577, -7325673, -1996846, 1267554, 3787301, 6786407, 10884076, 13465268, 8750219, -4838118, -19214114, -24395011, -21772095, -23645776, -37222090, -53739738, -57442553, -43488420, -23830627, -15328515, -23100017, -35883454, -38318514, -27199432, -12617524, -3128411, 3328553, 10015192, 11796912]
9566A1796912p371344q055745J773125O101755l025306j0135043k712336N661828
9558e966154r8311p022710K689900J4701623M420528j4948858q791106J7395586
9550B380498K0384464r625580k9575561j3362747P079863m80687j3769927J258237
9542c5711440K7911150K5953266j657273j6871377q164434J033637j156569k167159
9534a0830199K865509L446669r99569q05875Q2527q447966j5007722j361086J8288705
9525a2769007J1930166j5358031k3322569j85879J8787197R903256l999966J891766
9517a3123067J3074876O221324j0042639j4430269r046577p411086o050964L939643
9509c6868759J2810553O762107n333871m621249P952967J6756408J7301846J5818796
$$ y = [11796912, 4425568, -3630177, -1857052, 4244703, 1219397, -8915646, -11627982, -5966154, -6064465, -13087175, -10397275, 4304348, 8724876, -6223982, -15015088, 2380498, 22764962, 13139382, -16436179, -29798926, -22719063, -23199750, -36969677, -35711440, -7800290, 18152976, 16495703, -375674, -8540108, -7506471, -8663040, -10830199, -7964690, -4518021, -5517590, -6323465, -6240938, -14688904, -29696626, -31057712, -12769007, -838841, -16196872, -39519441, -39705320, -20918123, -11014867, -15014833, -13123067, -48191, 6173133, -3869506, -18299775, -27346352, -34757438, -40808402, -36868759, -24058206, -17296099, -22629970, -27251219, -19298252, -2541844, 14760002, 30578798]
9501C0578798J1456136R2546j0345516q467653N31427P98093j0853855k1548918
9493g758942j9323758l211268J7767669K7175275J2777055j4482907k5594938
9486a2651814r437910J0522420R639191l809905o632641K390644P186888M853767
9478B060640N807830R671826N787941m802234j0046545p764580n635860l270957
9470h191939M565495R656201j338051k0168407k2304849k265936J8362176K2760826
9462A075516J7145564J1053576J634947j1384195j4383251J150807K0667031K2353700
9454D9313695M425087j4408805j7955049q360709q70463o473175j8640247j9034368
9446c2004034m80489K0548043K2828252O878661r071120j5015371j5688783j3617904
$$ y = [30578798, 42034934, 42127480, 31781964, 23314311, 23845738, 24643831, 13789976, -7758942, -27082700, -30293968, -12526299, 14648976, 27426031, 12943124, -12651814, -22089724, -11567304, -1928113, -5738018, -12370659, -9980015, -2793127, 2060640, 7868470, 17540296, 23328237, 18526003, 8479458, 714878, -4920982, -8191939, -3626444, 6029757, 4691706, -15476701, -37781550, -40047486, -21685310, 1075516, 18221080, 29274656, 30909603, 19525408, 5142157, 6292964, 26959995, 49313695, 53738782, 39329977, 21374928, 13014219, 12143756, 5670581, -12969666, -32004034, -32484523, -11936480, 10891772, 17770433, 8699313, -6316058, -22004841, -35622745]
9438c5622745m649510O841623P204727m619915j0757263L55675J6074943J8094571
9430g077894P753890L51047J846368L972241m80378p576811p776654K975411J7038394
9421A1025614J9696663M674286j5287190k1275214j2059964m214506o038026n775765
9413b9254102O048764J7006769J0566250n814684r353600L520406J0636818k951067
9405D05554k2180768k3141068n284526J2044324J8480903K0407163K0532613R796578
9397C1060773j1856676k4345703j3274393N283594N983476p483990r277779O016484
9389a7894214J5661729Q432056K211968Q591136R032807j0904980k8396040j5195195
9381b8460733J4175624K0929966J74748j5396730q760452N95427m067302j0088566
$$ y = [-35622745, -40272255, -33430632, -26225905, -30845820, -41603083, -41247408, -25172465, -7077894, 675996, 1027043, 2873411, 6845652, 6365274, -1211537, -8988191, -6012780, 11025614, 30722277, 35396563, 20109373, -1165841, -13225805, -17440311, -23478337, -29254102, -23205338, -6198569, 4367681, -1447003, -10800603, -7280197, 3356621, 405554, -21775214, -44916282, -50200808, -38156484, -19675581, 731582, 21264195, 31060773, 19204097, -5141606, -18415999, -13132405, -7148929, -14632919, -23910698, -17894214, -2232485, 6199571, 8411539, 17002675, 26035482, 15130502, -13265538, -28460733, -14285109, 6644857, 6819605, -8577125, -17337577, -16742150, -20809452, -30898018]
9373c0898018k276861J0778408J4639993J1777542Q856170K71926j6163735k3155834
9365b6170409o055670J9113536K2476587P67846j9519639j8644757m467284N887227
9357b6612563P858658N386864j447936j2810495k0132467j3778024R46945P194694
9349e3394324j42090n384909M865943J9085846J6559269P85874l668284J0054986
9341a1237689J9154514Q460791m203500J059460J1339658M055340j0975625o161835
9333A1491114J4985290K0187071M52711j6478843j2755194n544225j0698098j3680650
9325a2040824Q24837J6534798J0269597q874922j3582929j103373N659993l520957
9317e833780j1726927k836107J4030670J6469422k624462k4942153k5750373k799301
$$ y = [-30898018, -33174879, -22396471, -7756478, 4021064, 12877234, 13149160, -3014575, -26170409, -32226079, -13112543, 9364044, 10131890, -9387749, -28032506, -32499790, -26612563, -18753905, -13367041, -14814977, -27625472, -47757939, -61535963, -60589018, -53394324, -53536414, -58921323, -54055380, -34969534, -18410265, -17624391, -21292675, -11237689, 7916825, 16377616, 12174116, 13233576, 24573234, 28628574, 17652949, 11491114, 26476404, 46663475, 47116186, 30637343, 17882149, 12337924, 1639826, -12040824, -11215987, 5318811, 15588408, 6713486, -6869443, -7972816, -2312823, -5833780, -17560707, -20396814, -6366144, 10103278, 7478816, -17463337, -43213710, -46013011]
9309d6013011J8510743J6072698J045709J028282J6672782J9523398j635718k0051671
9301E153212j1934757P317821J0717081K318849L096855R160048j475564k5409923
9293a056378l1921352r484252J5719724J8767500Q638086O540031J1267986O455230
9285B4926575q388230j5263820n007632R555489J2532622N358920J0097j002123
9277B2721898n963753j5915282j8397932o081570Q758916R856627p676n424801
9269a0453573k703675r00523j063086N319103J5296996J3707225j75166p086614
9261A1940687J037199O269044m673319j6357328j0334369L789382N877884j255188
9253c706008j344932L797210N1107q317102k661715J5827145K2979775P264018
$$ y = [-46013011, -27502268, -11429570, -10383861, -9355579, 7317203, 26840601, 25204883, 5153212, -6781545, 536276, 11253357, 13572206, 16669061, 25829109, 24353545, -1056378, -32977730, -42461982, -26742258, -7974758, 663328, 7203359, 18471345, 24926575, 16538345, 1274525, -3733107, 5822382, 18355004, 23713924, 23724021, 22721898, 16758145, 842863, -17555069, -23636639, -14877723, -5021096, -5028772, -10453573, -13157248, -14057771, -15120857, -9801754, 5495242, 19202467, 19027301, 11940687, 12977886, 19246930, 14573611, -1783717, -12118086, -8328704, -2450820, -3706008, -5050940, -1253730, -1202623, -9519725, -12181440, 3645705, 26625480, 33889498]
9245C3889498j4177006k1359613j4173134l089370N290576O555241j819340j1629098
9237b0512246q638227O632546J5638593O982578p043194q093392L666987J2623600
9229A257245R349470k02234n223086l095943m17923k587523m809474J841953J4637728
9220A0750213J8193877N552919q594864o801761N556541P606507o860106k1196496
9212D206830j9322828n061949N766872M271432m136788p193100M3016P513619
9204a3912896K093026j1047206j0761434R239402K6308448J9191379j114397r333343
9196A0662979l276357n66740o099201q335528m381922k676582j608434P786845
9188h494940J6846486O186722j7371468k1592639K431660K2209324J1374149j1652664
$$ y = [33889498, 19712492, -1647121, -15820255, -18909625, -13619049, -7063808, -8883148, -20512246, -29150473, -22517927, -6879334, 103244, -6939950, -15033342, -11366355, 1257245, 10606715, 10404481, 5181395, 2085452, 1667529, -919994, -5729468, -3887515, 10750213, 28944090, 34497009, 25902145, 19100384, 24656925, 32263432, 25403326, 4206830, -15115998, -20177947, -14411075, -10139643, -14276431, -21469531, -21426515, -13912896, -11819870, -22867076, -33628510, -24389108, 1919340, 21110719, 19996322, 10662979, 7386622, 6819882, 720681, -7614847, -11996769, -14673351, -16281785, -8494940, 8351546, 14538268, -2833200, -24425839, -21994179, 215145, 11589294, -63370]
9180f3370j4450990K117418J2899891Q857285K107933N3466j239823k734623j784991
9171E762196j786522n099425k258754J3152196K5171755J3369850j2483706k0179344
9163A5648246q98578J6512847O657614j7622745k6547331j4365703l78748K917903
9155a8076495K648586O386085P968103r8239j1766585j5200593r193465j757923
9147c9090526M030876J1270561J6656183R961458q178734j9201964q113017J3744311
9139a8920852J9082452k625504l1528140l8299075j4219829K0050095L3838245
9132c2622608J6868319q818321j2914152O616084K1894970J3853541k997167n772325
9124c891659K687172M140814k235639j976324M667418J319665j3856832k0935713
$$ y = [-63370, -14514360, -12396942, 502949, 9360234, 11468167, 11521633, 10281810, 7547187, 5762196, 3975674, -1123751, -3382505, 9769691, 34941446, 48311296, 35827590, 15648246, 14749668, 31262515, 37920129, 20297384, -6249947, -20615650, -20994398, -18076495, -15427909, -9041824, -1073721, -1171960, -12938545, -28139138, -37332603, -39090526, -35059650, -23789089, -7132906, 2828552, -5350182, -24552146, -32665163, -18920852, 161600, -2463904, -33992044, -72291119, -86510948, -66460853, -32622608, -15754289, -24572610, -37486762, -30870678, -8975708, 4877833, 1880666, -3891659, -1204487, 2936327, 700688, -1275636, 3391782, 4711447, -9145385, -30081098]
9116c0081098q977420P135032J0299873L827429j62223K22199N77310J265772
9108a5893126M015771O234558O032198M881950J772536m970895q621612q35694
9100g384314J0757919Q918461o057812j5158779j1225189p657024r032615l86076
9092c7225429J9725929K4314050k38417k2813482r362579K2519800K7277494m91646
9084B3705720k0708603j0543127N809799R35993j4517326j3923193L522669J5291922
9076a0426146R382083l287804p421869q87451P200464Q371326L068287l43197
9068E655693M962908J4993793J6972902K316265k2419849l8018499k8749119j73619
9060d4459525K1404146J5567067o199963j2858009M709043K0113009R352622j3442314
$$ y = [-30081098, -39058518, -31923486, -21623613, -17796184, -17958407, -17736208, -17158898, -15893126, -11877355, -5642797, 389401, 5271351, 7043887, 2072992, -6548620, -7384314, 3373605, 12292066, 6234254, -8924525, -20149714, -27806738, -36839353, -37225429, -17499500, 6814550, 6576133, -16237349, -25599928, -3080128, 24197366, 23705720, 2997117, -7546010, -1736211, -800218, -15317544, -29240737, -25718068, -10426146, -1044063, -4331867, -11753736, -12641187, -5440723, 2930603, 5998890, 5655693, 10618601, 25612394, 42585296, 44901561, 22481712, -15536787, -44285906, -44459525, -23055379, -7488312, -13688275, -26546284, -21837241, -1724232, 7628390, -5813924]
9052e813924j6528948L241700J7854455R945518n865026r070911j066344M139762
9044c163718K731863R31173M04629k268357m802240o52034P725251Q040556m372920
9035D574203j6483487j3405586K45575O193618k57400k625635J0185424K3256628
9027A1683340J6371692l489109j0477700J181131Q490384m605815k2951155k3002631
9019b6799863m636084J3217627J7915661J1517975K168297j855531L490903J0761383
9011B5780368O143506j0531030k1359803j4704815j871305J377072k813512l842876
9003b1822395j947622k168321j94801Q261934J3616325O307550m192846l553610
8995e693786K739776J91168p061793m066166M658758O12351j2984899j0564239
$$ y = [-5813924, -22342872, -19101172, -1246717, 8698801, 2833775, -6237136, -7303480, -3163718, -431855, 499318, 903947, -1364410, -6166650, -6818684, 906567, 8947123, 4574203, -11909284, -25314870, -25069295, -18875677, -19133077, -21758712, -11573288, 11683340, 28055032, 24565923, 14088223, 15269354, 23759738, 19153923, -3797232, -26799863, -31435947, -18218320, -302659, 11215316, 13383613, 11528082, 15018985, 25780368, 31923874, 21392844, 33041, -14671774, -16543079, -15166007, -17979519, -21822395, -23770017, -25938338, -26133139, -17871205, -4254880, 2052670, -2140176, -5693786, -2954010, -2762842, -9824635, -13890801, -9232043, -8619692, -21604591, -32168830]
8987c2168830J3636739L0250213J5437227j4439316k5775755j1296282N913003
8980a8443001M566064j1663643k0768412n968669K4986636M3765754L0926186
8973D7400915k54055j9160407j4774458l590550j429008m634156l429919K525673
8965B654035R083967J4200065J2785124j152163j9847740k3833499q127834P695291
8957f542754O894081j115971M17804O584077J420223r550867k433965K5445555
8949B1118183M1550240J8251739k6337139m6858124k6690633M391642J3582496
8942i91596N701158M236636Q389846j990822k3128869k4190293K252176K0337028
8934i384736L678795k1043335j4839677J1996070J8706662O52524p934621N313973
$$ y = [-32168830, -18532091, 11718122, 27155349, 12716033, -13059722, -24356004, -18443001, -13876937, -25540580, -46308992, -52277661, -27291025, 16474729, 47400915, 47146860, 27986453, 13211995, 9621445, 8192437, 3558281, 128362, 2654035, 11738002, 25938067, 38723191, 37571028, 17723288, -6110211, -14238045, -6542754, 351327, -764644, -346840, 6237237, 7657460, -1893407, -4327372, 21118183, 62668423, 80920162, 54583023, 7724899, -18965734, -14574092, -991596, 4709562, 8946198, 17336044, 15345222, -7783647, -31973940, -29721764, -9384736, -5705941, -26749276, -41588953, -29592883, -10886221, -10233697, -18168318, -12854345]
8926a2854345J3889185L628063l482829O821441J3551361N6882j3606762o016422
8918A986574O947585L14558j5971931j4643372L726056J5781490J3788047P980144
8910A9909151K40529j3318822k0595115o526458J5281263J5885693l733083j2603585
8902e460427Q00005J1131404j169243j8864021j6369072K869024J5971227J2142517
8894A051414k067438j6748305k2549182j1233011J2052949K4945351J1751599
8887b796623j3564180k2284529o143109J5145906K0587506J0085808j833272m566724
8879e369217N27787M968392K352685n022108q160851k228446O247451P445610
8871G61303K011204j02906M515048O324925k191213j1894921p696981P712602
$$ y = [-12854345, 1034840, 4662903, 1180074, 8001515, 21552876, 21609758, 8002996, 1986574, 8934159, 9248717, -6723214, -21366586, -17640530, -1859040, 11929007, 19909151, 20149680, 6830858, -13764257, -20290715, -5009452, 10876241, 7143158, -5460427, -4660422, 6470982, 5301739, -13562282, -29931354, -27062330, -11091103, 1051414, -1016024, -17764329, -40313511, -51546522, -39493573, -14548222, -2796623, -16360803, -38645332, -44788441, -29642535, -9055029, 1030779, -802493, -5369217, -4841430, 126962, 2479647, -2542461, -10703312, -12931758, -6684307, 761303, 2772507, 2669601, 7184649, 13509574, 11318361, -576560, -8273541, -560939]
8863e60939J3469700p42984j6782779j0953478J1434698K1172434O131961j0854466
8855A2314147n098418J4034392J8267574L476427n614030L515199Q858178j2283771
8847C7469698m3024791m4012397q156686K5214018K0192384q919638j7719934
8840c8957346R093253L8638332L3485208j712636k8837926k3931361k153388O573634
8832g802230m077016j2591416k020617J5098480J4225707l961981j1582433M633418
8824h078088J8438044Q41257l0729597l0282128R857336M3558461L4767485N095903
8816D3468673n623868J616552k77963j0099207k014963K1397719K4507711m271501
8808F8703153l0255215k4552059m587817K78816n611883k504325L344758p688748
$$ y = [-560939, 12908761, 12165777, -4617002, -15570480, -4135782, 17036652, 23168613, 12314147, 7215729, 21250121, 39517695, 42994122, 37380092, 40895291, 49753469, 37469698, -5555093, -49567490, -57724176, -32510158, -12317774, -21237412, -38957346, -29864093, 8774239, 42259447, 40546811, 11708885, -12222476, -14375864, -7802230, -11879246, -24470662, -26491279, -11392799, 2832908, -1129073, -12711506, -8078088, 10359956, 11201213, -19528384, -49810512, -39953176, 3605285, 38372770, 43468673, 37844805, 39461357, 39183394, 29084187, 27069224, 48466943, 72974654, 68703153, 38447938, 13895879, 9308062, 9586878, 3974995, 1470670, 4815428, -2873320]
8800b873320k6186340k1469942Q108375K6778528J2446423j2217610j5390784
8793c0804670m32883O897528J241445J592636J5401945K4226945J3298493m664669
8785B6756770j0202588p309593j2448414k1620496j4247156R121634K0691511
8778i258332P443218o973994n09337J1324819L932228j2103496r315520P187263
8770h273151Q119554o938384p865269J0407418J5120043p179435k3633055r051805
8762b9294084J1728296P158142q361769l624377J3261960J1662041n214305o909258
8754i593354Q414987J0673682p863493j8667035o705333N770751P25194o082042
8746b3326643J966939J0771860L198268o435319L666226K1263671J6036583j0653630
$$ y = [-2873320, -29059660, -50529602, -42421227, -15642699, -3196276, -15413886, -30804670, -31237553, -24340025, -23098580, -21505944, -6103999, 18122946, 31421439, 26756770, 16554182, 9244589, -3203825, -24824321, -39071477, -29949843, -9258332, -1815114, -8789108, -9298445, 2026374, 5958602, -6144894, -15460414, -8273151, -153597, -7091981, -14957250, -4549832, 10570211, 3390776, -20242279, -29294084, -17565788, -10407646, -18769415, -22393792, -9131832, 2530209, -2684096, -9593354, -1178367, 9495315, 1631822, -17035213, -23740546, -17969795, -17244601, -23326643, -21359704, -10587844, -7389576, -13824895, -10158669, 11105002, 27141585, 16487955]
8738A6487955k5072009j1376387P433053P128289n068965r853672p302794r320103
8730c6944633j3810629q278474O346281J5860227J5427507J3110326J0465463
8723B176068L25787j2035685q171799J3011924K5681594J3013614p443628j3118568
8715A3439307j0997394j7810105k3754811q772474J6287977K1386774N982327
8708d238399j168297Q730404J4078477O808543O097284J6427800J2851215j2750606
8700D6836421k9190434j4888412N422127K167589j1991535r618868L793514N687796
8692a781802j327583J94086O619871L112152m540691j854392M000702q11155n747218
8683b136030M851818J6159396N802519j0777804k109253K1064673J7918018j3504607
$$ y = [16487955, -8584054, -19960441, -12527388, -5399099, -10468064, -20321736, -27624530, -36944633, -50755262, -59033736, -52687455, -36827228, -21399721, -8289395, 2176068, 2501855, -9533830, -17705629, -4693705, 20987889, 34001503, 26557875, 13439307, 2441913, -15368192, -39123003, -47895477, -31607500, -10220726, -4238399, -5406696, 3323708, 17402185, 24210728, 30308012, 46735812, 59587027, 46836421, 17645987, 2757575, 8179702, 10347291, -1644244, -11263112, -7469598, -1781802, -3109385, -2915299, 3704572, 6816724, 2276033, 421641, 4422343, 3611188, -2136030, 2715788, 18875184, 24677703, 13899899, 11790646, 32855319, 50773337, 37268730]
8675C7268730k9312467q901196J5950335J4993442M94589l974892M03915L519163
8667C0441619Q650702J8405918K1204441R015075r066780k1236164k3851372j4972435
8659A8591004J313269N217461j6002542l7690265k5201730R151276J9514422N85664
8651b4521441l134401K3753201L5844296L593974l1194258j9753972J6176759
8644G64158K2162832l956030j8778021p115744L537519l548191j2203966o939752
8636b6077195O458282J7077789J9398124Q832636j0552032j9437942o737877R215575
8628a822640O542279n048327k555551R277047Q009145m509606o307238K728208
8620F313317K76185j5981252k1933210q853649K836616R16901p9310R408641J3880858
$$ y = [37268730, 7956263, -944933, 15005402, 29998844, 30493433, 26518541, 26922456, 30441619, 39092321, 57498239, 78702680, 87717755, 78650975, 57414811, 33563439, 18591004, 19904273, 25121734, 9119192, -28571073, -53772803, -44621527, -25107105, -24521441, -27655842, -3902641, 31941655, 35535629, 4341371, -15412601, 764158, 22926990, 18970960, 192939, -6922805, -3385286, -6933477, -19137443, -26077195, -19618913, -2541124, 16857000, 25689636, 15137604, -4300338, -11038215, -1822640, 4719639, -328688, -2884239, 6392808, 14401953, 9892347, 3585109, 6313317, 6589502, -9391750, -31324960, -40178609, -37341993, -36425092, -36504402, -27095761, -13214903]
8611a3214903J749203j1050413o401269O969675J0472700O229062Q760440J5566007
8603A9080502Q532840j5481138l3266701k2173805R510773K8991385J7639488
8596A2833344n149043p468086J0198493J5397883o205703k6190952j6399062O579611
8588a6403515Q517050p682603j0649188M216765R323312k900712m413524J8122116
8580a870299L5366536K0333542q949563j9045555j0218341o141064j0869709q081052
8572i475505M080385P812471l430887j3343600q092055M543463Q852169K120299
8564f933260n317914m296798M008439J0574464Q866372L084499K575011O875851
8556A9436664M337221r102933j9087960j1066896P365345J5309917O701458m022896
$$ y = [-13214903, -11465700, -22516113, -28917382, -21947707, -11475007, -5245945, 3514495, 19080502, 27613342, 12132204, -21134497, -43308302, -33797529, -4806144, 12833344, 7684301, 216215, 10414708, 25812591, 19606888, -6584064, -22983126, -16403515, -7886465, -15569068, -26218256, -22001491, -12678179, -15578891, -19992415, -1870299, 33496237, 53829779, 44880216, 25834661, 15616320, 9475256, -1394453, -9475505, -5395120, 2417351, -1013536, -14357136, -22449191, -17905728, -9053559, -6933260, -12251174, -16547972, -12539533, -1965069, 6901303, 9985802, 12560813, 19436664, 23773885, 14670952, -4417008, -15483904, -8118559, 7191358, 13892816, 9869920]
8548I869920m775158o78406j344947m954876m067990m35342k966076j1813902
8540b1166777j4541915k685259J4338756J9600773J0650649J851523L013927O179174
8532A7240851P28530q000784p772837j000567r05260p673145p067420L616983
8524a0833649Q105573r70484o456717M984554J6188691M122049k0303285k4817113
8516b9980381m479060J1512143N353774o190018m980218K3109l853290n136493
8508c7730434J0287469K6724444J8124492q367884j9100953k690290J7118830
8501D365674K0183621J2888653N288976o110847j9952710k0455284l418774J0479702
8493C269011O976387J595094J0659619K0151608R956800r258169j4550300j1200674
$$ y = [9869920, 5094762, 4416356, 3071409, -1883467, -5951457, -6386799, -9352875, -21166777, -35708692, -38393951, -24055195, -4454422, 6196227, 8047750, 11061677, 17240851, 17969381, 9968597, 2195760, 1195193, 289933, -7383212, -14450632, -10833649, -2728076, -3698560, -10155277, -5170723, 11017968, 15140017, -5163268, -29980381, -34459441, -22947298, -17593524, -23783542, -28763760, -28740651, -32593941, -37730434, -27442965, -718521, 17405971, 9038087, -10062866, -12753156, 4365674, 24549295, 37437948, 42726924, 36616077, 16663367, -3791917, -7210691, 3269011, 10245398, 11840492, 22500111, 42651719, 52608519, 43350350, 28800050, 17599376]
8485A7599376j8807502k7188749q419787K7670255L4927293l05382l2640945k1511253
8477b8676694J2149218K1432717P95332j5018125o419532Q491643O015568j2001417
8469a3231290k4805331j8596428j040522P578823j032692j0096571J043725K4983932
8461c5196354L2420883J2484480j3033866k2237887j8378109j1881302K01764
8454e5620391J9628906L0965863K1115577J738060p164892n181707n251042j0013098
8446i782724j2170823r612433m234057N261209J5246032J3461069j502921j0295701
8438a3630349M28518J4979348J1666793m442072j3209603j1612022j0886070j1598120
8430c8303577n664126M109786Q777933J0225780J2812674Q098981r566088k3229147
$$ y = [17599376, -1208126, -28396875, -36816662, -9146407, 25780886, 25475504, -7165441, -28676694, -16527476, 4905241, 5700573, -9317552, -15737084, -7245441, -1229873, -13231290, -38036621, -56633049, -57673571, -50094748, -51127440, -61224011, -60180286, -35196354, -2775471, 9709009, -3324857, -25562744, -43940853, -55822155, -55620391, -35991485, -5025622, 16089955, 17828015, 10663123, 5481416, 230374, -9782724, -21953547, -31565980, -35800037, -30538828, -15292796, -1831727, -3334648, -13630349, -13201831, 1777517, 13444310, 9002238, -4207365, -15819387, -26705457, -38303577, -43967703, -39857917, -31079984, -20854204, -8041530, 57451, -9508637, -32737784]
8422c2737784j4321813O580779J5881997J2797573J1087317P853023n812971j4423333
8414a3095212K210967K5720023J8924200j2469769k3973856l222500J1362700
8407E456553l283004j7419378j815039K2056185J7783826q793790k1841197p537385
8399a5393229J4717484K2658641J1630875p348319j6391046o583301Q128252O689781
8391A8109138o735826q015604N354877P052470j3069019k8405533j8022538P5605
8383d3656430J232212o606608k566762R969512J3896906R252692P016032O357697
8375e104749K664405M158225J5915970K1062795L905607j9690449k1501407k126443
8367g16046J2043538O990705o348833j2846969p203853P397969J8510588J0615315
$$ y = [-32737784, -47059597, -40478818, -24596821, -11799248, -711931, 7141092, 1328121, -13095212, -10884245, 14835778, 33759978, 21290209, -2683647, -5906147, 5456553, 2173549, -15245829, -17060868, 4995317, 22779143, 13985353, -7855844, -15393229, -675745, 21982896, 33613771, 26265452, 9874406, 3291105, 11419357, 18109138, 11373312, 3357708, 8712585, 15765055, 2696036, -25709497, -43732035, -43656430, -42424218, -49030826, -51597588, -41628076, -27731170, -18478478, -11462446, -5104749, -2440344, 1717881, 17633851, 38696646, 42602253, 22911804, 1410397, -716046, 11327492, 18318197, 11969364, -877605, -8081458, -683489, 17827099, 28442414]
8359B8442414j2906300k5963298j3750980M943218P868624K984554Q111461J5975103
8351A5704796R618562k930638k807344L125184m527010j7237534r763743J2917960
8343D100233J9789089N241922l565525M288298O929908p359980j8423566j1387734
8335c87355k107147o276474j1973549m209998P128067N657336m011177o878636
8327b3058933k40216J0205852K1265656K5541872J2023990j1701710j7656041
8320A6380470M077461K4678060J5859186q502957j5791475m580417n86598j0871780
8312B0661950j4723022j533171J1452044P626243n357605j1556513r419075o469294
8304i318443l474368L432842J1314478J1919434L006892p989555j1429260m837121
$$ y = [28442414, 15536114, -10427184, -24178164, -19234946, -11366322, -8381768, -270307, 15704796, 25323358, 22392720, 19585376, 22710560, 18183550, 946016, -8817727, 4100233, 23889322, 29131244, 25565719, 29854017, 36783925, 29423945, 11000379, -387355, -2494502, -8770976, -20744525, -24954523, -17826456, -12169120, -16180297, -23058933, -23299149, -13093297, 8172359, 33714231, 45738221, 34036511, 16380470, 20457931, 45135991, 60995177, 52492220, 36700745, 32120328, 31533730, 20661950, 5938928, 4405757, 15857801, 23484044, 18126439, 6569926, -2849149, -9318443, -12792811, -9359969, 1954509, 13873943, 16880835, 8891280, -2537980, -7375101]
8296g375101L776788L045432p462690j2787084l36190J9452996K2400540L597966
8288B4312657j2979234p412460O729384K837772j6979544k3733778o008743J2636601
8280b0597345J1413296L576979R522066J8164100N568407j7947127j6090035J5114086
8272H724427L3910097J2413623k2061276k7985895o392399J1271340J2461673
8265B2341590Q375372J942783j3891571k9513706k3862960M22716J6336899J2521807
8257e327070O513422J0494062J1547816j230123j4702596j3479403m191043q55590
8249a1230525k077805K91954L611984K380033J836036P223849J0049029J452101
8241A3536656j0098531j0898139l411780P14795Q16309K837589K299121q440816
$$ y = [-7375101, -3598313, -552881, -8015571, -20802655, -21138845, -1685849, 20714691, 24312657, 11333423, 3920963, 10650347, 13488119, -3491425, -27225203, -33233946, -20597345, -9184049, -5607070, 3914996, 22079096, 27647503, 9700376, -6389659, 8724427, 42634524, 55048147, 32986871, 5000976, -1391423, 9879917, 22341590, 30716962, 32659745, 18768174, -10745532, -34608492, -34185776, -17848877, -5327070, 1186352, 11680414, 23228230, 21998107, 7295511, -6183892, -10374935, -11230525, -13308330, -13016376, -9404392, -7024359, -5188323, 2035526, 12084555, 13536656, 3438125, -7460014, -10871794, -10156999, -9340690, -6503101, -4203980, -12644796]
8233a2644796k0418508j6585979O35673J0675927N820779J085499P459127J3855194
8225a0117084O305995q543472j2245661j73650J2774364J0786964m762796j6615750
8217b2591090j0215042Q946986K0249058J2983166n69411m158205n64833k267940
8209A812689p048511k685815O901508L582016j3557194k2512725j2432749J56229
8201d5784552J626071L543927J6287138K3864112J0970403m367066K687957J8805768
8193B7633758J1715086j2831404j6245835P746438J8435599n931777l0389633
8186A32232j8820853Q804556J1577400o549816r481871P438837J2776671m133344
8178A743812j5512340l184909J3477595J3460616O425294Q274038R685724n258274
$$ y = [-12644796, -33063304, -49649283, -49013610, -38337683, -32516904, -31431405, -23972278, -10117084, -3811089, -12354561, -24600222, -24773872, -11999508, -1212544, -5975340, -22591090, -32806132, -23859146, -3610088, 9373078, 8803667, 4645462, 4080629, 1812689, -5235822, -7921637, -1020129, 2561887, -10995307, -33508032, -45940781, -45784552, -44158481, -40614554, -24327416, -463304, 10507099, 6140033, 8827990, 27633758, 39348844, 26517440, 10271605, 18018043, 36453642, 30521865, 132232, -18688621, -9884065, 1693335, -4856481, -14338352, -6899515, 5877156, 1743812, -13768528, -16953437, -3475842, 9984774, 16410068, 24684106, 34369830, 29111556]
8170B9111556k5491418k5386447m243415J0863693K535316j5524727j9748399
8163d7883841o273510Q539000J0536496K771553j671970L334467J1183928J2733126
8155f730751O820806j549862p804391q682351k895166M099889L900892j91226
8147a3032160O113140K2720931K5562207K80939k8595105k7604154l378372R211385
8139h721189K379803K027950J6678000K0075386k141498k5662753k7013856j6608028
8131c8986185r822782K299335K5348506L4933297J2373148j7137884j8823023
8124i815588j031775M305233l825065k646686O117879J104965j2044363o280689
$$ y = [29111556, 3620138, -21766309, -26009724, -15146031, -12610715, -28135442, -47883841, -54157351, -45618351, -35081855, -32310302, -33982272, -30647805, -19463877, -6730751, 90055, -1459807, -9264198, -17946549, -20841715, -16741826, -12840934, -13032160, -6919020, 15801911, 41364118, 41645057, 13049952, -14554202, -17932574, -8721189, -6341386, -4313436, 12364564, 32439950, 30298452, 4635699, -22378157, -38986185, -48808967, -46509632, -21161126, 13772171, 26145319, 9007435, -9815588, -10847363, -6542130, -10367195, -13013881, -6896002, -5791037, -17835400, -24116089]
$$ [...]
##END NTUPLES=NMR SPECTRUM
##END=
