##TITLE=31Pdec_MTBDE2506-4
 CDCl3, 24 sc
 28.06.2021
##JCAMPDX= 6.0         $$ Bruker NMR JCAMP-DX V2.0
##DATA TYPE= NMR SPECTRUM
##DATA CLASS= NTUPLES
##ORIGIN= UXNMR, Bruker Analytische Messtechnik GmbH
##OWNER= root
$$ XWIN-NMR		Version 3.5
$$ Mon Jun 28 10:31:30 2021 Russian Standard Time (UT+4h)  she@DPX200
##.OBSERVE FREQUENCY= 81.013821
##.OBSERVE NUCLEUS= ^31P
##.ACQUISITION MODE= SIMULTANEOUS
##.ACQUISITION SCHEME= undefined
##.AVERAGES= 24
##.DIGITISER RES= 16
##SPECTROMETER/DATA SYSTEM= spect
##.PULSE SEQUENCE= zgpg30
##.SOLVENT NAME= CDCl3
##.SHIFT REFERENCE= (INTERNAL, CDCl3, 0, 248.564)
##AUDIT TRAIL= $$ (NUMBER, WHEN, WHO, WHERE, WHAT)
$$ ##TITLE= Audit trail, XWIN-NMR		Version 3.5
$$ ##JCAMPDX= 5.01
$$ ##ORIGIN= Bruker BioSpin GmbH
$$ ##OWNER= she
$$ F:/spectra/data/she/nmr/P31/1/pdata/1/auditp.txt
$$ ##AUDIT TRAIL=  $$ (NUMBER, WHEN, WHO, WHERE, WHAT)
(   1,<2021-06-28 10:29:22.00 +0400>,<she>,<DPX200>,
      <created by zg, POWCHK disabled, PULCHK disabled
       configuration hash MD5:
       00 E9 B6 7A A2 85 ED C7 34 08 36 98 17 FE 4E 26
       data hash MD5: 32K
       01 0A 38 E8 2B 54 F9 CB 2F 9B 48 2B 67 49 BB 26>)
(   2,<2021-06-28 10:29:29.54 +0400>,<she>,<DPX200>,
      <Start of raw data processing
       efp BC_mod = 2 LB = 1 FT_mod = 6 PKNL = 1 PHC0 = -7356.777 PHC1 = 2340.284 SI = 64K 
       data hash MD5: 64K
       C3 F0 FF AF C6 DF A2 0F 09 6F 5B FD 05 05 4F D7>)
(   3,<2021-06-28 10:29:52.35 +0400>,<she>,<DPX200>,
      <pk PHC0 = -49.30538 PHC1 = 15.4 
       data hash MD5: 64K
       59 56 8A 01 A0 C5 7E 4D 88 D1 88 01 C2 7A 42 82>)
(   4,<2021-06-28 10:29:56.43 +0400>,<she>,<DPX200>,
      <abs ABSG = 5 
       data hash MD5: 64K
       FF F7 EC 66 6D 55 D8 96 CA 6D 7E A2 0D 3B A8 DA>)
(   5,<2021-06-28 10:30:45.59 +0400>,<she>,<DPX200>,
      <pk PHC0 = -299.301 PHC1 = 676.8033 
       data hash MD5: 64K
       8F E0 8D E7 08 30 42 03 2C D0 D0 6B FD 80 E8 1A>)
(   6,<2021-06-28 10:30:48.82 +0400>,<she>,<DPX200>,
      <abs ABSG = 5 
       data hash MD5: 64K
       C1 09 C5 FB 66 23 25 A9 B6 A6 9D 50 E5 BF EC 0C>)
$$ ##END=
$$ 
$$ hash MD5
$$ A0 21 A1 90 E3 FC 8A 3A F1 0C DA E9 93 E2 9C 79
##$RELAX= 
##$RELAX= 
##$RELAX= 
##$RELAX= 
##$RELAX= 
##$RELAX= 
##$RELAX= 
##$RELAX= 
$$ Bruker specific parameters
$$ --------------------------
##$DU= <F:/spectra>
##$EXPNO= 1
##$NAME= <P31>
##$PROCNO= 1
##$TYPE= <nmr>
##$USER= <she>
##$AMP= (0..31)
100 100 100 100 100 100 100 100 100 100 100 100 100 100 100 100 100 100 
100 100 100 100 100 100 100 100 100 100 100 100 100 100 
##$AQSEQ= 0
##$AQ_mod= 1
##$AUNM= <au_zg>
##$AUTOPOS= <>
##$BF1= 81.014009
##$BF2= 200.13
##$BF3= 200.13
##$BF4= 200.13
##$BF5= 200.13
##$BF6= 200.13
##$BF7= 200.13
##$BF8= 200.13
##$BYTORDA= 1
##$CFDGTYP= 0
##$CFRGTYP= 5
##$CHEMSTR= <none>
##$CNST= (0..31)
1 1 145 1 1 1 1 1 1 1 1 1 1 1 1 1 1 1 1 1 1 1 1 1 1 1 1 1 1 1 1 1 
##$CPDPRG= <waltz16>
##$CPDPRG1= <>
##$CPDPRG2= <waltz16>
##$CPDPRG3= <>
##$CPDPRG4= <mlev>
##$CPDPRG5= <mlev>
$$ [...]
##$SUBNAM3= <"">
##$SUBNAM4= <"">
##$SUBNAM5= <"">
##$SUBNAM6= <"">
##$SUBNAM7= <"">
##$SUBNAM8= <"">
##$SUBNAM9= <"">
##$SW= 501.771253377433
##$SWIBOX= (0..15)
0 1 3 0 0 0 0 0 0 0 0 0 0 0 0 0 
##$SW_h= 40650.406504065
##$TD= 32768
##$TD0= 1
##$TE= 0
##$TE2= 300
##$TE3= 300
##$TEG= 300
##$TL= (0..7)
0 120 53 12 22 120 120 120 
##$TP= (0..7)
150 150 150 150 150 150 150 150 
##$TP07= 0
##$TPNAME0= <>
##$TPNAME1= <>
##$TPNAME2= <>
##$TPNAME3= <>
##$TPNAME4= <>
##$TPNAME5= <>
##$TPNAME6= <>
##$TPNAME7= <>
##$TPOAL= (0..7)
0.5 0.5 0.5 0.5 0.5 0.5 0.5 0.5 
##$TPOFFS= (0..7)
0 0 0 0 0 0 0 0 
##$TUNHIN= 0
##$TUNHOUT= 0
##$TUNXOUT= 0
##$USERA1= <user>
##$USERA2= <user>
##$USERA3= <user>
##$USERA4= <user>
##$USERA5= <user>
##$V9= 5
##$VALIST= <valist>
##$VCLIST= <CCCCCCCCCCCCCCC>
##$VD= 0
##$VDLIST= <DDDDDDDDDDDDDDD>
##$VPLIST= <PPPPPPPPPPPPPPP>
##$VTLIST= <TTTTTTTTTTTTTTT>
##$WBST= 1024
##$WBSW= 4
##$XGAIN= (0..3)
0 0 0 0 
##$XL= 0
##$YL= 0
##$YMAX_a= 111
##$YMIN_a= -177
##$ZGOPTNS= <>
##$ZL1= 120
##$ZL2= 120
##$ZL3= 120
##$ZL4= 120
##$ABSF1= 248.5645
##$ABSF2= -253.2056
##$ABSG= 5
##$ABSL= 3
##$ALPHA= 0
##$AQORDER= 0
##$ASSFAC= 0
##$ASSFACI= 0
##$ASSFACX= 0
##$ASSWID= 0
##$AUNMP= <proc_1d>
##$AZFE= 0.1
##$AZFW= 0.5
##$BCFW= 0
##$BC_mod= 2
##$BYTORDP= 0
##$COROFFS= 0
##$CY= -3
##$DATMOD= 1
##$DC= 0
##$DFILT= <>
##$DTYPP= 0
##$F1P= 0
##$F2P= 0
##$FCOR= 1
##$FTSIZE= 65536
##$FT_mod= 6
##$GAMMA= 0
##$GB= 0
##$INTBC= 1
##$INTSCL= 5.30512e-09
##$ISEN= 30
##$LB= 1
##$LEV0= 0
##$LPBIN= 0
##$MAXI= 10000
##$MC2= 0
##$MEAN= 0
##$ME_mod= 0
##$MI= 50
##$NCOEF= 0
##$NC_proc= -11
##$NLEV= 6
##$NOISF1= 182.463
##$NOISF2= 159.3651
##$NSP= 0
##$NTH_PI= 0
##$NZP= 0
##$OFFSET= 248.5645
##$PC= 4
##$PHC0= -7705.383
##$PHC1= 3032.487
##$PH_mod= 1
##$PKNL= yes
##$PPARMOD= 0
##$PSCAL= 0
##$PSIGN= 0
##$REVERSE= no
##$SF= 81.014009
##$SI= 65536
##$SIGF1= 159.3651
##$SIGF2= -187.1042
##$SINO= 113.3802
##$SIOLD= 16384
##$SREGLST= <1H.CDCl3>
##$SSB= 0
##$STSI= 65536
##$STSR= 0
##$SW_p= 40650.406504065
##$SYMM= 0
##$S_DEV= 0
##$TDeff= 32768
##$TDoff= 0
##$TI= <>
##$TILT= no
##$TM1= 0
##$TM2= 0
##$TOPLEV= 0
##$USERP1= <user>
##$USERP2= <user>
##$USERP3= <user>
##$USERP4= <user>
##$USERP5= <user>
##$WDW= 1
##$XDIM= 65536
##$YMAX_p= 329490909
##$YMIN_p= -72699614
$$ End of Bruker specific parameters
$$ ---------------------------------
##NTUPLES= NMR SPECTRUM
##VAR_NAME=  FREQUENCY,     SPECTRUM/REAL,   SPECTRUM/IMAG
##SYMBOL=    X,             R,               I
##VAR_TYPE=  INDEPENDENT,   DEPENDENT,       DEPENDENT
##VAR_FORM=  AFFN,          ASDF,            ASDF
##VAR_DIM=   65536,         65536,           65536
##UNITS=     HZ,            ARBITRARY UNITS, ARBITRARY UNITS
##FACTOR=    0.620285442955139, 1,           1
##FIRST=     20137.2065510759, 0,            0
##LAST=      -20513.1999529892, 0,           0
##MIN=       -20513.1999529892, -72699614,   0
##MAX=       20137.2065510759, 329490909,    0
$$ Real data points
##PAGE= N=1
##DATA TABLE= (X++(R..R)), XYDATA
$$ [...]
$$ plain form
39265 1623822 1270565 279261 -797651 -1363965 -1280313 -845634 -537906 -720481 -1245820
39256 -1245820 -1397510 -694168 243564 207180 -1069819 -2475471 -2866863 -2301506 -1593237
39247 -1593237 -1179784 -895141 -471643 196310 1021319 1620477 1541212 849889 127734 -304190
39237 -304190 -594666 -579493 338376 1921703 2605006 1324345 -704700 -1235832 183291
39228 183291 1771830 1904542 871205 57431 296121 1336240 2207623 1850875 74154
39219 74154 -1861490 -2266377 -891429 818171 1487900 1103039 343780 -431997 -1008494
39210 -1008494 -934122 -118930 673105 672753 136710 -114999 92070 224032 1762 -305384
39200 -305384 -562319 -1050335 -1813272 -2223916 -1614936 -151111 1273981 1994738 2155128
$$ packed form
39265A623822l53257r91304j076912n66314Q3652M34679L07728j82575n25339
39256a245820j51690P03342R37732l6384j276999j405652l91392N65357P08269
39247a593237M13453K84643M23498O67953Q25009N99158p9265o91323p22155m31924
39237c04190k90476J5173R17869J583327O83303j280661k029045n31132J419123
39228A83291J588539J32712j033337q13774K38690J040119Q71383l56748j776721
39219G4154j935644m04887J374948J709600O69729l84861p59259p75777n76497
39210a008494P4372Q15192P92035l52n36043k51709K07069J31962k22270l07146
39200c05384k56935m88016p62937m10644O08980J463825J425092P20757J60390
$$ plain form
39191 2155128 2241608 2308326 2001690 1251171 445561 -194687 -856333 -1418333 -1161759 98646
39181 98646 1141618 676892 -639933 -771752 904770 2569592 2302134 449479 -1153245
39172 -1153245 -1557745 -1315705 -1149764 -1023883 -555399 302016 1131671 1391734 990983
39163 990983 576952 808281 1246976 744731 -710642 -1515164 -632714 627953 269270
39154 269270 -1486474 -2410049 -1330054 448074 1153690 765658 526898 1080233 1899306
39145 1899306 2193295 1730888 865086 111652 -286965 -453840 -500975 -262454 319598 814157
39135 814157 822837 695063 1069308 1768954 1887954 1076412 68340 -232293 402962 1674749
39125 1674749 3035419 3658655 2922725 1294827 98289 44129 564013 854824 863410
$$ packed form
39191B155128Q6480O6718l06636p50519q05610o40248o61646n62000K56574J260405
39181I8646J042972m64726j316825j31819J676522J664822k67458j852655j602724
39172a153245m04500K42040J65941J25881M68484Q57415Q29655K60063m00751
39163I90983m14031K31329M38695n02245j455373q04522Q82450J260667l58683
39154B69270j755744r23575J079995J778128P05616l88032k38760N53335Q19073
39145A899306K93989m62407q65802p53434l98617j66875m7135K38521N82052M94559
39135H14157Q680j27774L74245O99646J19000q11542j008072l00633O35255J271787
39125A674749J360670O23236p35930j627898j196538n4160N19884K90811Q586
$$ plain form
39116 863410 856003 768763 535970 419921 443764 111818 -687018 -1099851 -361891 1043374
39106 1043374 1981290 2001914 1426754 617845 -45604 45604 990456 1736838 1203505 -106359
39096 -106359 -631107 128212 1035243 1025812 424322 198971 686552 1515856 2237428 2582928
39086 2582928 2472637 2138167 2026518 2357150 2883778 3111134 2632217 1457635 279545
39077 279545 92339 1083550 2184779 2281783 1573756 1054922 964268 658769 -112343 -808909
39067 -808909 -1046214 -1014582 -816953 -287422 344068 496404 179041 35403 247598 322539
39057 322539 184563 423505 1089505 1328977 733400 9153 -256338 -411790 -667704 -362406
39047 -362406 802209 1839628 1815501 1184340 762505 328480 -548409 -1178406 -643763
$$ packed form
39116H63410p407q7240k32793j16049K3843l31946p98836m12833P37960J405265
39106A043374R37916K0624n75160q08909o63449R1208R44852P46382n33333j309864
39096a06359n24748P59319R07031r431o01490k25351M87581Q29304P21572L45500
39086B582928j10291l34470j11649L30632N26628K27356m78917j174582j178090
39077B79545j87206R91211J101229R7004p08027n18834r0654l05499p71112o96566
39067h08909k37305L1632J97629N29531O31490J52336l17363j43638K12195P4941
39057C22539j37976K38942O66000K39472n95577p24247k65491j55452k55914L05298
39047c62406J164615J037419k4127o31161m21835m34025q76889o29997N34643
$$ plain form
39038 -643763 662189 1753181 2632254 3695864 4249358 3376784 1873466 1460936 2243933
39029 2243933 2760912 2440447 2008746 1417626 -288303 -2436051 -2446090 569378 3815380
39020 3815380 4090079 1722350 -419439 -799550 -308068 -118506 -281448 -432827 -495915
39011 -495915 -437148 -210073 -30963 -53905 96975 788947 1571176 1651989 1055014 571477
39001 571477 633204 910631 990254 815349 458580 41408 -88615 385133 1244248 1865683
38991 1865683 1867801 1359707 693582 286282 478696 1179793 1805396 1883863 1481334 757763
38981 757763 -408363 -1815615 -2459140 -1515515 360874 1558652 1359771 565647 208743
38972 208743 368498 544224 621885 994773 1898539 2941658 3397655 3006036 2380233 2287374
$$ packed form
39038f43763J305952J090992Q79073J063610N53494q72574j503318m12530P82997
39029B243933N16979l20465m31701n91120j705929k147748j0039L015468L246002
39020C815380K74699k367729k141789l80111M91482J89562j62942j51379o3088
39011d95915N8767K27075J79110k2942J50880O91972P82229Q0813n96975m83537
39001E71477O1727K77427P9623j74905l56769m17172j30023M73748Q59115O21435
38991A865683K118n08094o66125m07300J92414P01097O25603P8467m02529p23571
38981G57763j166126j407252o43525R43625J876389J197778j98881p94124l56904
38972B08743J59755J75726P7661L72888R03766J043119M55997l91619o25803r2859
$$ plain form
38962 2287374 2524802 2123486 917721 101801 546592 1311627 911605 -406047 -969211
38953 -969211 -169933 737560 608864 -120513 -538971 -707910 -1127723 -1569141 -1428649 -766396
38943 -766396 -83725 592585 1523095 2387205 2522667 2001404 1615800 1704624 1798342 1602053
38933 1602053 1469019 1513901 1112265 -31026 -1004741 -810316 84154 405320 108112
38924 108112 459478 1851734 2870760 2303103 965656 438357 803809 990174 807826
38915 807826 1025663 1515692 1047056 -588496 -1727730 -969142 909010 2058193 1774860
38906 1774860 756413 -144359 -504134 -162819 684766 1518572 2149195 2917507 3846571
38897 3846571 4301305 4018939 3638896 3522275 2977582 1573991 301596 280347 1087253
$$ packed form
38962B287374K37428m01316j205765q15920M44791P65035m00022j317652n63164
38953i69211P99278R07493j28696p29377m18458j68939m19813m41418J40492O62253
38943g66396O82671O76310R30510Q64110J35462n21263l85604Q8824R3718j96289
38933A602053j33034M4882m01636j143291r73715J94425Q94470L21166k97208
38924A08112L51366J392256J019026n67657j337447n27299L65452J86365j82348
38915H07826K17837M90029m68636j635552j139234P58588J878152J149183k83333
38906A774860j018447r00772l59775L41315Q47585Q33806O30623P68312R29064
38897C846571M54734k82366l80043j16621n44693j403591j272395k1249Q06906
$$ plain form
38888 1087253 1558849 1498926 1315041 796146 -199083 -596427 535771 2045524 2083604
38879 2083604 1006197 701704 1270510 933918 -517082 -935353 626512 2146010 1825705
38870 1825705 816981 981692 1799941 1572373 344994 -500724 -693160 -1070613 -1635248
38861 -1635248 -1440340 -249547 1128201 2009642 2227648 1727447 872448 664208 1501877
38852 1501877 2251981 1760167 695287 543797 1364192 2065602 2382644 2807033 2887077
38843 2887077 1592728 -513901 -1395780 -308287 1176781 1476362 858423 379866 341350
38834 341350 554463 968136 1260613 825799 -143390 -538543 64114 722388 705561 593794
38824 593794 935060 1007262 164339 -554939 281543 2092038 2737565 1367857 -519781
$$ packed form
38888A087253M71596n9923j83885n18895r95229l97344J132198J509753L8080
38879B083604j077407l04493N68806l36592j451000m18271J561865J519498l20305
38870A825705j008724J64711Q18249k27568j227379q45718j92436l77453n64635
38861a635248J94908J190793J377748Q81441K18006n00201q54999k08240Q37669
38852A501877P50104m91814j064880j51490Q20395P01410L17042M24389Q0044
38843B887077j294349k106629q81879J087493J485068K99581o17939m78557l8516
38834C41350K13113M13673K92477m34814r69189l95153O02657O58274j6827j11767
38824E93794L41266P2202q42923p19278Q36482J810495O45527j369708j887638
$$ plain form
38815 -519781 -1112915 -302900 738369 1182743 1183266 1291754 1695508 1985807 1625248 732780
38805 732780 205083 727771 1836883 2417511 2039427 1263191 632095 41117 -607461
38796 -607461 -759759 110779 1422223 1838067 897880 -270124 -296968 734391 1555049
38787 1555049 1533680 1454500 2204732 3380146 3812898 3100617 1930094 1053050 610527
38778 610527 456604 509080 619183 568515 379724 325499 577343 1114182 1864554 2558644
38768 2558644 2633194 1827824 714401 11099 -417012 -1060425 -1503081 -851029 495923
38759 495923 899138 -143434 -985903 -92939 1816688 3028249 3305534 3713707 4560687
38750 4560687 5021315 4623468 3734125 2563477 966337 -621233 -1259189 -809555 -113037
$$ packed form
38815e19781n93134Q10015J041269M44374N23J08488M03754K90299l60559q92468
38805G32780n27697N22688J109112N80628l78084p76236o31096n90978o48578
38796f07461j52298Q70538J311444M15844r40187j168004k6844J031359Q20658
38787A555049k1369p9180P50232J175414M32752p12281j170523q77044m42523
38778F10527j53923N2476J10103n0668j88791n4225K51844N36839P50372O94090
38768B558644P4550q05370j113423p03302m28111o43413m42656O52052J346952
38759D95923M03215j042572q42469Q92964J909627J211561K77285M08173Q46980
38750D560687M60628l97847q89343j170648j597140j587570o37956M49634O96518
$$ plain form
38741 -113037 392428 1126568 2126229 2582092 2194830 1810439 1914166 1639770 362525
38732 362525 -735070 -144988 1504165 2036415 662293 -1097967 -1578892 -803435 169753
38723 169753 628103 485872 108409 301462 1619998 3261134 3560599 2124894 540101
38714 540101 316238 1098652 1717630 1930961 1963927 1350197 -148652 -1172881 -246888
38705 -246888 1613598 1823858 -56259 -1605880 -1120179 199586 703963 912405 1981455
38696 1981455 3182843 3050320 2021938 1687348 1952988 1260746 -468619 -1404926 -715165
38687 -715165 182572 31500 -410040 44155 1054595 1562318 1405047 997158 361345
38678 361345 -416250 -636959 -45346 310292 -555974 -1969133 -2533785 -2115040 -1667136
$$ packed form
38741a13037N05465P34140R99661M55863l87262l84391J03727k74396j277245
38732C62525j097595N90082J649153N32250j374122j760260m80925P75457R73188
38723A69753M58350j42231l77463J93053J318536J641136K99465j435705j584793
38714E40101k23863P82414O18978K13331L2966o13730j498849j024229R25993
38705b46888J860486K10260j880117j549621M85701J319765N04377K08442J069050
38696A981455J201388j32523j028382l34590K65640o92242j729365r36307O89761
38687g15165Q97737j51072m41540M54195J010440N07723j57271m07889o35813
38678C61345p77595k20709N91613L55638q66266j413159n64652M18745M47904
$$ plain form
38669 -1667136 -1584402 -1545707 -1634035 -2178859 -2635533 -2072475 -827726 -278702 -786260 -1273498
38659 -1273498 -1142810 -1099433 -1498060 -1425986 -423477 260883 -499768 -1657592 -1382159
38650 -1382159 94402 755463 -191407 -1258513 -980869 166849 848801 743213 432544
38641 432544 177228 -196858 -530403 -334151 468418 1355192 1712655 1188748 -162618
38632 -162618 -1595202 -1875735 -505466 1423260 2346934 2105845 1834095 2011995 1790624
38623 1790624 657680 -380200 -128099 1127310 2246244 2838200 3106582 2672823 1019499
38614 1019499 -1031885 -1806484 -1037394 -294955 -631800 -1059961 -218888 1450196 2283167
38605 2283167 1586488 288803 -293783 379909 1838409 2913202 2649954 1429291 676089
$$ packed form
38669a667136Q2734L8695q8328n44824m56674N63058J244749N49024n07558m87238
38659a273498J30688M3377l98627P2074J002509O84360p60651j157824K75433
38650a382159J476561O61061r46870j067106K77644J147718O81952j05588l10669
38641D32544k55316l74086l33545J96252Q02569Q86774L57463n23907j351366
38632a62618j432584k80533J370269J928726R23674k41089k71750J77900k21371
38623A790624j132944j037880K52101J255409J118934N91956K68382m33759j653324
38614A019499k051384p74599P69090P42439l36845m28161Q41073J669084Q32971
38605B283167o96679j297685n82586O73692J458500J074793k63248j220663p53202
$$ plain form
38596 676089 924261 959346 -242486 -1580023 -1207263 657908 1915754 1506785 554059
38587 554059 333932 661560 888900 1108917 1473089 1410872 558482 -292467 -115886 1032020
38577 1032020 2338899 3244401 3453398 2764308 1739564 1654592 2666870 2948735 1154642
38568 1154642 -998215 -606179 2194484 4098423 3135666 1100499 440009 749825 145254
38559 145254 -1313489 -1805923 -786417 322590 516968 386402 487022 267663 -544749
38550 -544749 -896347 96013 1529359 1812912 832101 -119065 -224448 168584 640322
38541 640322 1346178 2336674 3114142 3254828 2868850 2148033 1054616 -181840 -836950
38532 -836950 -495137 286990 652255 532079 527498 855288 1037880 745320 382449 466352
$$ packed form
38596F76089K48172L5085j201832j337537L72760J865171J257846m08969r52726
38587E54059k20127L27628K27340K20017L64172o2217q52390q50949J76581J147906
38577A032020J306879R05502K08997o89090j024744q4972J012278K81865j794093
38568A154642k152857L92036K800663J903939r62757k035167o60490L09816o04571
38559A45254j458743m92434J019506J109007J94378j30566J00620k19359q12412
38550e44749l51598R92360J433346K83553r80811r51166j05383L93032M71738
38541F40322P05856R90496P77468J40686l85978p20817j093417j236456o55110
38532h36950L41813P82127L65265j20176m581L27790J82592k92560l62871Q3903
$$ plain form
38522 466352 746010 463308 -507595 -1277490 -1007437 -37876 562029 488234 583398 1465450
38512 1465450 2405194 2195445 800212 -587609 -1043139 -759399 -330568 126871 840379
38503 840379 1826740 2760901 3150569 2618530 1404780 526765 818466 1758974 1995632
38494 1995632 1197419 520063 864604 1624790 1829500 1655290 1866046 2409909 2658860
38485 2658860 2626743 2829075 3145489 2927430 2204112 1753804 1899317 2161778 2193931 2132926
38475 2132926 1928573 1303147 546605 306114 321706 -463243 -2032932 -2751973 -1554646
38466 -1554646 320744 898321 67364 -592903 -184198 580092 783435 522675 434085
38457 434085 783709 1358636 1772251 1683009 1093169 490087 320151 403862 371018 540202
$$ packed form
38522D66352K79658k82702r70903p69895K70053R69561N99905p3795R5164Q82052
38512A465450R39744k09749j395233j387821m55530K83740M28831M57439P13508
38503H40379R86361R34161L89668n32039j213750q78015K91701R40508K36658
38494A995632p98213o77356L44541P60186K04710j74210K10756N43863K48951
38485B658860l2117K02332L16414k18059p23318m50308J45513K62461L2153o1005
38475B132926k04353o25426p56542k40491J5592p84949j569689p19041J197327
38466a554646J875390N77577q30957o60267M08705P64290K03343k60760q8590
38457D34085L49624N74927M13615q9242n89840o03082j69936Q3711l2844J69184
$$ plain form
38447 540202 1598808 3300403 4324970 3873625 2724303 2095861 2002273 1553711 621909
38438 621909 216900 989469 2165320 2506348 1826138 894902 150149 -641555 -1389476
38429 -1389476 -1288444 -1296 1402586 1531822 447094 -485044 -457664 -45654 29073
38420 29073 28803 548805 1445200 2136967 2511001 2778198 2769331 2194630 1430838 1206886 1521146
38409 1521146 1692417 1556817 1705256 2247497 2295271 1328939 341096 709906 2295582
38400 2295582 3567802 3531037 2672465 1911177 1469372 1204715 1389634 2423496 3922314
38391 3922314 4695199 3847246 1762459 -106104 -480722 574918 1743825 1896651 1367042
38382 1367042 1399385 2357885 3175419 2893030 1985210 1464672 1335205 982614 663043 1209292
$$ packed form
38447E40202J058606J701595J024567m51345j149322o28442r3588m48562r31802
38438F21909m05009P72569J175851L41028o80210r31236p44753p91704p47921
38429a389476J01032J287148J403882J29236j084728r32138K7380M12010P4727
38420B9073k70N20002Q96395O91767L74034K67197q867n74701p63792k23952L14260
38409A521146J71271j35600J48439N42241M7774r66332r87843L68810J585676
38400B295582J272220l6765q58572p61288m41805k64657J84919J033862J498818
38391C922314P72885q47953k084787j868563l74618J055640J168907J52826n29609
38382A367042L2343R58500Q17534k82389r07820n20538j29467l52591l19571N46249
$$ plain form
38372 1209292 2260390 2329587 1143504 433125 1426207 2827672 2670767 1263089 654884
38363 654884 1639638 2965399 3444615 3219570 2713410 1871086 961605 794708 1455432
38354 1455432 1928609 1642785 1320661 1589119 1861842 1534768 1266968 1899851 2863492
38345 2863492 2906597 1912694 811812 75926 -517142 -896138 -689805 -147860 24013
38336 24013 -212897 -235160 96719 261599 132052 274376 1026922 2086299 3109746 3908143
38326 3908143 4004839 2993644 1528845 928959 1415448 1711274 905028 -188584 -223665
38317 -223665 832713 1837722 1993552 1477572 807293 262473 -62846 -87598 220114
38308 220114 702032 944279 564042 -224044 -644488 -387622 -179539 -619004 -926141 -4944
$$ packed form
38372A209292J051098O9197j186083p10379R93082J401465j56905j407678o08205
38363F54884R84754J325761M79216k25045n06160q42324r09481j66897O60724
38354A455432M73177k85824l22124K68458K72723l27074k67800O32883R63641
38345B863492M3105r93903j100882p35886n93068l78996K06333N41945J71873
38336B4013k36910k2263L31879J64880j29547J42324P52546J059377J023447P98397
38326C908143R6696j011195j464799n99886M86489K95826q06246j093612l5081
38317b23665J056378J005009J55830n15980o70279n44820l25319k4752L07712
38308B20114M81918K42247l80237p88086m20444K56866K08083m39465l07137R21197
$$ plain form
38298 -4944 1516767 1831131 667505 -227855 108813 378375 -526462 -1259439 -6587
38289 -6587 2360165 3192983 1726769 -116119 -611917 -175532 -31648 -412865 -742212
38280 -742212 -630207 -128111 354645 161890 -850028 -1613623 -885280 874906 1794912
38271 1794912 1119992 242333 563301 1513650 1716666 1162035 873599 932846 344190 -1042112
38261 -1042112 -1798269 -728517 1388064 2634474 2233973 1320009 1396441 2551232 3532732
38252 3532732 3363556 2403109 1705120 1738038 2100987 2274968 2185075 2024913 1924873 1916790
38242 1916790 1995865 2144625 2412783 2875737 3354137 3415231 2958275 2508938 2477941 2441177
38232 2441177 1818528 1021824 1024745 1781846 2064279 1194310 84255 37708 1159767 2465115
$$ packed form
38298d944J521711L14364j163626q95360L36668K69562r04837p32977J252852
38289f587K366752Q32818j466214j842888m95798M36385J43884l81217l29347
38280g42212J12005N02096M82756j92755j011918p63595P28343J760186R20006
38271A794912o74920q77659L20968R50349K03016n54631k88436N9247n88656j386302
38261a042112p56157J069752K116581J246410m00501r13964P6432J154791R81500
38252C532732j69176r60447o97989L2918L62949J73981q9893j60162j00040q083
38242A916790P9075J48760K68158M62954M78400O1094m56956m49337l0997l6764
38232B441177o22649p96704K921P57101K82433q69969j110055m6547J122059J305348
$$ plain form
38222 2465115 3032379 2589248 1480147 560530 664200 1667765 2462359 2262332 1501215
38213 1501215 1048373 1112132 1431444 1940323 2536729 2684940 2036314 1114068 664675 660485
38203 660485 666253 808599 1483340 2326889 2429005 1569142 473404 -144289 -128002 386533
38193 386533 1017781 1069055 276689 -476137 -131539 925405 1296786 668134 234687 703820
38183 703820 1150028 572964 -460516 -678843 94027 932788 1150397 820087 286232
38174 286232 -113538 -67881 364360 659583 573853 631404 1295964 2033645 1933781 1032919
38164 1032919 261174 167071 437239 696234 1033487 1510464 1742758 1345645 489358 -254339
38154 -254339 -437321 23311 908761 1817379 2321678 2176505 1455133 525986 -159668 -424075
$$ packed form
38222B465115N67264m43131j109101r19617J03670J003565P94594k00027p61117
38213A501215m52842O3759L19312N08879N96406J48211o48626r22246m49393m190
38203F60485N768J42346O74741Q43549J02116q59863j095738o17693J6287N14535
38193C86533O31248N1274p92366p52826L44598J056944L71381o28652m33447M69133
38183G03820M46208n77064j033480k18327P72870Q38761K17609l30310n33855
38174B86232l99770M5657M32241K95223q5730N7551O64560P37681r9864r00862
38164A032919p71745r4103K70168K58995L37253M76977K32294l97113q56287p43697
38154b54339j82982M60632Q85450R08618N04299j45173p21372r29147o85654k64407
$$ plain form
38144 -424075 -527397 -800261 -1140131 -1173035 -902415 -721177 -651293 -175857 791926 1374384
38134 1374384 853878 -31552 227115 1920112 3563618 3611815 2226489 968759 979489
38125 979489 1841918 2261686 1608676 526770 10901 238412 653823 936808 1262611
38116 1262611 1635541 1704590 1470013 1482419 1974861 2426340 2396509 2150426 1992161 1690289
38106 1690289 1152725 920120 1251681 1494310 1261674 1415253 2664711 3914094 3528704
38097 3528704 1822283 614503 480544 245849 -624040 -1034136 -301713 511478 290189
38088 290189 -465028 -731890 -598026 -642079 -592260 171899 1377103 2214189 2517975 2680889
38078 2680889 2795621 2699164 2466120 2122405 1319752 4439 -1091855 -1335484 -1013683
$$ packed form
38144d24075j03322k72864l39870l2904K70620J81238O9884M75436R67783N82458
38134A374384n20506q85430K58667J692997J643506M8197j385326j257730J0730
38125I79489Q62429M19768o53010j081906n15869K27511M15411K82985L25803
38116A262611L72930O9049k34577J2406M92442M51479k9831k46083j58265l01872
38106A690289n37564k32605L31561K42629k32636J53579J249458J249383l85390
38097C528704j706421j207780j33959k34695q69889m10096P32423Q13191k21289
38088B90189p55217k66862J33864m4053M9819P64159J205204Q37086L03786J62914
38078B680889J14732r6457k33044l43715q02653j315313j096294k43629L21801
$$ plain form
38069 -1013683 -598935 73142 1054095 1566893 1180406 926070 1854404 3086802 2898084
38060 2898084 1364600 209833 148361 243106 90931 658950 2202582 3125875 2127847
38051 2127847 213174 -739989 -503778 -266756 -510035 -531682 66825 660745 620204 234530
38041 234530 259606 960173 1863710 2289695 2001668 1364899 839128 397972 -319660 -1326621
38031 -1326621 -2109118 -2184023 -1516074 -396022 681329 1058910 435420 -530728 -719891
38022 -719891 138893 1188321 1648668 1701383 1926515 2470052 3064435 3297760 2632523 866446
38012 866446 -1142430 -2057289 -1787702 -1680997 -2389290 -2649119 -1224193 900141 1706746
38003 1706746 988057 439928 1063222 2009224 2234406 1900275 1589402 1285324 882976
$$ packed form
38069a013683M14748O72077R80953N12798l86487k54336R28334J232398j88718
38060B898084j533484j154767o1472R4745j52175N68019J543632R23293r98028
38051B127847j914673r53163K36211K37022k43279k1647N98507N93920m0541l85674
38041B34530K5076P00567R03537M25985k88027o36769n25771m41156p17632j006961
38031a326621p82497p4905O67949J120052J077351L77581o23490r66148j89163
38022g19891Q58784J049428M60347N2715K25132N43537N94383K33325o65237j766077
38012H66446k008876r14859K69587J06705p08293k59829J424926K124334Q06605
38003A706746p18689n48129O23294R46002K25182l34131l10873l04078m02348
$$ plain form
37994 882976 876266 1697038 2836335 3337638 2925923 2124737 1429545 824569 105166 -607749
37984 -607749 -812787 -183895 794404 1103120 450363 -137817 350943 1297972 1131918 -406074
37974 -406074 -1788603 -1792308 -952071 -344164 5730 554254 945212 546753 -143756 54567
37964 54567 1172950 1864202 1234432 -65840 -913961 -995736 -534215 458642 1907125
37955 1907125 3117220 3307494 2604839 1931355 1896270 2226403 2290173 1798602 970088 360966
37945 360966 557418 1640506 2852654 3190207 2527865 1792742 1748106 1987500 1623606
37936 1623606 738597 468820 1512763 3105941 3840672 3222997 2078083 1545838 1941785
37927 1941785 2565226 2482685 1536576 578013 530934 1291028 1933312 1998708 1937667 2043151
$$ packed form
37994H82976o710Q20772J139297N01303m11715q01186o95192o04976p19403p12915
37984f07749k05038O28892R78299L08716o52757n88180M88760R47029j66054j537992
37974d06074j382529l705Q40237O07907L49894N48524L90958l98459o90509J98323
37964E4567J118383O91252o29770j300272q48121q1775M61521R92857J448483
37955A907125J210095J90274p02655o73484l5085L30133O3770m91571q28514o09122
37945C60966J96452J083088J212148L37553o62342p35123m4636K39394l63894
37936A623606q85009k69777J043943J593178P34731o17675j144914n32245L95947
37927A941785O23441q2541r46109r58563m7079P60094O42284O5396o1041J05484
$$ plain form
37917 2043151 1752325 687050 -285857 -63542 970475 1383751 788035 288996 646872
37908 646872 1216123 1222691 961775 970010 997638 753456 837497 1794745 2843297 2783493 1818434
37897 1818434 1240577 1517792 1946954 2108373 2275500 2235051 1182685 -663182 -1676212
37888 -1676212 -891635 583911 1153417 828171 702156 1058595 1223813 923728 600074
37879 600074 486446 386205 351360 664358 1106196 1088829 577799 82004 -296655 -901583
37869 -901583 -1514245 -1333917 -295462 571827 602547 406674 701637 1111717 961042 515451
37859 515451 441434 606232 516566 504883 1207147 2086332 1912612 830789 460575 1435133
37849 1435133 2272475 1610233 321599 97644 806299 865736 -113838 -717041 78576
$$ packed form
37917B043151k90826j065275r72907K22315J034017M13276n95716m99039L57876
37908F46872N69251O568k60916Q235K7628k44182Q4041R57248J048552n9804r65059
37897A818434n77857K77215M29162J61419J67127m0449j052366j845867j013030
37888a676212P84577J475546N69506l25246j26015L56439J65218l00085l23654
37879F00074j13628j00241l4845L12998M41838j7367n11030m95795l78659o04928
37869i01583o12662J80328J038455Q67289L0720j95873K94963M10080j50675m45591
37859E15451p4017J64798q9666j1683P02264Q79185j73720j081823l70214R74558
37849A435133Q37342o62242j288634k23955P08655N9437r79574o03203P95617
$$ plain form
37840 78576 1505342 2265203 2046693 1257146 286773 -314612 96080 1207182 1631764
37831 1631764 741204 -205661 138507 1065504 908351 -237664 -632300 324658 1250783
37822 1250783 1159960 959581 1699789 2802698 3207013 3090327 3104425 2861790 1755758
37813 1755758 639306 934887 2269635 2720343 1609725 480278 782896 1989938 2772706
37804 2772706 2892084 2894869 2720010 1773768 149637 -1145640 -1269875 -364499 729920
37795 729920 1275285 1158058 785355 502272 236027 -135098 -379392 -341001 -449762 -1068105
37785 -1068105 -1576756 -1107478 -93522 152812 -436961 -442286 640360 1304768 378057
37776 378057 -956227 -939382 49016 295584 -440059 -809821 -278886 222079 106538 -140221
$$ packed form
37840G8576J426766P59861k18510p89547r70373o01385M10692J111102M24582
37831A631764q90560r46865L44168R26997j57153j146015l94636R56958R26125
37822A250783r0823k00379P40208J102909M04315j16686J4098k42635j106032
37813A755758j116452K95581J334748M50708j110618j129447L02618J207042P82768
37804B772706J19378K785j74859r46242j624131j295277j24235R05376J094419
37795G29920N45365j17227l72703k83083k66245l71125k44294L8391j08761o18343
37785a068105n08651M69278J013956K46334n89773n325J082646O64408r26711
37776C78057j334284J6845R88398K46568p35643l69762N30935N00965j15541k46759
$$ plain form
37766 -140221 -300022 -810624 -1350675 -694665 1216714 2518478 1793683 69162 -684420
37757 -684420 -131191 547180 646323 506386 400056 70479 -548448 -992737 -813843 -12569
37747 -12569 1020541 1657072 1380809 408979 -324241 -242660 149702 88504 -330228 -476145
37737 -476145 -272985 -211955 -461565 -672695 -572901 -119415 797523 2071450 2862284 2221636
37727 2221636 480613 -693928 -88156 1598968 2512434 1715229 187528 -307886 773070
37718 773070 2122797 2153186 967510 170645 691176 1644570 1807993 1362119 1306412 1795938
37708 1795938 2185502 2356542 2723636 2976270 2155867 327544 -1004430 -772205 247094
37699 247094 582975 -27739 -583398 -216721 943087 2014368 2082709 1022657 -129224
$$ packed form
37766a40221j59801n10602n40051O56010J911379J301764p24795j724521p53582
37757f84420N53229O78371R9143j39937j06330l29577o18927m44289J78894Q01274
37747a2569J033110O36531k76263r71830p33220Q1581L92362o1198m18732j45917
37737d76145K03160O1030k49610k11130R9794M53486R16938J273927P90834o40648
37727B221636j741023j174541O05772J687124R13466p97205j527701m95414J080956
37718G73070J349727L0389j185676p96865N20531R53394J63423m45874n5707M89526
37708A795938L89564J71040L67094K52634q20403j828323j331974K32225J019299
37699B47094L35881o10714n55659L66677J159808J071281O8341j060052j151881
$$ plain form
37690 -129224 -104001 1035307 1896522 1660871 1135471 1276925 1586840 1082409 233163 502182
37680 502182 2044415 3222772 2756077 1274182 233460 146182 499409 775843 857343
37671 857343 788670 728980 899030 1140123 831509 -253303 -1277811 -1143289 110794
37662 110794 1266629 1348974 615359 2819 24151 482603 992087 1414350 1801614 2140866
37652 2140866 2270083 2018749 1370881 462797 -506378 -1256045 -1437211 -991059 -517076
37643 -517076 -807877 -1745398 -2157727 -1310317 -109595 4356 -855003 -1108839 -27375
37634 -27375 1213836 1376157 985697 1313207 2294926 2746255 2279806 1667268 1334525 865373
37624 865373 293918 553630 1947707 3263577 3354856 2814968 2999360 3876147 4024312
$$ packed form
37690a29224K5223J139308Q61215k35651n25400J41454L09915n04431q49246K69019
37680E02182J542233J178357m66695j481895j040722q7278L53227K76434Q1500
37671H57343o8673n9690J70050K41093l08614j084812j024508J34522J254083
37662A10794J155835Q2345p33615o12540K1332M58452N09484M22263L87264L39252
37652B140866J29217k51334o47868r08084r69175p49667j81166M46152M73983
37643e17076k90801r37521m12329Q47410J200722J13951q59359k53836J081464
37634b7375J241211J62321l90460L27510R81719M51329m66449o12538l32743m69152
37624H65373n71455K59712J394077J315870R1279n39888J84392Q76787J48165
$$ plain form
37615 4024312 2697646 875205 26439 518670 1523664 2044838 1783030 1234051 1070986
37606 1070986 1354392 1479392 1029629 345944 -72760 -324326 -710298 -946423 -542292
37597 -542292 174921 272475 -464408 -1211128 -1293845 -911149 -365054 559305 1815918 2421144
37587 2421144 1511068 -206738 -1007372 -213859 1091162 1639532 1480854 1387047 1405422
37578 1405422 932867 36542 -370711 14668 240233 -363392 -808686 224427 2137153
37569 2137153 2943750 2115384 1370267 2087189 3365362 3611964 2828662 2054608 1515143
37560 1515143 823016 334485 656694 1160343 632137 -708502 -1444322 -1203950 -1023584
37551 -1023584 -1337449 -1367122 -897456 -854155 -1427353 -1381520 -219786 591804 -188619 -1560717
$$ packed form
37615D024312j326666j822441q48766M92231J004994N21174k61808n48979j63065
37606A070986K83406J25000m49763o83685m18704k51566l85972k36125M04131
37597e42292P17213R7554p36883p46720q2717L82696N46095R24359J256613O05226
37587B421144r10076j717806q00634P93513J305021N48370j58678r3807J8375
37578A405422m72555q96325m07253L85379K25565o03625m45294J033113J912726
37569B137153Q06597q28366p45117P16922J278173K46602p83302p74054n39465
37560A515143o92127m88531L22209N03649n28206j340639p35820K40372J80366
37551a023584l13865k9673M69666M3301n73198M5833J161734Q11590p80423j372098
$$ plain form
37541 -1560717 -1838435 -1047424 -305244 180333 921532 1708315 1869999 1415499 608713
37532 608713 -872309 -2945486 -4118019 -3195112 -1376234 -785746 -1365136 -1238023 84561
37523 84561 1073663 887468 499079 603302 441584 -479780 -1284788 -1251725 -867327 -473976
37513 -473976 570407 2376549 3674083 3617942 3056819 2819478 2174835 445693 -1165791
37504 -1165791 -1105110 153780 1003789 1191328 1600954 2185243 2070568 1446072 1431488 2081403
37494 2081403 2328682 2026100 2203699 2933900 2792808 1205383 -313076 -331998 375207
37485 375207 139968 -1097798 -1944371 -1722821 -1205093 -1242801 -1715557 -2081590 -2248397 -2463168
37475 -2463168 -2664971 -2412157 -1550562 -667160 -483654 -801543 -599632 513403 1535024
$$ packed form
37541a560717k77718P91011P42180M85577P41199P86783J61684m54500q06786
37532F08713j481022k073177j172533R22907J818878N90488n79390J27113J322584
37523H4561R89102j86195l88389J04223j61718r21364q05008L3063L84398L93351
37513d73976J044383J806142J297534n6141n61123k37341o44643j729142j611484
37504a165791O0681J258890Q50009J87539M09626N84289j14675o24496j4584O49915
37494B081403K47279l02582J77599P30201j41092j587425j518459j8922P07205
37485C75207k35239j237766q46573K21550N17728l7708m72756l66033j66807k14771
37475b463168k01803K52814Q61595Q83402J83506l17889K01911J113035J021621
$$ plain form
37466 1535024 1382227 476779 125493 599378 887250 358319 -402109 -655191 -439735
37457 -439735 -71612 437848 1025133 1369331 1486102 1883136 2719840 3412880 3432059 2915845
37447 2915845 2256430 1726119 1655819 2133395 2375971 1490301 120044 -8798 1294063
37438 1294063 2067899 1126204 -23550 376133 1444754 1188799 -129322 -449369 721389
37429 721389 1738064 1647330 1352079 1499223 1259993 70105 -1081777 -1105040 -264598
37420 -264598 681094 1585009 2272158 2015044 766178 -51359 804909 2594412 3523292
37411 3523292 2997164 1981397 1504010 1709035 2166139 2363539 2003442 1283785 711785
37402 711785 435301 216023 189347 838663 1909163 2356000 1933522 1773354 2587362 3344959
$$ packed form
37466A535024j52797r05448l51286M73885K87872n28931p60428k53082K15456
37457d39735L68123N09460N87285L44198J16771L97034Q36704O93040J9179n16214
37447B915845o59415n30311p0300M77576K42576q85670j370257j28842J302861
37438A294063P73836r41695j149754L99683J068621k55955j318121l20047J170758
37429G21389J016675r0734k95251J47144k39230j189888j151882k3263Q40442
37420b64598R45692R03915O87149k57114j248866q17537Q56268J789503R28880
37411C523292n26128j015767m77387K05025M57104J97400l60097p19657n72000
37402G11785k76484k19278k6676O49316J070500M46837m22478j60168Q14008P57597
$$ plain form
37392 3344959 2766131 1208415 -62417 -628265 -742240 -275391 746494 1328491 791473
37383 791473 185461 709920 1390455 394738 -1748402 -2614713 -1580245 -545227 -518303
37374 -518303 -107919 1505547 2599603 1653343 62019 27042 1209743 1712800 1347635
37365 1347635 1549155 2540661 2911914 2049936 965836 419830 11657 -433812 -237438
37356 -237438 747717 1588033 1840507 2302023 3305824 3614982 2271752 492678 181531
37347 181531 1184395 1677382 1070503 801740 1927797 3492046 4053168 3585840 2855052
37338 2855052 1942117 719859 69108 960933 2484021 2482549 518347 -1340103 -1358390
37329 -1358390 -305720 246935 421183 1249954 2358459 2375392 1355341 866586 1491132
$$ packed form
37392C344959n78828j557716j270832n65848j13975M66849J021885N81997n37018
37383G91473o06012N24459O80535r95717k143140q66311J034468J035018K6924
37374e18303M10384J613466J094056r46260j591324l4977J182701N03057l65165
37365A347635K01520R91506L71253q61978j084100n46006m08173m45469J96374
37356b37438R85155Q40316K52474M61516J003801L09158j343230j779074l11147
37347A81531J002864M92987o06879k68763J126057J564249N61122m67328p30788
37338B855052r12935j222258o50751Q91825J523088j472j964202j858450j8287
37329a358390J052670N52655J74248Q28771J108505J6933j020051m88755O24546
$$ plain form
37320 1491132 2019557 1640143 1265489 1806532 2522196 2221582 1087073 134494 -367588
37311 -367588 -778687 -999625 -711933 -309208 -389125 -499403 430905 2333906 3733413
37302 3733413 3554962 2402314 1585439 1439932 1188518 303108 -537180 -183552 1385427
37293 1385427 2722421 2577972 1508875 1063299 1577879 1854663 1135129 160026 -206385
37284 -206385 -156355 28323 864483 2420818 3264568 2179006 243774 -399082 556197
37275 556197 1524385 1619966 1536942 1724554 1459176 336621 -742304 -883314 -446473 -217856
37265 -217856 -166004 235753 1042831 1796166 2019564 1445368 279848 -547852 -99244 1331127
37255 1331127 2405800 2465250 2256657 2562208 2979641 2719061 1934202 1489710 1745727
$$ packed form
37320A491132N28425l79414l74654N41043P15664l00614j134509r52579n02082
37311c67588m11099k20938K87692M02725p9917j10278R30308J903001J399507
37302C733413j78451j152648q16875j45507k51414q85410q40288L53628J568979
37293A385427J336994j44449j069097m45576N14580K76784p19534r75103l66411
37284b06385N0030J84678Q36160J556335Q43750j085562j935232o42856R55279
37275E56197R68188R5581q3024J87612k65378j122555j078925j41010M36841K28617
37265b17856N1852M01757Q07078P53335K23398n74196j165520q27700M48608J430371
37255A331127J074673N9450k08593L05551M17433k60580p84859m44492K56017
$$ plain form
37246 1745727 2178542 2078469 1343429 712929 1135824 2504022 3290718 2268473 381252
37237 381252 -266961 709966 1572697 1243833 801071 1320490 1888663 1211808 -51962
37228 -51962 -303345 450931 826858 390771 35771 200151 344340 271288 478848 987599
37218 987599 1157005 920581 945260 1317485 1376886 1156877 1532277 2375446 2104086 85029
37208 85029 -1805658 -1382950 935990 2829866 3155162 2876982 3084162 3510613 3368301
37199 3368301 2585094 1653940 877366 252669 -257606 -705548 -1184398 -1629821 -1734821
37190 -1734821 -1214786 -116912 1110442 1822258 1678869 1119091 1008912 1499360 1658607
37181 1658607 828632 -57099 538789 2547202 4170372 4229369 3529468 3294272 3298490 2590916
$$ packed form
37246A745727M32815j00073p35040o30500M22895J368198P86696j022245j887221
37237C81252o48213R76927Q62731l28864m42762N19419N68173o76855j263770
37228e1962k51383P54276L75927m36087l55000J64380J44189p3052K07560N08751
37218I87599J69406k36424K4679L72225N9401k20009L75400Q43169k71360k019057
37208H5029j890687M22708K318940J893876L25296k78180K07180M26451j42312
37199C368301p83207r31154p76574o24697n10275m47942m78850m45423j05000
37190a734821N20035J097874J227354P11816j43389n59778j10179M90448J59247
37181A658607q29975q85731N95888K008413J623170N8997o99901k35196M218p07574
$$ plain form
37171 2590916 1361441 812277 1383143 2238412 2537204 2228379 1505809 476706 -371180
37162 -371180 -310294 582218 1261219 1019218 301841 -140178 -173866 98646 855446 1999804
37152 1999804 2713674 2348117 1360575 688842 549623 485481 247855 1309 -54165 258680
37142 258680 1041346 1880512 2043142 1640613 1802611 2905732 3552357 2508910 848883
37133 848883 602847 1793982 2593049 2216932 1732155 1777246 1480253 352852 -490207
37124 -490207 -55445 947251 1356750 1283717 1445100 1695008 1419714 781764 490565 731917
37114 731917 1148271 1474113 1531700 1103262 414363 159100 484946 670387 379961 320275
37104 320275 910919 1355512 1045352 825849 1553789 2344836 1864516 664907 435944
$$ packed form
37171B590916j229475n49164N70866Q55269K98792l08825p22570j029103q47886
37162c71180O0886Q92512O79001k42001p17377m42019l3688K72512P56800J144358
37152A999804P13870l65557r87542o71733j39219o4142k37626k46546n5474L12845
37142B58680P82666Q39166J62630m02529J61998J103121O46625j043447j660027
37133H48883k46036J191135P99067l76117m84777M5091k96993j127401q43059
37124d90207M34762J002696M09499p3033J61383K49908k75294o37950k91199K41352
37114G31917M16354L25842N7587m28438o88899k55263L25846J85441k90426n9686
37104C20275N90644M44593l10160k19503P27940P91047m80320j199609k28963
$$ plain form
37095 435944 1313143 1801664 1289138 741146 710032 566821 250503 922377 2902800 4509098
37085 4509098 4199100 2712133 1772046 1594445 1138806 209398 -311940 -188511 -240692
37076 -240692 -725929 -639247 654621 2068944 2076673 837037 -48206 167295 414010 -439911
37066 -439911 -1771770 -1985718 -651523 1090789 2129996 2401362 2177649 1391709 214731
37057 214731 -521840 -299944 161289 -223941 -1326286 -1831957 -862944 972323 2237794
37048 2237794 2072256 911281 -22949 11951 548526 680261 395003 520722 1346122
37039 1346122 2144689 2321430 2130628 1849449 1224451 335610 -25560 360246 529712
37030 529712 -18413 -230133 607940 1030767 -639562 -3217854 -3789610 -1810853 151763
$$ packed form
37095D35944Q77199M88521n12526n47992l1114j43211l16318O71874J980423J606298
37085D509098l09998j486967r40087j77601m55639r29408n21338J23429n2181
37076b40692m85237Q6682J293868J414323P729j239636q85243K15501K46715q53921
37066d39911j331859k13948J334195J742312J039207K71366k23713p85940j176978
37057B14731p36571K21896M61233l85230j102345n05671R69013J835267J265471
37048B237794j65538j160975r34230L4900N36575J31735k85258J25719Q25400
37039A346122P98567J76741j90802k81179o24998q88841l61170L85806J69466
37030E29712n48125k11720Q38073M22827j670329k578292n71756J978757J962616
$$ plain form
37021 151763 167233 -672479 -479780 623644 1251285 1081981 996386 1438158 1811771 1400551
37011 1400551 210302 -1046287 -1517202 -935057 148845 1088025 1870514 2628314 2856610
37002 2856610 2102359 1163232 1326128 2389416 2808064 2053612 1398367 1837691 2635215
36993 2635215 2717018 2255971 1901256 1501626 695787 -40844 -39732 446143 715917 694127
36983 694127 693325 657507 513197 766389 1834564 3158160 3810208 3654500 3141235 2360900
36973 2360900 1187149 84863 -172034 393710 860487 546325 -184993 -356951 549110
36964 549110 1906210 2381809 1407545 83006 -37595 1022538 1800201 1629039 1461742
36955 1461742 2004553 2413772 1764171 631492 75486 32719 -47093 138728 1043557 1945159
$$ packed form
37021A51763J5470q39712J92699J103424O27641j69304q5595M41772L73613m11220
37011A400551j190249j256589m70915N82145J083902R39180P82489P57800K28296
37002B856610p54251r39127J62896J063288M18648p54452o55245M39324P97524
36993B635215Q1803m61047l54715l99630q05839p36631J112M85875K69774k1790
36983F94127q02l5818j44310K53192J068175J323596O52048j55708n13265p80335
36973B360900j173751j102286k56897N65744M66777l14162p31318j71958R06061
36964E49110J357100M75599r74264j324539j20601J060133P77663j71162j67297
36955A461742N42811M09219o49601j132679n56006m2767p9812J85821R04829R01602
$$ plain form
36945 1945159 1840460 1173716 1142224 1639571 1509475 705490 532757 1575257 2905862
36936 2905862 3690783 4186222 4695357 4852783 4574917 4586423 5253058 5792561 5410687 4530026
36926 4530026 4184025 4735268 5807740 6989179 7978569 8419045 8175631 7549426 6788642
36917 6788642 5655996 3920046 2061168 1015420 1226283 2231943 3189029 3616448 3609672
36908 3609672 3458050 3183813 2562124 1549574 453978 -398167 -900045 -981317 -584041
36899 -584041 -41081 -17295 -687349 -1377600 -1455896 -1153360 -1015386 -1030621 -938957 -889579
36889 -889579 -966633 -528246 931854 2560784 2989459 2332293 2051678 2629284 2731849
36880 2731849 1312903 -629081 -1353935 -667937 140525 235921 50500 194098 466729
$$ packed form
36945A945159j04699o66744l1492M97347j30096q03985j72733J042500J330605
36936B905862P84921M95439N09135J57426k77866J1506O66635N39503l81874q80661
36926D530026l46001N51243J072472J181439R89390M40476k43414o26205p60784
36917F788642j132646j735950j858878j045748K10863J005660R57086M27419o776
36908C609672j51622k74237o21689j012550j095596q52145n01878q1272L97276
36899e84041N42960K3786o70054o90251p8296L02536J37974j5235R1664M9378
36889h89579p7054M38387J460100J628930M28675o57166k80615N77606J02565
36880B731849j418946j941984p24854O85998Q08462R5396j85421J43598K72631
$$ plain form
36871 466729 331576 -128387 -223849 429483 1369607 1862802 1841120 1873299 2146358 1987283
36861 1987283 809021 -808356 -1561611 -889668 447530 1234886 908528 -105248 -800083
36852 -800083 -449347 607668 1207893 714854 -188898 -503128 -264059 -160188 -133262 613175
36842 613175 2151197 3326792 3088802 1714079 405614 105368 843871 1793063 1840964
36833 1840964 577948 -1163117 -2113179 -1875471 -1021500 -106861 717445 1240218 1207728
36824 1207728 916111 982923 1347260 1278217 603898 118053 409804 1045093 1352438 1338581
36814 1338581 1309759 1178367 744613 258518 143404 407232 736740 950950 1044099 1011354
36804 1011354 913375 919703 1072434 1155029 898830 199986 -777730 -1496462 -1303675 -259372
$$ packed form
36871D66729j35153m59963r5462O53332R40124M93195k1682L2179K73059j59075
36861A987283j178262j617377p53255O71943J337198P87356l26358j013776o94835
36852h00083L50736J057015O00225m93039r03752l14230K39069J03871K6926P46437
36842F13175J538022J175595k37990j374723j308465l00246P38503R49192M7901
36833A840964j263016j741065r50062K37708Q53971R14639Q24306N22773l2490
36824A207728k91617O6812L64337o9043o74319m85845K91751O35289L07345j3857
36814A338581k8822j31392m33754m86095j15114K63828L29508K14210R3149l2745
36804A011354r7979O328J52731Q2595k56199o98844r77716p18732J92787J044303
$$ plain form
36794 -259372 553308 199413 -791632 -1039037 -140683 978645 1539774 1720002 1777157 1381870
36784 1381870 319887 -883465 -1502441 -1225603 -52345 1664637 2888373 2582958 1148684
36775 1148684 238585 629695 1230679 875852 154205 492921 2070291 3638299 4079808
36766 4079808 3334930 2032008 886404 322403 220266 170891 135183 409671 820802
36757 820802 713686 81617 -140176 545845 1325370 1230913 436279 -301993 -758008 -1007171
36747 -1007171 -795943 -50848 547863 399652 -78919 -161730 49592 9392 -294276 -593674
36737 -593674 -987075 -1401589 -1042977 482435 1985749 1882661 321207 -995970 -920931
36728 -920931 237340 1651409 2685126 2825548 2031303 1129369 945046 1200638 1163876
$$ packed form
36794b59372Q12680l53895r91045k47405Q98354J119328N61129J80228N7155l95287
36784A381870j061983j203352o18976K76838J173258J716982J223736l05415j434274
36775A148684r10099L91110O00984l54827p21647L38716J577370J568008M41509
36766D079808p44878j302922j145604n64001j02137m9375l5708K74488M11131
36757H20802j07116o32069k21793O86021P79525r4457p94634p38272m56015k49163
36747a007171K11228P45095N98711j48211m78571q2811K11322m0200l03668k99398
36737e93674l93401m14514L58612J525412J503314j03088j561454j317177P5039
36728i20931J158271J414069J033717J40422p94245r01934j84323K55592l6762
$$ plain form
36719 1163876 983122 1230938 1531948 1044490 37248 -546814 -907112 -1998567 -3315226
36710 -3315226 -3095620 -1225694 102105 -435676 -1337352 -797905 474892 663546 -188782
36701 -188782 -564083 -115157 54776 -444508 -694189 -266477 -21012 -516665 -883394 -113227
36691 -113227 1340266 2141263 1838010 1256135 1243789 1699212 2010751 1999121 2045543 2417275
36681 2417275 2836012 2828731 2268408 1399447 548219 53578 243813 1052172 1750807 1561664
36671 1561664 603958 -182867 -151643 425970 941772 1180338 1240332 1171292 1036052 1032632
36661 1032632 1223105 1367957 1304006 1229485 1294321 1170553 489385 -402825 -639983 80107
36651 80107 1005709 1214868 754415 502561 937092 1508338 1467671 905095 485797 421882
$$ packed form
36719A163876j80754K47816L01010m87458j007242n84062l60298j091455j316659
36710c315226K19606J869926J327799n37781r01676N39447J272797J88654q52328
36701a88782l75301M48926J69933m99284k49681M27712K45465m95653l66729P70167
36691a13227J453493Q00997l03253n81875j2346M55423L11539j1630M6422L71732
36681B417275M18737p281n60323q68961q51228m94641J90235Q08359O98635j89143
36671A561664r57706p86825L1224N77613N15802K38566N9994o9040j35240l420
36661A032632J90473J44852o3951p4521O4836j23768o81168q92210k37158P20090
36651H0107R25602K09159m60453k51854M34531N71246m0667n62576m19298o3915
$$ plain form
36641 421882 363382 229720 360113 700660 703085 385885 582543 1528049 2129309 1568649
36631 1568649 803671 1230200 2472337 3022101 2770363 3140714 4508841 5263890 4204519
36622 4204519 2419646 1679703 1975711 1887532 810982 -364322 -615184 84611 1006808
36613 1006808 1458959 1301860 968788 887403 867516 500067 161770 765919 2167811 2815208
36603 2815208 1771055 257937 136499 1424117 2529022 2630084 2492744 2857741 3301232
36594 3301232 3172359 2706260 2561235 2852542 3224640 3451785 3440398 2979927 2062712 1290196
36584 1290196 1417305 2441574 3515046 3861531 3514121 3028504 2728687 2508674 2280242
36575 2280242 2262534 2662125 3271432 3637550 3569104 3251797 2880629 2419916 1800957 1184663
$$ packed form
36641D21882n8500j33662J30393L40547K425l17200J96658R45506O01260n60660
36631A568649p64978M26529J242137N49764k51738L70351J368127P55049j059371
36622D204519j784873p39943K96008q8179j076550j175304k50862O99795R22197
36613A006808M52151j57099l33072q1385j9887l67449l38297O04149J401892O47397
36603B815208j044153j513118j21438J287618J104905J01062j37340L64997M43491
36594C301232j28873m66099j45025K91307L72098K27145j1387m60471r17215p72516
36584A290196J27109J024269J073472L46485l47410m85617k99817k20013k28432
36575B280242j7708L99591O09307L66118o8446l17307l71168m60713o18959o16294
$$ plain form
36565 1184663 913059 1219682 1948008 2527879 2422558 1769245 1366294 1765669 2604558
36556 2604558 3176157 3374741 3544685 3641085 3296910 2690151 2519576 2933990 3247137 2999273
36546 2999273 2568835 2370748 2187313 1767028 1367743 1125512 594718 -350311 -818973
36537 -818973 -51799 1211962 1583931 1011987 814735 1718487 2932784 3469046 3449272
36528 3449272 3568696 3895657 3845417 3099053 2093931 1637456 2170533 3272371 3862492
36519 3862492 3175205 1655064 639847 1009597 2329126 3434309 3690638 3528866 3805992
36510 3805992 4746739 5624973 5638056 5011910 4812439 5486378 6112122 5607513 4296154
36501 4296154 3536904 3910830 4560616 4488276 3825291 3462081 3902585 4898373 5915835
$$ packed form
36565A184663k71604L06623P28326N79871j05321o53313m02951L99375Q38889
36556B604558N71599J98584J69944R6400l44175o06759j70575M14414L13147k47864
36546B999273m30438j98087j83435m20285l99285k42231n30794r45029m68662
36537h18973P67174J263761L71969n71944j97252R03752J214297N36262j9774
36528C449272J19424L26961n0240p46364j005122m56475N33077J101838N90121
36519C862492o87287j520141j015217L69750J319529J105183K56329j61772K77126
36510C805992R40747Q78234J3083o26146j99471O73939O25744n04609j311359
36501D296154p59250L73926O49786p2340o62985l63210M40504R95788J017462
$$ plain form
36492 5915835 6565362 6705369 6468300 6254120 6586193 7831645 9818689 11628599 12178742
36483 12178742 11490292 11091558 12453416 15113092 17208560 18022654 19023296 21857729
36475 21857729 26196879 30441012 33978567 37725802 42725306 49292842 57566826 67900168
36467 67900168 80458699 95245099 112811791 134268632 160430511 191694069 228389685
36460 228389685 268995808 306642132 329490909 328154371 303787408 267345874 230320774
36453 230320774 197503786 168634394 143772943 124229788 109598072 97236162 85355363
36446 85355363 74678951 66451979 60511977 56116143 53133376 51292877 49428552 46740496
36438 46740496 44011571 42376844 41543740 40469288 39248757 38893499 39442295 39743432 39247219
$$ packed form
36492E915835O49527J40007k37069k14180L32073J245452J987044J809910N50143
36483A2178742o88450l98734J361858K659676K095468Q14094J000642K834433
36475B1857729M339150M244133L537555L747235M999504O567536Q273984J0333342
36467F7900168J2558531J4786400J7566692K1456841K6161879L1263558L6695616
36460B28389685M0606123L7646324K2848777j336538k4366963l6441534l7025100
36453B30320774l2816988k8869392k4861451j9543155j4631716j2361910j1880799
36446H5355363j0676412q226972n940002m395834k982767j840499j864325k688056
36438D6740496k728925j634727q33104j074452j220531l55258N48796L01137m96213
$$ plain form
36429 39247219 38690453 38607118 38315452 37002897 34928765 32848537 30884491 28652844 26063390
36420 26063390 23391001 20891767 18820764 17431640 16464130 15089866 13012479 11215010
36412 11215010 10782111 11203558 10828074 9101577 7396403 7182937 8128449 8644521 7831879
36403 7831879 6187602 4666077 3771663 3529399 3666561 3661795 3133578 2383535 2127075
36394 2127075 2492495 2742833 2285301 1529222 1314881 1793644 2359497 2532980 2449353 2515750
36384 2515750 2966837 3745595 4499717 4707525 4098673 2964991 1876554 1188206 992267
36375 992267 1302982 1951272 2495806 2601980 2345104 1864851 1089385 241080 134989 1217511
36365 1217511 2610475 2977215 2208691 1421650 1417852 2031059 2818646 3310237 2710486 754927
$$ packed form
36429C9247219n56766q3335k91666j312555k074132k080228j964046k231647k589454
36420B6063390k672389k499234k071003j389124r67510j374264k077387j797469
36412A1215010m32899M21447l75484j726497j705174k13466R45512N16072q12642
36403G831879j644277j521525q94414k42264J37162m766n28217p50043k56460
36394B127075L65420K50338m57532p56079k14341M78763N65853J73483q3627O6397
36384B515750M51087P78758P54122K07808o08852j133682j088437o88348j95939
36375I92267L10715O48290N44534J06174k56876m80253p75466q48305j06091J082522
36365A217511J392964L66740p68524p87041l798O13207P87587M91591n99751j955559
$$ plain form
36355 754927 -1005986 -384367 2410660 4456543 3734985 1655293 807869 1502874 2073110
36346 2073110 1667044 992471 728839 813576 1162924 1729784 1932421 1289590 552469 949998
36336 949998 2307362 3159689 2828932 2160578 2005526 2191309 2350333 2618388 2972744
36327 2972744 2814505 1815819 519964 -354144 -626083 -375036 380189 1344742 1882205
36318 1882205 1702950 1236504 1091543 1486102 2226580 2802765 2625097 1794871 1471468
36309 1471468 2620667 4457139 5125346 4045717 2572904 2084369 2441403 2739881 2608869
36300 2608869 2194352 1626275 1089002 888960 1062529 1360998 1707095 2047621 1871601
36291 1871601 844272 -158013 81931 1139189 1357712 545464 449761 1782140 2684307
$$ packed form
36355G54927j760913O21619K795027K045883p21558k079692q47424O95005N70236
36346B073110m06066o74573k63632Q4737L49348N66860K02637o42831p37121L97529
36336I49998J357364Q52327l30757o68354j55052J85783J59024K68055L54356
36327B972744j58239r98686j295855q74108k71939K51047P55225R64553N37463
36318A882205j79255m66446j44961L94559P40478N76185j77668q30226l23403
36309A471468J149199J836472O68207j079629j472813m88535L57034K98478j31012
36300B608869m14517n68077n37273k00042J73569K98469L46097L40526j76020
36291A871601j027329j002285K39944J057258K18523q12248r5703J332379R02167
$$ plain form
36282 2684307 1540068 -325039 -565526 751057 1616403 1229783 655550 677782 897933
36273 897933 942319 892210 426798 -899633 -2348507 -2490856 -1369204 -744929 -1635233
36264 -1635233 -2853070 -2735704 -1347761 -131672 -7169 -617056 -1171565 -1408529 -1636405
36255 -1636405 -2020391 -2048701 -1105039 382823 1144185 903543 1117051 2936627 5279263
36246 5279263 6246810 5790359 5309086 5071518 4096842 2612205 2345127 3676763 4582112
36237 4582112 3560472 1885776 1556719 2482296 3285780 3666297 4121199 4174764 2899324
36228 2899324 914119 20458 735479 1713166 1852034 1607005 1787292 2207904 2131752
36219 2131752 1291978 27305 -1023358 -1131833 -34225 1497652 2267837 2039180 1653930
$$ packed form
36282B684307j144239j865107k40487J316583Q65346l86620n74233K2232K20151
36273H97933M4386n0109m65412j326431j448874j42349J121652O24275q90304
36264a635233j217837J17366J387943J216089J24503o09887n54509k36964k27876
36255a636405l83986k8310R43662J487862P61362k40642K13508J819576K342636
36246E279263R67547m56451m81273k37568r74676j484637k67078J331636R05349
36237D582112j021640j674696l29057R25577Q03484L80517M54902N3565j275440
36228B899324j985205q93661P15021R77687J38868k45029J80287M20612p6152
36219B131752q39774j264673j050663j08475J097608J531877P70185k28657l85250
$$ plain form
36210 1653930 1599142 1266841 85647 -1306692 -1671158 -617806 1015577 2003601 1678737
36201 1678737 369848 -811048 -927299 -202825 273238 -46510 -597491 -770324 -791001
36192 -791001 -946416 -662038 628859 2062065 2007784 298179 -1283693 -1190821 78841
36183 78841 981568 995434 798970 837341 803954 562228 565835 986744 1227481 874124 521811
36172 521811 923858 1740098 2001150 1635126 1571492 2235675 2923799 3042868 3014420 3276014
36162 3276014 3253347 2337472 1251541 1151615 1659503 1274889 -136842 -858679 54423
36153 54423 1174426 855311 -247509 -359038 564618 1029726 682790 725729 1428139 1328029
36143 1328029 -181536 -1310355 -366165 1580136 2272920 1595705 1361876 2206129 2744338
$$ packed form
36210A653930n4788l32301j181194j392339l64466J053352J633383R88024l24864
36201A678737j308889j180896j16251P24474M76063l19748n50981j72833k0677
36192g91001j55415K84378J290897J433206n4281j709605j581872R2872J269662
36183G8841R02727J3866j96464L8371l3387k41726L607M20909K40737l53357l52313
36172E21811M02047Q16240K61052l66024o3634O64183O88124J19069k8448K61594
36162C276014k2667r15875j085931r9926N07888l84614j411731p21837R13102
36153E4423J120003l19115j102820j11529R23656M65108l46936M2939P02410j00110
36143A328029j509565j128819R44190J946301O92784o77215k33829Q44253N38209
$$ plain form
36134 2744338 2011883 865159 345820 231046 59633 246306 1085219 1687154 1136075
36125 1136075 27793 -298754 409692 1322772 1947559 2453651 2853372 2945244 2911589 2911004
36115 2911004 2245002 197526 -2220928 -2773929 -805729 1579461 1920776 165456 -1740302
36106 -1740302 -2301259 -1586368 -395837 605923 983869 637582 6473 -367142 -577384
36097 -577384 -1164975 -2087406 -2425424 -1469507 207446 1195042 773238 -279689 -567973
36088 -567973 341992 1459890 1542523 452245 -887639 -1626368 -1614432 -1037081 -92460
36079 -92460 762669 859305 89097 -697287 -526361 619513 1884161 2518692 2471557 2184307
36069 2184307 2142174 2533031 3095994 3376147 3220892 2814505 2233670 1485109 1101600 1889755
$$ packed form
36134B744338p32455j146724n19339j14774j71413J86673Q38913O01935n51079
36125A136075j108282l26547P08446R13080O24787N06092L99721R1872l3655n85
36115B911004o66002k047476k418454n53001J968200K385190L41315j755320j905758
36106a740302n60957P14891J190531J001760L77946l46287o31109l73615k10242
36097e77384n87591r22431l38018R55917J676953R87596m21804j052927k88284
36088e67973R09965J117898Q2633j090278j339884p38729J1936N77351R44621
36079i2460Q55129R6636p70208p86384J70926J145874J264648O34531m7135k87250
36069B184307m2133L90857N62963K80153j55255m06387n80835p48561l83509P88155
$$ plain form
36059 1889755 3561328 4427368 3363810 1481607 732890 1297545 1707139 1366821 1308771
36050 1308771 2103958 2658590 1974230 812077 447306 712791 563648 -57586 -279203
36041 -279203 92633 333614 138808 49260 409233 883453 1200700 1481851 1602571 1101688
36031 1101688 64082 -668018 -552401 27048 515739 887672 1208699 1217333 888136 801665
36021 801665 1304818 1774565 1408198 403450 -359988 -592952 -803503 -1265682 -1504925
36012 -1504925 -1042864 -152584 489262 681985 883123 1472938 2088631 2000279 1167527 494838
36002 494838 710074 1402874 1769838 1931176 2540507 3233673 2768639 1059939 -244337
35993 -244337 13454 891381 1037426 881945 1613690 2727273 2504895 837180 -315796
$$ packed form
36059A889755J671573Q66040j063558j882203p48717N64655M09594l40318n8050
36050A308771P95187N54632o84360j162153l64771K65485j49143o21234k21617
36041b79203L71836K40981j94806q9548L59973M74220L17247K81151J20720n00883
36031A101688j037606p32100J15617N79449M88691L71933L21027Q634l29197q6471
36021H01665N03153M69747l66367j004748p63438k32964k10551m62179k39243
36012a504925M62061Q90280O41846J92723K01138N89815O15693q8352q32752o72689
36002D94838K15236O92800L66964J61338O09331O93166m65034j708700j304276
35993b44337K57791Q77927J46045j55481P31745J113583k22378j667715j152976
$$ plain form
35984 -315796 278467 1472705 1653184 980484 665955 943856 994214 497458 164319 624976
35974 624976 1460146 1606987 565712 -894148 -1369749 -365907 1033285 1490414 1131942
35965 1131942 1138676 1762396 1902305 959804 -61486 -30285 684918 1002015 852034 1065787
35955 1065787 1918110 2793228 3150593 2967862 2317320 1325049 565394 720236 1671168
35946 1671168 2513637 2633145 2270070 1878099 1445547 766030 46279 -162841 348505
35937 348505 1044305 1126315 515928 161434 1018512 2766247 3998689 3805411 2692123
35928 2692123 1759643 1508797 1753484 2143833 2291759 1820734 819662 -59386 -373575
35919 -373575 -411110 -574853 -728773 -634961 -509955 -527378 -271257 568074 1377027 1339850
$$ packed form
35984c15796N94263J194238J80479o72700l14529K77901N0358m96756l33139M60657
35974F24976Q35170J46841j041275j459860m75601J003842J399192M57129l58472
35965A131942O734O23720J39909r42501j021290L1201P15203L17097j49981K13753
35955A065787Q52323Q75118L57365j82731o50542r92271p59655J54842R50932
35946A671168Q42469J19508l63075l91971m32552o79517p19751k09120N11346
35937C48505O95800Q2010o10387l54494Q57078J747735J232442j93278j113288
35928B692123r32480k50846K44687L90349J47926m71025j001072q79048l14189
35919c73575l7535j63743j53920R3812J25006j7423K56121Q39331Q08953l7177
$$ plain form
35909 1339850 684700 365345 718741 1291575 1821764 2456150 3019611 2995935 2389256 1837855
35899 1837855 1694114 1638521 1350077 974101 796523 929770 1325586 1661272 1417283 660033
35889 660033 434872 1523007 3026578 3242046 1928196 597497 382860 749227 728226
35880 728226 379382 369942 850423 1396584 1591276 1240375 469717 -131045 -11203 504277
35870 504277 559292 143194 266275 1362636 2376857 2063661 545578 -1048467 -1976741
35861 -1976741 -2332893 -2513341 -2742449 -2855215 -2328020 -940098 533417 978777 410925
35852 410925 -82880 -44269 -184571 -834015 -1125984 -480184 317109 508137 693972 1559391
35842 1559391 2356839 2190107 1911132 2874296 4310682 4019072 1720632 -261008 -169682
$$ packed form
35909A339850o55150l19355L53396N72834N30189O34386N63461k3676o06679n51401
35899A837855j43741n5593k88444l75976j77578J33247L95816L35686k43989p57250
35889F60033k25161J088135J503571K15468j313850j330699k14637L66367k1001
35880G28226l48844r440M80481N46161J94692l50901p70658o00762J19842N15480
35870E04277N5015m16098J23081J096361J014221l13196j518083j594045r28274
35861a976741l56152j80448k29108j12766N27195J387922J473515M45360n67852
35852D10925m93805L8611j40302o49444k91969O45800P97293J91028J85835Q65419
35842A559391P97448j66732k78975R63164J436386k91610k298440j981640R1326
$$ plain form
35833 -169682 1068528 1684794 1506934 1456046 1742169 1856170 1708813 1556046 1116747 -106165
35823 -106165 -1663007 -2303973 -1528475 -268958 323352 249909 362214 1013369 1610953
35814 1610953 1546286 1030151 667447 559148 376703 217928 700974 1943173 2998695
35805 2998695 2816917 1501899 166941 -323738 -80771 231217 143391 -294790 -652141
35796 -652141 -526632 34581 552444 632888 356925 104315 187426 716060 1528716 2120473
35786 2120473 1946407 1003606 -99254 -750055 -771860 -303481 307820 507430 38089
35777 38089 -470375 -120551 881337 1298028 589247 -371321 -765944 -975592 -1497231 -1714996
35767 -1714996 -829003 680552 1610915 1558831 919215 -60890 -1148496 -1576153 -823779
$$ packed form
35833a69682J238210O16266j77860n0888K86123J14001j47357j52767m39299j222912
35823a06165j556842o40966P75498J259517N92310p3443J12305O51155N97584
35814A610953o4667n16135l62704j08299j82445j58775M83046J242199J055522
35805B998695j81778j315018j334958m90679K42967L11988q7826m38181l57351
35796f52141J25509N61213N17863Q0444k75963k52610Q3111N28634Q12656N91757
35786B120473j74066r42801j102860o50801k1805M68379O11301J99610m69341
35777C8089n08464L49824J001888M16691p08781r60568l94623k09648n21639k17765
35767a714996Q85993J509555R30363n2084o39616r80105j087606m27657P52374
$$ plain form
35758 -823779 413415 1141085 1516033 2202235 2776562 2211965 668234 -639914 -1165506
35749 -1165506 -1211562 -713873 465417 1231260 227795 -1739169 -2295272 -919028 329878
35740 329878 171930 -30548 1063960 2367942 2308796 1484706 1411314 1842601 1405884 136523
35730 136523 -632186 -528116 -456189 -772600 -786994 -200773 341223 379139 238419 281275
35720 281275 400104 388931 170887 -302896 -841550 -989652 -790991 -1045952 -2014758 -2502024
35710 -2502024 -1332108 779843 2090670 2177896 2052728 2179618 1915272 982393 46454
35701 46454 -451603 -789407 -1044792 -879098 -442232 -258754 -32319 1045073 2514490
35692 2514490 2751858 1392342 61832 -82588 85503 -375694 -603826 389462 1469188
$$ packed form
35758h23779J237194P27670L74948O86202N74327n64597j543731j308148n25592
35749a165506m6056M97689J179290P65843j003465j966964n56103J376244J248906
35740C29878j57948k02478J094508J303982n9146q24090p3392M31287m36717j269361
35730A36523p68709J04070P1927l16411j4394N86221N41996L7916j40720M2856
35720B81275J18829j1173k18044m73783n38654j48102J98661k54961r68806m87266
35710b502024J169916K111951J310827Q7226j25168J26890k64346r32879r35939
35701D6454m98057l37804k55385J65694M36866J83478K26435J077392J469417
35692B514490K37368j359516j330510j44420J68091m61197k28132R93288J079726
$$ plain form
35683 1469188 755129 -1452854 -3014306 -2896486 -2045087 -1409796 -806331 -9164 470727
35674 470727 206489 -526870 -1269670 -1718024 -1526027 -694445 -74159 -376336 -800630 -31694
35664 -31694 1421327 1615118 225090 -756204 -204062 281217 -838692 -2204203 -1563173
35655 -1563173 662730 2146413 2215448 2181838 2464386 2018200 869719 607044 1527905
35646 1527905 1698938 118697 -1335371 -780871 702378 1019907 514863 1063851 2588739
35637 2588739 3054109 1816335 611519 813973 1688233 1999729 1697921 1237541 652112
35628 652112 175519 607517 2108210 3484006 3518976 2385714 1131180 428992 351717
35619 351717 640619 677303 -70584 -1094411 -1158573 -55055 924995 897053 682228 1307214
$$ packed form
35683A469188p14059k207983j561452J17820Q51399O35291O03465P97167M79891
35674D70727k64238p33359p42800m48354J91997Q31582O20286l02177m24294P68936
35664c1694J453021J93791j390028r81294N52142M85279j119909j365511O41030
35655a563173K225903J483683O9035l3610K82548m46186j148481k62675R20861
35646A527905J71033j580241j454068N54500J483249L17529n05044N48988J524888
35637B588739M65370j237774j204816K02454Q74260L11496l01808m60380n85429
35628F52112m76593M31998J500693J375796L4970j133262j254534p02188p7275
35619C51717K88902L6684p47887j023827o4162J103518R80050k7942k14825O24986
$$ plain form
35609 1307214 2228741 2228016 1302821 398198 -215236 -1023955 -2039772 -2633557 -2454393 -1650746
35599 -1650746 -483676 492412 442174 -540164 -870555 593865 2610086 3022017 1775267
35590 1775267 787892 1003169 1399107 1047137 297818 -479071 -1512089 -2353312 -1774965
35581 -1774965 134419 1406781 868028 -93453 254171 1327029 1353727 134538 -1044861
35572 -1044861 -1601783 -2040626 -2453713 -2252295 -1443253 -879649 -1053430 -1560712 -1810853
35563 -1810853 -1532253 -762188 -62212 -321232 -1452472 -1875506 -523076 1188854 990379
35554 990379 -935833 -2117275 -1324029 48534 611509 921121 1703981 2029247 954054
35545 954054 -317009 95036 1774453 2485579 1480644 480224 983784 2195083 2457299
$$ packed form
35609A307214R21527p25r25195r04623o13434q08719j015817n93785J79164Q03647
35599a650746J167070R76088n0238r82338l30391J464420K016221M11931j246750
35590A775267r87375K15277L95938l51970p49319p76889j033018q41223N78347
35581a774965J909384J272362n38753r61481L47624J072858K6698j219189j179399
35572a044861n56922m38843m13087K01418Q09042N63604j73781n07282k50141
35563a810853K78600P70065O99976k59020j131240m23034J352430J711930j98475
35554I90379j926212j181442P93246J372563N62975L09612P82860L25266j075193
35545I54054j271063M12045J679417P11126j004935j000420N03560J211299K62216
$$ plain form
35536 2457299 1634982 973290 1114070 1344728 888654 155367 220554 1311718 2335167
35527 2335167 2104005 705561 -756670 -1592406 -2076323 -2521971 -2582885 -1951956 -1150969
35518 -1150969 -892174 -959276 -490343 684942 1690759 1727434 1024879 459887 567737
35509 567737 1138387 1589585 1568927 1220381 895631 715873 643879 867951 1566010 2201628
35499 2201628 1806445 370839 -803141 -768291 -183417 -20484 186760 1485320 3399513
35490 3399513 4274413 3640135 2660465 2103763 1538306 917187 1121047 2064159 2025713 195955
35480 195955 -1606633 -1408520 -65459 156182 -882272 -1305319 -552008 -209045 -1115011
35471 -1115011 -1791807 -804199 918737 1442823 508373 -446675 -397653 290090 800204
$$ packed form
35536B457299q22317o61692J40780K30658m56074p33287O5187J091164J023449
35527B335167k31162j398444j462231q35736m83917m45648o0914O30929Q00987
35518a150969K58795o7102M68933J175285J005817L6675p02555n64992J07850
35509E67737N70650M51198k0658l48546l24750j79758p1994K24072O98059O35618
35499B201628l95183j435606j173980L4850N84874J62933K07244J298560J914193
35490C399513Q74900o34278r79670n56702n65457o21119K03860R43112l8446j829758
35480A95955j802588J98113J343061K21641j038454m23047P53311L42963r05966
35471a115011o76796R87608J722936N24086r34450r55048M9022O87743N10114
$$ plain form
35462 800204 834625 553195 158402 -240697 -562623 -634660 -177894 883567 2071672 2595248
35452 2595248 2051862 734954 -669767 -1440976 -1131272 -67245 603434 38842 -1146093
35443 -1146093 -1562756 -876988 -93514 103616 248959 873441 1375275 918426 -206989
35434 -206989 -990279 -1067617 -885174 -733773 -369413 423970 1420162 2142529 2217724 1653000
35424 1653000 918901 496090 228700 -430087 -1382921 -1754882 -1153968 -362304 -213513
35415 -213513 -457791 -462107 -371999 -590140 -595970 461295 2067549 2490514 999086 -981714
35405 -981714 -1485187 -200702 1465851 2170153 1935274 1729496 2119611 2607360 2380688
35396 2380688 1526172 1048943 1532275 2234507 1932065 388791 -1425449 -2370259 -2009993
$$ packed form
35462H00204L4421k81430l94793l99099l21926p2037M56766J061461J188105N23576
35452B595248n43386j316908j404721p71209L09704J064027O70679n64592j184935
35443a146093m16663O85768P83474J97130J45343O24482N01834m56849j125415
35434b06989p83290p7338J82443J51401L64360P93383R96192P22367P5195n64724
35424A653000p34099m22811k67390o58787r52834l71961O00914P91664J48791
35415b13513k44278m316R0108k18141n830J057265J606254M22965j491428j980800
35405i81714n03473J284485J666553P04302k34879k05778L90115M87749k26672
35396B380688q54516m77229M83332P02232l02442j543274j814240r44810L60266
$$ plain form
35387 -2009993 -710618 645989 1163378 600615 -429867 -1107866 -1063972 -276299 1185966
35378 1185966 2863525 3763187 3154357 1422975 -231637 -791720 29885 1693106 2937092
35369 2937092 2677295 1390483 904722 2051237 3305615 2851664 1289431 793120 1894445
35360 1894445 2789571 2053665 509537 -203286 259894 991559 1161913 671293 54256
35351 54256 136266 1220218 2393169 2365377 1229125 527716 1218971 2466613 2968459
35342 2968459 2611360 2103763 1716469 1289883 1040711 1415524 2196878 2466563 1660129
35333 1660129 340564 -288752 320301 1312621 1271681 -34386 -1235680 -1126108 -223069
35324 -223069 258105 357732 993519 1979246 2087990 1243097 921521 1767773 2403909 1581351
$$ packed form
35387b009993J299375J356607N17389n62763j030482o77999M3894P87673J462265
35378A185966J677559Q99662o08830j731382j654612n60083Q21605J663221J243986
35369B937092k59797j286812m85761J146515J254378m53951j562233m96311J101325
35360A894445Q95126p35906j544128p12823M63180P31665J70354m90620o17037
35351E4256Q2010J083952J172951k7792j136252p01409O91255J247642N01846
35342B968459l57099n07597l87294m26586k49172L74813P81354K69685q06434
35333A660129j319565o29316O09053R92320m0940j306067j201294J09572R03039
35324b23069M81174R9627O35787R85727J08744q44893l21576Q46252O36136q22558
$$ plain form
35314 1581351 172535 -172994 656978 1477207 1580618 1117693 333794 -455090 -608383
35305 -608383 105750 911395 975224 464933 -64166 -597829 -1052692 -566981 1325935 3390794
35295 3390794 3919845 2935225 1880103 1414350 928705 163328 -195197 116805 188099
35286 188099 -844559 -2527389 -3509428 -2875612 -944562 951422 1596393 1110632 714594
35277 714594 973741 994307 5106 -1137876 -1125179 -189005 373328 177886 -119281 -278981
35267 -278981 -572680 -682492 -72150 693472 627904 221976 858270 2288517 2730449 1826824
35257 1826824 1323516 2045078 2421097 1289306 111506 629677 1924907 1843439 270113
35248 270113 -1029322 -1118950 -555162 148078 872630 1032256 151876 -827087 -546925 507741
$$ packed form
35314A581351j408816l45529Q29972Q20229J03411m62925p83899p88884j53293
35305f08383P14133Q05645O3829n10291n29099n33663m54863M85711J892916K064859
35295C390794N29051r84620j055122m65753m85645p65377l58525L12002P1294
35286A88099j032658j682830r82039O33816J931050J895984O44971m85761l96038
35277G14594K59147K0566r89201j142982J2697R36174N62333j95442k97167j59700
35267b78981k93699j09812O10342P65622o5568m05928O36294J430247M41932r03625
35257A826824n03308P21562L76019j131791j177800N18171J295230q1468j573326
35248B70113j299435q9628N63788P03240P24552J59626q80380r78963K80162J054666
$$ plain form
35238 507741 529883 -718718 -1441244 -694785 165781 -152860 -804084 -432989 451684 395770
35228 395770 -521881 -876557 -279790 78868 -541973 -1266407 -992059 57978 806465
35219 806465 662128 -167753 -1141425 -1618735 -1132976 -10064 686570 396289 -163335
35210 -163335 -73304 440708 619670 678296 1433268 2510757 2412261 824666 -519436 -159354
35200 -159354 1053200 1347639 555408 -102840 -108720 14400 206271 1132551 2737755 3877599
35190 3877599 3828775 3115184 2418393 1648805 607069 -287574 -527274 -182460 377027
35181 377027 871623 962628 397262 -406851 -641092 -265798 -119016 -565539 -938102 -759095
35171 -759095 -552220 -801104 -1005251 -567337 148504 505651 705321 1330999 2267210 2852180
$$ packed form
35238E07741K2142j248601p22526P46459Q60566l18641o51224L71095Q84673n5914
35228C95770r17651l54676N96767L58658o20841p24434K74348J050037P48487
35219H06465j44337q29881r73672m77310M85759J122912O96634k90281n59624
35210a63335R0031N14012J78962N8626P54972J077489r8496j587595j344102L60082
35200a59354J212554K94439p92231o58248n880J23120J91871R26280J605204J139844
35190C877599m8824p13591o96791p69588j041736q94643k39700L44814N59487
35181C77027M94596R1005n65366q04113k34241L75294J46782m46523l72563J79007
35171g59095K06875k48884k04147M37914P15841L57147J99670O25678R36211N84970
$$ plain form
35161 2852180 2697464 1788207 391708 -556176 131451 2212715 3653662 3049543 1556354
35152 1556354 1102350 1544808 1345854 493210 614711 2111613 3238327 2662641 1260207
35143 1260207 518856 527347 504367 246164 56985 1982 51008 329619 600304 209850
35133 209850 -847665 -1611683 -1547375 -1383726 -1776471 -2066325 -1434789 -492747 -399967 -929667
35123 -929667 -844777 29535 580908 329128 137465 611947 1085429 888014 568145 916465
35113 916465 1495299 1187816 -99603 -1218720 -1226590 -320187 734572 1469368 1813949
35104 1813949 1833638 1689390 1612237 1680455 1754093 1734727 1702010 1679867 1488190 1018898 491426
35093 491426 201744 120363 -11828 -230713 -259512 74141 554009 821536 748894 450517
$$ packed form
35161B852180j54716r09257j396499r47884O87627K081264J440947o04119j493189
35152A556354m54004M42458j98954q52644J21501J496902J126714n75686j402434
35143A260207p41351Q491k2980k58203j89179n5003M9026K78611K70685l90454
35133B09850j057515p64018O4308J63649l92745k89854O31536R42042R2780n29700
35123i29667Q4890Q74312N51373k51780j91663M74482M73482j97415l19869L48320
35113I16465N78834l07483j287419j119117p870R06403J054759P34796L44581
35104A813949J9689j44248p7153O8218P3638j9366l2717k2143j91677m69292n27472
35093D91426k89682q1381j32191k18885k8799L33653M79868K67527p2642k98377
$$ plain form
35083 450517 86290 -141027 115612 1131127 2620699 3647215 3344907 1858935 366898
35074 366898 -66636 416427 765196 360754 -320384 -498535 -108783 325842 499304 483975
35064 483975 268000 -261095 -856325 -1027723 -773860 -651259 -873043 -879919 -188166 820967
35054 820967 1474301 1777815 2145710 2362031 1626019 -167271 -1829414 -2035213 -818744
35045 -818744 499829 810579 286130 -96040 226487 925732 1372204 1329253 1002998 747901
35035 747901 920360 1719162 2849583 3542407 3237776 2122229 768967 -442091 -1224877
35026 -1224877 -1212860 -547865 -225308 -943525 -1864603 -1582965 -194701 861199 1067485
35017 1067485 1404404 2244452 2370176 1103718 -86819 429068 1958748 2610384 2087520
$$ packed form
35083D50517l64227k27317K56639J015515J489572J026516l02308j485972j492037
35074C66898m33534M83063L48769m04442o81138j78151L89752M34625J73462j5329
35064D83975k15975n29095n95230j71398K53863J22601k21784o876O91753J009133
35054H20967O53334L03514L67895K16321p36012j793290j662143k05799J216469
35045h18744J318573L10750n24449l82170L22527O99245M46472m2951l26255k55097
35035G47901J72459P98802J130421O92824l04631j115547j353262j211058p82786
35026a224877J2017O64995L22557p18217r21078K81638J388264J055900K06286
35017A067485L36919Q40048J25724j266458j190537N15887J529680O51636n22864
$$ plain form
35008 2087520 1586563 1422161 694598 -721017 -1698627 -1698082 -1486811 -1551377 -1240163 -161588
34998 -161588 804531 732331 9346 -271881 351510 1492929 2413677 2392723 1292587 34814
34988 34814 -255850 214936 159716 -815411 -1658906 -1654757 -1378415 -1224456 -478587 1064494
34978 1064494 1981707 1237114 184398 735239 2301930 2627018 1346721 526680 1371571
34969 1371571 2503413 2352265 1447694 1031418 801461 -238503 -1463154 -1087239 1033651
34960 1033651 2752553 2383630 823715 5501 212515 237355 -301368 -425369 214338
34951 214338 381169 -835890 -2333678 -2449123 -1306894 -326363 40634 431087 704944
34942 704944 -86127 -1567525 -1850021 -317378 1129863 782434 -474224 -891668 -564502
$$ packed form
35008B087520n00957j64402p27563j415615r77610N45K11271o4566L11214J078575
34998a61588R66119p2200p22985k81227O23391J141419R20748k0954j100136j257773
34988C4814k90664M70786n5220r75127q43495M149K76342J53959P45869J543081
34978A064494R17213p44593j052716N50841J566691L25088j280297q20041Q44891
34969A371571J131842j51148r04571m16276k29957j039964j224651L75915K120890
34960A033651J718902l68923j559915q18214K07014K4840n38723j24001O39707
34951B14338J66831j217059j497788j15445J142229R80531L66997L90453K73857
34942G04944p91071j481398k82496J532643J447241l47429j256658m17444L27166
$$ plain form
34933 -564502 -587499 -664355 210552 1309014 839494 -931090 -1566349 -15598 1791428
34924 1791428 1808832 548652 -289447 -371738 -458247 -630673 -362682 187160 362724 243323
34914 243323 482130 1024041 1097562 531181 55975 82464 87160 -385501 -857776 -635968
34904 -635968 74269 413234 57280 -418189 -422742 -117841 -53130 -364902 -708872 -826672
34894 -826672 -742760 -429198 219540 943444 1181602 893804 827444 1518657 2477729 2942380
34884 2942380 3022619 3332091 3755838 3490140 2275907 736493 -565662 -1537160 -1911661
34875 -1911661 -1234462 87395 684609 -98667 -1116871 -833938 612468 1599633 1105477
34866 1105477 -140931 -657138 181182 1697579 2763473 2855334 2295060 1604228 924050
$$ packed form
34933e64502k2997p6856Q74907J098462m69520j770584o35259J550751J807026
34924A791428J7404j260180q38099q2291q6509j72426K67991N49842J75564j19401
34914B43323K38807N41911P3521n66381m75206K6489M696m72661m72275K21808
34904f35968P10237L38965l55954m75469m553L04901O4711l11772l43970j17800
34894h26672Q3912L13562O48738P23904K38158k87798o6360O91213R59072M64651
34884B942380Q0239L09472M23747k65698j214233j539414j302155r71498l74501
34875a911661O77199J321857N97214p83276j018204K82933J446406R87165m94156
34866A105477j246408n16207Q38320J516397J065894R1861n60274o90832o80178
$$ plain form
34857 924050 250068 -145606 -60344 108204 -127234 -430346 -74867 737247 1007234 542478
34847 542478 261963 497573 273965 -944570 -2025237 -1812821 -956431 -705152 -736221
34838 -736221 108412 1389090 1293099 -576351 -2371324 -2499764 -1546544 -969762 -1025768
34829 -1025768 -908385 -210488 645436 1088331 924919 428844 206040 630552 1234098
34820 1234098 1116586 122817 -930112 -1347966 -1237335 -897248 -305088 406149 688868
34811 688868 340090 -35785 166575 750986 1150475 1180626 972168 656897 477544 650097
34801 650097 807632 299230 -604976 -740500 159500 775692 195550 -495051 101141 1335593
34791 1335593 1503616 637059 429111 1455975 2365064 2178940 1642758 1585642 1521633 878272
$$ packed form
34857I24050o73982l95674Q5262J68548k35438l03112L55479Q12114K69987m64756
34847E42478k80515K35610k23608j218535j080667K12416Q56390K51279l1069
34838g36221Q44633J280678r5991j869450j794973j28440R53220N76782n6006
34829a025768J17383O97897Q55924M42895j63412m96075k22804M24512O03546
34820A234098j17512r93769j052929m17854J10631L40087N92160P11237K82719
34811F88868l48778l75875K02360N84411L99489L0151k08458l15271j79353J72553
34801F50097J57535n08402r04206j35524R00000O16192n80142o90601N96192J234452
34791A335593J68023q66557k07948J026864R09089j86124n36182n7116o4009o43361
$$ plain form
34781 878272 308300 558474 993305 535032 -576190 -1217882 -1134549 -1000012 -987230 -586702
34771 -586702 71180 -49797 -1374539 -2834969 -3113289 -2197095 -1111686 -508165 -197500
34762 -197500 19741 -228117 -1264737 -2502200 -2756230 -1560499 195704 1214546 1116779
34753 1116779 506170 21415 -123621 147338 773528 1240324 1030563 550333 788731
34744 788731 1788004 2386943 1968699 1441208 1672809 1948878 1187011 -69138 -370375
34735 -370375 309231 588143 9578 -293411 372614 1140322 1183791 1008094 1149495 862010
34725 862010 -554699 -2050793 -2037190 -818906 -186668 -678995 -913364 -3237 933251
34716 933251 567558 -530998 -812829 -89636 385402 -5366 -367993 225212 1388324
$$ packed form
34781H78272n69972K50174M34831m58273j111222o41692Q3333J34537J2782M00528
34771e86702O57882j20977j324742j460430k78320R16194J085409O03521L10665
34762a97500K17241k47858j036620j237463k54030J195731J756203J018842r7767
34753A116779o10609m84755j45036K70959O26190M66796k09761m80230K38398
34744G88731R99273N98939m18244n27491K31601K76069p61867j256149l01237
34735c70375O79606K78912n78565l02989O66025P67708M3469j75697J41401k87485
34725H62010j416709j496094J3603J218284O32238m92327k34369R10127R36488
34716I33251l65693j098556k81831P23193M75038l90768l62627N93205J163112
$$ plain form
34707 1388324 2075106 1870659 1058917 -28946 -1061602 -1518674 -1204070 -713863 -679469
34698 -679469 -775355 -319924 325676 83828 -994160 -1456059 -536193 662466 896249
34689 896249 619845 960112 1719940 1836332 1311305 1124769 1379344 1088086 -34167
34680 -34167 -1019406 -1235021 -1166989 -1126288 -495958 1026689 2616281 3549431 4144593 4586679
34670 4586679 3979962 1826165 -483567 -1168807 -514202 -274748 -875213 -851023 665930
34661 665930 2383079 2504333 1008512 -526694 -853020 -109741 785248 1192109 1134762
34652 1134762 947288 742525 310489 -457885 -1211220 -1374865 -732967 280849 866624
34643 866624 568036 -136701 -221127 516937 840207 -376195 -2232947 -2642452 -1175805
$$ packed form
34707A388324O86782k04447q11742j087863j032656m57072L14604M90207L4394
34698f79469r5886M55431O45600k41848j077988m61899R19866J198659K33783
34689H96249k76404L40267P59828J16392n25027j86536K54575k91258j122253
34680c4167r85239k15615O8032M0701O30330J522647J589592R33150N95162M42086
34670D586679o06717k153797k309732o85240O54605K39454o00465K4190J516953
34661F65930J717149J21254j495821j535206l26326P43279Q94989M06861n7347
34652A134762j87474k04763m32036p68374p53335j63645O41898J013816N85775
34643H66624k98588p04737q4426P38064L23270j216402j856752m09505J466647
$$ plain form
34634 -1175805 337099 553904 432119 1286683 2488288 2644202 2007505 1884903 2277344
34625 2277344 2002646 891169 9283 -277669 -678581 -1285430 -1309877 -856971 -1165612
34616 -1165612 -2436717 -3080482 -2016684 -311587 459231 272269 83693 265868 643737
34607 643737 1194068 1736801 1712718 1098858 697286 754030 381292 -664196 -868696 899730
34597 899730 3112278 3244562 1238277 -522522 -598123 -75565 -435068 -1419333 -1815551
34588 -1815551 -1318168 -748468 -933914 -1963517 -3233031 -3841973 -3214330 -1641675 -95650
34579 -95650 622229 468713 -28113 -354083 -447533 -650958 -1118778 -1348290 -731792 399867
34569 399867 965349 624331 299417 711100 1224632 969949 400823 657125 1773408
$$ packed form
34634a175805J512904K16805j21785Q54564J201605J55914o36697j22602L92441
34625B277344k74698j111477q81886k86952m00912o06849k4447M52906l08641
34616a165612j271105o43765J063798J705097P70818j86962j88576J82175L77869
34607F43737N50331N42733k4083o13860m01572N6744l72738j045488k04500J768426
34597H99730K212548J32284k006285j760799p5601N22558l59503r84265l96218
34588a815551M97383N69700j85446j029603j269514o08942O27643J572655J546025
34579i5650P17879j53516m96826l25970r3450k03425m67820k29512O16498J131659
34569C99867N65482l41018l24914M11683N13532k54683n69126K56302J116283
$$ plain form
34560 1773408 2626446 2515738 1812568 1102790 598825 404065 527982 604665 303649 -66459
34550 -66459 -88666 -137976 -803860 -1583675 -1324846 -74877 707905 180668 -699611 -587094
34540 -587094 502569 1505249 1753167 1455316 1116815 1019906 1102377 1061335 734884 432184
34530 432184 588754 1125037 1547757 1611541 1398504 892198 119385 -412658 -210053 319460
34520 319460 326016 -145089 -244080 206580 469049 355316 663588 1618849 2120216 1362522
34510 1362522 137519 -434722 -500821 -691665 -640209 300469 1421470 1334849 191989
34501 191989 -297237 635365 1638636 1213821 -189314 -991397 -771244 -620885 -1275033
34492 -1275033 -1920706 -1406416 -34826 710265 176605 -599619 -470558 149966 41341
$$ packed form
34560A773408Q53038j10708p03170p09778n03965j94760J23917P6683l01016l70108
34550f6459k2207m9310o65884p79815K58829J249969P82782n27237q80279J12517
34540e87094J089663J002680K47918k97851l38501r6909Q2471m1042l26451l02700
34530D32184J56570N36283M22720O3784k13037n06306p72813n32043K02605N29513
34520C19460O556m71105r8991M50660K62469j13733L08272R55261N01367p57694
34510A362522j225003n72241o6099j90844N1456R40678J121001q6621j142860
34501A91989m89226R32602J003271m24815j403135q02083K20153J50359o54148
34492a275033o45673N14290J371590P45091n33660p76224J29061O20524j08625
$$ plain form
34483 41341 -846138 -1315655 -849988 -448607 -1055951 -2048216 -2000033 -449017 1700320 3170219
34473 3170219 3265683 2243245 1172359 1077674 1857835 2449410 2331918 2228846 2805206
34464 2805206 3339146 2561045 542690 -1082949 -877643 877790 2480334 2435370 871451
34455 871451 -623124 -779159 -91573 73673 -392705 -192259 1190054 2394386 1990128
34446 1990128 329855 -1249147 -2100432 -2149000 -1089212 930286 2478490 2165374 489813
34437 489813 -893611 -1419629 -1803227 -2283454 -2206093 -1421725 -699920 -474265 -318786 88038
34427 88038 508893 812359 1078472 968559 88780 -956515 -1099196 -521541 -483563 -1173485
34417 -1173485 -1226275 36142 1341106 1354898 655452 742733 1893355 2996904 2997936 1769332
$$ packed form
34483D1341q87479m69517M65667M01381o07344r92265M8183J551016K149337J469899
34473C170219R5464j022438j070886r4685P80161N91575j17492j03072N76360
34464B805206N33940p78101k018355j625639K05306J755433J602544m4964j563919
34455H71451j494575j56035O87586J65246m66378K00446J382313J204332m04258
34446A990128j660273j579002q51285m8568J059788K019498J548204l13116j675561
34437D89813j383424n26018l83598m80227P7361P84368P21805K25655J55479M06824
34427H8038M20855L03466K66113j09913q79779j045295j42681N77655L7978o89922
34417a173485n2790J262417J304964J3792o99446Q7281J150622J103549J032j228604
$$ plain form
34407 1769332 37517 -1060784 -931848 -380846 -748893 -1946952 -2451922 -1664246 -885586
34398 -885586 -1180872 -1717758 -1388587 -724936 -687660 -693426 351862 1861045 2355199 1963550
34388 1963550 2099295 2786212 2450497 752841 -383213 518901 2312381 2928239 2170614
34379 2170614 1540197 1846920 2246600 1678954 393756 -387511 -73711 503490 215054
34370 215054 -690978 -794199 443213 1792005 2057443 1745998 1827560 1776299 519414
34361 519414 -1162637 -1183269 770526 2577514 2595503 1537270 752707 293188 -307414
34352 -307414 -751087 -669960 -475013 -389471 268533 1670105 2499695 1812300 798105 1010276
34342 1010276 1740504 1175366 -397239 -837907 388242 1333725 743267 -25690 609774
$$ packed form
34407A769332j731815j098301J28936N51002l68047j198059n04970P87676P78660
34398h85586k95286n36886L29171O63651L7276n766J045288J509183M94154l91649
34388A963550J35745O86917l35715j697656j136054R02114J793480O15858p57625
34379B170614o30417L06723L99680n67646j285198p81267L13800N77201k88436
34370B15054r06032j03221J237412J348792K65438l11445Q1562n1261j256885
34361E19414j682051k0632J953795J806988J7989j058233p84563m59519o00602
34352c07414m43673Q1127J94947Q5542O58004J401572Q29590o87395j014195K12171
34342A010276P30228n65138j572605m40668J226149R45483n90458p68957O35464
$$ plain form
34333 609774 1883116 2013933 936231 21167 -277048 -821956 -1949403 -2703933 -2286475
34324 -2286475 -1212535 -490517 -341732 -309848 -190279 -215515 -472744 -724181 -882991 -1153605
34314 -1153605 -1427312 -1016087 427116 1970142 2179698 928347 -377311 -650586 -304355
34305 -304355 -39653 483600 1657573 2460543 1604140 -154366 -624203 680177 1750390
34296 1750390 1069034 -258232 -428176 388809 746471 341302 140125 568741 1055090
34287 1055090 1193547 1073837 561947 -503057 -1432927 -1284770 -450531 -386939 -1452769
34278 -1452769 -2233401 -1554981 -128532 485049 -254035 -1658069 -2770511 -2916723 -1947843
34269 -1947843 -584259 26223 -318215 -501595 306317 1324694 1282665 362876 -21593
$$ packed form
34333F09774J273342J30817j077702r15064k98215n44908j127447p54530M17458
34324b286475J073940P22018J48785L1884J19569k5236k57229k51437j58810k70614
34314a153605k73707M11225J443203J543026K09556j251351j305658k73275L46231
34305c04355K64702N23253J173973Q02970q56403j758506m69837J304380J070213
34296A750390o81356j327266j69944Q16985L57662m05169k01177M28616M86349
34287A055090J38457j19710n11890j065004r29870J48157Q34239O3592j065830
34278a452769p80632O78420J426449O13581p39084j404034j112442j46212R68880
34269a947843J363584O10482l44438j83380Q07912J018377m2029r19789l84469
$$ plain form
34260 -21593 736722 1589512 1209129 -414108 -1958695 -1999259 -238834 2125011 3318586
34251 3318586 2648109 1178665 447684 701515 869746 122585 -1139834 -1878136 -1493816
34242 -1493816 -229184 1112122 1733973 1414306 572295 -323150 -1169987 -1825210 -1740989
34233 -1740989 -650986 615336 773489 -417371 -1898014 -2576616 -2287815 -1543396 -1029604
34224 -1029604 -1365184 -2548962 -3494468 -2962455 -1251642 -111105 -546723 -1578977 -1785570
34215 -1785570 -1231362 -978442 -1297562 -1421065 -832703 92175 643901 315379 -972629
34206 -972629 -2466648 -2736900 -1176394 868687 1522045 820336 502012 1287141 1876722
34197 1876722 1240689 396502 737605 1719432 1731924 648140 -106001 169059 642497
$$ packed form
34260b1593P58315Q52790l80383j623237j544587m0564J760425K363845J193575
34251C318586o70477j469444p30981K53831J68231p47161j262419p38302L84320
34242a493816J264632J341306O21851l19667q42011q95445q46837o55223Q4221
34233a740989J090003J266322J58153j190860j480643o78602K88801P44419N13792
34224a029604l35580j183778r45506N32013J710813J140537m35618j032254k06593
34215a785570N54208K52920l19120j23503N88362R24878N51726l28522j288008
34206i72629j494019k70252J560506K045081O53358p01709l18324P85129N89581
34197A876722o36033q44187L41103R81827J2492j083784p54141K75060M73438
$$ plain form
34188 642497 544060 105154 -436961 -1364245 -2398789 -2446073 -1330383 -599208 -1423692 -2703989
34178 -2703989 -2703928 -1790506 -1779794 -2886491 -3252382 -1771303 355102 1509592 1634892 1514490
34168 1514490 1373094 1184072 1321815 1859531 2069565 1592418 1212193 1436713 1332228
34159 1332228 143583 -875080 -26126 2026570 2991391 2286197 1602726 1984682 2431500
34150 2431500 2014445 1415337 1353347 1172761 249911 -591522 -447250 31839 -203961 -792790
34140 -792790 -819569 -642167 -1170065 -1899191 -1496468 -144215 512621 -79841 -572848 66381
34130 66381 1007665 991373 174215 -326087 52932 1051154 2228704 3090217 2985475 1709003
34120 1709003 135693 -365544 637869 2039363 2249072 923253 -519421 -453398 922615
$$ packed form
34188F42497r8437m38906n42115r27284j034544m7284J115690P31175q24484j280297
34178b703989O1R13422J0712j106697l65891J481079K126405J154490J25300j20402
34168A514490j41396j89022J37743N37716K10034m77147l80225K24520j04485
34159A332228j188645j018663Q48954K052696R64821p05194o83471L81956M46818
34150B431500m17055n99108o1990j80586r22850q41433J44272M79089k35800n88829
34140g92790k6779J77402n27898p29126M02723J352253O56836n92462m93007O39229
34130F6381R41284j6292q17158n00302L79019R98222J177550Q61513j04742j276472
34120A709003j573310n01237J003413J401494K09709j325819j442674O6023J376013
$$ plain form
34111 922615 1776523 1131317 241929 676643 1905293 2198914 1448991 1308342 2386050
34102 2386050 3111662 2131545 323137 -657098 -659702 -618630 -704955 -319067 476641 829688
34092 829688 379819 -296126 -558671 -310117 223748 690732 706005 324099 221498 827903
34082 827903 1564323 1627582 1222354 1195132 1683651 2041565 1969587 1766008 1500595 936524
34072 936524 318540 212251 447306 324293 73483 825757 2625868 3768589 2972953
34063 2972953 1136049 -67925 -335102 -305044 52338 1050946 1888342 1424049 230750
34054 230750 96520 1260675 1885424 840213 -660834 -1098880 -750095 -460543 266362
34045 266362 2145209 3971790 3741082 1721060 385695 955777 1847141 1298004 -82326
$$ packed form
34111I22615Q53908o45206q89388M34714J228650K93621p49923j40649J077708
34102B386050P25612r80117j808408r80235k604M1072q6325L85888P95708L53047
34092H29688m49869o75945k62545K48554N33865M66984J5273l81906j02601O06405
34082H27903P36420O3259m05228k7222M88519L57914p1978k03579k65413n64071
34072I36524o17984j06289K35055j23013k50810P52274J800111J142721p95636
34063B972953j836904j203974k67177L0058L57382R98608Q37396m64293j193299
34054B30750j34230J164155O24749j045211j501047m38046L48785K89552P26905
34045B66362J878847J826581k30708k020022j335365N70082Q91364n49137j380330
$$ plain form
34036 -82326 -547460 188229 947915 1006913 707497 483738 415012 656947 1365192 2159867
34026 2159867 2407273 2054915 1595645 1296402 1055420 860114 720355 303084 -650568
34017 -650568 -1683437 -2143880 -2171229 -2292037 -2222912 -1213332 373370 1099569 465716
34008 465716 -302305 -92905 532080 419326 -434287 -1144947 -1248527 -818955 109531 1252634
33998 1252634 1718011 1014942 90297 263074 1304467 1682934 710125 -645675 -1263567
33989 -1263567 -1172736 -989601 -915831 -809512 -638636 -359779 217510 1017025 1510530 1356347
33979 1356347 953997 976827 1514599 2012718 1999162 1601826 1272555 1115880 682370 -379991
33969 -379991 -1557003 -1802683 -856467 243590 417534 -75119 -133143 575419 1267950
$$ packed form
34036h2326m65134P35689P59686N8998k99416k23759o8726K41935P08245P94675
34026B159867K47406l52358m59270k99243k40982j95306j39759m17271r53652
34017f50568j032869m60443k7349j20808O9125J009580J586702P26199o33853
34008D65716p68021K09400O24985j12754q53613p10660j03580M29572R28486J143103
33998A252634M65377p03069r24645J72777J041393L78467r72809j355800o17892
33989a263567R0831J83135P3770J06319J70876K78857N77289P99515M93505j54183
33979A356347m02350K2830N37772M98119j3556l97336l29271j56675m33510j062361
33969c79991j177012k45680R46216J100057J73944m92653n8024P08562O92531
$$ plain form
33960 1267950 1267367 799971 418074 274396 234028 229883 259457 353776 640008 1097972 1290626
33949 1290626 799394 -93274 -667497 -694870 -564855 -540024 -515559 -470253 -447154 -150962
33939 -150962 592043 1035066 236674 -1329836 -2113879 -1701288 -1335914 -1749131 -1995884
33930 -1995884 -1327427 -682680 -1004025 -1443476 -907734 -228763 -787023 -1818105 -1415136
33921 -1415136 182196 826787 108171 117755 1800482 3064672 1991424 -144601 -934589
33912 -934589 -329968 43836 -62330 471955 1582928 1855510 1027010 512911 892534
33903 892534 791811 -751630 -2365103 -2109892 -189283 1466049 1788890 1492052 1558453
33894 1558453 1913533 1825121 989432 -6105 -71281 1386442 3540740 4545171 3378106
$$ packed form
33960A267950n83m67396l81897j43678m0368m145K9574R4319K86232M57964J92654
33949A290626m91232q92668n74223k7373J30015K4831K4465M5306K3099K96192
33939a50962P43005M43023p98392j566510p84043M12591L65374m13217k46753
33930a995884O68457O44747l21345m39451N35742O78971n58260j031082M02969
33921a415136J597332O44591p18616R584J682727J264190j073248k136025p89988
33912i34589O04621L73804j06166N34285J110973K72582q28500n14099L79623
33903H92534j00723j543441j613473K55211J920609J655332L22841k96838O6401
33894A558453L55080q8412q35689r95537o5176J457723K154298J004431j167065
$$ plain form
33885 3378106 1074779 -396644 -221705 883419 1973063 2579284 2309685 1004559 -412554
33876 -412554 -445782 969360 1999176 1287654 -125722 -358245 619194 1264938 1038563
33867 1038563 1042485 1948699 2832698 2679266 1829535 1146668 714977 255357 64315 553606
33857 553606 1351890 1778244 1844550 1942162 1880757 1167826 49066 -652065 -685550 -538141
33847 -538141 -469738 -221245 252833 577913 656418 849785 1277776 1600331 1661233 1682263
33837 1682263 1675614 1393605 1016802 1038105 1198874 518905 -1110730 -2343125 -2138684 -1242700
33827 -1242700 -947352 -1138154 -795643 58944 365517 -100898 -306469 248283 609381
33818 609381 -67955 -1082764 -1262335 -742034 -539579 -710174 -193356 1312654 2435958
$$ packed form
33885C378106k303327j471423J74939J105124J089644O06221k69599j305126j417113
33876d12554l3228J415142J029816p11522j413376k32523R77439O45744k26375
33867A038563L922R06214Q83999j53432q49731o82867m31691m59620j91042M89291
33857E53606P98284M26354O6306R7612o1405p12931j118760p01131l3485J47409
33847e38141O8403K48493M74078L25080P8505J93367M27991L22555O0902K1030
33837A682263o649k82009l76803K1303J60769o79969j629635j232395K04441Q95984
33827a242700K95348j90802L42511Q54587L06573m66415k05571N54752L61098
33818F09381o77336j014809j79571N20301K02455j70595N16818J506010J123304
$$ plain form
33809 2435958 1780209 -129605 -1351201 -766529 868926 2065259 2088438 1182897 42869
33800 42869 -509779 69663 1322605 1897483 1139433 228226 760452 2345894 2852345
33791 2852345 1347024 -463282 -521601 852369 1639203 888421 -443418 -1155747 -1045648
33782 -1045648 -412750 535584 1426511 1740728 1501225 1274902 1182072 631413 -563549
33773 -563549 -1539750 -1422537 -417033 729586 1778826 2754906 3101682 2079716 10332
33764 10332 -1660487 -1755247 -382367 1454889 2752585 2956712 2110122 846969 -83521
33755 -83521 -487316 -688331 -826297 -669778 -283005 -296887 -1043239 -1809221 -1585995 -442860
33745 -442860 469516 383989 -191875 -368714 -197869 -506055 -1499657 -2164240 -1405583 510526
$$ packed form
33809B435958o55749j909814j221596N84672J635455J196333K3179r05541j140028
33800D2869n52648N79442J252942N74878p58050r11207N32226J585442N06451
33791B852345j505321j810306n8319J373970P86834p50782j331839p12329J10099
33782a045648O32898R48334Q90927L14217k39503k26323r2830n50659j194962
33773e63549r76201J17213J005504J146619J049240R76080L46776j021966k069384
33764A0332j670819r4760J372880J837256J297696K04127q46590j263153r30490
33755h3521m03795k01015j37966J56519L86773j3882p46352p65982K23226J143135
33745d42860R12376q5527n75864j76839J70845l08186r93602o64583P58657J916109
$$ plain form
33735 510526 2125409 2408876 1815767 1506474 1829920 2048072 1527079 633260 101437
33726 101437 -77843 -507347 -1193755 -1245418 -117224 1380618 1932388 1350447 714275
33717 714275 876204 1459516 1578046 1042734 446173 318857 584899 754933 414517 -394382
33707 -394382 -1133487 -1245069 -763579 -249328 -64240 -53962 -29898 -61388 -70401 243034
33697 243034 667620 394888 -640906 -1070362 171757 1933112 2094553 605691 -326869
33688 -326869 576087 1890392 1724086 350394 -592088 -489782 60661 750946 1702576
33679 1702576 2420964 2117946 1095501 453227 275837 -522592 -2181528 -3292524 -2763207
33670 -2763207 -1480226 -1048161 -1643887 -2136370 -1815961 -976680 -65078 749151 1199336
$$ packed form
33735E10526J614883K83467n93109l09293L23446K18152n20993q93819n31823
33726A01437j79280m29504o86408n1663J128194J497842N51770n81941o36172
33717G14275J61929N83312J18530n35312n96561j27316K66042J70034l40416q08899
33707c94382p39105j11582M81490N14251J85088J0278K4064l1490r013L13435
33697B43034M24586k72732j035794m29456J242119J761355J61441j488862r32560
33688c26869R02956J314305j66306j373692r42482J02306N50443O90285R51630
33679A702576P18388l03018j022445o42274j77390p98429j658936j110996N29317
33670b763207J282981M32065n95726m92483L20409Q39281R11602Q14229M50185
$$ plain form
33661 1199336 1002932 446857 189724 322669 269381 -174325 -381032 94752 599707 168152
33651 168152 -990657 -1559810 -864829 78181 -169472 -1448940 -2024324 -797407 1195818
33642 1195818 2052235 1296154 129954 -384136 -405115 -410812 -253959 215428 333905 -623632
$$ packed form
33661A199336j96404n56075k57133J32945n3288m43706k06707M75784N04955m31555
33651A68152j158809n69153O94981R43010k47653j279468n75384J226917J993225
33642A195818Q56417p56081j166200n14090k0979n697J56853M69387J18477r57537
$$ [...]
##END NTUPLES=NMR SPECTRUM
##END=
