##TITLE=31Pdec_MTBDE0807-3
 CDCl3, 124 sc
 9.07.2021
##JCAMPDX= 6.0         $$ Bruker NMR JCAMP-DX V2.0
##DATA TYPE= NMR SPECTRUM
##DATA CLASS= NTUPLES
##ORIGIN= UXNMR, Bruker Analytische Messtechnik GmbH
##OWNER= root
$$ XWIN-NMR		Version 3.5
$$ Fri Jul  9 09:14:38 2021 Russian Standard Time (UT+4h)  she@DPX200
##.OBSERVE FREQUENCY= 81.013821
##.OBSERVE NUCLEUS= ^31P
##.ACQUISITION MODE= SIMULTANEOUS
##.ACQUISITION SCHEME= undefined
##.AVERAGES= 24
##.DIGITISER RES= 16
##SPECTROMETER/DATA SYSTEM= spect
##.PULSE SEQUENCE= zgpg30
##.SOLVENT NAME= DMSO
##.SHIFT REFERENCE= (INTERNAL, DMSO, 0, 248.564)
##AUDIT TRAIL= $$ (NUMBER, WHEN, WHO, WHERE, WHAT)
$$ ##TITLE= Audit trail, XWIN-NMR		Version 3.5
$$ ##JCAMPDX= 5.01
$$ ##ORIGIN= Bruker BioSpin GmbH
$$ ##OWNER= she
$$ F:/spectra/data/she/nmr/P31/1/pdata/1/auditp.txt
$$ ##AUDIT TRAIL=  $$ (NUMBER, WHEN, WHO, WHERE, WHAT)
(   1,<2021-07-09 09:13:07.95 +0400>,<she>,<DPX200>,
      <created by zg, POWCHK disabled, PULCHK disabled
       configuration hash MD5:
       00 E9 B6 7A A2 85 ED C7 34 08 36 98 17 FE 4E 26
       data hash MD5: 32K
       EB 51 A0 A0 FE EC 44 17 29 FB 2A F2 E0 1E 53 38>)
(   2,<2021-07-09 09:13:10.73 +0400>,<she>,<DPX200>,
      <Start of raw data processing
       efp BC_mod = 2 LB = 1 FT_mod = 6 PKNL = 1 PHC0 = -9009.577 PHC1 = 2948.075 SI = 64K 
       data hash MD5: 64K
       FC 57 77 27 0D 14 2C BF 2C 12 C7 94 30 01 E4 C9>)
(   3,<2021-07-09 09:13:48.95 +0400>,<she>,<DPX200>,
      <pk PHC0 = 37.68054 PHC1 = -72.8 
       data hash MD5: 64K
       7A 6C 48 EA AE 8C A1 63 2F 0F 8F FF 7B D9 2C 4E>)
(   4,<2021-07-09 09:13:53.06 +0400>,<she>,<DPX200>,
      <abs ABSG = 5 
       data hash MD5: 64K
       CD 24 16 EC 7F 17 E7 11 BD 0A 5E E6 EA 38 75 92>)
$$ ##END=
$$ 
$$ hash MD5
$$ 9C 1A 96 26 F0 A3 3E A9 45 84 5E 5F FE 87 D0 77
##$RELAX= 
##$RELAX= 
##$RELAX= 
##$RELAX= 
##$RELAX= 
##$RELAX= 
##$RELAX= 
##$RELAX= 
$$ Bruker specific parameters
$$ --------------------------
##$DU= <F:/spectra>
##$EXPNO= 1
##$NAME= <P31>
##$PROCNO= 1
##$TYPE= <nmr>
##$USER= <she>
##$AMP= (0..31)
100 100 100 100 100 100 100 100 100 100 100 100 100 100 100 100 100 100 
100 100 100 100 100 100 100 100 100 100 100 100 100 100 
##$AQSEQ= 0
##$AQ_mod= 1
##$AUNM= <au_zg>
##$AUTOPOS= <>
##$BF1= 81.014009
##$BF2= 200.13
##$BF3= 200.13
##$BF4= 200.13
##$BF5= 200.13
##$BF6= 200.13
##$BF7= 200.13
##$BF8= 200.13
##$BYTORDA= 1
##$CFDGTYP= 0
##$CFRGTYP= 5
##$CHEMSTR= <none>
##$CNST= (0..31)
1 1 145 1 1 1 1 1 1 1 1 1 1 1 1 1 1 1 1 1 1 1 1 1 1 1 1 1 1 1 1 1 
##$CPDPRG= <waltz16>
##$CPDPRG1= <>
##$CPDPRG2= <waltz16>
##$CPDPRG3= <>
##$CPDPRG4= <mlev>
##$CPDPRG5= <mlev>
##$CPDPRG6= <mlev>
##$CPDPRG7= <mlev>
##$CPDPRG8= <mlev>
##$CPDPRGB= <>
##$CPDPRGT= <>
##$D= (0..31)
0 1 0 0 0 0 0 0 0 0 0 0.03 2e-05 3e-06 0 0 0 0 0 0 0 0 0 0 0 0 0 0 0 0 
0 0 
##$DATE= 1625807587
##$DBL= (0..7)
120 120 120 11 120 120 24 19 
##$DBP= (0..7)
150 150 150 150 150 150 150 150 
##$DBP07= 0
##$DBPNAM0= <>
##$DBPNAM1= <>
##$DBPNAM2= <>
$$ [...]
##$SUBNAM3= <"">
##$SUBNAM4= <"">
##$SUBNAM5= <"">
##$SUBNAM6= <"">
##$SUBNAM7= <"">
##$SUBNAM8= <"">
##$SUBNAM9= <"">
##$SW= 501.771253377433
##$SWIBOX= (0..15)
0 1 3 0 0 0 0 0 0 0 0 0 0 0 0 0 
##$SW_h= 40650.406504065
##$TD= 32768
##$TD0= 1
##$TE= 0
##$TE2= 300
##$TE3= 300
##$TEG= 300
##$TL= (0..7)
0 120 53 12 22 120 120 120 
##$TP= (0..7)
150 150 150 150 150 150 150 150 
##$TP07= 0
##$TPNAME0= <>
##$TPNAME1= <>
##$TPNAME2= <>
##$TPNAME3= <>
##$TPNAME4= <>
##$TPNAME5= <>
##$TPNAME6= <>
##$TPNAME7= <>
##$TPOAL= (0..7)
0.5 0.5 0.5 0.5 0.5 0.5 0.5 0.5 
##$TPOFFS= (0..7)
0 0 0 0 0 0 0 0 
##$TUNHIN= 0
##$TUNHOUT= 0
##$TUNXOUT= 0
##$USERA1= <user>
##$USERA2= <user>
##$USERA3= <user>
##$USERA4= <user>
##$USERA5= <user>
##$V9= 5
##$VALIST= <valist>
##$VCLIST= <CCCCCCCCCCCCCCC>
##$VD= 0
##$VDLIST= <DDDDDDDDDDDDDDD>
##$VPLIST= <PPPPPPPPPPPPPPP>
##$VTLIST= <TTTTTTTTTTTTTTT>
##$WBST= 1024
##$WBSW= 4
##$XGAIN= (0..3)
0 0 0 0 
##$XL= 0
##$YL= 0
##$YMAX_a= 5482
##$YMIN_a= -5584
##$ZGOPTNS= <>
##$ZL1= 120
##$ZL2= 120
##$ZL3= 120
##$ZL4= 120
##$ABSF1= 248.5645
##$ABSF2= -253.2056
##$ABSG= 5
##$ABSL= 3
##$ALPHA= 0
##$AQORDER= 0
##$ASSFAC= 0
##$ASSFACI= 0
##$ASSFACX= 0
##$ASSWID= 0
##$AUNMP= <proc_1d>
##$AZFE= 0.1
##$AZFW= 0.5
##$BCFW= 0
##$BC_mod= 2
##$BYTORDP= 0
##$COROFFS= 0
##$CY= -3
##$DATMOD= 1
##$DC= 0
##$DFILT= <>
##$DTYPP= 0
##$F1P= 0
##$F2P= 0
##$FCOR= 1
##$FTSIZE= 65536
##$FT_mod= 6
##$GAMMA= 0
##$GB= 0
##$INTBC= 1
##$INTSCL= 5.30512e-09
##$ISEN= 30
##$LB= 1
##$LEV0= 0
##$LPBIN= 0
##$MAXI= 10000
##$MC2= 0
##$MEAN= 0
##$ME_mod= 0
##$MI= 50
##$NCOEF= 0
##$NC_proc= -7
##$NLEV= 6
##$NOISF1= 182.463
##$NOISF2= 159.3651
##$NSP= 0
##$NTH_PI= 0
##$NZP= 0
##$OFFSET= 248.5645
##$PC= 4
##$PHC0= -8971.896
##$PHC1= 2875.275
##$PH_mod= 1
##$PKNL= yes
##$PPARMOD= 0
##$PSCAL= 0
##$PSIGN= 0
##$REVERSE= no
##$SF= 81.014009
##$SI= 65536
##$SIGF1= 159.3651
##$SIGF2= -187.1042
##$SINO= 113.3802
##$SIOLD= 16384
##$SREGLST= <1H.CDCl3>
##$SSB= 0
##$STSI= 65536
##$STSR= 0
##$SW_p= 40650.406504065
##$SYMM= 0
##$S_DEV= 0
##$TDeff= 32768
##$TDoff= 0
##$TI= <>
##$TILT= no
##$TM1= 0
##$TM2= 0
##$TOPLEV= 0
##$USERP1= <user>
##$USERP2= <user>
##$USERP3= <user>
##$USERP4= <user>
##$USERP5= <user>
##$WDW= 1
##$XDIM= 65536
##$YMAX_p= 412556325
##$YMIN_p= -10524166
$$ End of Bruker specific parameters
$$ ---------------------------------
##NTUPLES= NMR SPECTRUM
##VAR_NAME=  FREQUENCY,     SPECTRUM/REAL,   SPECTRUM/IMAG
##SYMBOL=    X,             R,               I
##VAR_TYPE=  INDEPENDENT,   DEPENDENT,       DEPENDENT
##VAR_FORM=  AFFN,          ASDF,            ASDF
##VAR_DIM=   65536,         65536,           65536
##UNITS=     HZ,            ARBITRARY UNITS, ARBITRARY UNITS
##FACTOR=    0.620285442955139, 1,           1
##FIRST=     20137.2065510759, 0,            0
##LAST=      -20513.1999529892, 0,           0
##MIN=       -20513.1999529892, -10524166,   0
##MAX=       20137.2065510759, 412556325,    0
$$ Real data points
##PAGE= N=1
##DATA TABLE= (X++(R..R)), XYDATA
$$ [...]
39121B730500L61423j35588n81247r80988j584606j865311r09058R97701K265962
39112B98788J925612P24897j77598o77425j171165j394669q31914J78673P42030
39103c82771O34147M15119M20561L89224J02163k31019l05381m2187L77598N15063
39093A892517m2714j052291j605478j140979p4843Q95036J473383J381447K94599
39084B020677j102950j204316J98275R45400m31470j889941n00830K847558M232996
39075E115399K171007o08782j399339o88068q6290K00433L64052j72678j247938
39066C647796j343737r4589O17880k84469j117789m16235M17031k69118j311505
39057a54735r47109l0220r7231k11073R21661J579140l11527k671939j861303
$$ y = [2730500, 3091923, 2956335, 2375088, 1394100, -190506, -2055817, -2964875, -1967174, 298788, 2224400, 2949297, 2771699, 2094274, 923109, -471560, -1303474, -1124801, -382771, 251376, 666495, 1087056, 1476280, 1578443, 1347424, 1042043, 999856, 1377454, 1892517, 1849803, 797512, -807966, -1948945, -2023788, -1128752, 344631, 1726078, 2020677, 917727, -286589, -88314, 857086, 425616, -1464325, -1965155, 882403, 5115399, 7286406, 6677624, 5278285, 4590217, 4503927, 4704360, 5068412, 4895734, 3647796, 2304059, 2209470, 2827350, 2542881, 1425092, 1008857, 1425888, 1156770, -154735, -1101844, -1132064, -1229295, -1440368, -518707, 1060433, 748906, -1923033, -3784336]
39048c784336J214656K326783P80250l5874R18810Q23820j050881j455610P37798
39039D75416J872206j67492j911527k35381K148410J499011n10632j81678J431400
39030D419733O55354j911759k324140j18533J208134K99067n77277l49053n54079
39021G47447j292037n18203J495239J564507r36107k355607n89311J488887J017892
39012F22707k17222O26864K407150K237351M32806n82223o72110j535497k871379
39003D48447k644691p86790O68504J075796J731934K752506K410551L11491j418007
38994D549741j213981k39583k78651j159931j505524p72745N52350J823433K394996
38985D150105J756428K88003p88091p73120j90539J56412O857o70877j740755
$$ y = [-3784336, -2569680, -242897, 537353, 501479, 1420289, 2244109, 1193228, -262382, 475416, 2347622, 2180130, 268603, 33222, 2181632, 3680643, 3170011, 2988333, 4419733, 5075087, 3163328, 839188, 720655, 1928789, 2227856, 1650579, 1301526, 747447, -544590, -1062793, 432446, 1996953, 1060846, -1294761, -1884072, -395185, 622707, 405485, 1032349, 3439499, 5676850, 6109656, 5527433, 4855323, 3319826, 448447, -2196244, -2983034, -2314530, -1238734, 493200, 3245706, 5656257, 5967748, 4549741, 3335760, 3096177, 2817526, 1657595, 152071, -620674, -68324, 1755109, 4150105, 5906533, 6194536, 5406445, 4633325, 4442786, 4599198, 4606055, 3935178, 2194423]
38976B194423k333830j454564L32070J123451L26655k76292Q07267K326066K019199
38967E064445m7428j593562j239603R2026R05385Q27114K70434m04765q57526
38958C016520o96758K233N50160L65664l85614r38053n12332R97696K537244K531529
38948G468289P37603r62610o69723Q70236J049654j025239l217375l221865j378357
38939c49387L80235J219252J625002J694121R18305m06626j121090r00449p16766
38930B342597j070737j010606J54342J196083M47565j477054k020904n6089K384638
38921H89835K551087L23090j841715j863855J023J948234K409964J047102j114253
38912D350512k303736j523040L04406J342982J055128M98337L52455q711r64939
$$ y = [2194423, -139407, -1593971, -1261901, -138450, 188205, -88087, 719180, 3045246, 5064445, 5017017, 3423455, 2183852, 2275878, 3181263, 4008377, 4278811, 3874046, 3016520, 2319762, 2321995, 2872155, 3237819, 2852205, 1914152, 1401820, 2399516, 4936760, 7468289, 8205892, 7243282, 6573559, 7443795, 8493449, 7468210, 4250835, 1028970, -349387, 30848, 1250100, 2875102, 4569223, 5487528, 5080902, 3959812, 3059363, 2342597, 1271860, 261254, 415596, 1611679, 2059244, 582190, -1438714, -1494803, 889835, 3440922, 3764012, 1922297, 58442, 59465, 2007699, 4417663, 5464765, 4350512, 2046776, 523736, 828142, 2171124, 3226252, 3724589, 4077044, 4068333, 3103394]
38903C103394j608791j203390l70682K73749J209062K295719J725813j029622
38895D395252k819028o13727L177774L171027j078324l937740j800724J936095
38887B430605K500132N04617n01991j91479p09785j678471p63600J438058J733196
38878D761282k31584j169826L91958J868069J165546j97706l38498q6425o58585
38869E504231j145031p17869q00941k390165l408576j625514J513866K899740
38861a70259K195516J332827Q12003k78409j337654p17638J051947J630426O03253
38852E122012q3311L04162K89390o24024q11054K96806P27273p53016k325194
38843B143044j939445l92643L83950L25702M07986L67859l93895q07413M26728
$$ y = [3103394, 1494603, 291213, -79469, 194280, 1403342, 3699061, 5424874, 4395252, 1576224, 962497, 4140271, 7311298, 6232974, 2295234, 494510, 2430605, 4930737, 5435354, 4933363, 4741884, 4032099, 2353628, 1590028, 3028086, 4761282, 4529698, 3359872, 3751830, 5619899, 6785445, 6587739, 6249241, 6162816, 5504231, 4359200, 3641331, 2840390, 450225, -2958351, -4583865, -3069999, -170259, 2025257, 3358084, 4170087, 3891678, 2554024, 1836386, 2888333, 4518759, 5122012, 5038701, 5342863, 5632253, 5008229, 4197175, 4493981, 5221254, 4468238, 2143044, 203599, -189044, 194906, 520608, 928594, 1296453, 902558, 95145, 521873]
38834E21873K077624J664265o46003j910934n69399J487627J813219N55789m14274
38825D579787k28085M04496O56831N18314M13250M95882L75010m41222j591212
38816E183051j745564k51012J436394J250965n28453j414410k92462R11698L13179
38807D863386q80082l87880J172188R33065j667368l563594k227686Q41721K251660
38798A335410J034441p48409j015216K02775J421261J376239N6956j248534j112695
38789A302228L97247J741314J928221J560309J263079M92374q72251j322975q5556
38780F403990P38818r01620l006930j931494J541605K628594k05725k719591j512028
38771A035619R66755J045240j92922L25723J666210N58962k355465k997309l62066
$$ y = [521873, 2599497, 4263762, 3617759, 1706825, 1137426, 2625053, 4438272, 4994061, 4579787, 4351702, 4756198, 5413029, 5931343, 6344593, 6840475, 7215485, 6774263, 5183051, 3437487, 3186475, 4622869, 5873834, 5345381, 3930971, 3638509, 4550207, 4863386, 3983304, 3595424, 4767612, 5700677, 4033309, 469715, -1757971, -916250, 1335410, 2369851, 1621442, 606226, 809001, 2230262, 3606501, 3663457, 2414923, 1302228, 1699475, 3440789, 5369010, 6929319, 8192398, 8684772, 7812521, 6489546, 6403990, 7142808, 6241188, 3234258, 1302764, 2844369, 5472963, 5267238, 2547647, 1035619, 2002374, 3047614, 2854692, 3180415, 4846625, 5405587, 3050122, 52813, -309253]
38762c09253K047436J813946M75240j15407m53351j086119j064485j93603J45880
38753A260284k42229K38048J566216J361305q62096k102036n89865J248112R91362
38744B869101N3890L76959N54967j109281k531089j016574J704573K054499N17646
38735C474691L30487J489257J032855j171016j947399m18412O62390k8516m89048
38726B935289K81922M23703p13706q04317J051934K008955J00108k200922j887731
38717A195235K206P23234K71336L17620O27240j82061j526448j479286J53896
38708A02972J703884J968663R32808q55474k048005j030641J590175K691766P79089
38699E835237j465358j136562M27468J70747j516515j883117q49536q00185j753346
$$ y = [-309253, 1738183, 3552129, 4027369, 3911962, 3458611, 2372492, 1308007, 1114404, 1260284, 1018055, 1256103, 2822319, 4183624, 3321528, 1219492, 629627, 1877739, 2869101, 2922991, 3299950, 3854917, 2745636, 214547, -802027, 902546, 2957045, 3474691, 3805178, 5294435, 6327290, 5156274, 3208875, 2790463, 3452853, 3424337, 2935289, 3217211, 3640914, 2927208, 2122891, 3174825, 5183780, 5283888, 3082966, 1195235, 1197441, 1920675, 2192011, 2509631, 3136871, 2954810, 1428362, -50924, 102972, 1806856, 3775519, 4708327, 3852853, 1804848, 774207, 2364382, 5056148, 5835237, 4369879, 3233317, 3660785, 3831532, 2315017, 431900, -417636, -1217821, -2971167]
38690b971167j018841J833300L665382K614298P52044L51921N56050l36793j785634
38681C660560k274962j745406q68817M64905K141216K757789J399376o31547j486878
38672C416236j182346q35698n31786L49491J396593J484588N55240l01579m17276
38663C933463j41022k6685k73538p82941j131182q08771L0152O01032O82679R00998
38653B984185J271818P06822r81928j906091o07400J265160R72813j055101j528384
38644A121894P26908K677292J421276j425865j994082K55578J922775P56404j276020
38635D186160j259843L77395R75153q3438p65557J6094P15320j12732j464678
38626B583874j613426o13475L67602Q95918R47612Q5268j267702j085005J480324
$$ y = [-2971167, -3990008, -2156708, 1508674, 4122972, 4875016, 5226937, 5782987, 5446194, 3660560, 1385598, -359808, -1228625, -763720, 1377496, 4135285, 5534661, 4903114, 3416236, 2233890, 1398192, 866406, 1215897, 2612490, 4097078, 4652318, 4350739, 3933463, 3792441, 3765756, 3492218, 2709277, 1578095, 769324, 799476, 1400508, 2083187, 2984185, 4256003, 4962825, 3980897, 2074806, 1467406, 2732566, 3705379, 2650278, 1121894, 1848802, 4526094, 5947370, 4521505, 2527423, 2783001, 4705776, 5462180, 4186160, 2926317, 3303712, 4278865, 4195427, 3429870, 3445964, 4161284, 4048552, 2583874, 970448, 356973, 724575, 1620493, 2568105, 2653373, 1385671, 300666, 1780990]
38617A780990L720846K509597r43196k549114j224456J44779j34167k59678J021219
38608D066820J829510P15614m81761l50M69526j080764k854986j919067O96591
38599A441133J475424J9588q00340N7898N85997p0584j28352J043478J284369
38590D908611m68247j793035n48549J487377J336935o28038j589780o60002K99815
38581B345087j34630j218666j610697r50725L60730J643257K031608J199313Q9219
38572C754496o8234N26578N46678l91281j104508n91410O33923J425585J334852
38563F066679M86465j027902k768924l522289k337544L2874J629215J470910N82360
38554F11844M93707J316004J859649J254484k29578j752815k525924j914438J49380
$$ y = [1780990, 5501836, 8011433, 7068237, 4519123, 3294667, 3439446, 3305279, 3045601, 4066820, 5896330, 6611944, 6130183, 6129833, 6599359, 5518595, 2663609, 744542, 1441133, 2916557, 2936145, 2135805, 2193703, 2779700, 2709116, 2580764, 3624242, 4908611, 4440364, 2647329, 2098780, 3586157, 4923092, 4295054, 2705274, 2045272, 2345087, 2210457, 991791, -618906, -1569631, -1208901, 434356, 2465964, 3665277, 3754496, 3686262, 4212840, 4759518, 4368237, 3263729, 2672319, 3306242, 4731827, 6066679, 6553144, 5525242, 2756318, -765971, -3103515, -3070641, -1441426, 29484, 611844, 1105551, 2421555, 4281204, 5535688, 5306110, 3553295, 1027371, -887067, -737687]
38545g37687K509064L308254J797327p59473k399504k302205j040778L41742R67255
38536A683995M81846m76742o62561K37761J051024Q68498M72831Q02169R40034
38527E398855m35367k145432j594938R59984J983971k27297k534594j283637K175198
38518B296743L205749L97504k641072k352046M45817K365427J763895j13376j243918
38509D124723q68298J21023J88037j034598j884095o14236J764549K282267K40444
38500D319816j419379m07126J336161P56823j268849j365392N99958J183147p17123
38491C018036j738850K93888K412700J283360j157518r61664J035215O23561k320130
38482B488598l157195j38590K427231J006151j621675j183959J180217J272492
$$ y = [-737687, 1771377, 5079631, 6876958, 6117485, 3717981, 1415776, 374998, 716740, 1683995, 2165841, 1689099, 1026538, 1264299, 2315323, 3183821, 3656652, 4458821, 5398855, 4963488, 2818056, 1223118, 2183102, 4167073, 3939776, 1405182, 121545, 2296743, 5502492, 5899996, 3258924, 906878, 1352695, 3718122, 5482017, 5368641, 4124723, 3256425, 3377448, 3565485, 2530887, 646792, 32556, 1797105, 4079372, 4319816, 2900437, 2493311, 3829472, 4586295, 3317446, 1952054, 2552012, 3735159, 3018036, 1279186, 1573074, 3985774, 5269134, 4111616, 3149952, 4185167, 4808728, 2488598, -668597, -807187, 1620044, 2626195, 1004520, -179439, 1000778, 2273270]
38474B273270j040673j905381K075J705909J189115K54653P26399J316391L82533
38465D904291r12241o96710K42317j81440j732345k135115n81509J279298J925826
38456B112372J622236J089070K07244j080989j791331j006813N73937J311769
38448C037495P46270K5207N159j136p98281j552929r18912M94842P34948j37725
38438A634938L71293K996048M476949J978378k055291k839631j91664J383074
38430G754094k61785j987818r55115Q93928O56975n14526J42657J800746J379846
38421H909002j011688k036394m10587J411892J320593J60089n23670o20534m48476
38412F750227L863M0593j232063k709990k121439K19868J320519J82776o02495
$$ y = [2273270, 1232597, -672784, -670709, 1035200, 2224315, 2478968, 3205367, 4521758, 4904291, 3992050, 3295340, 3537657, 3356217, 1623872, -511243, -1092752, 186546, 2112372, 3734608, 4823678, 5030922, 3949933, 2158602, 1151789, 1725726, 3037495, 3783765, 3808972, 3814131, 3812995, 3014714, 1461785, 542873, 1037715, 1772663, 1634938, 2006231, 5002279, 9479228, 11457606, 9402315, 6562684, 6371020, 7754094, 7492309, 5504491, 4549376, 5443304, 6100279, 5585753, 5728410, 7529156, 8909002, 7897314, 5860920, 5450333, 6862225, 8182818, 8342907, 7819237, 7198703, 6750227, 6754090, 6794683, 5562620, 2852630, 731191, 951059, 2271578, 2454354, 1851859]
38403A851859M87074J118301n19346j907371l58644J742729L59008l187521l592430
38394d006341L60409L930551L412928O95040p35348o35207o47293r10305n04216
38385I60218M60070J186291J404808R82629k57290j387489q47257R42997J512426
38376D957403M9076j169179n56365J61573p67599j757462o36920J304900J302653
38367B888080l04247q48941K53790J203253J288487J336931J039571p36064k850759
38358C270101k491053M91692K800956K104415k91352j886735j754174k91074J444414
38349C397190J680977l91827k571583j864081J014854K364753J062130j24790
38341D567623M52957R25253j8078o55683j0106k20478k352955l483343j367397
$$ y = [1851859, 2338933, 3457234, 2937888, 1030517, 671873, 2414602, 2773610, -413911, -4006341, -3645932, 284619, 3697547, 4392587, 3657239, 3022032, 2374739, 1464434, 960218, 1420288, 2606579, 4011387, 4994016, 4736726, 3349237, 2501980, 3444977, 4957403, 5006479, 3837300, 3280935, 3442508, 2674909, 917447, 280527, 1585427, 2888080, 2583833, 1734892, 1988682, 3191935, 4480422, 5817353, 6856924, 6120860, 3270101, 779048, 1270740, 4071696, 6176111, 5884759, 3998024, 2243850, 1952776, 3397190, 5078167, 4686340, 2114757, 250676, 1265530, 3630283, 4692413, 4567623, 5020580, 5945833, 5927755, 5272072, 5261966, 5041488, 2688533, -794810, -2162207]
38332b162207J227543P91351j076913m85068K139635K949109J025128p22440n87420
38323C098718J08320J88421m732m65136j497173j916103m06528J574227J475661
38314B155675j33074n28807L48621K5263j531669j406226J058997K780180J904477
38305D673437K86106m69181j423953k878183k510944M69702K858192K092827K81370
38296C379373M04611J299823J01361k461339l145606j318279O53690J372881J421776
38287A708291R41991m79417j643640o68962J624112K259408O73614j75220J518285
38278E758462L289131K004535j238219k399046j20183K390036J703825j403994
38270I984547l278975k202075q1631O64703N5020n11519o72402r08348r72224
$$ y = [-2162207, -934664, -143313, -1220226, -1705294, 434341, 3383450, 4408578, 3686138, 3098718, 3207038, 3395459, 3390727, 2925591, 1428418, -487685, -894213, 680014, 2155675, 2022601, 1493794, 1842415, 1867678, 336009, -1070217, -11220, 2768960, 4673437, 4959543, 4490362, 3066409, 188226, -2322718, -1853016, 1005176, 3098003, 3379373, 3783984, 5083807, 5185168, 2723829, -421777, -1740056, -1086366, 286515, 1708291, 2650282, 2170865, 527225, -141737, 1482375, 3741783, 4415397, 4240177, 5758462, 9047593, 11052128, 9813909, 7414863, 7294680, 9684716, 11388541, 9984547, 6705572, 4503497, 4421866, 5086569, 5141589, 4630070, 3957668, 3049320, 2077096]
38261B077096l25100M44535M17449R0159M90271J059855N46058m47135k85743
38252D067445O02658L37090p68564n18010Q27943L99651j937857k291821R56093
38243A674628L604589J747050j978797k432483K57610J666045L42367q10084j48042
38234C922883L94946n57692j313474k99613J183681J187942N9325n14800q7804
38225C975394L28470m3257p76930q10082K20773J206342P23663p97074j311014
38216B716285k62985K89989r27247j865083l36882J968069J814703k83971p48535
38207B364343J269252K536482R55807j309335j475463j41617L29141n02282j109920
38198B916408n62527M95458R00493R2420j358525k026619j144908J93835M26741
$$ y = [2077096, 1751996, 2196531, 2613980, 2704139, 3194410, 4254265, 4800323, 4353188, 4067445, 4670103, 5007193, 4238629, 3720619, 4548562, 4948213, 3010356, 718535, 1674628, 5279217, 7026267, 5047470, 2614987, 2872597, 4538642, 4881009, 4070925, 3922883, 4317829, 3760137, 2446663, 2147050, 3330731, 4518673, 4577998, 4063198, 3975394, 4303864, 4260607, 3483677, 2673595, 2894368, 4100710, 4824373, 4027299, 2716285, 2453300, 2743289, 1816042, -49041, -385923, 1582146, 3396849, 3112878, 2364343, 3633595, 6170077, 7125884, 5816549, 4341086, 4199469, 4528610, 4026328, 2916408, 2353881, 2849339, 3749832, 3842252, 2483727, 457108, -687800, -493965, -67224]
38189f7224j18911J64879J307838J549237L19745p32932m89658m4353m75835q43445
38179E69341L9341J333275J422657M40772j25161K35698N91094J54373p94675
38170C866715j431842j070431L75787J946676K081206K95622j860784k306664
38162A896285q29757O52941L78798j165656j842740n24103J409066J830165P49611
38153B554610J99619J082540J760849P32234q52715r49607K69487R56206M29268
38144F182491m69552j194512j617660r55676J104917K659108J538294j154029
38136F093381k180634q78805K22918j93433n15820K14227M26605o33201r23788
38127A631450P46434J971915N05608j595555r52936J591983K096486l98711k459264
$$ y = [-67224, -186135, -21256, 1286582, 2835819, 3155564, 2422632, 1932974, 1888621, 1412786, 569341, 608682, 1941957, 3364614, 3805386, 3680225, 3915923, 4507017, 4661390, 3866715, 2434873, 1364442, 1740229, 3686905, 5768111, 6063733, 4202949, 1896285, 1066528, 1719469, 2098267, 932611, -910129, -1434232, -25166, 1804999, 2554610, 2754229, 3836769, 5597618, 6329852, 5477137, 4527530, 4797017, 5753223, 6182491, 5712939, 4518427, 2900767, 1945091, 3050008, 5709116, 7247410, 6093381, 3912747, 3033942, 3256860, 3063427, 2547607, 2761834, 3188439, 2555238, 1631450, 2377884, 4349799, 4855407, 3259852, 2306916, 3898899, 5995385, 5596674, 3137410]
38118C137410j368483J299244K350927J142287l50517m64217M70731J026705L83847
38109G627934r66206j866207j586560k95670J147986J579751L02042j800659k567835
38100A574576j117943N86306L41951q33716k34549J860133K199203j43811j926390
38091B305760q33529Q55430K53407j324806r22365P71188O56706j278020j798986
38082a315215J62499J702953N45722j602599j832968Q720J803386K183182J525348
38073C181028O60031j41838r23972j353424o17943J483294L303410K465527q69115
38064G186998l225141j982037Q41788J266842r54888k200994n30663J724176J850880
38055C976961M29486n01232o44478p78553o64467R7568L94921p58010j715948
$$ y = [3137410, 1768927, 3068171, 5419098, 6561385, 6210868, 5746651, 6217382, 7244087, 7627934, 6661728, 4795521, 3208961, 2913291, 4061277, 5641028, 5943070, 4142411, 1574576, 456633, 1042939, 1384890, 551174, 316625, 2176758, 4375961, 4232150, 2305760, 1472231, 2327661, 2581068, 1256262, 333897, 1105085, 1761791, 483771, -1315215, -1152716, 550237, 1095959, -506640, -2339608, -2330888, -527502, 1655680, 3181028, 3841059, 3699221, 2775249, 1421825, 803882, 2287176, 5590586, 8056113, 7186998, 3961857, 1979820, 2821608, 4088450, 3133562, 932568, 401905, 2126081, 3976961, 4406447, 3905215, 3260737, 2482184, 1817717, 1915285, 2310206, 1552196, -163752]
38046a63752m1894L267675M197913J159155k441579k650986j27259J335038L47954
38037D882265o71676K77135J772012J483962j44734p64129J52506O17195o56663
38028F947873k203090j896920N9892J445888Q93579n91862j109168j81442Q71704
38019D236454P48992k07661o95419m42899m98416j278734j578288m75100Q30830
38010F39759N50599r33190j471257j04754J910485K955835K461259N92136j840291
38001D760581l150151k175178o4956R47051N46972K80769O40985N96312J75875
37992B558260P32325J973455J676050n03638j903112j069629j00267p96158j510732
37983A056554m07501R72001N13588n59811o1414R98181M27619p65674j95892J099068
$$ y = [-163752, -205646, 3062029, 7259942, 8419097, 5977518, 3326532, 3199273, 4534311, 4882265, 4210589, 4487724, 6259736, 7743698, 7598964, 6834835, 6987341, 7604536, 6947873, 4744783, 2847863, 2907755, 4353643, 5247222, 4655360, 3546192, 3364750, 4236454, 4985446, 4777785, 4082366, 3639467, 3141051, 1862317, 284029, -191071, 639759, 1190358, 257168, -1214089, -1318843, 591642, 3547477, 6008736, 6600872, 4760581, 1610430, -564748, -629704, 317347, 864319, 1145088, 1786073, 2382385, 2558260, 3290585, 5264040, 6940090, 6436452, 4533340, 3463711, 3363444, 2567286, 1056554, 649053, 1621054, 2134642, 1574831, 1513417, 2511598, 2939217, 2173543, 1977651, 3076719]
37973C076719K90144j628170q91838K298638L284671L11527k527060j757319M38984
37964B896296M91441q92336q10282O61551J118486K52981J27832J381022K035778
37955G262769N17651k051127l228622j974031M12168J728860J172440N3222j18979
37946C774351L09226N2067p29824p09708J62086N81459L39320N07168Q67656p3881
37936E079920j727752j251088J635870K935586J26052l277369k533009J076800
37928B065010K187540m08896k216658k57045K570930K245866o12704k332447j422690
37919A818906L94006J218832P50187m07829j337726j011752N93315J884959J497187
37910E400085L07996J29114Q52767Q07716j98212m79485M21883O44980p88351
$$ y = [3076719, 3366863, 1738693, 846855, 3145493, 6430164, 6741691, 4214631, 2457312, 2896296, 3387737, 2495401, 1685119, 2346670, 3465156, 3718137, 3845969, 5226991, 7262769, 7780420, 5729293, 2500671, 526640, 938808, 2667668, 3840108, 3893330, 3774351, 4083577, 4135644, 3405820, 2696112, 2858198, 3439657, 3778977, 4286145, 5153801, 5079920, 3352168, 2101080, 3736950, 6672536, 6798588, 3521219, 988210, 2065010, 4252550, 3843654, 1626996, 1369951, 3940881, 6186747, 5574043, 3241596, 1818906, 2212912, 3431744, 4181931, 3774102, 2436376, 1424624, 2017939, 3902898, 5400085, 5708081, 5837195, 6689962, 7497678, 7299466, 6819981, 7241864, 7886844, 7098493]
37901G098493j945475j008708O13787O01673m33754l64370L32518n49509k310993
37892B033662j651492J660785L505222J570302r64886n44032J287124R67544j084368
37883F779861j607283q6360Q83810J53764q09016j066149j120264q09495M16598
37874B735466J231410j25977k139692j475212J504130K688303O05727j282236
37866C741919l14888J355257Q89621o62914r01017k47243l15807m41046P22658
37857C826540J881441Q92153j251766j612781Q3297J165120K17235j233069j469808
37848B498362o75081J95123P69158R79438P24976J46183n40917j263541j504096
37839A329605l66343J729530K515243N59694k386467l334372j598967J090915
$$ y = [7098493, 5153018, 4144310, 4758097, 5359770, 4926016, 4561646, 4894164, 4344655, 2033662, 382170, 2042955, 5548177, 7118479, 6153593, 5609561, 6896685, 7864229, 6779861, 5172578, 5086218, 5970028, 6123792, 5314776, 4248627, 3128363, 2318868, 2735466, 3966876, 3840899, 1701207, 225995, 1730125, 4418428, 5024155, 3741919, 3427031, 4782288, 5671909, 5008995, 4107978, 3860735, 3544928, 3103882, 3826540, 5707981, 6600134, 5348368, 3735587, 3818884, 4984004, 5201239, 3968170, 2498362, 1823281, 2018404, 2787562, 3767000, 4491976, 4638159, 4097242, 2833701, 1329605, 963262, 2692792, 5208035, 5767729, 3381262, 46890, -1552077, -461162]
37831d61162L039309L407393J692025j402689l320409k210476L14120J172779
37823B230890M7887p72733k94315K26643J39646K98216P37149K85234q55392r15040
37813A128185K15091M24446p56606p52785J705431L640222J938532j667151k851287
37804C024078p68920J233199O31039j390251k401371j749465l17579J054994J921150
37795A236874J944688J087927k33321j393381j757005r94275K90746P74428K6267
37786I82948o76772j26075R01478Q56110k3678j30808P37661J050614K48396l23169
37776C496705Q3766K73644m96326p61168O71636K119141J287218q73059j283157
37767D518400N29870J560258k30853k961897l512775j469965R36742J742206R32606
$$ y = [-461162, 2578147, 5985540, 7677565, 6274876, 2954467, 743991, 1058111, 2230890, 2278777, 1506044, 1211729, 1438372, 1578018, 1876234, 2613383, 2898617, 2043225, 1128185, 1343276, 1767722, 1011116, 258331, 1963762, 5603984, 7542516, 5875365, 3024078, 2255158, 3488357, 4119396, 2729145, 327774, -1421691, -1739270, -684276, 1236874, 3181562, 4269489, 4036168, 2642787, 885782, -108493, 182253, 956681, 982948, 306176, 180101, 1081579, 1937689, 1914011, 1783203, 2520864, 3571478, 3819874, 3496705, 3580471, 3854115, 3357789, 2596621, 3268257, 5387398, 6674616, 5801557, 4518400, 5048270, 6608528, 6377675, 3415778, -96997, -1566962, -630220, 1111986, 2044592]
37758B044592p4273J52698J593911K448853J150175j271521k256335j228309o1241
37749B498550L26712J204673K737673K501550m45030k807710j620693O96293j06433
37740D985585l025478l094064N66209L082598J309241j703580j851550L36077
37732F05038J883579K059851J800603R14653q80501j904708o68480J165000R17975
37723E893010j002254j984785j320779m82187M7790J057810J931237R76542j156828
37714C959556j569263L95034J690271J66324j988520j627552M95443J039811o90490
37705A870614j810386m36713J402696Q70246j322795j755223Q60036L700739L462048
37696F841262N25522j867610j846414o24780l6578j00715J88782Q93755J141724
$$ y = [2044592, 1970319, 2123017, 3716928, 6165781, 7315956, 6044435, 3788100, 2559791, 2498550, 2825262, 4029935, 6767608, 9269158, 8824128, 6016418, 4395725, 5092018, 4985585, 1960107, -1133957, -567748, 2514850, 3824091, 2120511, 268961, 605038, 2488617, 4548468, 6349071, 7263724, 6383223, 4478515, 3810035, 4975035, 5893010, 4890756, 2905971, 1585192, 1103005, 1150795, 2208605, 4139842, 5116384, 3959556, 2390293, 2785327, 4475598, 4641922, 2653402, 1025850, 1521293, 2561104, 1870614, 60228, -376485, 1026211, 1896457, 573662, -1181561, -321525, 3379214, 6841262, 7366784, 5499174, 3652760, 3027980, 2991402, 2890687, 3079469, 3973224, 5114948]
37687E114948O10753K0465J64376R49285J420363O53595j182573k712803k656633
37678B381776j147203N84404J486782J208741N3374q03803j1023J843222K035030
37669G631300n32365k779988j497769J252562P74981k566998l263720O05743L823501
37660C447247K002690j710703k054912J73041N61066j024673q28675J721430L061483
37651E347994J653974j4331k90695n91004j658352j843667o59271k05821j235073
37642E03754j323026Q88731K845849K011654p1966m75476N17728N40983n92326
37633D845905q84538J96678R23430L15671l66105J62942J116706Q03616q76112
37624F238193k137961j543059K28655J416713J526414J463381J334729o2363k606210
$$ y = [5114948, 5725701, 5746166, 5910542, 6859827, 8280190, 8933785, 7751212, 5038409, 2381776, 1234573, 1818977, 3305759, 4514500, 4567874, 3764071, 3753048, 5596270, 7631300, 7098935, 4318947, 2821178, 4073740, 4848721, 2281723, -981997, -376254, 3447247, 5449937, 3739234, 1684322, 1857363, 2418429, 1393756, 565081, 2286511, 5347994, 7001968, 6987637, 6696942, 6105938, 4447586, 2603919, 1944648, 1738827, 503754, -819272, 69459, 2915308, 4926962, 4854996, 4379520, 4897248, 5438231, 4845905, 3961367, 4158045, 5081475, 5397146, 5031041, 5193983, 6310689, 7114305, 6238193, 4100232, 2557173, 2785828, 4202541, 5728955, 7192336, 8527065, 8464702, 5858492]
37615E858492l650268j428313J814332K594189J036819N7317M10593M0476j546775
37606E186862j980826k02639J368730N84388j205477j615370p17201o6358k0725
37597A331384J4495P3924Q4847N89537J555968J760784P00190k91349j70615J15142
37587E764307m52463r56019k33697Q36957O68973n30231j372239j376273q07605
37578A541710L84058J721554J615436l04740j507986L28114L409749L762819P37728
37569A1688442k183375k319924r34040n95509j550925k070822j120262O14782
37561A528367J770434J502595j1351j663633k172268j170072L71593R39514n7339
37552A037840j487570j564712j13334R36196K76594m60856R63686L305739K944446
$$ y = [5858492, 2208224, 779911, 2594243, 5188432, 6225251, 6282568, 6693161, 6733637, 5186862, 3206036, 3003397, 4372127, 4956515, 3751038, 2135668, 1418467, 1352109, 1331384, 1345879, 1419803, 1504650, 2094187, 3650155, 5410939, 6111129, 5819780, 5649165, 5764307, 5311844, 4355825, 4122128, 4959085, 5628058, 5097827, 3725588, 2349315, 1541710, 1925768, 3647322, 5262758, 4958018, 3450032, 3778146, 7187895, 10950714, 11688442, 9505067, 7185143, 6251103, 5655594, 4104669, 2033847, 913585, 1528367, 3298801, 4801396, 4790045, 3126412, 954144, -215928, 155665, 1095179, 1037840, -449730, -2014442, -2127776, -1191580, -914986, -1375842, -412156, 2893583, 5838029]
37543E838029m51296k632024q34212J930209J449981j246380j731449Q56605K788120
37534E967583J683477l60851p27630k33657j118610l008292l168740l09018L434042
37525B158304M644591K308387r76908j813114K3044J385880L3280k302303k493997
37516B967164m60498J080665P12292k30253m22540m27601j027291j581999j212248
37507f02309l13886K24606M06592P47494J175570J193167P55809L38751L08579
37498D234373N51225N75468r790q49687r48966J8656Q76204L29992j032730j295473
37488B449272J49559J726736J855968Q97799J89572j240n03712j507854j869060
37479C387040o07375J397002K036166N98872r52866l20404J790024K161743n82905
$$ y = [5838029, 5386733, 2754709, 1920497, 3850706, 5300687, 4054307, 2322858, 3179463, 5967583, 7651060, 7290209, 6562579, 6328922, 5210312, 2202020, -966720, -1275738, 2158304, 6802895, 9111282, 8134374, 6321260, 6344304, 7730184, 7763464, 5461161, 2967164, 2506666, 3587331, 4299623, 4069370, 3646830, 3219229, 2191938, 609939, -602309, -916195, -691589, -284997, 462497, 1638067, 2831234, 3587043, 3925794, 4234373, 4785598, 5361066, 5351276, 4501589, 3552623, 3571279, 4447483, 4777475, 3744745, 2449272, 2598831, 4325567, 6181535, 7079334, 7268906, 7267666, 6763954, 5256100, 3387040, 2779665, 4176667, 6212833, 6811705, 5858839, 5538435, 7328459, 9490202, 8907297]
37470H907297l673033l583405o93619J299546L58899j430392j007241J459817
37462A637869K823333J134672j630993j881345Q57218K938266J322707j952160
37454E249567k272047R52225L203400J357633j793152j833771Q51599K178998
37446G894452N76338j411612j495216l86397L40808M45142J98958m99896j286992
37437D375585j281237n61619j72944k56306R3161P04773J22233j695136k544382
37428a215872j123538Q02303R78918k7780K8067J501457K398472J371856m45620
37419D268263j078708k21681O14526K44550o00266l76066Q74578J394577M04296
37410E524069n00178J35311J046623J84798j699016j962969k71936R44597N46314
$$ y = [8907297, 5234264, 1650859, 957240, 2256786, 2615685, 1185293, 178052, 1637869, 4461202, 5595874, 3964881, 2083536, 2940754, 5879020, 7201727, 5249567, 2977520, 3929745, 7133145, 8490778, 6697626, 4863855, 5715454, 7894452, 8470790, 7059178, 5563962, 5177565, 5518373, 5963515, 6162473, 5662577, 4375585, 3094348, 2532729, 2359785, 2103479, 2196640, 2901413, 3023646, 1328510, -1215872, -2339410, -1537107, -558189, -585969, -557902, 943555, 3342027, 4713883, 4268263, 3189555, 2967874, 3582400, 3826950, 3226684, 2850618, 3725196, 5119773, 5524069, 5023891, 5159202, 6205825, 6390623, 4691607, 2728638, 2456702, 3401299, 3947613]
37401C947613K18454R80744J161825l57103j561604m53701J328019J005057o85244
37392E584060o83372J193516J827853m7520j721453r56178L71244n40870k642989
37383B384291k518425K15608K272702J798387R48774J889962K984738J614521
37375A1590558j082629j758294l63682k21379k204298k922071m14646K159051
37367D782610J428425p39743n32973J344443J079095j478561k355421l7770K058750
37358E548855J025694j465205k379676j493777l10886O10859J122892M04360j431635
37349A631481k305900p53303J747779K717985J774455L34546n61057p19952k09940
37340C656094M33046M18549J8251L97391J425448J394013j81818j501815j386946
$$ y = [3947613, 4166067, 5146811, 6308636, 5951533, 4389929, 3936228, 5264247, 6269304, 5584060, 4900688, 6094204, 7922057, 7874537, 6153084, 5196906, 5568150, 5027280, 2384291, -134134, 81474, 2354176, 4152563, 5101337, 6991299, 9976037, 11590558, 10507929, 8749635, 8385953, 8164574, 5960276, 3038205, 2623559, 4782610, 6211035, 5471292, 4938319, 6282762, 7361857, 5883296, 3527875, 3490105, 5548855, 6574549, 5109344, 2729668, 1235891, 925005, 1535864, 2658756, 3063116, 1631481, -674419, -1427722, 320057, 3038042, 4812497, 5147043, 4585986, 3866034, 3656094, 4089140, 4507689, 4525940, 4923331, 6348779, 7742792, 7560974, 6059159, 4672213]
37331D672213j029626j339970r46127J066881K644169J564623r88902k305034
37323C338227k065497j654456r80486Q77796K766632K442832K06490j299642q65021
37314B766875K46452R27087J374704J533482P73714n79616j360291j267139p19698
37305C695570N04648K341204K847415M11631k745764k606881P32758K651179O22145
37296H453905k111307j502155J428397K434940J44668k495574k440745q4035J700649
37287E528743R35428j351836k210009k04276K499473K544574k19240k380295j465029
37278C677533R82233J876660N89454j051077j639292j294937m18711Q57084J847271
37269E426218J411097m99655k247247k185067n64553Q41185Q88951J98563l6361
$$ y = [4672213, 3642587, 2302617, 1356490, 2423371, 5067540, 6632163, 5643261, 3338227, 1272730, -381726, -1362212, -484416, 2282216, 4725048, 4931538, 3631896, 2766875, 3013327, 3940414, 5315118, 6848600, 7622314, 7042698, 5682407, 4415268, 3695570, 4200218, 6541422, 9388837, 9800468, 7054704, 4447823, 5180581, 7831760, 8453905, 6342598, 4840443, 6268840, 8703780, 8848448, 6352874, 3912129, 3828094, 5528743, 6464171, 5112335, 2902326, 2698050, 5197523, 7742097, 7522857, 5142562, 3677533, 4659766, 6536426, 7125880, 6074803, 4435511, 3140574, 2721863, 3578947, 5426218, 6837315, 6337660, 4090413, 1905346, 1340793, 2181978, 3070929, 3269492, 3233131]
37260C233131L19527N36209L51576J35040p8239n70150r71570o30711n2788l54199
37250A917826r92816j20267K029135K552925K40452j935530j020445J405921J878376
37241E955577M24208k44273L11532J01707r51014p02787Q14654P68112j584449
37232D893267l069037j343012J628073K697782J563469r1938j141432j034752
37224D102420M69679J975332J124010j730942k922744n14751K401679J860766
37216F765449j476610l590479k441843M63450K796072L380962K190236K98483
37208H385720o96270m83269l37725p45810n11238N84377O25365j000665j544918
37199D275567R60360L733425K854137p41857k621288j310572L65229J39462j051559
$$ y = [3233131, 3552658, 4088867, 4440443, 4575483, 4497244, 3927094, 2955524, 2324813, 2272025, 1917826, 925010, 804743, 2833878, 5386803, 5627255, 3691725, 2671280, 4077201, 5955577, 6379785, 6135512, 6447044, 6548751, 5597737, 4894950, 5709604, 6477716, 4893267, 1824230, 481218, 2109291, 4807073, 6370542, 6278604, 5137172, 4102420, 4572099, 6547431, 7671441, 5940499, 3017755, 2503004, 4904683, 6765449, 5288839, 1698360, -743483, -280033, 2516039, 5897001, 8087237, 8385720, 7689450, 7206181, 6868456, 6122646, 5611408, 6195785, 6821150, 5820485, 4275567, 5235927, 8969352, 11823489, 11081632, 8460344, 7149772, 7515001, 7654463, 6602904]
37190F602904j552075j057784K00165J716329J961314n5199k415383k215808M6822
37181C231285R56171o48492k118961j370885K96905R86091R93839J275862J482478
37172E084293J136466Q02512O71195j40953j571451j848343j94912J544221J493979
37163F977007K39911p58876j435341k067215j725451J05127J689332J091807p59894
37154C356407j195209M55409K144720K014046M27236j012818j325593q04495l85811
37145C673892m31437k00995Q66761J642450N43112j641649k182067l54895J257193
37136C172365O57724o63695n81557J31568k96834r98276Q5826K129994K217597
37127E854712L3074j464352n04091J225188J590147P66693j24366r21204j573290
$$ y = [6602904, 5050829, 3993045, 4193210, 5909539, 7870853, 7815654, 5400271, 3184463, 3231285, 4187456, 3538964, 1420003, 49118, 346023, 1332114, 2325953, 3601815, 5084293, 6220759, 7023271, 7694466, 7553513, 5982062, 4133719, 3938807, 5483028, 6977007, 7216918, 6458042, 5022701, 2955486, 1230035, 1335162, 3024494, 4116301, 3356407, 2161198, 2616607, 4761327, 6775373, 7202609, 6189791, 4864198, 4059703, 3673892, 3242455, 3041460, 3908221, 5550671, 6093783, 4452134, 2270067, 1915172, 3172365, 3830089, 3166394, 2584837, 2716405, 2419571, 1421295, 1507121, 3637115, 5854712, 5887786, 4423434, 3919343, 5144531, 6734678, 7501371, 7377005, 6455801, 4882511]
37118D882511j170187O15081K305429K240591O29421j047841j902541j955191
37110D597273j339895k43298P33357R56051L96984m00731p41818j96889Q49756
37101D610790J236527M26185m02870J20507J170827N76274j753902l241446k233594
37092E09298k49582N55584L71826N92240J252788J539626J663765K151396K145251
37083A0532192N88325j509457k213690j639137j433607j598906n60896J420342
37075C585166J913945K81283r36921p7795R77460K98615n19973P79091K649953
37066H950824J780113j345536k756561r40076J196979J147611J43614Q0960J71320
37057H429248r76578k245432j722120k5206P63284M57496M11579N78922j99150
$$ y = [4882511, 3712324, 4327405, 6632834, 8873425, 9502846, 8455005, 6552464, 4597273, 3257378, 3014080, 3747437, 4703488, 5100472, 4699741, 3957923, 3761034, 4610790, 5847317, 6273502, 5870632, 5991139, 7161966, 7738240, 5984338, 2742892, 509298, 259716, 815300, 1187126, 1779366, 3032154, 4571780, 6235545, 8386941, 10532192, 11120517, 9611060, 7397370, 5758233, 4324626, 2725720, 2164824, 3585166, 5499111, 5780394, 4843473, 4765678, 5743138, 6041753, 5521780, 6300871, 8950824, 10730937, 9385401, 6628840, 5688764, 6885743, 8033354, 8176968, 8257928, 8429248, 7452670, 5207238, 3485118, 3459912, 4223196, 4680692, 5092271, 5671193, 5472043]
37048E472043j247904m48571J983525K987473J000425j673361k305938j403335
37040D364357j038043j246064m29249J521159K793636K243327O48375p26581j385243
37031F745674j223011k04414J098970J567150O97934p39166j539733j274837n36395
37022D592172j85837m02306m68961K58659J256627J372269N65910Q2826L64067
37013G435426L4464j826735l446735k248673J302965L694773K667047o3653j271998
37004F276881k41443R21384M73838p78520q66533M96200J355802Q4613k178526
36995E543696k681911o26973J680350J832205K76224p85935m53488L54041P79128
36986E917337Q29754N74076K6738k70799J15337N27611K31736n5470N98060J108595
$$ y = [5472043, 4224139, 3775568, 5759093, 8746566, 9746991, 8073630, 5767692, 4364357, 3326314, 2080250, 1651001, 3172160, 5965796, 8209123, 8857498, 8130917, 6745674, 5522663, 5318249, 6417219, 7984369, 8682303, 7943137, 6403404, 5128567, 4592172, 4406335, 4004029, 3535068, 3793727, 5050354, 6422623, 6988533, 7071359, 7435426, 7469890, 5643155, 2196420, -52253, 1250712, 4945485, 7612532, 7548879, 6276881, 6035438, 6956822, 7430660, 6652140, 5785607, 6281807, 7637609, 7722222, 5543696, 2861785, 2234812, 3915162, 5747367, 6023591, 5237656, 4784168, 5138209, 5917337, 6747091, 7321167, 7347905, 7077106, 7192443, 7720054, 7951790, 7896320, 8494380, 9602975]
36976I602975k25444k258606j904019Q92892K301622K57602k130865j303383J246337
36967F479111J547131m68016j094724J015854K719257J285959j606861k475841
36959G401870o50213J526905K065987J287183O82426R04885J143444K93358j370233
36950A3285612k130922q85868J247875K196946J408882Q8555o90108q88125o54216
36941A2978631Q3515R86535J425590J475075J736523K016923J415082Q6795l65667
36932B1839002R75394K774101K905216J015017j057086j224685P85301L172719
36924C1184979L884423K860663K018965K577956L270005K296637K01440r42617
36916D7352451p63182r31782k255611l611424m198498m609424m861296l682491
$$ y = [9602975, 9377531, 7118925, 5214906, 6107798, 8409420, 8667022, 6536157, 5232774, 6479111, 8026242, 7558226, 6463502, 7479356, 10198613, 11484572, 9877711, 7401870, 6751657, 8278562, 10344549, 11631732, 12314158, 13219043, 14362487, 14655845, 13285612, 11154690, 10268822, 11516697, 13713643, 15122525, 15211080, 14520972, 13632847, 12978631, 13062146, 14048681, 15474271, 16949346, 18685869, 20702792, 22117874, 22204669, 21839002, 22814396, 25588497, 28493713, 29508730, 28451644, 27226959, 28012260, 31184979, 35069402, 37930065, 39949030, 42526986, 45796991, 48093628, 48295068, 47352451, 46589269, 45657487, 43401876, 39790452, 35591954, 30982530, 26121234, 22438743]
36908B2438743j109912L40618j043785l383864l704887j884601k1695R48516J560832
36899A4139965J469504m57338l489668m848412l048952Q5440J620890P65522p72131
36890E464820j097523k25604J40320j070199k504007j857627P57920K472626J514369
36881C595095k75874l21164Q69251R82342j16308m31769M83580P32717o22434
36872D895436j921851j478404Q2860J021023O55817l58064q43176R0105J878000
36863D021746K272019j02989l124393l245059l21212K126632K028391J311294
36855D966429K010894K642754Q18953k442821l790828k121999K29130O91716q41104
36846B163124k482214k366750k91651J950847K236344N65138q37937l03268J355980
$$ y = [22438743, 21328831, 21669449, 20625664, 17241800, 13536913, 11652312, 11630617, 12579133, 14139965, 15609469, 15152131, 11662463, 6814051, 3765099, 3850539, 5471429, 6236951, 5464820, 4367297, 4141693, 4282013, 3211814, 707807, -1149820, -391900, 2080726, 3595095, 3319221, 2998057, 3867308, 4849650, 4733342, 4301573, 4785153, 5517870, 4895436, 2973585, 1495181, 1578041, 2599064, 3254881, 2896817, 2053641, 2143746, 4021746, 6293765, 6190776, 3066383, -178676, -499888, 1626744, 3655135, 4966429, 6977323, 9620077, 10439030, 7996209, 4205381, 2083382, 2312512, 3004228, 2163124, -319090, -2685840, -2977491, -1026644, 1209700, 1774838, 936901, 633633, 1989613]
36837A989613K192970J360253m74609j831216j264044J091843K723837J383027
36829G171674j409561k054698l21060L33022j192941j516200J075245K781383
36821D866864L33807l001210k320810J012445J949439J58183k85793J380440J595829
36812E689194n95598j762440l88440P14592j6178k23581J343829K163769Q16462
36803G741609k09268N84877N73856j961162l989376k644228r5898M53416N1444
36794E05270J043249K189275J338889K5128N62677J259762l24939j856932K54824
36785D997203L746214L254835q30233k829156r40466O70064l10070j046161J21980
36776F834210L53670j850916l026871n25155K711307K981947J475880J042303
$$ y = [1989613, 4182583, 5542836, 5068227, 3237011, 1972967, 3064810, 5788647, 7171674, 5762113, 3707415, 3386355, 3719377, 2526436, 1010236, 2085481, 4866864, 5200671, 2199461, -121349, 891096, 2840535, 2998718, 2712925, 4093365, 5689194, 5093596, 3331156, 2942716, 3657308, 3641130, 3417549, 4761378, 6925147, 7741609, 7532341, 8117218, 8691074, 6729912, 2740536, 96308, 410, 453826, 505270, 1548519, 3737794, 5076683, 5101811, 5664488, 6924250, 6599311, 4742379, 4997203, 8743417, 11998252, 11168019, 8338863, 7398397, 8068461, 7758391, 6712230, 6834210, 7187880, 5336964, 2310093, 1784938, 4496245, 7478192, 8954072, 9996375]
36768I996375Q04087j426342l915090l059529N92299K754466J439865j024159
36760F161972j944763j165637J58755J173148J351495P12051R9480p790m18172
36751F120539j607829k193554q76326J003090J051117n80630j427598l44815J216897
36742B360891J650588J016022J54899m24544m41364J30773O84056N56698m3315
36733E644704m83620o70792o76462q6772J105799J716494Q97439k58331k53047
36724F935412L43937j60620j614923k066497p49962Q76935J293194N14930n95922
36715D776484j189518o48763O31272R85058m20406j779965r71896R16183J020372
36706C318821o36770j118768M51378J417400K41831r10762k14644N18231o56266
$$ y = [9996375, 10800462, 9374120, 5459030, 2399501, 2991800, 5746266, 7186131, 6161972, 4217209, 3051572, 3210327, 4383475, 5734970, 6447021, 6546501, 6538711, 6120539, 4512710, 2319156, 1442830, 2445920, 3497037, 2916407, 1488809, 1143994, 2360891, 4011479, 5027501, 5182400, 4757856, 4316492, 4447265, 5131321, 5688019, 5644704, 5161084, 4490292, 3813830, 3727058, 4832857, 6549351, 7446790, 7188459, 6935412, 7279349, 7118729, 5503806, 3437309, 2687347, 3564282, 4857476, 5372406, 4776484, 3586966, 2938203, 3569475, 4554533, 4134127, 2354162, 1382266, 2298449, 3318821, 2682051, 1563283, 2014661, 3432061, 3673892, 2763130, 2548486, 3066717, 2410451]
36697B410451j899999o83241J416926J078829r57194r14266J523035K398488P6409
36688D449438j796153j23995K503667J767026j709829l369935j376083J357878
36680A702014J899522Q88242L56833M50931N9974p67013r34620k59128K89481
36671C686236K50555K75272P79671J055074L85068n91936n26678P20890J630481
36662G664633Q82659q79807j825579j201283M5863Q85117J264598J128966j73881
36653G791286k275844k911032p34599J790445J086978j992026k608582J002143
36645A148769M385063L175220n03632j549020M00864J268066l88683j535971l70128
36636F030548Q73017L99203q6695Q22289J105279r23520k756330j255657K026178
$$ y = [2410451, 510452, -172789, 1244137, 2322966, 1365772, 451506, 1974541, 4373029, 4449438, 2653285, 2529290, 5032957, 6799983, 5090154, 1720219, 344136, 1702014, 3601536, 4489778, 4846611, 5297542, 5357516, 4590503, 3655883, 3396755, 3686236, 3936791, 4212063, 4991734, 6046808, 6431876, 5839940, 5313262, 6034152, 7664633, 8547292, 7667485, 5841906, 4640623, 4686486, 5571603, 6836201, 7965167, 7791286, 5515442, 2604410, 1869811, 3660256, 4747234, 2755208, 146626, 1148769, 5533832, 8709052, 8205420, 6656400, 7057264, 8325330, 7936647, 6400676, 6030548, 6903565, 7302768, 7216073, 8038362, 9143641, 8220121, 5463791, 4208134, 6234312]
36627F234312K877307N07298j979505k422293j519552l00682J054427J833477
36619F284789J138059j87980m92413j08420o00628j471426p46674J085459J258009
36610F158775m84086j008220Q57970J829715n53180l366620k363278J556254L600673
36601F228003J804998r86341j724906o47249M72975J072425J577138J971088J814945
36592A1583076R79522l68313j963018l135833k893543r52480J517243K722529
36584G489183J957458L03951n01558J41873J179082J176235j17974j624815k081842
36575G921593j115169N34962J564422J189899k298o29076j59262N82372Q36779
36566A0724222R34428J293078J400663P35858k13626q57793j383977j627654n21768
$$ y = [6234312, 9111619, 9618917, 7639412, 5217119, 3697567, 3396885, 4451312, 6284789, 7422848, 7234868, 6742455, 6634035, 6033407, 4561981, 3815307, 4900766, 6158775, 5674689, 4666469, 5524439, 7354154, 6800974, 3434354, 1071076, 2627330, 6228003, 8033001, 7046660, 5321754, 4674505, 5147480, 6219905, 7797043, 9768131, 11583076, 12562598, 12194285, 10231267, 7095434, 4201891, 3249411, 4766654, 7489183, 9446641, 9750592, 9249034, 9390907, 10569989, 11746224, 11628250, 10003435, 7921593, 6806424, 7341386, 8905808, 10095707, 10093409, 9464333, 9305071, 9887443, 10724222, 11658650, 12951728, 14352391, 15088249, 14874623, 14016830, 12632853, 11005199, 10483431]
36557A0483431J662788K196090m54186l246413k180584J505023K698170K3571
36549A2687890k240705r88162J307967J321385J75147O96321K237870K109545
36541A7307258M34446l19898J47300l73835k407649l515068j973599P15895J993874
36532A2008724J220874l27090j143294m91094J246808K619415K268579N04775
36524A7907697q38757m56643R65419J628579O90540q54779j434864q16887k36510
36515A6553795m60612o34875J66909J243908J488373J393786J935707K207548
36507B3894539P00556j420503j359656P76123J810133O48419K0932J558993K782749
36498B9412285J408919o15328m50325R54330R26200k55096k55752J222783K537357
$$ y = [10483431, 12146219, 14342309, 13888123, 10641710, 8461126, 9966149, 12664319, 12687890, 10447185, 9459023, 10766990, 12088375, 12263522, 12959843, 15197713, 17307258, 17741704, 17421806, 17569106, 17195271, 14787622, 11272554, 9298955, 10014850, 12008724, 13229598, 12902508, 11759214, 11268120, 12514928, 15134343, 17402922, 17907697, 17068940, 16612297, 17577716, 19206295, 19896835, 19042056, 17607192, 16790305, 16553795, 16093183, 15458308, 15625217, 16869125, 18357498, 19751284, 21686991, 23894539, 24595095, 23174592, 21814936, 22591059, 24401192, 25049611, 25070543, 26629536, 29412285, 30821204, 30205876, 29755551, 30709881, 31636081, 31380985, 31125233, 32348016, 34885373]
36489C4885373L107543L366339K948461J788255J630266L489411N121400M150468
36481F0487516K051548J602700K239931J940135J837873M155749P004856O721784
36473H8042092M563342N149179Q414352R541221P632259P627118J1592782J4856126
36465A57418471J4077596J2906767J5223937J8292163J7986616J6320468J7721155
36458B69947173K1114552K2046673K0520332K0264815K1193057J8957600J2336427
36451D06380629N343983Q31713k955490p705460j1536589j2766259j3487727j6183793
36443C47921007j9289576j9491753j7042985j5527095j6637518j7989638j6742779
36436B25199663j3352090j0516108r577685r445562q768659p707605p062977o807981
$$ y = [34885373, 37992916, 41359255, 44307716, 46095971, 47726237, 51215648, 56337048, 60487516, 62539064, 64141764, 66381695, 68321830, 70159703, 74315452, 81320308, 88042092, 92605434, 97754613, 106168965, 115710186, 123342445, 130969563, 142562345, 157418471, 171496067, 184402834, 199626771, 217918934, 235905550, 252226018, 269947173, 291061725, 313108398, 333628730, 353893545, 375086602, 394044202, 406380629, 411724612, 412556325, 409600835, 401895375, 390358786, 377592527, 364104800, 347921007, 328631431, 309139678, 292096693, 276569598, 259932080, 241942442, 225199663, 211847573, 201331465, 191753780, 182308218, 173539559, 165831954, 158768977, 151960996]
36428A51960996o512217o448824o945538p119008n905226m216900m151187n728749
36420A04933347o496869n198469l715027l958591m804169m132936k425429j886292
36412G2315565k808571l307180k513348j751810k184295l168047l610437l500457
36404D9471420l291652k792939j573771k9030O62780k28321j891434k419746r28983
36395C6978324Q63795K93434k632249m648326l281767j66786J245974K29860j032419
36386B7849840j224252j362639k173539k393330r22834R96394J331742M6251j146491
36377B1001142j273108q92509n88485j53084M24224M61259k30376p20458m48826
36368A7579779l66733j263434j823054l89517J658280R94077k489157m489935
$$ y = [151960996, 145448779, 138999955, 132054417, 124935409, 119030183, 114813283, 110662096, 104933347, 98436478, 93238009, 89522982, 85564391, 80760222, 76627286, 74201857, 72315565, 69506994, 66199814, 63686466, 61934656, 59750361, 56582314, 52971877, 49471420, 46179768, 43386829, 41813058, 41784028, 42446808, 42218487, 40327053, 37907307, 36978324, 37842119, 38135553, 35503304, 30854978, 27573211, 27406425, 28652399, 28882259, 27849840, 26625588, 25262949, 23089410, 20696080, 19773246, 20769640, 22101382, 22147633, 21001142, 19728034, 18835525, 18247040, 18093956, 18518180, 18979439, 18749063, 18028605, 17579779, 17213046, 15949612, 14126558, 13737041, 15395321, 16389398, 13900241, 9410306]
36360I410306k145315J534351J983702j82645o22356J557942K628067O86488j215750
36351A3634790k51313J674791J349291o50317j470021p21742m47425j311714j820322
36342I986018j062120K09340J211870J850263J783939N89452r62714j340817l11354
36333A1953877O03684J28547j084172j195310N88149K684250K503843k58276k458615
36324A3465977j233857J654740J800309j367410l424478j581795J115969Q39246
36316A1268701j012012o44374J629320K294943Q24109R1328P30321J3070k560496
36307A2634910l218493K06605M136453M115516J098244o83029l53725q27125k955407
36298A4153949l448861k12201L433833K866022j026595k724486L0707K845747
$$ y = [9410306, 7264991, 8799342, 10783044, 10600399, 9978043, 11535985, 14164052, 14850540, 13634790, 13383477, 15058268, 16407559, 15757242, 14287221, 13565479, 13118054, 11806340, 9986018, 8923898, 9133238, 10345108, 12195371, 13979310, 14568762, 13606048, 12265231, 11953877, 12557561, 12686108, 11601936, 10406626, 10994775, 13679025, 16182868, 15924592, 13465977, 12232120, 13886860, 15687169, 14319759, 10895281, 9313486, 10429455, 11268701, 10256689, 9612315, 11241635, 13536578, 14360687, 14452015, 15182336, 15195406, 12634910, 9416417, 9623022, 13759475, 17874991, 18973235, 18290206, 17936481, 17109356, 14153949, 10705088, 10492887, 13926720, 16792742, 15766147, 13041661, 13072368, 15918115]
36290A5918115J122680l112575m295356j441151J209331J220077P42719J291882
36282A2655722P72685j754444k919085m01109K353339J348704j094045o7673L416586
36273A4310680L702345m09035l851287l171651p31241L04648K15921R5988o14039
36264I852329j721977j223579J089023K392113J341531L59664J149666J550049
36256A4788819l09721k158166j294982P65265J060410J61551M93169J634744J387599
36247A6528688J67943K46939J424120J406253R5878l02515O04579Q54041n8883
36238B0967043l91913K27408j30005j983461l032344j878280k88782q8826l85402
36229A3015438J72106O46784l74099j930715k058356q98722j99467m17905m11880
$$ y = [15918115, 17040795, 13928220, 9632864, 8191713, 9401044, 10621121, 11363840, 12655722, 13428407, 11673963, 8754878, 8353769, 10707108, 12055812, 10961767, 10894094, 14310680, 18013025, 17603990, 13752703, 10581052, 9849811, 10154459, 10370380, 10466368, 9852329, 8130352, 6906773, 7995796, 10387909, 11729440, 12089104, 13238770, 14788819, 14479098, 12320932, 11025950, 11791215, 12851625, 13013176, 13506345, 15141089, 16528688, 16696631, 16943570, 18367690, 19773943, 19869821, 19567306, 20171885, 21025926, 20967043, 20575130, 20802538, 20672533, 18689072, 15656728, 13778448, 13489666, 13400840, 13015438, 13187544, 13834328, 13460229, 11529514, 9471158, 8572436, 8372969, 7955064, 7543184]
36220G543184L49795J125243J299809Q81024k25578j885144k806271j629042Q47536
36211E500556K088338R47256r57958j550364p46867J10799K27255j17090l05042
36202E196883O9641Q59974J171093K60103j074346j139823J22008P44753j94487
36193F015799q51123L81872J770018O24390k202380l164320j206067Q75135P73856
36184C017180l91751n40394L93480J276439J575516J062629m25649j774648j152356
36175C040446R76187J659634j77758j697068n68600J145229M31578j556144j429322
36166A824182Q16257K005731J026023N9727M70082R56799M82493K3822M10091
36157H075207P91098K19064j014884k119874k338263q94998J724320K967587J106052
$$ y = [7543184, 7892979, 9018222, 10318031, 11199055, 10973477, 9088333, 6282062, 4653020, 5500556, 7588894, 8536150, 7578192, 6027828, 5280961, 5391760, 5619015, 5501925, 5196883, 5266524, 6126498, 7297591, 7557694, 6483348, 5343525, 5465533, 6210286, 6015799, 5164676, 5546548, 7316566, 7940956, 5738576, 2574256, 1368189, 2243324, 3017180, 2625429, 2085035, 2478515, 3754954, 5330470, 6393099, 5967450, 4192802, 3040446, 4016633, 5676267, 5498509, 3801441, 3232841, 4378070, 4809648, 3253504, 1824182, 2640439, 4646170, 5672193, 5731920, 6202002, 7158801, 7641294, 7665116, 8075207, 8866305, 9085369, 8070485, 5950611, 3612348, 2717350, 4441670, 7409257, 8515309]
36148H515309j618537j691090K73421M77461j643276k268396L79808K798321J703014
36139F926035r61648j535650k18588K83434m40748o38213q1040j92786r32127
36130B208669n88434J101607K085766R23284j094867j597521n0788J659697J409884
36121F057297o90924k355465j842620N7223J477499J956875K059732J512793j07026
36112H125384j468219r12470M72452J40624j538829j521109Q44115K583036J921372
36103H646356O26686J07280r32748k872624l081487k37236K674145K706673J132751
36094H769796J85545r45732l111369l586586j81595L685150L202022m19594k012700
36085E584937n14941O21010K67340R14359K881454L046379N88941j185523m34857
$$ y = [8515309, 6896772, 5205682, 5479103, 5956564, 4313288, 2044892, 2424700, 5223021, 6926035, 5964387, 4428737, 4210149, 4493583, 4052835, 3414622, 3333582, 3140796, 2208669, 1620235, 2721842, 4807608, 5730892, 4636025, 3038504, 2987716, 4647413, 6057297, 5366373, 3010908, 1168288, 1225511, 2703010, 4659885, 6719617, 8232410, 8125384, 6657165, 5744695, 6217147, 6357771, 4818942, 3297833, 4141948, 6724984, 8646356, 9273042, 9380322, 8447574, 5574950, 2493463, 2256227, 4930372, 7637045, 8769796, 8955341, 8009609, 4898240, 1311654, 1130059, 4815209, 8017231, 7597637, 5584937, 5069996, 5691006, 5958346, 6872705, 9754159, 12800538, 13389479, 12203956, 11769099]
36076A1769099N30036L7894l3778J482607K189147M87233r98272K57508K181587
36067A7903061J663924q7214Q3110J505341Q78702j584351j889345J253545L760997
36058B3487770J858918k442961m077499j631734J274544J150585j079754j992110
36050A6547759m93541J085820O34022q94761j320104n49353k75307r57482j150205
36041A2626848o8075J031161Q43115m388o5667P20817J075228K24998j190622
36032A5193415j980057j608409n58197K17314J94300k94164n57952l33661J01773
36023A0374362L78479L20988J1113j81606N6489L67462n4898j237223j991767
36014H043399j302861K80930J238079P69585n02547j222888n31029R02253J175917
$$ y = [11769099, 12299135, 12337029, 12303251, 13785858, 15975005, 16462238, 15463966, 15721474, 17903061, 19566985, 19479771, 19562881, 21068222, 21946924, 20362573, 18473228, 19726773, 23487770, 25346688, 22903727, 18826228, 17194494, 18469038, 19619623, 18539869, 16547759, 16054218, 17140038, 17774060, 16879299, 15559195, 15009842, 14734535, 13777053, 12626848, 12558773, 13589934, 14433049, 14428661, 14362994, 15083811, 16159039, 16384037, 15193415, 13213358, 11604949, 11046752, 11264066, 11458366, 11164202, 10606250, 10272589, 10374362, 10752841, 11073829, 11084942, 10903336, 10959825, 11327287, 11272389, 10035166, 8043399, 6740538, 7021468, 8259547, 9029132, 8526585, 7303697, 6772668, 7674921, 8850838]
36005H850838n76332k449983j871784N75696J647719K76097q13779L05001J475002
35996G418475J98785j888280j596412N61033J404848L55588j78110O72080J112034
35987H060041L63249r2024L41242K33709q53454j198401R045J110533Q20391J48065
35977H942396Q9471k20295j437905k239871j394536J68746J038810J420621J881782
35968H249219J630093j3355j700256j653696l49014K82551k38537o08435o1962
35959E536608N94771M30961l03560o65968j91542O39557Q64714J1040j297031
35950E619550j904090j308902k6669J063905J342807P26208j19738k01133N62351
35941E754289J044467N47035j01440p4593j10319j035013j771063q65753P35429
$$ y = [8850838, 8274506, 5824523, 3952739, 4528435, 6176154, 6452251, 5638472, 5943473, 7418475, 7617260, 5728980, 4132568, 4693601, 6098449, 6454037, 6275927, 6948007, 8060041, 8423290, 8331266, 8672508, 8906217, 8052763, 6854362, 6863407, 7973940, 8794331, 8942396, 9031867, 8811572, 7373667, 5133796, 3739260, 3908006, 4946816, 6367437, 8249219, 9879312, 9865957, 8165701, 6512005, 6162991, 6445542, 6207005, 5598570, 5536608, 6131379, 6562340, 6258780, 5592812, 5401270, 6040827, 6905541, 6916581, 5619550, 3715460, 2406558, 2379889, 3443794, 4786601, 5512809, 5393071, 5191938, 5754289, 6798756, 7345791, 7244351, 7169758, 7059439, 6024426, 4253363, 3387610, 4123039]
35932D123039Q31752m82576r64219P9272Q46620J82813q34624j076708q13424
35923A891945k94590Q56361K064243J847269K82600p46754n71915o75454j667534
35914B986171j837969j11670J838588K031391P95152m84828j325378j509906n40102
35905A841449Q58162Q26220n30146n23097J812377L393846J558933j559720k272074
35896E405950j014938j073932k708502k627010M60081L392411K956355K01144
35888D991559j283051L6744K250825K662059Q14246j172187r82070J358983L611854
35879A2288962L954058K855790K084639K494735L248813K886714R96479j002089
35871B9808101j230059N121Q2714k125245l835439k209118O69991L65674k782513
$$ y = [4123039, 4954791, 4472215, 3507996, 3587268, 4433888, 4616701, 3782077, 2705369, 1891945, 1597355, 2453716, 4517959, 6365228, 6647828, 5901074, 5329159, 4653705, 2986171, 1148202, 1036532, 2875120, 4906511, 5701663, 5216835, 3891457, 2381551, 1841449, 2699611, 3525831, 2995685, 2472588, 4284965, 7678811, 9237744, 7678024, 5405950, 4391012, 3317080, 608578, -2018432, -1558351, 1834060, 4790415, 4991559, 3708508, 3745252, 5996077, 8658136, 9472382, 8300195, 7318125, 8677108, 12288962, 16243020, 19098810, 21183449, 23678184, 26926997, 29813711, 30810190, 29808101, 28578042, 28583163, 28665877, 26540632, 22705193, 20496075, 21166066, 21531740, 18749227]
35862A8749227l658321m07188K344167O78534k617812k842504o01821J83404r11419
35853A0916267q29319J192012K406031J207068o92137j308900q08889k82048k43562
35844A1556523p69500j513429j560931n77258L72501M08951K57415O21964N83138
35835I379374m27848p14503R94403K435643O62995k929099m006714j461057J331232
35826E264426J642468M22506m88575j018895j515911j309352o2182J244260J738293
35817E917038J599925J025718q9569j010888n57428Q13916J181402M0255q59973
35808H060396l01875O53046O58247N2531l31791p53831j581469k002146j246404
35799C206704k24287l67716j278550j071963Q51824K709415K595638R12168m07469
$$ y = [18749227, 15090906, 14683718, 17027885, 17706419, 15088607, 12246103, 11644282, 11827686, 10916267, 10086948, 11278960, 13684991, 14892059, 14199922, 12891022, 12082133, 11800085, 11556523, 10787023, 9273594, 7712663, 7135405, 7507906, 7916857, 8174272, 8796236, 9379374, 8951526, 8237023, 9231426, 11667069, 12330064, 9400965, 5394251, 3933194, 5264426, 6906894, 7329400, 6840825, 5821930, 4306019, 2996667, 2934485, 4178745, 5917038, 7516963, 8542681, 8453112, 7442224, 6884796, 7698712, 8880114, 8920369, 8060396, 7758521, 8411567, 9069814, 9122345, 8790554, 8036723, 6455254, 4453108, 3206704, 2982417, 2614701, 1336151, 264188, 1116012, 3825427, 6421065, 7333233, 6925764]
35790F925764n41116k84508P426J071482K478947J922333j152123l154536q98910
35781F374759K729588K006993k910372n562023k677970J189398J165704q62707
35773A453370o78878J055753J083572j28029J70542J389343Q95860n48681j12994
35764D579858J351079M74232k137124k271793O89046K463029P94479j375594j189841
35755C377371J63848N47137J26643j35321r7175N18174J740230J780260o89265
35746G331902k957516j367961K252384K614107l72278j241647J595215L047144
35738A0901350M23806j834050l75561R80302j417506l872731j895235J335230
35730D245605M00822k563813j609206K218958K452031j391835k654851J234220
$$ y = [6925764, 6384648, 6100140, 6107566, 7179048, 9657995, 11580328, 10428205, 7273669, 6374759, 9104347, 11111340, 8200968, 2638945, -39025, 1150373, 2316077, 1453370, 774492, 1830245, 2913817, 2785788, 2956330, 4345673, 5241533, 4692852, 4579858, 5930937, 6405169, 4268045, 1996252, 2685298, 5148327, 5942806, 4567212, 3377371, 3541219, 4088356, 4214999, 4079678, 3982503, 4500677, 6240907, 8021167, 7331902, 4374386, 3006425, 5258809, 7872916, 7500638, 6258991, 7854206, 10901350, 11325156, 9491106, 9115545, 10095847, 8678341, 4805610, 2910375, 4245605, 4646427, 2082614, 473408, 2692366, 5144397, 3752562, 1097711, 2331931]
35722B331931M358211J838567k784812l467627j34372K796933L060387J877840
35714I877058P09480j3142k5180L98728j2379j729071k977475j871631O12006
35705D968394J596186J51832j447758q54980J191364J999326P29822n53711j81656
35696G598819M79949o02409k354664j875673Q02508K329907J036534q04050j009784
35687E601137o57113j170843j211767O58037K520749J612401j225376k764810
35679C362415j985766n31706M48022J027616R36826J10029n147J487633K501654
35670G351576P33306k014633j882007J077613K804629J314886q97068j272628
35662G215674m48954R9380M88337R52664O27258n87412j163702l95662L01983
$$ y = [2331931, 6690142, 8528709, 5743897, 2276270, 2141898, 4938831, 7999218, 9877058, 10586538, 10573396, 10548216, 10946944, 10934565, 9205494, 6228019, 4356388, 4968394, 6564580, 6716412, 5268654, 4413674, 5605038, 7604364, 8334186, 7780475, 7598819, 8078768, 7476359, 5121695, 3246022, 4048530, 6378437, 7414971, 6610921, 5601137, 4944024, 3773181, 2561414, 3219451, 5740200, 7352601, 6127225, 3362415, 1376649, 844943, 1292965, 2320581, 3257407, 3367436, 3362289, 4849922, 7351576, 8084882, 6070249, 4188242, 5265855, 8070484, 9385370, 8488302, 7215674, 6766720, 6866100, 7354437, 8307101, 8934359, 8346947, 7183245, 6787583, 7089566]
35653G089566j77493r01287q60421o58707q58593n94882N85746J294399M70293
35644E388621n57462r5329J034293P07624j081089k044838q39757J132706J641948
35635E286717L87916q66836p00418J52247N720j103173j337891r9575O51408m55162
35625A920953j477740j770K553438K594836j38207k134603j447828m565L26657
35616B191171M87824J388554J549409j1074j185224P6571J998406J422791j238574
35607F679854k548721r76720J459725K380679J515196j49096j622304j955510
35599D783103p59452P79726P16648j250832l083731k568625K75551L065615L120209
35590E078212P9833l207019l219845J83721L254201K831447J53350j312038p07598
$$ y = [7089566, 6912073, 6010786, 5150365, 4491658, 3633065, 3038183, 3623929, 4918328, 5388621, 4831159, 4735830, 5770123, 6477747, 5396658, 3351820, 2512063, 3644769, 5286717, 5674633, 4807797, 4107379, 4259626, 4265346, 3162173, 1824282, 1724707, 2376115, 1920953, 443213, 441443, 2994881, 5589717, 5451510, 3316907, 1869079, 1864514, 2191171, 2678995, 4067549, 5616958, 5605884, 4420660, 4497231, 6495637, 7918428, 6679854, 4131133, 3154413, 4614138, 6994817, 8510013, 8360917, 6738613, 4783103, 4023651, 4803377, 5520025, 4269193, 1185462, -1383163, -1107612, 1958003, 5078212, 5158045, 1951026, -1268819, -1085098, 2169103, 5000550, 5153900, 3841862, 3134264]
35581C134264j73816q09144r50955P10039K496231J861595r50691k977112k047419
35572B92992Q36615K770806K052842j95903j429365n75913Q54806Q90585k66896
35563E230569p38125J16895P37186j40648j387990j136163L13768Q63944k43429
35554C616007j341102r03966K82609N91979O4435m9176M28689N68564L88388R14490
35544D560917J825987J255247r34863j848497M46731L319345K721308r72803l408098
35535F965274k456712o53035n45639r02349L87430K196163J835643n23176k039069
35526D264530j389434j84130l7815m68306l60542J93239M12903Q8499m32437p86577
35516A299930o48115J22795J069624J464616J195006P04152R0218q39734j582088
$$ y = [3134264, 2960448, 2151304, 1200349, 1910388, 4406619, 6268214, 5317523, 2340411, 292992, 1129607, 3900413, 5953255, 5757352, 4327987, 3752074, 4606880, 5497465, 5230569, 4492444, 4609339, 5346525, 5205877, 3817887, 2681724, 2995492, 3859436, 3616007, 2274905, 1370939, 1653548, 2245527, 2309962, 2260786, 2689475, 3258039, 3646427, 4560917, 6386904, 7642151, 6707288, 4858791, 5305522, 8624867, 11346175, 10373372, 6965274, 4508562, 3855527, 3309888, 2407539, 2794969, 4991132, 6826775, 6303599, 4264530, 2875096, 2690966, 2653151, 2184845, 1824303, 2017542, 2430445, 2518944, 2086507, 1299930, 651815, 774610, 1844234, 3308850, 4503856, 5208008, 5298226, 4458492, 2876404]
35507B876404j153652L43310J491419J460767J053705J072924P64553q54467k876455
35498D178508l279759j664026K52610J057408J160024J322608J029155m50232
35490C606296k139006k070105k720J902557J756228L68377L4829J334153K318915
35481G109524J164161j314543k583739j502969L45844O81634o92898j728300p08657
35472G70057J556965K566071J020894j640406k887735j876286k1081J026717J141715
35463A656911J151896J305540J144612N50419m8545n16471j109457j498540p19545
35454A916820J240735K676302K013823o1993j464487j411453r83162r78177p51586
35445B196822K03922R38249M83252l41457N829J371174J996460R79964o72709
$$ y = [2876404, 1722752, 2066062, 3557481, 5018248, 6071953, 7144877, 7909430, 7054963, 4178508, 898749, -765277, -512667, 544741, 1704765, 3027373, 4056528, 3606296, 1467290, -602815, -605535, 1297022, 3053250, 3421627, 3456456, 4790609, 7109524, 8273685, 6959142, 4375403, 2872434, 3218278, 3899912, 3207014, 1478714, 770057, 2327022, 4893093, 5913987, 4273581, 1385846, -490440, -511521, 515196, 1656911, 2808807, 4114347, 5258959, 5809378, 5760833, 5244362, 4134905, 2636365, 1916820, 3157555, 5833857, 7847680, 7785687, 6321200, 4909747, 3926585, 2948408, 2196822, 2400744, 3338993, 3822245, 3480788, 3486617, 4857791, 6854251, 7834215, 7161506]
35436G161506j658823j811888j494259p21392L24458P90724J75428o51830m91944
35427A621980L44032L51972q47594j624102m86638J658224K530753J511819L08669
35418E369115K35776K60596j068889k815440k619765j95851K087383K411112J428868
35409E092905M00650n85304j433167j094008N15975J387919K44556j065820l95462
35400C068244R48557L19372j445360j040416J600296K607094J47733k590636k210836
35391A404048J55085J203808K04143j062320j404516r37360J16263J336889J729601
35382B745641R69321N7144l58689q44060j298214l45526J752820J999163j041508
35373C636092l984288k793274J355810L770668K712333N85614o89870j587765
$$ y = [7161506, 5502683, 3690795, 2196536, 1475144, 1799602, 2590326, 2765754, 2113924, 1621980, 1966012, 2317984, 1470390, -153712, -640350, 1017874, 3548627, 5060446, 5369115, 5604891, 5865487, 4796598, 1981158, -638607, -834458, 1252925, 3664037, 5092905, 5493555, 4908251, 3475084, 2381076, 2897051, 4284970, 4529526, 3463706, 3068244, 4016801, 4336173, 2890813, 1850397, 3450693, 6057787, 6205520, 3614884, 1404048, 1559133, 2762941, 2967084, 1904764, 500248, -437112, -320849, 1016040, 2745641, 3714962, 3772106, 3413417, 2569357, 1271143, 925617, 2678437, 4677600, 3636092, -348196, -3141470, -1785660, 1985008, 4697341, 5282955, 4593085, 3005320]
35365C005320k082829p40969K115364L504141J723386j068959j765554q5939J837057
35356F441018K183055O51170j771925l254331k389206J63834K120818K048198
35348F192631N34621j085187j893391j294273O17455K301461J966846m4193j499653
35339E796317j231623l43012j58427o29392j236538j784557j691014j58584K168497
35330G31667L248425K153754J81980j154345j691345j502995q8132K113369L001689
35321F994067J237589j585224k658936j294650O11928J041929j58338j561164
35313B627201j825028j057523m77156n62790k39094J266037K664093K280544P85576
35304E461860J72252M22066k80184j977128k463604j057822N2354m96163r47381
$$ y = [3005320, 922491, 181522, 2296886, 5801027, 7524413, 6455454, 4689900, 4603961, 6441018, 8624073, 9275243, 7503318, 4248987, 1859781, 2023615, 4144433, 6192631, 6727252, 5642065, 3748674, 2454401, 3071856, 5373317, 7340163, 7295970, 5796317, 4564694, 4221682, 4063255, 3433863, 2197325, 412768, -1278246, -1436830, 731667, 3980092, 6133846, 6315826, 5161481, 3470136, 1967141, 1879009, 3992378, 6994067, 8231656, 6646432, 3987496, 2692846, 3304774, 4346703, 4188365, 2627201, 802173, -255350, -732506, -1295296, -1534390, -268353, 2395740, 4676284, 5461860, 5634112, 6056178, 5775994, 3798866, 1335262, 277440, 329794, -166369, -1113750]
35295a113750L62572J920592J454773l77135j145660k89438O65944P47392M07887
35286B633177K36637L53957O96534Q53004L14535l38305K51982J799302J983709
35277H784532q2222j851159q64597J362658J564569l75191j715489j445656j340854
35268D036591k171607k031936K49665K515500K086066k85776j394975J6144J866543
35259D886215K028059J157872R84701J070691m65071l133419l713970j006500
35251A808578J523384L24208k821368l233879j95886K408955K184152R31415N53182
35242C482741K67846n37582m04359J135947J902804P60312j87104M93860P86621
35233G701086p78612j808648l20959J002901p37731k906029j319040K165192K076347
$$ y = [-1113750, -751178, 1169414, 2624187, 2247052, 1101392, 811954, 1477898, 2225290, 2633177, 2869814, 3223771, 3920305, 4773309, 5087844, 4749539, 5001521, 6800823, 8784532, 8702310, 6851151, 5986554, 7349212, 8913781, 8538590, 6823101, 5377445, 4036591, 1864984, -166952, 82713, 2598213, 4684279, 4398503, 3003528, 3019672, 4886215, 6914274, 8072146, 9056847, 10127538, 9662467, 6529048, 2815078, 1808578, 3331962, 3656170, 834802, -2399077, -2594963, -186008, 1998144, 2929559, 3482741, 3750587, 3213005, 2808646, 3944593, 5847397, 6607709, 6420605, 6914465, 7701086, 6922474, 5113826, 4792867, 5795768, 5058037, 2152008, 832968, 2998160, 5074507]
35224E074507j650327l405677r36190J557659Q73180l71877R05154K800080J895269
35215F741778j078014k623836j501227O35443K175931K587017J552406o83772
35207G805726k619558k722021j093819Q25536J640523P99708r51330j744598n16000
35198A424167J208399J083874n53096j103737J98909J181199L99492p35570o85385
35189B418252j41787j58259j82737L59067N38378k80129r63117o02528j13088
35180H74052j71887L24828J756539J994193k79172k499322j611662J060826J875545
35171C323940O94211O57365K423810K880152M62833k108080k141632p81639k84228
35162E126732k40130P15068J529112L64666j582449j363365R09127J948795N01175
$$ y = [5074507, 3424180, 18503, -917687, 639972, 1513152, 1141275, 2046429, 4846509, 6741778, 5663764, 3039928, 1538701, 2174144, 4350075, 6937092, 8489498, 7805726, 5186168, 2464147, 1370328, 2195864, 3836387, 4636095, 3684765, 1940167, 1424167, 2632566, 3716440, 3163344, 2059607, 2258516, 3439715, 3839207, 3103637, 2418252, 2276465, 2118206, 1935469, 2294536, 2832914, 2552785, 1589668, 987140, 874052, 702165, 1026993, 2783532, 4777725, 4498553, 1999231, 387569, 1448395, 3323940, 4018151, 4675516, 7099326, 9979478, 10442311, 8334231, 6192599, 5410960, 5126732, 4886602, 5601670, 7130782, 7495448, 5912999, 4549634, 5458761, 7407556, 7908731]
35153G908731p10243L49846J555765K55253k101528k235407m07989K26981r12001
35144C929408j047521P46037J580202k94215k142425r77424J675853K356797Q94147
35135F720859l08036o43719j336412k025189j069255R53278J589102N36495j5715
35126D401408N58914L67327j138188j790392n05181P83003O56002O04782J762151
35117E699826K107172k74040l293793l350259m65364J971352J954804P55071K39926
35108E344695N81598R45122Q36483K85781m29087j013601j448120j772451j509327
35099A821093k13414J220508J220746N3292n6472J645832K713343Q56326k455302
35090F805952l773579k115138L46862J420258Q81793k88009r79152m39458R75638
$$ y = [7908731, 7198488, 7548334, 9104099, 9359352, 7257824, 5022417, 4614428, 4841409, 3929408, 2881887, 3627924, 5208126, 4913911, 2771486, 1794062, 3469915, 5826712, 6720859, 6412823, 5769104, 4432692, 2407503, 1338248, 2291526, 3880628, 4417123, 4401408, 4960322, 5327649, 4189461, 2399069, 1893888, 2676891, 3332893, 3937675, 5699826, 7806998, 7532958, 4239165, 888906, 423542, 2394894, 4349698, 5104769, 5344695, 5926293, 6871415, 7707898, 7993679, 7564592, 6550991, 5102871, 3330420, 1821093, 1607679, 2828187, 4048933, 4102225, 4045753, 5691585, 8404928, 9261254, 6805952, 3032373, 917235, 1264097, 2684355, 3566148, 3278139, 2298987, 1859529, 2835167]
35081B835167J790602J206602L18292M02857Q63292L59725q42742j424376j255276
35072D254143j154081q76651M93695K234342K280957K58000j693876j757251n16692
35063C522586M42723N45425Q8928n84100r15186k30704J094837J513641K88432
35054E766582j180735j080860K90305R29171k5852j042529l32737J531250K134032
35045F988627L08860k271212l151748j991340m19423M89973J151480J838146J776097
35036D719460O19250n19044n78182p3428J6048m7037N08113J240080J026368m563
35026F907065m99295J81402J204793J475169O58962q97347k324812k461335r78152
35017C266450P56194R63106l59712j514767j386678n55396P7521O35163J616860
$$ y = [2835167, 4625769, 5832371, 6150663, 6553520, 7416812, 7776537, 6933795, 5509419, 4254143, 3100062, 2223411, 2717106, 4951448, 7232405, 7490405, 5796529, 4039278, 3522586, 3965309, 4510734, 4599662, 4015562, 3100376, 2869672, 3964509, 5478150, 5766582, 4585847, 3504987, 3795292, 4724463, 4698611, 3656082, 3323345, 4854595, 6988627, 7297487, 5026275, 1874527, -116813, -536236, -46263, 1105217, 2943363, 4719460, 5338710, 4819666, 4241484, 4168056, 4184104, 4137067, 4645180, 5885260, 6911628, 6907065, 6407770, 6589172, 7793965, 9269134, 9928096, 9030749, 6705937, 4244602, 3266450, 4022644, 4985750, 4626038, 3111271, 1724593, 1169197, 1246718, 1881881, 3498741]
35008C498741K649711K637628R97403j548424l320586k938929o69603J501119
35000B807060J690118J76353q41220J89864K264150K956475J340799q63958j459757
34991H259884n79422l24830j533409k310872q05948J724183K394783O98395j037886
34982F484878j217040p79735q49562p76078J99931J107942O91031n35286j194651
34973C131430j061962p53296k71512O89695J598507J537266M17836j107091k351100
34964A829773k603656j438380K73739Q85169L11734L71372J791104K641231J214921
34955E277007j220742k291769j621099l25335R70662J730546R09043j031575j356917
34946A039821J133738L436115K464906p1439n41862N87570K036k270095k846980
$$ y = [3498741, 6148452, 8786080, 9783483, 8235059, 4914473, 1975544, 1305941, 2807060, 4497178, 4673531, 3832311, 4022175, 6286325, 9242800, 10583599, 9719641, 8259884, 7680462, 7355632, 5822223, 3511351, 2705403, 4429586, 6824369, 7522764, 6484878, 5267838, 4488103, 3638541, 2862463, 3062394, 4170336, 4861367, 4326081, 3131430, 2069468, 1316172, 1044660, 1734355, 3332862, 4870128, 5287964, 4180873, 1829773, -773883, -2212263, -1938524, -1053355, -741621, -370249, 1420855, 4062086, 5277007, 4056265, 1764496, 143397, -181938, 788724, 2519270, 3428313, 2396738, 1039821, 2173559, 5609674, 8074580, 8003141, 7461279, 8048849, 8050885, 5780790, 2933810]
34937B933810j051668M338q79624r76906J243870L271529K707443O20847j024647
34928F848992j895799j680622M16810K839268K150570j550536l547403j301156
34920B280124J587957J171779r95713j412601m25466k79847m70236M61258J137439
34911C054694K4647n74871J732216L968467J827210k511038l021462M54240J959792
34902F913895p56111l129626k053088m69589r40361r56362J409112K718259p1683
34893B664446l500036k675313Q51931J914446P6945o28163R88111J945671Q73210
34884B511248j03618K25041M25958p1890J10345R42914N24563r33205p03752J430560
34874D358164J921622o96126k813393j453464Q48104N01858j133974o42483J117948
$$ y = [2933810, 1882142, 1886480, 1006856, 29950, 1273820, 4545349, 7252792, 7873639, 6848992, 4953193, 3272571, 3689381, 6528649, 8679219, 7128683, 3581280, 2280124, 3868081, 5039860, 4044147, 2631546, 2206080, 1926233, 1455997, 1917255, 3054694, 3079341, 2504470, 4236686, 8205153, 10032363, 7521325, 4499863, 4954103, 6913895, 6157784, 3028158, 975070, 505481, -434880, -1391242, 17870, 2736129, 2664446, -835590, -3510903, -2658972, -744526, -667581, -1295744, -307633, 1638038, 2511248, 2407630, 2632671, 3058629, 2986739, 3097084, 4039998, 4564561, 3631356, 2927604, 4358164, 6279786, 5583660, 2770267, 1316803, 2164907, 2666765, 1532791, 890308, 2008256]
34865B008256O92709j395057j222210J531554K535508j26679k666461j466306
34857a08686J698278K940523J709836J73869n13184n74046P182R16618P21342
34848F971732j079546k538534j909908l52501K38815M33233J561846K372705P94319
34839F492161j878355k274221k18592J007822L7808p34784K70220J104518P5013
34830C881590j006258k9899J438832N59948j942235k649895o31002J322051R43373
34821A886505o03278j012310n3953Q89153J252848J589056J822320Q75875j392626
34812E253590l058626k169753M83399K031287J127555n46543r67288l91198j04987
34803A657436n1071M69422Q43173J04293q81400n92889K85329j28059j292776
$$ y = [2008256, 2700965, 1305908, 83698, 1615252, 4150760, 4024081, 1357620, -108686, 1589592, 4530115, 6239951, 6413820, 5900636, 5326590, 5333772, 6250390, 6971732, 5892186, 3353652, 1443744, 1091243, 1330058, 1763291, 3325137, 5697842, 6492161, 4613806, 2339585, 2120993, 3128815, 3166623, 2431839, 2702059, 3806577, 3881590, 2875332, 2845433, 4284265, 4844213, 2901978, 252083, -378919, 943132, 1886505, 1283227, 270917, 216964, 1106117, 2358965, 3948021, 5770341, 6646216, 5253590, 2194964, 25211, 508610, 2539897, 3667452, 3120909, 2153621, 1762423, 1657436, 1606365, 2075787, 2918960, 3023253, 2141853, 1548964, 1834293, 1706234, 413458]
34794D13458p70780J363400K090690L86288r56847q0216R23967J32797n40265
34785B962492Q94104K116344J00497l095964k983515R1568J463236k15187j127475
34776B06100Q60842K610077J283722q71194o23786P77914J93135j706793j681729
34767A048288K44393O21396j571381k949487r53841K176241K803016J016503k08746
34758B226382K76617P26774j90n36508L82543J395202M59241j668968k109828
34749A151265q1837J688529Q02272j299679j475180N09018J853630J073094p6008
34740D145104J35081N82364m06522j664362p41961J829146K698638N28924j912038
34731E194374j688667L64099J377854N70559m95237q36780r13798q53536r3307
$$ y = [413458, -357322, 1006078, 3096768, 3483056, 2526209, 2445993, 3369960, 3502757, 2962492, 3856596, 5972940, 6073437, 2977473, -6042, 85526, 1548762, 1333575, 206100, 1066942, 3677019, 4960741, 4089547, 3465761, 4243675, 4436810, 2730017, 1048288, 1292681, 1914077, 342696, -2606791, -3560632, -1384391, 1418625, 2435128, 2226382, 2502999, 3229773, 3229583, 2693075, 3075618, 4470820, 4930061, 3261093, 1151265, 1069428, 2757957, 3560229, 2260550, 785370, 1294388, 3148018, 4221112, 4145104, 4280185, 4862549, 4456027, 2791665, 2049704, 3878850, 6577488, 7106412, 5194374, 3505707, 3869806, 5247660, 5818219, 5322982, 4486202, 3572404, 2718868, 2625561]
34722B625561R32439Q10987n12080j231859l29373R62341J272975R79294P72531
34713F282816L9012j678142l003252k421472o16646P34585J470657K204433K154994
34704E166985L18960j841881j808118r267N63145r04952j788809m20649J296056
34695E71470J235929L13900L47194Q79412M95650l50758k39890O28902R61679
34686D843488N85862J47142n05263j605850k016865o87496J070566J034764n92228
34677B274120j546896r76209k26032j32516R8946Q74455J276100Q82854O01146
34668C125968Q17013M84577q96556j949926j326749K15971Q92104K47603o14270
34659I95735n76312N34444J958400K375230J009454j050262j588925j08807J127767
$$ y = [2625561, 3558000, 4368987, 3856907, 2625048, 2295675, 3258016, 4530991, 5510285, 6282816, 6321828, 4643686, 1640434, -781038, -1397684, -663099, 807558, 3011991, 5166985, 5485945, 3644064, 1835946, 1826679, 2389824, 1484872, -303937, -724586, 571470, 1807399, 2121299, 2468493, 3347905, 3843555, 3492797, 3252907, 3881809, 4843488, 5429350, 5576492, 5071229, 3465379, 1448514, 761018, 1831584, 2866348, 2274120, 727224, -248985, -475017, -607533, -508587, 365868, 1641968, 2524822, 3125968, 3942981, 4427558, 3531002, 1581076, 254327, 470298, 1362402, 1610005, 995735, 419423, 953867, 2912267, 5287497, 6296951, 5246689, 3657764, 3548957, 4676724]
34650D676724N3328k183783k755065j106230N64957P79541O47490J493604K454551
34641D625117J957844M01393m97746m71716q38856j861867k018579o05152P61159
34632A451597M65531p13393r98897k27804N78376J210532J896168J796132K08516
34623E666758j275002n17141J379259J093288j609328k931946p90543J777693
34615B793038J299403q37154r24725J184712K353469J349926J47217Q9798R3743
34606G549427o55581j063468l86385J13487p00403j647035q75927J124921J839310
34597E298346Q5999k142695j997313M35332J837708r8667l186858l313349j07251
34588c188748K511730J988752L77809K99289O66762o17809k096621q60456J990418
$$ y = [4676724, 4730052, 2546269, -208796, -1315026, -750069, 29472, 676962, 2170566, 4625117, 6582961, 6984354, 6486608, 6014892, 5176036, 3314169, 1295590, 690438, 1451597, 1917128, 1203735, 204838, -22966, 555410, 1765942, 3662110, 5458242, 5666758, 4391756, 3874615, 5253874, 6347162, 4737834, 1805888, 1015345, 2793038, 4092441, 3255287, 2330562, 3515274, 5868743, 7218669, 7365886, 7455684, 7549427, 6893846, 5830378, 5443993, 5557480, 4857077, 3210042, 2334115, 3459036, 5298346, 5384345, 3241650, 1244337, 1679669, 3517377, 3418710, 231852, -3081497, -3188748, -677018, 1311734, 1689543, 1988832, 2655594, 2037785, -58836, -919292, 1071126]
34579A071126K336154m96356k438679q97382J447168R96700j468791k357820m72187
34570b280067J790584J916769J79606j152591o78599N98794Q63925K27351M71274
34561A937046J711498J567958p71455k194272k85350J933372Q4351m108518m578341
34552d703711r1639L731414K821195p0847p62641L88483R72178R73410J192764
34543D450606N21467j515083k322112j49434K066653Q00749k275791k905253r33959
34534b262157J92283m69494n34456P15794J155221J12549l52003N83158J029655
34525A70550J57494o439J765898L350508K342091m76078k539148k706257j533664
34516E24955J73925J610935J889632R60290j46915o84430q88973r57856n73468
$$ y = [1071126, 3407280, 2910924, 472245, -425137, 1022031, 2018731, 549940, -1807880, -2280067, -489483, 1427286, 1606892, 454301, -224298, 374496, 1238421, 1465772, 1937046, 3648544, 5216502, 4445047, 2250775, 1965425, 3898797, 3983148, -125370, -4703711, -4795350, -1063936, 1757259, 1686412, 923771, 1312254, 2284432, 3257842, 4450606, 4972073, 3456990, 1134878, 985444, 3052097, 3852846, 1577055, -1328198, -2262157, -2069874, -2539368, -3073824, -2358030, -1202809, -1090260, -1442263, -859105, 170550, 328044, 321605, 2087503, 5438011, 7780102, 7304024, 4764876, 2058619, 524955, 698880, 2309815, 4199447, 5159737, 5012822, 4328392, 3439419, 2481563, 1908095]
34507A908095R8852K70729r1278n4979O41064J115827R57610Q09106Q51537L55473
34497F862036o30167r28354l98702n19144j629423j618574Q37902L433149K943179
34488H351902k16011k536398k121533n68599m2111n38922p39880p3068R45656
34479B461036J521704J078938l64471j829852k021745q02781N25412Q29178M36810
34470A834229L06806N30019N06984K41409L50603P00459J79648j547382k973275
34461A29500k425291k77452J604445K253679K119174J405415k87935k206179k271869
34452D3487J3637K050185J332335r01961j349995N81227K079943J185278o17048
34443D417088j002658j07760K72044l97547r20086m31911M17249N21840k01615
$$ y = [1908095, 2006947, 2277676, 2186398, 2131419, 2772483, 3888310, 4845920, 5655026, 6506563, 6862036, 6231869, 5303515, 4904813, 4385669, 2756246, 1137672, 1975574, 5408723, 8351902, 8135891, 5599493, 3477960, 2909361, 2867250, 2328328, 1588448, 1515380, 2461036, 3982740, 5061678, 4697207, 2867355, 845610, 42829, 568241, 1397419, 1834229, 2141035, 2671054, 3178038, 3419447, 3770050, 4470509, 4650157, 3102775, 129500, -2295791, -2573243, -968798, 1284881, 3404055, 4809470, 4521535, 2315356, 43487, 57124, 2107309, 3439644, 2537683, 1187688, 1768915, 3848858, 5034136, 4417088, 3414430, 3306670, 3578714, 3181167, 2261081, 1829170, 2246419, 2768259, 2566644]
34434B566644p24662j41254J127987J625286O59023n59304l50993J068311J755743
34425G026781O90286r41765j550190j056034k94666L79951Q65042N81831p31213
34416D970023j990578j799959l26235R19602J011456K96753o16934j331104j175606
34407d2582L00063K036937K083592J40105j797432k105857j470266j062735l54222
34398b272397J362522K510866J002266j884698k429348J27218K104296P63725
34390A284450j648084j591578L85175J146080L15885L69468J798798K030501j32268
34381C958427k327672k237725o67813M88954J002757J344514J060807j7863o31164
34372A973222L8208P94245L71275n29373p68722p50330j095145r54855L63808
$$ y = [2566644, 1841982, 1700728, 2828715, 4454001, 5113024, 4553720, 4202727, 5271038, 7026781, 7717067, 6775302, 5225112, 4169078, 3874412, 4254363, 5119405, 5701236, 4970023, 2979445, 1179486, 853251, 1772853, 2784309, 3081062, 2464128, 1133024, -42582, 257481, 2294418, 4378010, 4518115, 2720683, 614826, -855440, -1918175, -2272397, -909875, 1600991, 2603257, 718559, -1710789, -1583571, 520725, 1284450, -363634, -1955212, -1570037, -423957, -108072, 261396, 2060194, 4090695, 3958427, 1630755, -606970, -1274783, -785829, 216928, 1561442, 2622249, 2604386, 1973222, 2011430, 2805675, 3176950, 2647577, 1878855, 1128525, 33380, -921475, -557667]
34363e57667J637950J687499J502180K130947K183433J91564k158556k359220
34355D258130j264598j353567j960958m21139K559703L247702R28609r07989m11939
34346D673954L1533j315719k301942q80812J306728J989754J702072J461446J72010
34337F839024k527457l759050j444051J525008J144519j495950k095720O2427
34329a751250J714674J468341J386357K307366K044712l51068k323451j750127
34321B745554r5601M99940O37382J670287K420899Q63973k027515l076528j372635
34312B265756N78913O11498l33499k17326Q98239J230763J57328r66209j023677
34303C201786p07250j040282j457763p65751N84329R62639K87161K80123J399582
$$ y = [-557667, 1080283, 2767782, 4269962, 6400909, 8584342, 8775906, 6617350, 4258130, 2993532, 1639965, -320993, -742132, 1817571, 5065273, 5993882, 5085893, 4673954, 4705487, 3389768, 1087826, 207014, 1513742, 3503496, 5205568, 6667014, 6839024, 4311567, 552517, -891534, 633474, 1777993, 282043, -1813677, -1751250, -36576, 1431765, 2818122, 5125488, 7170200, 6819132, 4495681, 2745554, 2649953, 3149893, 3787275, 5457562, 7878461, 8742434, 6714919, 3638391, 2265756, 2844669, 3456167, 3122668, 2905342, 3803581, 5034344, 5191672, 4225463, 3201786, 2494536, 1454254, -3509, -769260, -184931, 777708, 1064869, 1344992, 2744574]
34294B744574J672068j1848j473729l90102J653355J221983j529995k841006j086122
34285d0822Q41747K44820j326754j027705O05013R12041k56517l80035J499621
34276A071409L296150L089766J358296p25938k854056m256219l138823N53881
34268a605534L500073K599634o67260k016428j65155J807584J261907n12711q42966
34259C359144M55463J530496J352629K55129j363027k965477l166753j051658
34251a594054J972010L333738K312348M71280p33898j172720r55289j2657Q75040
34242D495798M17663j114320j706320l57209J336123J389623J20751n56335J81878
34233D207652J214666J058627m38663j943599j967789n27702P55836P14425K07214
$$ y = [2744574, 4416642, 4404794, 2931065, 2540963, 4194318, 5416301, 3886306, 1045300, -40822, 800925, 1045745, -281009, -1308714, -703701, 208340, -48177, -428212, 1071409, 4367559, 7457325, 8815621, 8089683, 5235627, 979408, -2159415, -1605534, 1894539, 4494173, 3826913, 1810485, 1645330, 3452914, 4714821, 4202110, 3359144, 3814607, 5345103, 6697732, 6952861, 5589834, 2624357, -542396, -1594054, 377956, 3711694, 6024042, 6495322, 5761424, 4588704, 3633415, 3620758, 4495798, 4913461, 3799141, 2092821, 1735612, 3071735, 4461358, 4582109, 4025774, 4207652, 5422318, 6480945, 6042282, 4098683, 2130894, 1603192, 2359028, 3073453, 3280667]
34224C280667N69182J175382M08857j218067j318077N33878J705353L75107j762040
34215C750242k183466r20592M92466J529783K058991J032256j634211l298449
34207H27020j653797J357533J830986l42340j417883K47221J777605O35091j364312
34198A897124j244827K98709L13391j352228j671291P15385L151708K738415L89232
34189E235618q34867k40827R8036p34703r28141N81215J537339l57071l183519
34180A173080k985480K72918K362585J003922r68643l06597J769049J944552n0142
34171D215244j634800j492615o53186r3614J62919j26560j133682j662663m02556
34162b821513J572778J800296O9754j144404k90649J329155J880992J309528M52990
$$ y = [3280667, 3849849, 5025231, 5434088, 4216021, 2897944, 3431822, 5137175, 5512282, 3750242, 1566776, 646184, 1138650, 2668433, 4727424, 5759680, 4125469, 827020, -826777, 530756, 2361742, 2019402, 601519, 848740, 2626345, 3261436, 1897124, 652297, 951006, 1264397, -87831, -1759122, -1043737, 2107971, 4846386, 5235618, 4400751, 4159924, 4257960, 3523257, 2595116, 3176331, 4713670, 4356599, 1173080, -1812400, -1539482, 823103, 1827025, 858382, 551785, 2320834, 4265386, 4215244, 2580444, 1087829, 434643, 341029, 503948, 377388, -756294, -2418957, -2821513, -1248735, 551561, 621315, -523089, -813738, 515417, 2396409, 3705937, 4158927]
34153D158927m44003j230350j195537j25562Q35922M44089r73745j838277j097856
34144a466392O60658J727574R32046r55545j807169n62041J445494K216244J474412
34135C665281M18006k10077n74244p70616p03545o34268p07831l27775Q62425
34126A017356J893389J601503L25749p10582j019253o65128M76624J808743J667249
34117F395650k38707j525361o08690K44603j465366l438307j509560L134036M739586
34108E727884J492337j883158j591718J16155q9372j045838j75708J355791P85639
34099D692012j228877j835083p62476q2888j85869L55057J346081Q44012j337272
34090A804697k823023j901181N17913K475390K819801J475019n27224j322930
$$ y = [4158927, 3714924, 2484574, 1289037, 1163475, 1999397, 2443486, 1469741, -368536, -1466392, -805734, 921840, 1853886, 898341, -908828, -1470869, -25375, 2190869, 3665281, 4083287, 3873210, 3298966, 2528350, 1824805, 1190537, 482706, 154931, 1017356, 2910745, 4512248, 4837997, 4127415, 3108162, 2443034, 2919658, 4728401, 6395650, 6156943, 4631582, 4022892, 4267495, 2802129, -636178, -2145738, 988298, 5727884, 7220221, 5337063, 3745345, 3861500, 3772128, 2726290, 2550582, 3906373, 4692012, 3463135, 1628052, 865576, 782688, 596819, 951876, 2297957, 3141969, 1804697, -1018326, -2919507, -2401594, 73796, 2893597, 4368616, 3841392, 2518462]
34082B518462j2959J900882K146208M33117j609842k623541k295957p88009R49727
34073F18088J095045q68728k567544j496279J135392J780919l06890j966306p43195
34064c319498J794391K550561R30084j019416j395852j69144J252888J357306
34056A981320j13394j633111j239335J185337L474699L394626R27447j880474
34048F097115k977508k006141k46263Q55482R74756O27675l1501j271269k552584
34039e30238k430769m50263J781297K399657J482124M32635j61384p84029j461659
34030B77371j367142j51001J293260J765996J017862r7052n31765j18184L27027
34021B416372K03755O0199N74420J076615M91062m87196j58313R70726K17824
$$ y = [2518462, 2505503, 4406385, 6552593, 6985710, 5375868, 2752327, 456370, -331639, 618088, 1713133, 844405, -1723139, -3219418, -2084026, -303107, -609997, -2576303, -3319498, -1525107, 1025454, 1955538, 936122, -459730, -628874, 624014, 1981320, 1867926, 234815, -1004520, 180817, 3655516, 7050142, 7977589, 6097115, 3119607, 1113466, 867203, 1722685, 2697441, 3325116, 3293615, 2022346, -530238, -2961007, -3411270, -1629973, 769684, 2251808, 2684443, 2523059, 1739030, 277371, -1089771, -1240772, 52488, 1818484, 2836346, 2739294, 2207529, 2089345, 2416372, 2620127, 2680326, 3254746, 4331361, 4822423, 4335227, 4176914, 5147640, 5365464]
34012E365464k878113m691269k211374K207103L521727O03694k459676j706935
34004b249379K050773M444012K396391k510034n318792k893544K197954M428294
33996B545675K105006r03745j095007K5887n98667k274969k057737K07607J926815
33987a19135J916402J193260K30390j296729k321495j160632J392293K554147
33979B388501J340912n25139j410321j137339P3656J547682J568766m87300k163400
33970A196018j054580J000248M96771j778242j773229J046848K796680J627534
33962C558048J57693K37314K39618n84244o358K314534K592935j060288m511007
33953B938245l414848K90730J851404P53932n4652K69445J99807l53184k32694
$$ y = [5365464, 2487351, -2203918, -4415292, -2208189, 1313538, 1917232, -542444, -2249379, -198606, 4245406, 6641797, 4131763, -1187029, -4080573, -1882619, 2545675, 4650681, 3746936, 2651929, 2677816, 2079149, -195820, -2253557, -2045950, -119135, 1797267, 2990527, 3220917, 1924188, -397307, -1557939, -165646, 2388501, 3729413, 3204274, 1793953, 656614, 730270, 2277952, 3846718, 3359418, 1196018, 141438, 1141686, 1638457, -139785, -1913014, -866166, 1930514, 3558048, 3715741, 3953055, 4192673, 3608429, 3602071, 5916605, 8509540, 7449252, 2938245, -476603, -185873, 1665531, 2419463, 2364811, 2634256, 2834063, 2480879, 2248185]
33944B248185p0547j219252k355397q93798K542551M469374L247178N13686j786696
33935F695284k937207k382353j31885J852533J467999l60429r17713J16033N29586
33926C931848m64206j157804n69968J44064J52214K06528O47804N02871n35824
33917B857527j269328r19734o2631Q92543K170390L075175K179205j46610j557454
33908G219083j070930m58635j132372j811853r64066L24540O7719j266430j419340
33899e12284J34220J429421R19930n22707j095315m47378K21790k3355p25910
33890f21588q47832k04482M48308O37540P14201Q79694N39215n86904j392508
33881d34356n82715J322529K351348J499805k02248j189573j030520l54309J33160
$$ y = [2248185, 2177638, 958386, -1397011, -2290809, 251742, 4721116, 7968294, 8481980, 6695284, 3758077, 1375724, 1243839, 3096372, 4564371, 4203942, 3286229, 3402262, 3931848, 3467642, 2309838, 1739870, 1883934, 2036148, 2242676, 2890480, 3393351, 2857527, 1588199, 668465, 605834, 1498377, 3668767, 6743942, 8923147, 8776537, 7219083, 6148153, 5689518, 4557146, 2745293, 1781227, 2105767, 2173486, 907056, -512284, -378064, 1051357, 1971287, 1448580, 353265, -94113, 127677, 104322, -621588, -1469420, -1673902, -1225594, -588054, 126147, 1005841, 1545056, 958152, -434356, -1017071, 305458, 2656806, 4156611, 3954363, 2764790, 1734270, 1379961, 1513121]
33872A513121K21573K29228N93017J120255R03201m27930j670033j190778Q67921
33863B159575K430219J847491k08493j605459j164120J38689L64078j114877k761907
33854H5196k582377m64635J779720K585501J967913O95300o45191j360850p29635
33845A330942Q28549J697912J038949j09387m74945k40321j68473j52369J92234
33836C943091M04078j16211r34311j143279n06183O47055J813580K091591Q10302
33827G009713j034180j534292o94988n17496j465937j437087L58256J434444J19425
33818B237858j339133n73647Q46189N58037j68950P30307J435613o38689l115302
33809b7717j816267J612023J627649j903467l144039k6748K318761K96070k376931
$$ y = [1513121, 1734694, 1963922, 2556939, 3677194, 4580395, 4152465, 2482432, 1291654, 2159575, 4589794, 6437285, 6228792, 4623333, 3459213, 3597902, 3961980, 2847103, 85196, -2497181, -2961816, -1182096, 1403405, 3371318, 4066618, 3421427, 2060577, 1330942, 2159491, 3857403, 4896352, 4786965, 4312020, 4071699, 3903226, 3750857, 3943091, 4347169, 4230958, 3296647, 2153368, 1647185, 2294240, 4107820, 6199411, 7009713, 5975533, 4441241, 3746253, 3228757, 1762820, 325733, 683989, 2118433, 2237858, 898725, 325078, 1171267, 1729304, 1560354, 2290661, 3726274, 3087585, -27717, -1843984, -231961, 1395688, -507779, -3651818, -3678566, -1359805, -1063735, -3440666]
33800c440666j268609J744926K419332R06715O2025K07448n3227l00084L96338
33791F74198P56909m02556j162188N43257K817278K397848j62057j596145j016416
33782B850128l80773p63800j365475j488695p76510J414429M236984M555469J011641
33773I293398k797173k746711k01756L98254j416233k134739n85735O38821J92981
$$ y = [-3440666, -4709275, -2964349, -545017, 361698, 423723, 631171, 577944, 277860, 674198, 1431107, 1028551, -133637, 409620, 3226898, 5624746, 5462689, 3866544, 2850128, 2469355, 1705555, 340080, -1148615, -1925125, -510696, 3726288, 8281757, 9293398, 6496225, 3749514, 3547758, 3946012, 2529779, 395040, -190695, 448126, 641107]
$$ [...]
##END NTUPLES=NMR SPECTRUM
##END=
