##TITLE=31Pdec_MTBDE0807-28
 CDCl3, 124 sc
 9.07.2021
##JCAMPDX= 6.0         $$ Bruker NMR JCAMP-DX V2.0
##DATA TYPE= NMR SPECTRUM
##DATA CLASS= NTUPLES
##ORIGIN= UXNMR, Bruker Analytische Messtechnik GmbH
##OWNER= root
$$ XWIN-NMR		Version 3.5
$$ Fri Jul  9 09:06:12 2021 Russian Standard Time (UT+4h)  she@DPX200
##.OBSERVE FREQUENCY= 81.013821
##.OBSERVE NUCLEUS= ^31P
##.ACQUISITION MODE= SIMULTANEOUS
##.ACQUISITION SCHEME= undefined
##.AVERAGES= 124
##.DIGITISER RES= 16
##SPECTROMETER/DATA SYSTEM= spect
##.PULSE SEQUENCE= zgpg30
##.SOLVENT NAME= DMSO
##.SHIFT REFERENCE= (INTERNAL, DMSO, 0, 248.564)
##AUDIT TRAIL= $$ (NUMBER, WHEN, WHO, WHERE, WHAT)
$$ ##TITLE= Audit trail, XWIN-NMR		Version 3.5
$$ ##JCAMPDX= 5.01
$$ ##ORIGIN= Bruker BioSpin GmbH
$$ ##OWNER= she
$$ F:/spectra/data/she/nmr/P31/1/pdata/1/auditp.txt
$$ ##AUDIT TRAIL=  $$ (NUMBER, WHEN, WHO, WHERE, WHAT)
(   1,<2021-07-09 09:04:54.26 +0400>,<she>,<DPX200>,
      <continue with go, POWCHK disabled, PULCHK disabled
       configuration hash MD5:
       00 E9 B6 7A A2 85 ED C7 34 08 36 98 17 FE 4E 26
       data hash MD5: 32K
       71 7F 6F AD 4A FA A4 85 5C F8 35 87 89 7A 74 6E>)
(   2,<2021-07-09 09:04:58.71 +0400>,<she>,<DPX200>,
      <Start of raw data processing
       efp BC_mod = 2 LB = 1 FT_mod = 6 PKNL = 1 PHC0 = -9131.073 PHC1 = 3153.875 SI = 64K 
       data hash MD5: 64K
       4C 9B 2F 55 D1 99 2D 4D 68 6A 0B 74 08 2D 4C FD>)
(   3,<2021-07-09 09:05:33.18 +0400>,<she>,<DPX200>,
      <pk PHC0 = 121.4965 PHC1 = -205.8002 
       data hash MD5: 64K
       7C 82 6B F3 A1 B3 C5 1F ED 26 FF 13 CA 26 A6 E2>)
(   4,<2021-07-09 09:05:36.26 +0400>,<she>,<DPX200>,
      <abs ABSG = 5 
       data hash MD5: 64K
       85 EE 74 20 9E 25 8B B1 77 9A 12 BC 9F 47 AA F9>)
$$ ##END=
$$ 
$$ hash MD5
$$ 51 B4 D5 49 C2 ED FC 80 A3 41 4B 7C E9 02 6A 6B
##$RELAX= 
##$RELAX= 
##$RELAX= 
##$RELAX= 
##$RELAX= 
##$RELAX= 
##$RELAX= 
##$RELAX= 
$$ Bruker specific parameters
$$ --------------------------
##$DU= <F:/spectra>
##$EXPNO= 1
##$NAME= <P31>
##$PROCNO= 1
##$TYPE= <nmr>
##$USER= <she>
##$AMP= (0..31)
100 100 100 100 100 100 100 100 100 100 100 100 100 100 100 100 100 100 
100 100 100 100 100 100 100 100 100 100 100 100 100 100 
##$AQSEQ= 0
##$AQ_mod= 1
##$AUNM= <au_zg>
##$AUTOPOS= <>
##$BF1= 81.014009
##$BF2= 200.13
##$BF3= 200.13
##$BF4= 200.13
##$BF5= 200.13
##$BF6= 200.13
##$BF7= 200.13
##$BF8= 200.13
##$BYTORDA= 1
##$CFDGTYP= 0
##$CFRGTYP= 5
##$CHEMSTR= <none>
##$CNST= (0..31)
1 1 145 1 1 1 1 1 1 1 1 1 1 1 1 1 1 1 1 1 1 1 1 1 1 1 1 1 1 1 1 1 
##$CPDPRG= <waltz16>
##$CPDPRG1= <>
##$CPDPRG2= <waltz16>
##$CPDPRG3= <>
##$CPDPRG4= <mlev>
##$CPDPRG5= <mlev>
##$CPDPRG6= <mlev>
##$CPDPRG7= <mlev>
##$CPDPRG8= <mlev>
##$CPDPRGB= <>
##$CPDPRGT= <>
##$D= (0..31)
0 1 0 0 0 0 0 0 0 0 0 0.03 2e-05 3e-06 0 0 0 0 0 0 0 0 0 0 0 0 0 0 0 0 
0 0 
##$DATE= 1625806897
##$DBL= (0..7)
120 120 120 11 120 120 24 19 
##$DBP= (0..7)
150 150 150 150 150 150 150 150 
##$DBP07= 0
##$DBPNAM0= <>
##$DBPNAM1= <>
$$ [...]
##$SUBNAM3= <"">
##$SUBNAM4= <"">
##$SUBNAM5= <"">
##$SUBNAM6= <"">
##$SUBNAM7= <"">
##$SUBNAM8= <"">
##$SUBNAM9= <"">
##$SW= 501.771253377433
##$SWIBOX= (0..15)
0 1 3 0 0 0 0 0 0 0 0 0 0 0 0 0 
##$SW_h= 40650.406504065
##$TD= 32768
##$TD0= 1
##$TE= 0
##$TE2= 300
##$TE3= 300
##$TEG= 300
##$TL= (0..7)
0 120 53 12 22 120 120 120 
##$TP= (0..7)
150 150 150 150 150 150 150 150 
##$TP07= 0
##$TPNAME0= <>
##$TPNAME1= <>
##$TPNAME2= <>
##$TPNAME3= <>
##$TPNAME4= <>
##$TPNAME5= <>
##$TPNAME6= <>
##$TPNAME7= <>
##$TPOAL= (0..7)
0.5 0.5 0.5 0.5 0.5 0.5 0.5 0.5 
##$TPOFFS= (0..7)
0 0 0 0 0 0 0 0 
##$TUNHIN= 0
##$TUNHOUT= 0
##$TUNXOUT= 0
##$USERA1= <user>
##$USERA2= <user>
##$USERA3= <user>
##$USERA4= <user>
##$USERA5= <user>
##$V9= 5
##$VALIST= <valist>
##$VCLIST= <CCCCCCCCCCCCCCC>
##$VD= 0
##$VDLIST= <DDDDDDDDDDDDDDD>
##$VPLIST= <PPPPPPPPPPPPPPP>
##$VTLIST= <TTTTTTTTTTTTTTT>
##$WBST= 1024
##$WBSW= 4
##$XGAIN= (0..3)
0 0 0 0 
##$XL= 0
##$YL= 0
##$YMAX_a= 2658
##$YMIN_a= -5556
##$ZGOPTNS= <>
##$ZL1= 120
##$ZL2= 120
##$ZL3= 120
##$ZL4= 120
##$ABSF1= 248.5645
##$ABSF2= -253.2056
##$ABSG= 5
##$ABSL= 3
##$ALPHA= 0
##$AQORDER= 0
##$ASSFAC= 0
##$ASSFACI= 0
##$ASSFACX= 0
##$ASSWID= 0
##$AUNMP= <proc_1d>
##$AZFE= 0.1
##$AZFW= 0.5
##$BCFW= 0
##$BC_mod= 2
##$BYTORDP= 0
##$COROFFS= 0
##$CY= -3
##$DATMOD= 1
##$DC= 0
##$DFILT= <>
##$DTYPP= 0
##$F1P= 0
##$F2P= 0
##$FCOR= 1
##$FTSIZE= 65536
##$FT_mod= 6
##$GAMMA= 0
##$GB= 0
##$INTBC= 1
##$INTSCL= 5.30512e-09
##$ISEN= 30
##$LB= 1
##$LEV0= 0
##$LPBIN= 0
##$MAXI= 10000
##$MC2= 0
##$MEAN= 0
##$ME_mod= 0
##$MI= 50
##$NCOEF= 0
##$NC_proc= -7
##$NLEV= 6
##$NOISF1= 182.463
##$NOISF2= 159.3651
##$NSP= 0
##$NTH_PI= 0
##$NZP= 0
##$OFFSET= 248.5645
##$PC= 4
##$PHC0= -9009.577
##$PHC1= 2948.075
##$PH_mod= 1
##$PKNL= yes
##$PPARMOD= 0
##$PSCAL= 0
##$PSIGN= 0
##$REVERSE= no
##$SF= 81.014009
##$SI= 65536
##$SIGF1= 159.3651
##$SIGF2= -187.1042
##$SINO= 113.3802
##$SIOLD= 16384
##$SREGLST= <1H.CDCl3>
##$SSB= 0
##$STSI= 65536
##$STSR= 0
##$SW_p= 40650.406504065
##$SYMM= 0
##$S_DEV= 0
##$TDeff= 32768
##$TDoff= 0
##$TI= <>
##$TILT= no
##$TM1= 0
##$TM2= 0
##$TOPLEV= 0
##$USERP1= <user>
##$USERP2= <user>
##$USERP3= <user>
##$USERP4= <user>
##$USERP5= <user>
##$WDW= 1
##$XDIM= 65536
##$YMAX_p= 418687375
##$YMIN_p= -48864733
$$ End of Bruker specific parameters
$$ ---------------------------------
##NTUPLES= NMR SPECTRUM
##VAR_NAME=  FREQUENCY,     SPECTRUM/REAL,   SPECTRUM/IMAG
##SYMBOL=    X,             R,               I
##VAR_TYPE=  INDEPENDENT,   DEPENDENT,       DEPENDENT
##VAR_FORM=  AFFN,          ASDF,            ASDF
##VAR_DIM=   65536,         65536,           65536
##UNITS=     HZ,            ARBITRARY UNITS, ARBITRARY UNITS
##FACTOR=    0.620285442955139, 1,           1
##FIRST=     20137.2065510759, 0,            0
##LAST=      -20513.1999529892, 0,           0
##MIN=       -20513.1999529892, -48864733,   0
##MAX=       20137.2065510759, 418687375,    0
$$ Real data points
##PAGE= N=1
##DATA TABLE= (X++(R..R)), XYDATA
$$ [...]
15095 -268694 -1179000 -1698212 -1556655 -1409368 -360360 1940159 2579583 -1573588 -8770438
15086 -8770438 -13722433 -14063135 -12230745 -10488854 -7843091 -3681904 -803990 -1328603
15078 -1328603 -2095084 1289851 6807302 7610872 2150934 -2317714 774696 8131225
15070 8131225 10971905 6401812 7230 -2089750 545394 4763297 8159209 9669550
15062 9669550 8854333 6822234 5944508 6469545 4930225 -1475265 -9635550 -12715801 -8418293
15053 -8418293 -2492765 -1838564 -5639386 -6691373 -1776570 3199369 1214124 -5550854
15045 -5550854 -8131863 -2934377 3755188 4870862 1331449 -1394454 -1496096 -1241521
15037 -1241521 -1803493 -2425898 -3415460 -5497131 -6939177 -5516825 -2707482 -1643277 -1541164
15028 -1541164 882386 4653611 4958009 1259661 -1051002 546393 1135011 -3567131
15020 -3567131 -9543514 -9936223 -4756910 172408 1887543 2641935 4493619 6429192
15012 6429192 7238478 7413848 7304157 6144070 3801825 1537289 318371 -350771 -1567548
15003 -1567548 -3657169 -5445084 -4755044 -843074 3485531 4459120 2856200 3859988
14995 3859988 9371538 13712959 10553988 1890663 -4078942 -3028219 1521009 3956456
14987 3956456 2533121 -852248 -3671583 -4535747 -3863832 -3277844 -3224170 -1944911 1656821
14978 1656821 5469490 6653362 5287060 3158086 699038 -1850552 -2274373 521407
14970 521407 2833762 446865 -4367887 -5520156 -2399888 -419390 -1615853 -1417477
14962 -1417477 2850591 6661378 5470407 1873066 697884 1181986 -443121 -3613267
14954 -3613267 -4574003 -3114705 -2340848 -2391370 -150218 4159364 5459740 940886 -5416843
14945 -5416843 -8120683 -7024007 -5981398 -6688777 -7250345 -6256934 -4938849 -4265230 -2436200
14936 -2436200 2434820 8230494 10337582 7838956 5505309 7676203 12256829 13743571
14928 13743571 10831205 7149634 4832619 2055920 -1811796 -3454927 -1039924 1576973
14920 1576973 245006 -2817223 -2694406 -191789 -827181 -5746717 -9605368 -8893455 -6889269
14911 -6889269 -7538212 -9185720 -8496792 -6870000 -7594893 -8680775 -4636201 4367227 10774892
14902 10774892 9222679 3499748 1018419 3686464 7770272 10208468 10800771 9617017
14894 9617017 6859841 4974451 6329994 8397501 6008471 -313935 -3466974 -4426
14886 -4426 3763248 521874 -7126678 -10490486 -7211652 -3113569 -2171333 -1698652 898372
14877 898372 3053243 2168615 837666 2575920 5745394 6341846 4714493 4864058 7857852
14868 7857852 10185984 9018850 5747888 3325180 2493593 1904365 515354 -1317853
14860 -1317853 -2595708 -2828324 -2401409 -1818966 -919557 387738 898050 -746126 -3346202
14851 -3346202 -3666797 -907736 1303030 -611268 -5153854 -7626641 -6143531 -3087265
14843 -3087265 -761668 1502396 4888266 7989635 8115308 4963710 1362559 107608
14835 107608 1009250 1789216 1600786 2483695 6429559 11748251 14183125 12090460 8760865
14826 8760865 8170853 9535293 8141280 1703910 -5877978 -8207458 -3122429 5290319
14818 5290319 11050725 11266040 6588232 -1046429 -8875091 -12859241 -10605195 -5442112
14810 -5442112 -3839404 -6846278 -7871613 -2164237 5277972 6322190 1503959 -1292983
14802 -1292983 1020395 3159294 1087473 -1872466 -1509107 741792 1759420 2335714
14794 2335714 4251256 5574123 3595225 -272192 -2650689 -2773164 -1317481 2263848
14786 2263848 7187672 9344605 6680392 3630415 4742379 6572057 2465410 -6243958
14778 -6243958 -11142545 -8885475 -5264231 -5516457 -7087185 -5256547 -1085652 290304
14770 290304 -3221801 -8368398 -10324729 -7478067 -3425071 -3978434 -10256127 -15611857
14762 -15611857 -12584168 -2322517 6727286 9268123 7759051 6261802 5073883 3558539
14754 3558539 3439219 5744591 7664429 5975735 1717913 -1296449 -1192443 876421
14746 876421 2989364 3937994 3453525 2301867 1458757 889518 300704 567621 2175405
14737 2175405 2917775 567026 -2290439 -391177 6232716 10817425 8449566 2251488
14729 2251488 -1406670 -413025 2893057 5623406 5496265 1241445 -4769608 -6897414
14721 -6897414 -2750847 2732676 3141907 -1183780 -4164109 -1968812 3135031 6188098
14713 6188098 4426363 -366254 -2753846 1392247 9164289 12374831 7301747 -355592
14705 -355592 -3401957 -2634699 -3639900 -6771995 -6796130 -2246633 1268693 -864498 -5738161
14696 -5738161 -7499269 -5278088 -3184430 -3951962 -5764493 -5488047 -2847917 -249015
14688 -249015 619234 397761 81723 -637409 -1452856 279889 6074581 11924536 11678176
14679 11678176 5452256 270786 759953 3802331 4907197 4953038 6550035 8011991
14671 8011991 6196980 2313919 -458937 -2704720 -6579249 -9946197 -8718376 -3871677
14663 -3871677 -248723 743885 1250693 623144 -4164566 -11483613 -15383931 -14158311 -11909037
14654 -11909037 -10109433 -4981284 3779509 8963135 5351515 -2356505 -6147272 -4559902
14646 -4559902 -1168030 2010029 3898555 1452861 -5819439 -11266579 -8106681 473859
14638 473859 5021299 2701515 -618593 -1171815 -2319768 -6546415 -9659325 -7368516
14630 -7368516 -2328276 511726 1705677 4782808 8468833 7900640 3253254 880342
14622 880342 4042203 7636670 5464783 -924387 -4797435 -3490530 -609174 242239
14614 242239 -691860 -2390559 -5586179 -10016611 -12402649 -10125788 -5087001 -1389902
14606 -1389902 -660262 -1897677 -4228258 -6940182 -8030656 -5900050 -2105887 167395
14598 167395 -20218 -1275540 -2724105 -4263849 -4963887 -4356166 -4451739 -6933128 -9173206
14589 -9173206 -7301413 -2817309 -1189521 -3487382 -4852040 -2708009 -776874 -2089482
14581 -2089482 -3297624 -106129 5618967 8567401 6823203 2059600 -4023472 -9182623
14573 -9182623 -9550210 -4123090 1792458 2624824 150393 -92886 2088897 2474150 1226898
14564 1226898 3021307 7566660 7994889 1760233 -4040533 -3004506 1002084 841906
14556 841906 -2067340 -809359 4525755 6144806 1057418 -3838595 -2454108 1345232
14548 1345232 439365 -4486720 -7075851 -5881356 -5558521 -7611658 -7207212 -1703144 3773018
14539 3773018 3687315 649678 1183947 5685808 8573525 7345736 5326861 4855610 3646466
14530 3646466 69232 -2956571 -2578801 -790196 -1053764 -2970524 -3974705 -4197009 -5676300
14521 -5676300 -7856348 -7716817 -4371310 -537023 975254 119803 -1264287 -1519822 -244130
14512 -244130 1464027 1950498 957797 -178948 -1014719 -2952534 -6137780 -7335732 -3672735
14503 -3672735 2507931 5508206 2939168 -1893209 -4431790 -3568257 -1432702 -172887
14495 -172887 196800 1208087 3370199 4588629 2639745 -637425 -288261 5117497 10465616
14486 10465616 10132676 4690274 -1192707 -4940454 -6352965 -4111884 2634102 9859839
14478 9859839 11269074 6202040 635520 -678444 920045 2014065 1873754 1485732
14470 1485732 1325323 1925298 3695469 4738438 1984082 -4056674 -8994689 -10532517
14462 -10532517 -11001612 -11993592 -10756452 -5273762 802374 2665371 1271706 1198540 3259369
14453 3259369 4031413 2190755 608719 1273641 1930045 -320694 -4315711 -5786495 -2451989
14444 -2451989 3032953 5670584 3754974 1155586 2555187 6940645 8622958 5243852
14436 5243852 1160661 907754 3034881 3883045 4060856 6069985 7742838 4539741 -1682505
14427 -1682505 -2919058 3689531 10528939 9473601 3073859 747703 5898491 12095342
14419 12095342 12147236 6596709 1588601 1097066 3368573 3865123 157056 -5704211 -8936923
14410 -8936923 -6698812 -1541814 609344 -3282968 -9882889 -13214846 -11070702 -6257389
14402 -6257389 -2196719 313895 1641310 1358776 -503167 -2164749 -2255168 -1926268 -2559812
14393 -2559812 -2818544 -1022136 710990 -1138849 -4966982 -4672081 1595969 7761331
14385 7761331 7741252 3304035 398609 813243 2021754 3059464 5144918 7165514 5984216
14376 5984216 2003030 -318211 1019311 2748252 2097101 1379545 3715170 7175992
14368 7175992 7027953 2265951 -3660864 -7900434 -10457441 -11259436 -8515549 -1919496
14360 -1919496 4512303 5421975 42217 -6409290 -8069949 -4427207 61584 1961098
14352 1961098 2628448 4985228 8172861 7969037 2639691 -3838874 -5592218 -894373
14344 -894373 6355254 10475538 8926209 4248527 1523649 3287180 7016994 8429889
14336 8429889 6516935 3523749 707661 -2719787 -6080149 -6472693 -3386150 -538329
14328 -538329 -249696 691344 5431577 10121402 8308278 1186310 -2955152 -319411 3805120
14319 3805120 4484211 4629493 8113049 10821945 6136568 -3076173 -6282440 112946
14311 112946 7419100 6887206 1035590 -2032851 -899964 -806930 -3342991 -3413361 1924372
14302 1924372 7121686 4430113 -5945967 -15536647 -16955398 -11183330 -5386516 -5188902
14294 -5188902 -9847634 -14245538 -14558813 -11459369 -8148700 -6566903 -6457153 -7114624 -8145367
14285 -8145367 -8565032 -7139972 -4286641 -2009341 -1191003 -652417 84812 -853265 -4676332
14276 -4676332 -9006751 -10652499 -10164445 -10324352 -10507914 -6800948 831850 5647793 2067367
14267 2067367 -5830748 -8350632 -2426334 4619762 4905281 -411249 -4355857 -4083216
14259 -4083216 -3035981 -3793765 -3712995 154600 5183290 5857260 1277865 -3388045 -3402629
14250 -3402629 199605 2974345 2866825 1763406 2071595 3738708 5017424 4912760 4052729
14241 4052729 3598085 3934150 4381380 3921973 2404177 1313792 2911588 7708361 12767653
14232 12767653 13711921 9247003 2901967 -758557 -942602 -339849 -854386 -1863360 -2585699
14223 -2585699 -3333142 -3432839 -820285 4133569 6795385 3448307 -2942761 -5495517 -1673192
14214 -1673192 4227169 6949855 5658270 2837906 770241 539428 2352193 5057052
14206 5057052 6454159 5234597 1952552 -2009811 -5074956 -5232437 -1435712 4168730
14198 4168730 7467379 6551427 2889207 -1689161 -6406047 -9579642 -8941294 -5468243
14190 -5468243 -3344181 -3879765 -3013328 2180468 7994026 9082915 6057230 3385746
14182 3385746 2016420 -395142 -3237814 -3203363 -981714 -1345861 -4856716 -5597415 -545697
14173 -545697 4109182 1118919 -6829882 -10299288 -6066943 -875055 -1161531 -4321869
14165 -4321869 -3555772 1847498 5744955 4089248 120427 -1105184 206378 468539
14157 468539 -501117 530406 3522690 3800682 -528052 -4626794 -4101938 -2002746 -3474320
14148 -3474320 -6523753 -4869812 1117825 3773824 -314015 -4994195 -3857215 875158
14140 875158 2923504 907700 -2063837 -4424250 -6568929 -7298504 -5025177 -1761466
14132 -1761466 -1367023 -3905427 -5527591 -3899451 -211968 4023721 8237493 10468240
14124 10468240 7944822 1594103 -3339061 -3198502 -83017 1578651 409532 -1738572
14116 -1738572 -3038953 -3160784 -2836153 -3474886 -5891409 -8319349 -7616294 -3850166 -1321499
14107 -1321499 -2887387 -5718529 -5683996 -3605728 -3001687 -3313881 -831171 3748785 4680859
14098 4680859 -10784 -4510484 -3317158 1165741 3268028 2296205 993847 -987250
14090 -987250 -5635393 -10272042 -9756430 -5178715 -3586361 -7535366 -11193716 -9296091
14082 -9296091 -4162259 -667646 219732 -952975 -5427837 -12013339 -14405958 -9026049
14074 -9026049 -1972034 -1496119 -6217742 -7868774 -3881218 405048 1418293 1353632 1734908
14065 1734908 449142 -2863167 -4984765 -4846520 -5042482 -5691046 -3351444 1416537 2561322
14056 2561322 -1576305 -4045808 -254654 3559107 -194924 -7937955 -10131023 -5499257
14048 -5499257 -1448566 -1978863 -3625605 -3422228 -3102458 -3956266 -4064199 -2773284 -2675657
14039 -2675657 -5024178 -7462021 -7920495 -6790924 -4148102 709431 5634608 6418143
14031 6418143 3259812 1673109 4167085 5647465 872407 -7392875 -12178945 -11529755
14023 -11529755 -9300709 -8626766 -9325147 -10820624 -12813221 -12833145 -7698613 1067967 6840853
14014 6840853 5187256 -773020 -4670366 -4880243 -5328032 -8740813 -12228247 -11141341
14006 -11141341 -5529195 -294027 948917 -92467 537842 3666650 6485897 6630738
13998 6630738 4827084 3401369 3607328 4779745 5215110 3739417 1051138 -764843
13990 -764843 -748699 -303740 -748890 -726316 1823717 5696191 7125196 4743968 1277466
13981 1277466 -525828 -1234282 -2660250 -4467930 -4681932 -2552123 406685 1623279
13973 1623279 -675335 -5615983 -9535044 -9527459 -7346957 -7183173 -9030915 -7985317 -2096989
13964 -2096989 3166716 2275584 -1722689 -1423862 3573332 5909148 1723453 -3649487
13956 -3649487 -4149735 -1933560 -3181721 -8253861 -11477225 -9688081 -5945676 -4218830
13948 -4218830 -4490959 -4558837 -3544985 -1813290 321355 2039024 1992425 482375 5869
13939 5869 1977713 4502932 5151042 4185936 2884194 563072 -3628768 -7399457 -7663239
13930 -7663239 -5668806 -5581444 -7655817 -7380133 -2896166 1198195 149944 -4623620 -8812746
13921 -8812746 -11409484 -13398208 -12922841 -7062861 2323802 9253948 10362061 7421492
13913 7421492 3438930 163916 -694725 1639872 4108829 2209780 -3337226 -6522864
13905 -6522864 -4379626 -1055429 -1100431 -3001321 -3011845 -1786572 -2648633 -5630210 -7968439
13896 -7968439 -9215511 -11250382 -13651628 -13434197 -9908607 -6247517 -5362092 -6948411
13888 -6948411 -9153032 -10501119 -9632458 -5876250 -1084771 1415579 794828 -210175
13880 -210175 944666 3522377 4968824 3884094 872515 -2160586 -3239238 -2321303
13872 -2321303 -1977771 -4200624 -6976705 -6766022 -4101565 -3022119 -4446396 -4477132 -951061
13863 -951061 2814217 3565661 3073454 3798387 3731164 530711 -2726963 -2126151 -644243
13854 -644243 -3976635 -9856332 -9896676 -2934277 2073143 -525979 -4932329 -4161989 -1105473
13845 -1105473 -2245980 -5937638 -5582453 -1380540 76168 -2852227 -4312323 -604265
13837 -604265 5048488 9009298 11627663 12845413 10169055 4520799 1979077 5096054
13829 5096054 7626119 3222321 -4782950 -8219377 -5646733 -2669259 -2353941 -1933683
13821 -1933683 811207 3705056 4150016 2671234 990919 -164611 -204448 1504807 4095695
13812 4095695 6040629 7748727 10253549 11329712 7194081 -740492 -5297293 -2299592
13804 -2299592 3788905 6142483 4290466 2661895 2930481 2692648 927624 -99181
13796 -99181 876970 1944780 1681959 1779904 3881193 6189650 5753415 2708288 -168890
13787 -168890 -1323403 -1546234 -1621736 -1122588 255987 2029488 3825965 5172001 4341929
13778 4341929 -90565 -5819359 -7737654 -4086521 769374 2049954 737933 928795
13770 928795 2984968 3490080 1142269 -1744527 -3560149 -4691943 -4112006 144173 5494513
13761 5494513 5251490 -2167597 -9154391 -8461332 -3206715 -2175040 -7601507 -13335340
13753 -13335340 -14274360 -12116333 -10987537 -11644504 -11627908 -8762041 -3527251 849691 1217868
13744 1217868 -1315289 -1878651 1350144 3562019 224244 -5195526 -5897046 -2485848
13736 -2485848 -2268355 -7531953 -11590003 -8997718 -3602360 -2347782 -5468648 -7519137
13728 -7519137 -5520795 -1620744 1238885 2633352 3651657 4946845 6241726 6941472
13720 6941472 7165089 7758455 8321440 6316088 600287 -4923640 -4846714 276106 3954602
13711 3954602 2382337 -1029470 -1649056 -62360 562955 138022 641004 1450981 -187440
13702 -187440 -4554774 -8494929 -9190002 -6831784 -3595941 -1534379 -1314356 -1843237 -1404310
13693 -1404310 60184 496209 -1491354 -4065421 -3557434 1361436 7374467 9077284
13685 9077284 4694068 -1158281 -2409669 621976 1640038 -2111468 -5431644 -3809787
13677 -3809787 -1386855 -3896552 -7698175 -4655685 3814996 7528003 2992011 -1939872
13669 -1939872 -1389354 551275 -447419 -761956 3182556 6891519 5567433 3421438 6855820
13660 6855820 13158447 14333405 8901906 2420789 -944193 -639562 3324081 8748742
13652 8748742 9632987 3252151 -3964236 -4587486 -974021 -283378 -2247454 -1095358 2843260
13643 2843260 3769216 1816659 3255935 8353312 9173757 2122855 -6178958 -8946464
13635 -8946464 -7644291 -6927992 -7763024 -8952960 -9866883 -8857860 -4170608 1656318 3826728
13626 3826728 3050086 4788799 9219498 9472477 2641371 -5067908 -8006011 -8578116 -10400489
13617 -10400489 -10954687 -6974630 -1464007 875525 726528 916149 384307 -2549290 -4530148
13608 -4530148 -1174255 5623080 10076250 10389921 9224631 8046972 5917480 2699351
13600 2699351 -765139 -4546178 -8137325 -8745655 -4756334 771591 3763905 4628686
13592 4628686 6399423 9094764 10008705 8494722 6510056 4969661 2979679 307127
13584 307127 -2304909 -4898025 -7904904 -10431642 -10909438 -8907934 -5056494 -454612
13576 -454612 2789817 2497235 -724246 -3710735 -4927587 -5678326 -6244131 -4747914 -1489351
13567 -1489351 199950 -65324 2044185 7765957 10916632 6446018 -1175300 -4046410
13559 -4046410 -1692968 483140 571573 994442 1936043 1193556 55242 2594968 8536367
13550 8536367 12378117 10464441 4656549 -1009556 -3292534 -307364 6122434 9517511
13542 9517511 5258795 -2559232 -5941660 -3844901 -2384588 -4637186 -6798684 -5332995
13534 -5332995 -1769337 1182352 2881884 2584394 -908389 -5863323 -8478850 -8191415
13526 -8191415 -7569866 -6751855 -3698175 -228609 -752829 -3738789 -2338675 3850192 6014427
13517 6014427 -474743 -8049152 -8640533 -6106418 -8794505 -15201231 -16564127 -10955905
13509 -10955905 -5480768 -4931675 -6281726 -5102419 -805479 5267262 10958679 11880485
13501 11880485 5184096 -3912368 -5703444 1457059 8038251 6070142 -478990 -2694117
13493 -2694117 463970 2540760 502027 -1409757 815415 5038354 6746895 5208420
13485 5208420 3280872 3181812 4854721 7341619 9530275 9953757 7749022 4086846 1572098
13476 1572098 1986217 4992557 8492265 9611182 6500491 754173 -2864922 -1354973
13468 -1354973 2236050 2038765 -3018290 -7767574 -7684661 -3959564 -251218 2065515 2788071
13459 2788071 398667 -5279129 -10087597 -9661415 -5524842 -2869839 -2968173 -2307651 804398
13450 804398 3559659 3436585 1242496 -1902065 -6162469 -9648962 -8009414 -563052
13442 -563052 6728508 8136617 5375700 4141694 5567448 5492065 1438901 -3813361 -6103680
13433 -6103680 -4393824 -791250 1762593 1397873 -1264919 -3225288 -2049865 1241589
13425 1241589 3522478 3324880 1457521 -1595157 -6131736 -10600629 -11466923 -7607591
13417 -7607591 -2795594 -1301214 -2222780 -1172618 2648356 4583059 1180565 -4345195
13409 -4345195 -6336212 -4529260 -3766638 -6289622 -8652210 -7529918 -4551257 -2748611
13401 -2748611 -1459959 1699579 5918055 7946061 6488550 2518489 -3356844 -10032909
13393 -10032909 -13639494 -10700890 -3370905 2706892 5540470 7234635 7721535 4213996
13385 4213996 -1864447 -4098867 -497213 2328520 -962736 -5650320 -4165210 1752094
13377 1752094 3417136 -1845372 -7337332 -7013413 -2592304 1036610 2234836 1756416
13369 1756416 -533158 -4680622 -8471434 -9042564 -5901021 -990375 3241489 5095722
13361 5095722 4470648 3299456 3486428 3602746 -115478 -7827359 -13415017 -10782645 -1983263
13352 -1983263 4210939 2443847 -3242203 -5083796 -1138968 3406374 3621526 456886
13344 456886 -1867292 -1580813 -330355 266965 372707 98424 -1820024 -6278450 -11652505
13335 -11652505 -14433943 -12122041 -5667404 687275 2814984 1015997 135956 3750767
13327 3750767 8955220 9434341 3776390 -2186445 -2530315 1801293 5201593 4722816 2530997
13318 2530997 1654380 2004214 1690897 843691 2091901 6472315 10167505 7805564 -416874
13309 -416874 -7657235 -8584967 -6121482 -6632208 -10507991 -12566590 -11086435 -10320422 -12644495
13300 -12644495 -14123478 -10999972 -5656088 -2160009 -58890 2725546 4257697 1377284
13292 1377284 -3857819 -6037948 -4012235 -1793703 -2047282 -3127878 -2949253 -1871992
13284 -1871992 -1025906 -920116 -2217210 -5102682 -7730661 -8048298 -7052823 -7288795 -8349438
13275 -8349438 -7263338 -3463164 138278 1466775 1227983 -29873 -3090979 -7145739
13267 -7145739 -9192386 -8043583 -6016967 -5045874 -3971991 -1562184 424983 -558214
13259 -558214 -4415878 -8992072 -12463859 -13766366 -12521979 -10096949 -8993025 -9703599
13251 -9703599 -9848506 -7787857 -5223124 -4585645 -5571193 -6098701 -5397545 -4458659 -4357039
13242 -4357039 -5289123 -6335333 -5668628 -2529826 757057 1091971 -636784 -256176 3181413
13233 3181413 5481674 4070639 2492224 4498094 7378929 6200356 2010726 -104359
13225 -104359 227605 -1563543 -6158165 -7937706 -3754204 1467182 1534990 -2672991 -5687023
13216 -5687023 -5261497 -3466389 -1974214 -690939 -277677 -1918090 -4458491 -5264524 -4352651
13207 -4352651 -4417814 -6027656 -6197162 -3360895 -640869 -1550177 -4738348 -6268486 -5785997
13198 -5785997 -6656663 -9973940 -12206547 -10346163 -6548381 -5281752 -7560400 -10466248
13190 -10466248 -11364563 -10013178 -6960045 -2723737 925522 1545722 -701020 -2332355
13182 -2332355 -849279 1769718 1910249 -547341 -2528544 -2670021 -2802259 -3827983 -3245079
13173 -3245079 945761 5908133 6701863 2855107 -828452 -633147 1600732 1931065 102304
13164 102304 -641014 1344300 3876755 4226675 2530309 881910 415234 628884 872108
13155 872108 1053527 853534 -629397 -3802365 -7483357 -9445380 -8301297 -4833024 -1388085
13146 -1388085 22443 -896747 -2755307 -3398667 -1271153 3005032 6360457 5954631 2680438
13137 2680438 611721 2024829 4400587 3768589 -280238 -4653740 -6642208 -5733797
13129 -5733797 -2684958 782490 2187979 756213 -1095986 -1304980 -1762000 -4730571
13121 -4730571 -7263591 -4645873 1012395 2264253 -2339628 -5619871 -3512898 -1872069
13113 -1872069 -6083117 -10886093 -8577101 -2238366 -1050324 -5097555 -5422774 830235
13105 830235 5910643 4558494 1745276 2538905 2806265 -2954838 -10669607 -11680543 -5314670
13096 -5314670 1175410 3474417 3666374 3214400 -99549 -6247305 -10081304 -8105812
13088 -8105812 -4132959 -3938152 -6556248 -5550007 1293195 7941847 7793715 2432836
13080 2432836 -723458 1354633 3330419 -893546 -9608586 -15194546 -13244596 -6926894
13072 -6926894 -2518857 -3008570 -6358351 -8282798 -6404630 -2669265 -1174321 -2813760
13064 -2813760 -3925374 -2076715 -446210 -2665916 -5658196 -3238235 3954769 8540312
13056 8540312 7111079 4158764 3241427 1352230 -3755655 -7228541 -4375709 572365
13048 572365 258118 -4365907 -6179755 -3959326 -3995296 -8846755 -12268226 -8576045 -1280939
13039 -1280939 1869640 -1169836 -5806493 -7552912 -5952848 -2807594 206510 1809453
13031 1809453 1013227 -2249664 -6575289 -9397717 -8591711 -4789655 -1601550 -1899944 -4020070
13022 -4020070 -3683789 -79100 2341703 -438951 -6362276 -9607550 -7869082 -4961311
13014 -4961311 -5553716 -9063708 -10461067 -6726547 -665266 2578008 1500278 -914476
13006 -914476 -1796256 -1780734 -3284481 -6918370 -10481290 -10808322 -6555124 -149295 3508959
12997 3508959 2089224 -998287 -1152698 279796 -2236244 -8722531 -11187873 -4228438
12989 -4228438 6401313 10785445 7336516 2727916 1371035 1272792 26929 -1426157
12981 -1426157 -2470172 -4838906 -8408651 -9072332 -3889589 4252773 9749192 10246139
12973 10246139 7582851 4579599 2948056 3175242 4516944 5334310 4320562 1365955
12965 1365955 -2384464 -4500732 -2318503 3944781 9694160 10105291 5787622 1926926
12957 1926926 1788831 3730098 4889417 4890932 4948634 5732455 7161504 8495117 8195662
12948 8195662 5558862 2390278 867317 272900 -1309415 -2874293 -1945892 341740
12940 341740 346805 -1756786 -2101379 -306078 -313177 -2158254 42103 7810666 12657188
12931 12657188 6951608 -4342919 -9840926 -6567705 -1569870 -580543 -2253027 -3333047
12923 -3333047 -2915270 -644935 3738894 7630789 6932374 1795493 -2701916 -2955640 -690486
12914 -690486 679235 545186 756055 2987136 7027572 9956710 7820604 781187 -4697169
12905 -4697169 -2721960 3778035 6332320 2286049 -2357340 -2214044 868749 2473581
12897 2473581 1793414 208225 -2074522 -4592403 -5166034 -3077239 -974145 -914045 -1403069
12888 -1403069 -944720 -1138263 -3085150 -4208703 -2601462 -1338874 -3780292 -7228738
12880 -7228738 -6622704 -2702893 -669197 -1565699 -1169343 2151985 4580283 3544491 1733001
12871 1733001 1644151 945039 -2905479 -7031211 -6649027 -2197343 1276070 867504 -1846285
12862 -1846285 -4732350 -7426449 -9163702 -7972260 -3972631 -1041005 -2723238 -7589676
12854 -7589676 -10815366 -9946324 -7104948 -5357150 -4852270 -3572438 -593843 2858706
12846 2858706 5103248 5419660 3893833 1087638 -1872513 -3815978 -4427593 -3902658 -1819236
12837 -1819236 2255259 6679660 8026063 4821774 -114657 -2673654 -2080672 -816560
12829 -816560 -448122 154250 1978279 3549913 3177536 2243347 3925847 8459973 11663921
12820 11663921 9548745 3430764 -1299490 -1456514 700268 1226355 -332111 -1293939
12812 -1293939 -157461 1884988 3365119 3810946 2367873 -1875803 -7001435 -8567999
12804 -8567999 -4932460 -10302 1752935 1174256 2064711 4790586 5972445 4127559
12796 4127559 1579928 64736 -1917301 -5741498 -9492290 -10223757 -7600844 -3599330
12788 -3599330 -22440 2263054 3016946 3026343 3720951 5140936 5296573 2620054 -1916522
12779 -1916522 -5940441 -7804953 -6998065 -4038047 -843480 413531 -313542 -1453354
12771 -1453354 -3171293 -7348661 -12995905 -15326846 -12076465 -7328188 -5395192 -4180317
12763 -4180317 359943 5816855 6049959 1490839 -462493 3503102 8000045 7862056
12755 7862056 5161447 3445984 1082699 -3988479 -7688921 -5100802 410002 883514
12747 883514 -4161577 -6580743 -1523763 5964566 8631340 5991736 2428218 468384
12739 468384 -240047 76118 1533552 2902772 2478838 287253 -1975312 -2517711 -456144
12730 -456144 3254381 5635542 4768343 3313715 5527507 9947723 9740724 2831599 -3342937
12721 -3342937 -1755821 3731361 3890666 -2681104 -8855863 -10072871 -8609413 -6649624
12713 -6649624 -3080295 665283 -803313 -8305517 -14393667 -13104425 -8209593 -6399242
12705 -6399242 -7120719 -5817794 -3395418 -4464053 -7996475 -7985708 -3444772 145694 709734
12696 709734 3035844 9146567 12382995 6563236 -3834337 -8815341 -5657745 -956818
12688 -956818 -990373 -4945000 -7851729 -6576769 -2290322 810059 -630457 -4904893 -6214339
12679 -6214339 -2080966 2252085 528508 -5001917 -5915869 407747 6615879 5274179
12671 5274179 -1661722 -6587956 -6027980 -2563986 853791 3833347 6021430 5840358
12663 5840358 3132373 472607 191412 1463277 1622856 -452466 -3218846 -4258970
12655 -4258970 -2685216 -158443 344596 -2548693 -6765659 -8714415 -7349964 -5369927
12647 -5369927 -5791840 -8239206 -9505136 -7216997 -2077023 3016569 5081478 2744998
12639 2744998 -2755792 -8019034 -9977149 -8414203 -5431804 -2535834 494508 3577371
12631 3577371 4984316 3582539 1379447 1674195 4580191 6351161 4078849 -436629
12623 -436629 -3050325 -2713573 -2517973 -4877471 -7495605 -5900032 487167 6771216 7828750
12614 7828750 3777050 -1023454 -3392258 -3880313 -4256800 -4787847 -4890201 -4737925 -4860339
12605 -4860339 -5200546 -5712157 -6897524 -8671938 -9842955 -9995056 -10600095 -12580843 -14075905
12596 -14075905 -12873093 -10083856 -8701601 -8951726 -8016580 -4643197 -1257754 -680253
12588 -680253 -2892021 -5734999 -6929010 -5197941 -1670189 -229183 -3623672 -8962179
12580 -8962179 -10467918 -7315573 -4597437 -5056648 -4641289 641034 7793025 11131101
12572 11131101 10255285 8798685 7586397 4439387 -365066 -3693242 -4418227 -4150236
12564 -4150236 -3292948 -908212 1444775 471562 -3562676 -6611512 -6587042 -4972841 -2239030
12555 -2239030 2960181 8408795 7969799 125108 -7728522 -7841662 -1720142 3075127
12547 3075127 3126752 1545817 1568703 2259715 797601 -3828789 -9697980 -13057830 -11293255
12538 -11293255 -6091301 -2271854 -2153977 -3085458 -2142915 -514953 -575422 -1303585 -288858
12529 -288858 1543497 1088568 -2122425 -5682937 -7818480 -7930462 -5220699 -600343 1656203
12520 1656203 -1229295 -5376815 -5332660 -3274601 -6275815 -13848548 -16071780 -7421873
12512 -7421873 4501025 9279856 7250024 6299389 8893937 9900858 6335068 2216636
12504 2216636 2387467 6470901 10625056 11665604 8277801 1602659 -4022114 -4019084 1197986
12495 1197986 6407108 7841591 6358819 3737370 29116 -3399152 -2722190 2588562
12487 2588562 6376185 2998392 -4441963 -8299466 -7136754 -6215270 -7877465 -8581239
12479 -8581239 -7055997 -8133368 -14294504 -19238669 -15687210 -5882537 1687307 3606939
12471 3606939 3489970 4122560 4202716 3092341 2789645 3763528 3724843 2049826 988873
12462 988873 1027726 -389943 -3658192 -5078308 -2540875 1057787 2622186 2867218 2799857
12453 2799857 896472 -2513344 -2767144 2281485 6950894 5041477 -699925 -2719050
12445 -2719050 145868 2480645 1874206 1290131 1967417 1409816 -243251 1095018 5879450
12436 5879450 8327029 4802374 -457964 -1777433 276452 1583307 919817 -531326
12428 -531326 -2861851 -6153002 -7976885 -6573299 -4657021 -5818591 -8605085 -8473535
12420 -8473535 -4751496 -1478102 -1563085 -3835905 -5910263 -6537043 -4957871 -1321693 1718482
12411 1718482 1014757 -2586292 -4642017 -3099407 -1151479 -2552610 -6441585 -8960606
12403 -8960606 -8524496 -7174029 -7130517 -7912096 -7358902 -4623902 -1409457 -60522 -744545
12394 -744545 -1320973 -261048 1464884 2289115 2407611 2427301 956632 -3399678 -7872851
12385 -7872851 -7123461 -470477 5788061 5919028 2001787 56597 791069 -835945 -6611533
12376 -6611533 -10871476 -8073987 -884047 3261538 1643902 -1938320 -3993604 -5210219
12368 -5210219 -6598241 -6188393 -2352182 2349287 3838193 1740252 -735150 -1334591
12360 -1334591 -833684 -1131502 -3438273 -7921318 -12996651 -15217284 -12080702 -5222003
12352 -5222003 781585 2815472 1177278 -2122437 -4994177 -5775860 -4553294 -3896877
12344 -3896877 -5988460 -9131605 -9557214 -6527921 -2837530 -346376 1513429 2353092
12336 2353092 20995 -5091302 -8493186 -6840223 -2212759 960137 838580 -1851863
12328 -1851863 -5945352 -9516786 -10121161 -8079572 -7068235 -8717744 -9436965 -5969363
12320 -5969363 -1260454 -503439 -3592182 -6293903 -7211294 -8278455 -9379210 -8281625
12312 -8281625 -5885031 -5604102 -6676084 -4127178 2625794 7077625 4872604 573570
12304 573570 783029 4602124 6239650 4500880 3919480 7071628 10767826 10704934 6492339
12295 6492339 1178777 -1795535 -718742 3073802 5479744 3124697 -2822669 -7601993
12287 -7601993 -7765805 -4089719 -92025 900934 -2125681 -6825522 -9057106 -7395173
12279 -7395173 -5316330 -6507569 -9014259 -7731412 -2573273 516470 -1629855 -4140214
12271 -4140214 -1129900 5423431 8556966 6369586 4072394 5907945 9737722 11286092
12263 11286092 10058957 8460646 7389090 5589225 2479952 -617020 -1957287 -930553
12255 -930553 1430933 2733620 955453 -3046042 -5706423 -4618849 -1244844 1520552
12247 1520552 3146215 4707736 5407183 3044093 -1669911 -4451722 -2924523 -478865
12239 -478865 -1950101 -6499303 -8033114 -3345953 3047616 4458611 699774 -2102893
12231 -2102893 -298209 2612180 2188747 372294 2056373 6056891 5537014 -1441495
12223 -1441495 -7577372 -5922313 749959 4789200 4325741 3226249 2593576 -609491
12215 -609491 -6163145 -8635298 -5326848 -916626 -853877 -4093817 -6009985 -5428331 -4758191
12206 -4758191 -5004676 -4546955 -2304014 805502 3479740 5231546 6206270 6946494 7701721
12197 7701721 7407976 4811066 1126435 -739586 -609900 -1733900 -5283867 -7430893
12189 -7430893 -4858832 -321434 1077311 -1041745 -3210445 -4460739 -6915989 -10396691
12181 -10396691 -11297900 -7942147 -3357082 -1300568 -2204776 -4145674 -5520734 -5856297
12173 -5856297 -5836810 -6871192 -8741625 -8122397 -2386695 5176035 7675515 3240531 -2156836
12164 -2156836 -2298463 1969416 5434987 5829172 5061615 4514136 2816655 -1006063 -4621306
12155 -4621306 -4466245 -415197 3054170 1580256 -3450949 -5932015 -2682881 2157061
12147 2157061 2817222 65107 -210224 4149768 8879887 10284647 10082542 10883620 11209351
12138 11209351 8866686 6078456 6520494 8967473 8757132 5041641 1752906 864958
12130 864958 -394565 -3685507 -5469885 -2515180 1608305 430308 -6007513 -10569259
12122 -10569259 -8624487 -3792779 -1969825 -3457830 -4508664 -3819436 -2842831 -1069908
12114 -1069908 3626545 9539378 11149899 6489238 310190 -2329481 -1784841 -704804
12106 -704804 426945 984840 -2276610 -10131033 -16390229 -14516702 -6920884 -1642559
12098 -1642559 -1113646 -935034 640174 -304571 -5276988 -9455726 -9012721 -6480992 -5265417
12089 -5265417 -4084526 -957315 1966256 2214015 1861661 3874955 6687586 7099671 5890067
12080 5890067 5784896 6122338 4439610 1633691 710975 1692412 2339727 2665597 3963204
12071 3963204 4496157 1388685 -3647468 -5701580 -3837223 -1799159 -1315683 -152919
12063 -152919 2188431 2501438 -294425 -2487701 -1617613 -741495 -3302876 -7441408 -9060862
12054 -9060862 -7669306 -5687326 -4477234 -4422323 -6425575 -9621092 -9914024 -5024096 798788
12045 798788 1676599 -1485163 -2467249 812999 3753336 2842078 656269 862829 2896314
12036 2896314 4844887 7658870 12147938 14577443 10486989 2027903 -3428028 -2485390
12028 -2485390 675953 1015560 -1041892 -2176575 -1757359 -1660209 -2460520 -3138380 -3712051
12019 -3712051 -5060692 -6268907 -5058644 -1478076 1287249 955883 -796292 -729133 1753720
12010 1753720 4386729 5475805 5866476 6947898 7680218 5043087 -1821495 -8708258
12002 -8708258 -9410790 -2386776 6998594 11917799 10429320 5186911 -1064298 -6781520
11994 -6781520 -9738302 -8068838 -3888755 -2135829 -4060652 -5004658 -1021550 5030643
11986 5030643 7262018 4812317 2296708 2607790 3055787 -205792 -6630652 -11926470
11978 -11926470 -12757292 -9250575 -3817171 889755 3203775 3215775 2694909 3256104 4252959
11969 4252959 3545095 954716 -515830 1325684 3656981 1291290 -6144505 -12754133
11961 -12754133 -13603979 -10585324 -8692164 -9074118 -9221581 -8168150 -7335294 -7000092 -6036155
11952 -6036155 -4906537 -4889375 -4507597 -1206979 3187165 3671154 -316066 -3615359 -3239571
11943 -3239571 -2140680 -2887426 -3436232 -2576063 -3625033 -7914185 -10121863 -6174488 -1038821
11934 -1038821 -1514551 -5142834 -4507960 77999 1450454 -1680151 -2585273 1522711 4642482
11925 4642482 2386197 -981879 -607764 845995 -1019903 -4016519 -3495599 -998651
11917 -998651 -1802080 -5774775 -7322730 -4103559 11493 1394258 1124401 1466729 2036204
11908 2036204 1947762 2883419 6881388 12221691 14404441 11562932 6888699 4560470 4592674
11899 4592674 3597561 190315 -2974203 -3521489 -3152322 -4805836 -7849844 -9150293 -7940279
11890 -7940279 -6319372 -5354613 -4222392 -3242756 -3858127 -4819739 -2468453 3370987 7382623
11881 7382623 5216388 -719588 -4538151 -3938007 -1540252 -611087 -1552564 -1889005 1131367
11872 1131367 6815047 10267709 8030325 3960214 5012021 10736302 12942708 8052080
11864 8052080 3110208 4971898 9823448 10135223 6812539 5948325 6987818 3985474
11856 3985474 -2401272 -4303290 644816 5305561 4528993 1937578 1260941 -627287
11848 -627287 -6097248 -9553358 -5609173 702661 387274 -5861886 -8933454 -5055150
11840 -5055150 -245693 -523734 -4768444 -8962538 -11506424 -12008293 -9800112 -6298470
11832 -6298470 -4861094 -5902468 -5678781 -2027807 2302007 4207935 4206325 3269740 109554
11823 109554 -4455314 -4663361 2846397 11486135 11284150 2429873 -4452765 -2669006 2369437
11814 2369437 2236789 -2891490 -6512708 -5955976 -4559421 -5078549 -6197415 -5936804 -4405259
11805 -4405259 -2243518 313659 1777565 -5020 -4077885 -6070613 -3631154 399988
11797 399988 2532894 3712073 6534849 9461798 8322022 3123945 -1251635 -1965315
11789 -1965315 -1490181 -2326510 -2825162 -1248034 -25683 -1579218 -2857849 424592 5652793
11780 5652793 5734369 -72202 -4230578 -1991201 1633432 -58533 -5274263 -7020516
11772 -7020516 -3514044 592747 2019645 2121974 2308929 1489330 -658618 -2187440 -2447685
11763 -2447685 -3730572 -7373406 -10906640 -11046554 -7606260 -3017113 221742 587494
11755 587494 -1866240 -4728630 -4908575 -2105359 1156335 3388375 5514587 7740491
11747 7740491 8198007 6189862 3865223 2921209 2417377 1590592 1718277 3063428 3313188
11738 3313188 1734494 1439219 4163413 6232012 3999003 322511 530271 4073808
11730 4073808 5690252 3591819 899686 -489398 -1783442 -2926014 -1997392 115659
11722 115659 -224759 -3262538 -4768709 -2903325 -1315463 -3056387 -5874060 -6385483 -5059546
11713 -5059546 -4164341 -4249261 -5403390 -8368692 -11384499 -9815143 -2854952 2888135 1306928
11704 1306928 -4281205 -5391142 -42911 5273864 5024486 821832 -2683874 -3569653
11696 -3569653 -2449675 -42611 2566729 3323533 1243085 -1790120 -2879258 -1468312
11688 -1468312 91682 -770407 -4039781 -7078239 -7441710 -5516892 -3654615 -2823500 -1649473
11679 -1649473 643885 2209545 1053622 -1813916 -3583542 -3161497 -1778437 -933601
11671 -933601 -1497039 -3889712 -6974909 -7593495 -3926961 904444 1566783 -2639031 -6539321
11662 -6539321 -5965315 -3239516 -3618607 -8042949 -12123287 -11707710 -6890967 -381485 5499558
11653 5499558 8963033 8171238 3196145 -2105096 -3102048 -61948 1638645 -1472198
11645 -1472198 -5927509 -5826392 -865704 3422028 3052523 -196401 -2454940 -2404170 -971067
11636 -971067 908166 2589666 3803181 5578796 8874691 11395646 8881375 1290042
11628 1290042 -5514336 -6685308 -3961618 -1528554 265947 3038435 5228814 4150764
11620 4150764 1597603 1912579 4974934 6361523 4504849 2375218 1451527 -472820
11612 -472820 -3970322 -5783661 -4263858 -2177612 -1379471 591590 5188504 8621830
11604 8621830 7293101 3812887 2895143 4312152 4927091 4949622 6401853 7460861 4914512
11595 4914512 1299220 2464283 7562464 8826297 3411742 -1722064 -589269 2721463
11587 2721463 1377356 -3008342 -3859974 -1253096 -1708433 -6555077 -8545147 -2831954
11579 -2831954 4861494 5563469 -1056888 -6852956 -5798065 -262181 3472264 2820506
11571 2820506 558193 282646 2008141 2883827 1538762 -35323 195106 904981 -321507
11562 -321507 -2389561 -1724057 1896928 4115951 2000895 -1929269 -3881663 -4300404 -6338183
11553 -6338183 -10619215 -14469567 -15378108 -12806190 -7546011 -1658903 1830522 1549145
11545 1549145 -547303 -1986454 -2998849 -4651608 -5453891 -3269417 217380 726018
11537 726018 -2746480 -6547282 -7369546 -5762699 -4058896 -3436753 -3786935 -4290866 -3588637
11528 -3588637 -1282012 644068 -136381 -3139369 -6067435 -8031921 -8990006 -7296829
11520 -7296829 -1941962 3447472 3776983 39621 -1296304 2500148 6861281 7187305
11512 7187305 4517566 1539262 -2050121 -6890143 -10895629 -12277290 -12016831 -10508379
11504 -10508379 -5998745 443707 3346234 580882 -2097430 397047 3987651 2176188
11496 2176188 -2548219 -2262489 3247818 5585891 525706 -6063388 -7161816 -3148894
11488 -3148894 1275934 3513983 3270991 324269 -4521610 -8472164 -9119194 -6576799
11480 -6576799 -2660811 179830 -700937 -5770609 -11090200 -11651877 -7488391 -3295921
11472 -3295921 -1586781 -40964 3269179 6112686 5797729 3378962 1508040 460839
11464 460839 -985341 -2316386 -1629446 1186131 3450976 2319099 -1814288 -4686343
11456 -4686343 -2168410 4052768 6641074 1074207 -7511074 -9715044 -3599044 3378819
11448 3378819 4707363 2310813 1445016 2267317 564572 -4802192 -9095321 -7124482
11440 -7124482 174690 5825746 4051566 -2777148 -6160531 -1545280 5769052 7205081
11432 7205081 1366118 -5548647 -8147319 -6219633 -1622359 3906912 7320779 5803146
11424 5803146 1397606 -81501 3582664 8438747 10392591 9689888 7902516 4913136
11416 4913136 1255209 -472767 770654 2477849 2272192 657386 -1178456 -2701586
11408 -2701586 -2141308 2236483 7603559 8463319 4776973 2287977 2614591 409105 -5707473
11399 -5707473 -7654406 -178545 8514900 7417864 -1060620 -5427718 -2415933 548881
11391 548881 -1033765 -3311906 -3386833 -4254466 -7408899 -8641976 -5266482 -1207021 -761391
11382 -761391 -2294406 -2120079 -729816 -1414152 -5314203 -10425821 -13404857 -11362723 -4906196
11373 -4906196 179727 -1481224 -6835833 -7111622 -101742 6025826 4054665 -2857634
11365 -2857634 -7234081 -7589879 -7280826 -6987664 -4548145 -182417 3760776 7072123 10742446
11356 10742446 12920894 10996863 7195436 6784190 10213598 11949441 8379137 2498554
11348 2498554 -1144253 -2359923 -3618517 -5260251 -5315262 -2748561 1159078 3730318
11340 3730318 2111619 -4655090 -13159893 -17016771 -13123128 -5610883 -1348853 -2303226
11332 -2303226 -4901195 -6373660 -8023967 -10971033 -12236411 -8506018 -2166684 471052
11324 471052 -2625444 -6303899 -5184783 -722667 1370154 -1022448 -4506955 -5693994
11316 -5693994 -5187180 -5049694 -5031218 -3428061 -410492 1618810 981431 -1152200 -1961384
11307 -1961384 -29636 2917868 3645999 1163766 -1723524 -1565383 1637610 5052082
11299 5052082 7238881 9283854 11320990 10962664 7138543 3097540 2638310 4683989
11291 4683989 4929747 2470749 1074207 2874320 4336068 1176500 -4837257 -7478091
11283 -7478091 -4046551 1436938 3823878 2862076 1805774 2123377 2468428 2099074 2042146
11274 2042146 2255109 628113 -3460758 -6926104 -6763246 -4543515 -4297413 -6588627 -7607815
11265 -7607815 -4326113 1951776 7642114 10364189 10042218 8720702 9544151 13426192
11257 13426192 16457261 13799610 6936276 3150401 5883558 9738027 8362240 3486115
11249 3486115 1359726 3020046 3959743 2211156 540102 322107 -796326 -3636123
11241 -3636123 -5221859 -3951261 -2280303 -1808209 -352240 3075866 4964936 2745220
11233 2745220 -697110 -2265058 -4224107 -9115619 -12809586 -9462427 -1248839 4057435
11225 4057435 4277606 4205987 5704304 4331855 -2043040 -8385108 -9651762 -7078079 -3916783
11216 -3916783 -416706 2995342 2814692 -2243844 -7173254 -6975813 -3585043 -1623783
11208 -1623783 -943979 795530 1312710 -3498322 -11314896 -14674351 -10510065 -2883046
11200 -2883046 3547238 7254428 7332434 3443281 -869737 -547793 3916667 6836133 5758457
11191 5758457 4057239 3858509 2567087 -1154604 -3990850 -3854340 -3536811 -4703372 -3886789
11182 -3886789 803061 4451876 2831994 353907 3261255 8483359 7796033 1453860
11174 1453860 -1460229 2920405 7551421 5854369 1316259 825491 3928281 4731341
11166 4731341 1429893 -1996453 -2582256 -1814321 -1926753 -2626178 -2544877 -1301353 835013
11157 835013 3264221 4315462 2326426 -1412592 -2779719 328496 4538097 4369640
11149 4369640 -1500855 -9104147 -13848455 -14308914 -11427118 -6451866 -910720 3097648
11141 3097648 4338587 3628910 2629470 2018754 1424983 293222 -1646897 -3653293 -3518580
11132 -3518580 210426 5025395 6184352 3032786 488517 1835550 3406733 341590
11124 341590 -5158892 -6612136 -2965388 134554 -1094626 -4015900 -4597742 -2313802
11116 -2313802 1380196 5254801 7454164 6298140 3386748 2198089 2548715 807356
11108 807356 -3095638 -4044595 431689 5657620 6369100 3366804 214233 -2286306 -4294092
11099 -4294092 -3769359 126997 3705963 3365756 524052 -2348321 -6865908 -14357645
11091 -14357645 -19759913 -16909867 -8369881 -2954488 -3669602 -4781273 -1840533 1648773
11083 1648773 231646 -5238032 -8609127 -5821337 686820 4373367 1251287 -5345772
11075 -5345772 -7961127 -3876827 1786653 3573949 2625953 2740673 3353706 1564010 -1709578
11066 -1709578 -3404062 -4083688 -6101320 -7933205 -6923882 -5925374 -9442270 -14026257
11058 -14026257 -11449710 -2371134 2505458 -2042976 -7793610 -5481678 2177057 5812725
11050 5812725 2088009 -5090733 -11618745 -15227565 -13726948 -7315534 -813602 1302345
11042 1302345 376433 52362 -95852 -2511164 -5540652 -5190457 -2106102 -1230847 -4294095
11033 -4294095 -7509860 -7531278 -5453264 -3758615 -3019306 -3128425 -4639725 -7092171 -8493308
11024 -8493308 -8259113 -8576042 -10909718 -12908441 -11175614 -6252191 -2379621 -2251538 -4173778
11015 -4173778 -5124571 -4539155 -3399788 -1305957 2570852 5984037 4634624 -1837781
11007 -1837781 -7726606 -7508929 -2328660 2201668 3032097 1780149 1136023 2163325 4382018
10998 4382018 5803805 3776329 -1453451 -5222562 -3706514 620940 2611000 2220672
10990 2220672 3809808 8170895 10794913 8971319 5544464 4061140 4659042 6346678
10982 6346678 8987405 11251902 10775001 8062358 6107362 4816912 847457 -5232071
10974 -5232071 -7550096 -3925135 -463315 -2647991 -6874366 -6311755 -1221880 2507680
10966 2507680 2368434 905175 99746 -471430 -695024 249616 1540980 1749703 1412676
10957 1412676 1597316 1410512 -2525 -922524 154598 1383526 867826 704966 3534367
10948 3534367 7243971 7712143 4992334 2138101 -308181 -3701670 -6777602 -6911008
10940 -6911008 -4666229 -2273939 622521 4333649 4574432 -2499491 -12106494 -15370683
10932 -15370683 -11583258 -7896485 -6767954 -3096816 4186879 7571557 2683195 -3768317
10924 -3768317 -3633235 1838504 6761192 9861296 12123973 10826320 4032277 -2682643
10916 -2682643 -2146590 3868354 7298106 5297806 2086130 733265 445433 1377518 4761209
10907 4761209 8057213 7085221 3549057 3286359 6147962 5466821 -340693 -3876976 -333566
10898 -333566 4590190 3624168 -1606854 -5075589 -5824006 -6208013 -5168423 -645354 4418753
10889 4418753 5771736 5136530 6575161 7823841 3406940 -4766860 -8622705 -5996575
10881 -5996575 -2952426 -2908991 -2280351 630160 1422967 -1398676 -1479007 5401238 13077272
10872 13077272 13340897 7314868 2009991 60394 -398237 534597 3751554 6604642
10864 6604642 5685289 2359189 122757 -1100020 -2628211 -2232197 1927365 5609401
10856 5609401 3897902 -297723 -795092 1221962 -202741 -4141870 -3376967 3184959
10848 3184959 8065991 6595730 2274403 -726445 -2148275 -1268762 3348174 7749640
10840 7749640 5234560 -2362736 -5361536 -1360193 401793 -5569445 -11571667 -9277937
10832 -9277937 -2436908 953886 1150284 2676808 4611902 3814026 2291291 2777033 2224630
10823 2224630 -1768644 -3690568 1106498 5691789 886078 -8499239 -9120798 711438
10815 711438 8714083 7183284 2097971 981436 2293477 1670934 417849 1941069
10807 1941069 4956306 5334261 1963318 -2225035 -3289511 420047 5900582 7372316
10799 7372316 3500848 490209 3463642 7787635 5789800 -290892 -979900 5246818
10791 5246818 9239009 5535511 -11945 -827313 708836 -287162 -1899730 810888
10783 810888 7037276 11250685 10552446 6671371 2796831 1612391 4063718 7548540
10775 7548540 8065627 5976410 5780343 8134883 7181161 -589740 -9727833 -13017444 -11317337
10766 -11317337 -10552723 -11829217 -10916480 -6352572 -1881087 -338838 -110425 1051713
10758 1051713 2481504 2460479 906721 -1358271 -4221613 -7785713 -11221114 -13011705
10750 -13011705 -12104870 -8913296 -5577660 -4567118 -6079630 -7400517 -5967093 -2599146
10742 -2599146 -324043 -167396 218900 3007259 6581134 7158684 3907161 440896 -43463
10733 -43463 655995 -1174932 -4323049 -3121561 3842088 9762135 7959498 1283537 -1505733
10724 -1505733 2616935 7961310 8938109 6943651 6602739 8894882 10897916 10452034 8416899
10715 8416899 6761636 6134434 5610007 4194066 2003835 -483224 -3843498 -8730460
10707 -8730460 -13215976 -13449588 -8441238 -2174500 918887 760302 -72166 -756158 -2289697
10698 -2289697 -4737779 -7087205 -8610009 -8239712 -4443251 1896335 6658326 7272392
10690 7272392 5942611 5199268 3358047 -1564448 -6434944 -6597580 -2769990 665197
10682 665197 2155875 2453051 -39738 -6859955 -13879562 -15042956 -11152396 -8168151
10674 -8168151 -7258410 -4014728 2201522 6250956 6138199 6039093 7805748 7076569 1620127
10665 1620127 -3352385 -2941253 49245 418873 -1456459 -2013411 -1045389 -784242 -1088058
10656 -1088058 -7858 2640190 5598426 8177165 9362452 7424342 3197055 1202979
10648 1202979 4403777 9828934 12250372 10454337 7347172 5553161 5425439 6094081
10640 6094081 6223022 4598467 1621316 -449738 329962 3846644 8400676 11743692
10632 11743692 12120111 10081940 8651949 9547062 10191555 7150929 1345238 -3514068
10624 -3514068 -6494238 -9345452 -11651107 -10738362 -6474058 -1873376 1219509 3141102
10616 3141102 3499665 1600290 -648739 -834750 -508838 -2678037 -5602148 -4721429 -369857
10607 -369857 2427973 1780891 352628 -1085870 -4798444 -10020461 -12379795 -10669467
10599 -10669467 -8245352 -6864219 -5196350 -3854387 -5207871 -7650900 -6987130 -3979220
10591 -3979220 -3255946 -4591837 -3477471 -581459 -1324377 -5199807 -5760904 -2889625 -3875319
10582 -3875319 -9316380 -9910446 -2245431 3985390 1362959 -3577804 -2423399 995671
10574 995671 -1582605 -8253761 -10415271 -6186515 -1363152 35955 -1079171 -2851819
10566 -2851819 -3974786 -3144831 -743292 1154281 2036730 2567032 854603 -4919839 -10212688
10557 -10212688 -8361610 -1675009 776985 -2665713 -4585989 -2249156 -1191275 -2764852
10549 -2764852 -1137146 3626590 3257046 -2966444 -4380834 2857377 8119434 4281574
10541 4281574 -1015094 -331363 1880949 1567268 4026590 10349328 10130102 -570689
10533 -570689 -8734961 -4338313 3637142 3918321 738970 1299338 1018459 -3534336 -2746912
10524 -2746912 8129754 14597273 4792421 -8929933 -9541659 -2081927 -624099 -2842098
10516 -2842098 554332 4385635 -142125 -5380572 -704557 6162317 3739912 -639054
10508 -639054 3927024 8795280 2601721 -4732822 -1086992 2550760 -5631939 -11063313
10500 -11063313 -104706 8586405 -2405623 -10359859 7750223 24982438 9836546
10493 9836546 -7740493 13537740 38940528 14936329 -1634330 105948590 311127477
10486 311127477 418687375 309556434 106025842 3615282 24026031 44370904
10480 44370904 8853288 -19927691 -965279 20373636 6689527 -11164067 -1944861
10473 -1944861 12294480 6268152 -2892525 5299479 16164344 11915018 4216155 6900963
10465 6900963 9219581 1305187 -3462471 5260615 13134874 7294097 -748162 1506438
10457 1506438 4868357 -1084398 -7003386 -2851644 2219251 -1829754 -6376481 -1494306
10449 -1494306 4389608 521022 -6105906 -4399332 1206062 1457513 -503895 1710542
10441 1710542 4012471 2038001 2373846 9067473 11855989 2959917 -6975853 -5546097
10433 -5546097 705388 -1150226 -7933343 -7923065 -2064804 69319 -1156876 2011610
10425 2011610 8313831 9346983 4581772 711288 -850004 -3216949 -4276161 -132845
10417 -132845 4649545 2233971 -5332914 -9064942 -6823980 -3842319 -1935220 1452814
10409 1452814 5209762 5270516 2171876 -381986 -2606681 -6510346 -9341218 -7237840
10401 -7237840 -2802890 -1101882 -986042 1504524 4194432 1987135 -3468045 -6067006
10393 -6067006 -5156824 -4618146 -4078890 209 5734038 7218842 4209935 2293594 3491827
10384 3491827 4249630 2787500 1316406 788256 -59522 -642750 308927 428963 -2883388
10375 -2883388 -5989183 -3381072 2403781 3586172 -130146 -692704 4753183 8483389
10367 8483389 4164677 -3443909 -5873152 -2234161 2386049 5528087 8354810 10225316
10359 10225316 8062753 1566821 -4655575 -5595716 -1037762 4571239 6866588 5591471
10351 5591471 3807810 3715189 4470987 4382703 3592348 3276338 3267438 2087885 -887653 -4264351
10341 -4264351 -5657762 -3976926 -1193073 -987605 -4071451 -5926118 -2055931 5050042
10333 5050042 7975238 3892003 -1912490 -3395326 -936778 902585 -227934 -2613523
10325 -2613523 -3050990 45542 4410976 4959973 -91204 -4971691 -2806902 4084583
10317 4084583 6352663 758123 -5730435 -6976334 -5398204 -4997357 -3929534 505917
10309 505917 5408933 6931364 6730440 7925176 8923234 7279012 5696538 7786783 11153862
10300 11153862 11079242 8254904 6591904 5963695 3573701 409685 -83480 1801830 3087120
10291 3087120 3721100 5364900 6372328 4070179 510237 -210094 997931 82341 -2485364
10282 -2485364 -2447253 633195 2917420 2780923 1404247 -2111002 -8989516 -14718551 -12899998
10273 -12899998 -5882156 -3210296 -7528672 -10329117 -5082261 3323877 7161886 6934196
10265 6934196 7426707 7882514 3822203 -3531253 -6922553 -2738591 4161422 6947023
10257 6947023 4796210 2305852 2822434 4893275 5477420 4624223 5016437 7461452 9504805
10248 9504805 9323617 8335243 8217241 7813757 5327011 1354451 -2766959 -7198459 -11232454
10239 -11232454 -11512039 -6662693 -1324855 -858879 -3839172 -4786133 -2692086 -1132969
10231 -1132969 -1043173 133015 2080126 1070094 -2949137 -4851147 -2005775 1799624
10223 1799624 2310304 -13195 -2728407 -4691324 -4702586 -1644844 2058635 2177465 -18639
10214 -18639 1980339 9173905 12778109 5825016 -5955571 -10934749 -5894275 2340244
10206 2340244 6905014 6457588 2496939 -2613340 -5240790 -3413343 -381734 -959491
10198 -959491 -4572357 -6353087 -4696495 -2558738 -1025511 2584591 8453230 11608394
10190 11608394 8783005 3715759 1862483 3008153 3068760 732119 -2000776 -4237131
10182 -4237131 -6575807 -7670960 -4932749 825769 5321736 6289275 5488098 4244152
10174 4244152 1052380 -4245542 -7795863 -6651395 -3445984 -2283660 -2249153 490808
10166 490808 5566636 8391922 6980354 3890569 972704 -2791550 -6925426 -8048422
10158 -8048422 -5383028 -3269945 -4948032 -7541557 -6899495 -4209000 -3574662 -5400850
10150 -5400850 -6595811 -5794255 -4119226 -1830744 1566557 4397554 3965943 560700
10142 560700 -3058270 -5800223 -8324351 -9400646 -6326604 527652 7201670 10704750
10134 10704750 10823439 7610794 1665913 -2487904 1117388 11364819 18705089 16015503
10126 16015503 7092670 375149 -2109138 -4167154 -6530947 -5513033 -555311 3551587
10118 3551587 4052517 4234893 6861455 8518080 5164780 -339021 -2026091 -66781
10110 -66781 161032 -2241993 -1840340 3692365 8767061 7931908 3314631 -265047 -2722094
10101 -2722094 -5809257 -7004970 -3198035 2052568 2278382 -2007388 -4444228 -3407320
10093 -3407320 -3619047 -6392694 -6568461 -1949397 1798603 -130421 -4306839 -4990493 -2161799
10084 -2161799 909899 3340645 5328888 5618980 4663733 5852772 9290663 9425869 3798845
10075 3798845 -1433618 -819368 1227842 -1703227 -6056909 -3702653 3927033 7287191
10067 7287191 3151765 -2131078 -3757146 -3390198 -2139644 1912300 6940210 6964541 1534054
10058 1534054 -1917357 1042726 5848602 7618505 8501888 11451466 13382494 10577304
10050 10577304 5568453 2467401 81160 -3749195 -5099205 902368 10138046 12903614
10042 12903614 7313650 1983512 3682749 8670198 9487115 5438461 1851907 1682239
10034 1682239 2640343 2092522 649730 -140225 -534839 -1093942 -675067 1480151 3083760
10025 3083760 1354381 -2348143 -3878348 -2372693 -1145195 -1816473 -2028511 -869531
10017 -869531 -1667297 -5868810 -8663858 -5668118 -414305 619673 -2225088 -3552475
10009 -3552475 -2709538 -4266811 -8488190 -8952398 -2329334 5378062 6036067 -911961 -8975456
10000 -8975456 -12083616 -9065475 -2924495 2079761 3719065 3181845 2516988 1605477 -334447
9991 -334447 -1710798 -504899 1592603 1006515 -1991009 -3463500 -1877529 69075 116409
9982 116409 -979294 -2120906 -3389854 -4230967 -3524627 -1940774 -1150153 -809913 587237
9973 587237 2737409 4862433 8271842 13074592 14557053 8964848 1227264 -319536
9965 -319536 3909487 5736405 2191842 -1130415 -481815 1433414 3090316 6806446 10755407
9956 10755407 8233640 -455504 -4970165 235851 7105816 7176859 4915569 8787641
9948 8787641 16056859 17001284 10025081 2578378 -524765 -748621 587298 4044526 7856504
9939 7856504 8905589 7670915 6752636 5737064 2968234 553737 1491578 3359618 1300009
9930 1300009 -3649244 -5567473 -2580366 1319758 3314871 4636941 5903342 5312435
9922 5312435 2881075 1772405 3766852 7003830 9387468 11005494 12096677 11497168
9914 11497168 8465640 4227451 713427 -1316605 -2565075 -3887772 -4491983 -2286132
9906 -2286132 2391079 4938776 1983384 -2488682 -1703947 3686832 6624921 5319588
9898 5319588 5764392 10423366 13316061 10511338 6837892 6863709 7744497 7051429 8677834
9889 8677834 13693972 14655354 7729726 1164244 1813160 3155218 -1444632 -3916395 5273784
9880 5273784 18561065 23186132 23087660 29197701 36201512 33521059 33387942 56514334
9872 56514334 87896025 81968847 25677715 -34301760 -48864733 -26667702 -11400194
9865 -11400194 -18324159 -25142159 -16634582 -5158871 -4148803 -8055030 -7427962 -4940906
9857 -4940906 -6421662 -9118908 -8120493 -5397697 -4961482 -5608810 -4304449 -1750267 -390075
9848 -390075 -931189 -3244154 -6568019 -7680473 -3811811 1672405 1933165 -3784135 -8659890
9839 -8659890 -7728530 -3503879 -709532 -503085 -1525439 -2009637 280912 5442162 8208311
9830 8208311 3018602 -6855981 -11646114 -8050362 -2987740 -2114412 -2185505 1123594 5148466
9821 5148466 5784296 4968728 5874973 5586506 112439 -6788727 -7694817 -2516089 1996091
9812 1996091 2498357 1469338 124532 -3126756 -6582113 -5736527 -1948090 -2739964 -9912127
9803 -9912127 -14771415 -10344387 -1857334 1447331 -430239 -1013337 487475 -1009839
9795 -1009839 -5766850 -7707585 -4800949 -2507708 -4066274 -5034256 -1871405 781423
9787 781423 -2490436 -7961133 -7232056 721119 8390711 9903039 6937881 4417022 4839478
9778 4839478 7587668 10403648 10845936 8644067 6489865 6478882 7011295 5895317 4621432
9769 4621432 5570462 6594645 3638701 -1644723 -2680166 2511921 7973026 8232093 5414611
9760 5414611 4856051 7265939 8870847 7175458 3409341 386530 64701 2237314 4318536
9751 4318536 3681104 1052120 -80102 2011441 5639973 9141828 12856307 16234228
9743 16234228 16239040 11264484 4451097 471347 428590 1938186 2699285 1979393 30978
9734 30978 -1952760 -2505870 -2073474 -2888314 -4984954 -4545709 952032 7486059 7989065
9725 7989065 1111868 -6573764 -8139128 -3905669 34128 -412799 -3195175 -3922234 -1695432
9716 -1695432 835258 2242485 3967724 6432491 6855133 3356448 -1389738 -3737223
9708 -3737223 -4134835 -4991427 -5459327 -2849504 1958075 5302084 6252379 6540782 5798396
9699 5798396 2465050 -986013 -260982 2857213 1934202 -3366033 -5689160 -2050090 458293
9690 458293 -4133850 -10837300 -11391292 -6275194 -2260397 -2162492 -3772075 -5683619 -7485172
9681 -7485172 -6651786 -1801205 2695007 1474081 -3696505 -6158770 -3663134 -223516
9673 -223516 370054 -1883024 -5074236 -6530719 -3673908 2043952 4443742 623488 -3370776
9664 -3370776 -808529 4897390 5103809 -495048 -3820509 -1396467 1413898 238645
9656 238645 -2371215 -2879912 -1440570 1494781 6320971 9788798 6467901 -2307821 -7726894
9647 -7726894 -5195574 -249095 1012543 637628 2910815 5905215 5411012 2955654 3329052
9638 3329052 6778482 9349893 9032834 6774606 3392056 -9351 -548716 2975515 6848640
9629 6848640 6882379 4350760 3326958 4051221 3637472 1779579 622785 -165096 -2948960
9620 -2948960 -6837431 -7914131 -5526402 -3829374 -5667072 -8624261 -8772531 -5398308
9612 -5398308 -539190 3689951 5930685 5788852 4410193 3358563 2454708 439943 -2142582
9603 -2142582 -3078209 -1953133 -1029997 -1739864 -2532971 -1374334 1541487 4690141 6982006
9594 6982006 7431594 4937911 31849 -4492162 -6267936 -5799716 -5179308 -5604041 -7303672
9585 -7303672 -10372790 -13880281 -15309837 -12951395 -8249145 -4007394 -1018333 1514458
9577 1514458 3072995 2225728 -122370 -1011155 204565 707908 -1178070 -3180905 -2973674
9568 -2973674 -2041309 -2640776 -3356197 -1700999 509108 -719865 -4471533 -5251404 -1402095
9559 -1402095 2022789 1075196 -1233964 -396063 2402554 3154068 2176745 3159068 6487550
9550 6487550 8592668 7690349 5775871 4666142 3919001 3076377 2421493 1112465 -1894385
9541 -1894385 -4545082 -2987000 2865437 8491668 10634140 10761764 11543575 13288060 15318544
9532 15318544 17337927 17544210 13062796 4982650 -304083 1696495 7262077 8831200
9524 8831200 4192960 -1972356 -4620471 -3128269 -56976 1774219 714354 -2849898
9516 -2849898 -6374167 -7162620 -4746141 -773787 2615253 3465390 489137 -5333344 -10430688
9507 -10430688 -11657833 -9331844 -6206121 -4211607 -3318010 -2566079 -866443 2247262
9499 2247262 5391134 6088507 4155595 2767032 4200713 6049533 4259114 -1019954
9491 -1019954 -5366990 -5498261 -2269730 1441914 3406853 2770135 678866 224341 3074178
9482 3074178 5878488 3127407 -5176231 -11560414 -9093629 360699 8344225 9438345
9474 9438345 6274115 4816915 6920582 9089710 7807345 4200603 2501884 4678226
9466 4678226 8051848 8631482 5764454 2602556 2398455 5214067 8368209 9647544 9634953
9457 9634953 10451047 12252154 12206799 8086855 1831654 -2428912 -3329742 -2861651 -2427995
9448 -2427995 -1597206 -1131738 -3205065 -6865325 -7324639 -2776383 1618794 472268 -4062170
9439 -4062170 -5971370 -4567940 -4367084 -6776306 -7942425 -5490596 -1921058 206782
9431 206782 1586358 2743167 1970710 -721347 -1833485 250518 1814555 -533121 -3847553
9422 -3847553 -2860025 1997874 5118302 3494714 -104102 -1859451 -1458761 -1206950 -2841858
9413 -2841858 -5871609 -7811775 -6259519 -1806410 2065363 3287620 3714524 5287659
9405 5287659 5925282 2857983 -1462211 -1656313 2274966 4005207 -17193 -5036417 -4654639
9396 -4654639 356390 3854141 3008062 1035241 1661703 4468318 6543417 6321179 4702932
9387 4702932 3755575 4914179 7430348 8447662 5833124 1014049 -2376322 -2728155 -1584780
9378 -1584780 -283245 2129556 6224881 9679375 10056859 8887912 9768378 12412115 11985229
9369 11985229 5739683 -2532216 -7009886 -6719256 -4909022 -3012591 738611 6490597
9361 6490597 10703872 10908134 9471434 9914316 11655804 11611323 9536212 7969298 7192727
9352 7192727 4342319 -1272352 -5512774 -4503296 -35394 2956845 2968322 2898191 4765202
9343 4765202 6581280 5651186 2803267 1365432 2757082 4919585 5161185 3132044 540357
9334 540357 -825848 4569 2902487 5579818 3874775 -4027556 -13373143 -16087538 -10054481
9325 -10054481 -2373802 -666149 -3687776 -4515820 -1069910 2055174 1972966 1442855 2528369
9316 2528369 2292772 -1348790 -4470106 -3112345 -822410 -3962789 -11442732 -15792083
9308 -15792083 -14157155 -11511675 -11547187 -10819902 -5475838 1071109 2101563 -3014554 -7789342
9299 -7789342 -6521436 -127025 6085540 8301834 7200523 6015179 6272305 6033143 2984682
9290 2984682 -1623419 -3969006 -2241657 1971721 6676761 10916044 12910427 10542138
9282 10542138 5540731 3728954 7952735 13090569 11783336 4083124 -2265821 -1430896
9274 -1430896 3643477 5414481 1211320 -3428784 -1416701 6849434 13078526 10812505
9266 10812505 3632678 788827 5492141 11350372 11039138 4801062 -1295807 -2423994
9258 -2423994 1662996 7732745 11479145 10828619 8163102 7158473 7223645 4825354 756719
9249 756719 459840 4851159 6964146 1897775 -5562774 -8620938 -8384390 -9321099 -9522965
9240 -9522965 -4062511 4634285 8680697 6061154 1915996 -784320 -3254273 -3682763
9232 -3682763 2344707 12156660 15807670 9235191 -46284 -4117120 -4023164 -3670018 -2015735
9223 -2015735 2517679 6064122 4726266 1555948 1492368 2885995 721774 -4266136 -6281218
9214 -6281218 -3086667 1551489 3428426 1692972 -1908654 -4005940 -1472557 4253498
9206 4253498 7081339 4242477 1278566 4298461 10549491 13008789 11798483 13199270
9198 13199270 17989131 19207873 13321363 6046981 3497480 3682148 1614534 -1614007
9190 -1614007 -649992 5170970 10037519 9190546 4567088 1556757 2229992 3653226 2444134
9181 2444134 -827223 -2953987 -2886014 -2964404 -4857097 -6601094 -5429085 -1897515 910458
9172 910458 1315622 374589 206296 2410068 6641950 9183259 5312720 -4071241 -10521935
9163 -10521935 -6929276 2892865 8228887 4917120 -257730 194370 4866659 7185415
9155 7185415 5054824 2398516 2477067 3902657 3900009 2356183 759459 -998009 -3961906
9146 -3961906 -6483276 -4431090 3060175 10379856 11284944 6987666 4612429 7538494
9138 7538494 11414688 10849488 5854574 -313164 -5508994 -8019167 -5529454 1258654
9130 1258654 6939951 7348926 4841132 4084711 5403168 6342227 6827129 7814300 7394600
9121 7394600 3691558 -483517 -1551640 -1655728 -4867292 -8772127 -7405976 -1903214
9113 -1903214 8974 -3976007 -7352939 -5588172 -2546658 -2739556 -4148754 -3241027 -1338514
9104 -1338514 -1064105 -999941 1258262 4298378 5553979 5725890 6561113 6997347 5253200
9095 5253200 2280663 -161910 -2355347 -4541454 -4868792 -2693294 -1202927 -3293278
9087 -3293278 -7101749 -8736439 -7209548 -3998190 -407905 1914223 974855 -1972540
9079 -1972540 -2079543 2516415 7204185 7691448 6560620 8531201 12700900 14770705 14068592
9070 14068592 12779744 10709340 6706624 3194697 3134684 4210771 2329706 -843501
9062 -843501 -843037 763593 -1041467 -3808254 756423 12113311 17876578 10518260 -1369903
9053 -1369903 -5229967 -1053503 2359773 2431988 4273085 9155347 11530756 9026421 7181484
9044 7181484 10645405 15636585 15611648 10471014 5557922 3955993 4189700 4232303 3517081
9035 3517081 1289909 -2986590 -6972344 -6833602 -2634967 754281 -187388 -3495757 -5680997
9026 -5680997 -6560837 -7194514 -6312092 -3256180 -1912821 -5947825 -11398631 -10606918 -3708545
9017 -3708545 887704 -892214 -3299562 -1437162 329152 -3077971 -6927272 -3311093
9009 -3311093 5572710 10173287 8086439 6246757 8067792 7969824 1999678 -4382235 -4551013
9000 -4551013 -825211 -181179 -3639598 -6013475 -4220370 -299199 3048243 4968218
8992 4968218 4449095 415735 -4824709 -5845017 -204126 7593752 10539788 6826665
8984 6826665 1250398 -1007781 -93213 107204 -2125322 -4342755 -3972913 -1876537 -361910
8975 -361910 418706 1751383 3208567 2899716 472986 -2606074 -5499223 -8128666 -9127018
8966 -9127018 -6873297 -3011281 -1475239 -2753044 -2560188 1588137 5588067 3794243
8958 3794243 -3043989 -8422331 -7963701 -3556459 288487 1336953 277465 -1121971
8950 -1121971 -1231788 588270 3122395 4201521 3515189 3658856 6908689 11300745 11907360
8941 11907360 6959660 1069864 256961 4397296 7352600 5132433 911785 2731
8933 2731 2547475 4532731 4412519 4543423 6169656 7055845 5209423 1784809 -889627
8924 -889627 -1344288 1752798 8676640 15457922 15764325 8871176 2034428 1227821 3180595
8915 3180595 1655302 -1705172 -103231 6011266 7860298 1848734 -3676956 -7080
8907 -7080 9608523 15478419 14940429 12819376 10926985 5892455 -1894407 -5616878 -1927848
8898 -1927848 2886059 1544358 -3959072 -6057237 -2379684 2774786 5698467 6282458
8890 6282458 4743419 1116581 -1846291 -754749 2516762 2234963 -2279685 -4320338
8882 -4320338 937783 9362745 13477270 11402134 6413777 856999 -4836556 -8945522
8874 -8945522 -9007759 -5351010 -806178 2878298 5900799 8478950 10544454 12505067 13893314
8865 13893314 12318200 6456037 -771110 -4681029 -3814367 -124233 4523525 9018437
8857 9018437 11194970 9004261 3734782 -610831 -1440798 642290 3472322 4802839
8849 4802839 3333038 444863 -565241 762807 458543 -3570089 -6686157 -3942537
8841 -3942537 1072702 245908 -7056626 -12767304 -11399311 -6014189 -1628603 816434
8833 816434 1640501 -127294 -3135767 -2960875 1318971 4593312 3531731 2065391 4468683
8824 4468683 7461481 5040336 -1845355 -6645891 -6813878 -6201572 -7868533 -9579883 -7882267
8815 -7882267 -3312579 279614 193446 -2437452 -4286420 -4089641 -4345697 -7163375 -9686690
8806 -9686690 -7508988 -2533060 -2019753 -7780791 -11937476 -7553136 1259136 5361668
8798 5361668 3224875 1043169 2027808 2516116 -747880 -5378638 -7521113 -7323405 -7824501
8789 -7824501 -10393185 -12911137 -11807100 -5849569 1418189 4185466 679339 -4547968
8781 -4547968 -6356314 -5057753 -4322235 -5238032 -5883950 -5288999 -3983514 -1366094 3682731
8772 3682731 9582686 12722500 11773907 9092784 7883633 9656611 13487236 15850719
8764 15850719 12848760 5191456 -820707 -322340 3943753 5854888 4197934 2473105
8756 2473105 2224123 1695340 401020 -970 661115 1025995 1540900 3457847 5096079
8747 5096079 4048503 2515736 4681045 8849372 8758819 3789777 1011575 4468316 8682658
8738 8682658 6662378 -505208 -6142833 -6447892 -2797572 1652697 4674511 6293675
8730 6293675 8900925 13511123 15836856 10690897 862450 -4519193 -2324723 762075
8722 762075 -92939 -219012 4870862 9498437 6033628 -1765563 -3201449 3697985 10115686
8713 10115686 9775079 5845336 3300689 2124265 1029919 1755643 5504200 8862335
8705 8862335 7230971 855317 -4930925 -4949166 961735 7591254 9222560 5768394 2735355
8696 2735355 3815088 6094483 5243011 2386992 1495052 2402670 1904378 241168 412999
8687 412999 1715744 529335 -2210070 -1256467 3877918 7031487 4910468 1689720 950979
8678 950979 24722 -3110009 -4161001 -114929 3305495 -382605 -7123068 -7703641 -2060403
8669 -2060403 1069552 -1578401 -3321251 619442 5434417 5189202 2165176 2204611 5475936
8660 5475936 7781440 8052165 8621740 9440694 7619654 2955592 -639886 -432340 1650859
8651 1650859 2230433 879504 -148971 746645 2646379 3101602 701752 -3024923 -4790135
8642 -4790135 -3292005 -732043 638845 1990358 5563199 10014458 11580333 9888915
8634 9888915 8782628 10086589 10283378 6019734 4810 -2248810 -49439 2014646
8626 2014646 1061129 -323209 1505585 5761011 8150668 6108362 1425414 -2051889
8618 -2051889 -2248214 -262001 1387820 1346298 150595 -1019948 -1403674 -593002 1269014
8609 1269014 2809136 2370630 512451 163046 3060374 7345661 10081519 10688828 10130833
8600 10130833 8473307 6027006 5489745 9087560 13706736 12921531 5100851 -3855892
8592 -3855892 -7621605 -6359258 -4342368 -3384580 -2017666 77730 565424 -1903929 -4935804
8583 -4935804 -4721618 -241138 5911866 10578954 12902961 13840999 13911242 12968917 11961859
8574 11961859 12570894 14093195 13077966 8153312 3138643 2528182 5658387 8781701
8566 8781701 11131475 14252844 16473125 14077206 8449305 5591866 6577261 5118715
8558 5118715 -1705326 -6828304 -3167697 4805178 6780359 973996 -4821256 -5295375
8550 -5295375 -3052924 -1506641 300387 3349255 5130690 4053356 3106800 5388749
8542 5388749 8919717 9463745 6515092 3167890 1313729 244894 -225640 1714630 6971326
8533 6971326 12695057 14261598 10530390 5881951 5421680 8515743 9449436 5160398 -546499
8524 -546499 -2436702 -730950 528592 -254170 -1530358 -2618299 -3872383 -3589244 330773
8515 330773 5475340 6656736 3488905 1367058 3417450 6432379 7032216 6780567 7697163
8506 7697163 7223479 2346118 -4388696 -7864143 -7431253 -6402965 -5936195 -4047492 -227746
8497 -227746 3246022 4951515 5903813 7095063 8261501 9387087 10881791 11985690 11251043
8488 11251043 8760338 5888981 3151539 432307 -1241691 -838557 194410 -435546
8480 -435546 -2021846 -2032375 -1095480 -2679374 -6816255 -8549631 -4997219 -98400 1067958
8471 1067958 -341687 553537 4427899 7194476 7037089 7121813 9819326 12189456 10114580
8462 10114580 4643058 934934 1613811 4164562 5328023 5389090 6418729 7998787 7403429
8453 7403429 4086249 1570771 3464923 8865328 13262681 13332105 9471612 4416909 1200804
8444 1200804 1822022 5308683 6987199 2682635 -5315837 -9546308 -6526034 -1514720
8436 -1514720 -1118355 -4094586 -4256014 -785325 542525 -2896345 -5774758 -2721391 3829640
8427 3829640 7817081 8015001 7603779 7776259 7023427 5643465 5688520 6375940 4470653
8418 4470653 159496 -1912373 887789 5403051 7262824 6062036 4083320 2786420
8410 2786420 2643828 3953981 5816283 6434952 5861327 5840456 5661805 1717766 -6499964
8401 -6499964 -13457718 -13802014 -8815440 -3696423 -1186099 -968209 -2252298 -3182581 -703942
8392 -703942 4729888 7281821 3313596 -2228156 -2661374 185395 -367480 -4074547 -4099282
8383 -4099282 1029416 4406082 1406470 -4379434 -8321920 -10541328 -11424133 -8550337
8375 -8550337 -2413224 1033421 -1581260 -5635354 -5774796 -3600065 -3303883 -4463180 -4373399
8366 -4373399 -3163049 -1403399 2812782 8788002 10062102 3132858 -4951530 -5393037
8358 -5393037 -476413 835530 -2662784 -3925174 -432493 2483814 1865340 1261271 2527487
8349 2527487 2218152 -662382 -1307395 2380027 5040156 2512764 -857886 844996 5521117
8340 5521117 6092197 176690 -7851674 -12092767 -9100677 258715 9701513 11852336
8332 11852336 7171503 4630311 9535892 15255062 12580933 3265349 -2836391 -1579414
8324 -1579414 2179522 4103455 5210713 6290877 5021853 1389206 -210547 2147887
8316 2147887 4035249 1763327 -1058342 801429 5162044 5267744 522275 -2099970
8308 -2099970 1357992 5663484 4345636 -471100 -1585077 1789878 2412301 -3860606
8300 -3860606 -11020387 -10808581 -3896573 1822719 2098797 -52807 -1139486 -1763625 -2969292
8291 -2969292 -3154516 -1275718 871970 2260284 4621565 7794461 7319548 1154043 -4784628
8282 -4784628 -3479043 2997051 6298947 3799011 1195488 2624528 4707492 2935514
8274 2935514 -1272997 -3389236 -1978837 1367439 5548322 9887348 12361790 11261614
8266 11261614 7932952 5481292 5232960 6138279 6899790 7132366 7110507 7607007 9204329
8257 9204329 10883954 10504050 7598536 4227229 2096477 738193 -235603 466182 3027611
8248 3027611 4472433 2289247 -1734886 -4536803 -6883514 -11278557 -15722162 -14631603
8240 -14631603 -6835805 1862678 5941335 6177824 6207159 6705635 6231606 5102618 4604681
8231 4604681 3912067 1492439 -1290029 -1510472 771500 2707408 3285112 4190803 5744038
8222 5744038 5916813 4609107 4827755 7227089 7327652 2015797 -4049696 -3601176 2766520
8213 2766520 6713624 3455236 -2183786 -3338264 -263900 2046479 2340262 3884753
8205 3884753 7476575 9028884 5840973 1347964 780890 4435387 8187170 9233840
8197 9233840 8254822 6586657 4546447 2885199 2928933 4268716 4824768 4337281 5068153
8188 5068153 7325772 7392486 3048300 -1426636 -323234 4684710 6261129 2473406 350306
8179 350306 5524023 13112444 13667386 5596264 -3345312 -6060677 -3042746 956420 3107892
8170 3107892 3760794 4027338 3928678 2315416 -1505341 -5402371 -4955339 1502174 9305935
8161 9305935 11781386 7940932 3137168 2171229 4705808 7534835 8013837 4703459 -1839167
8152 -1839167 -7753165 -8623976 -4830874 -1024654 721038 3269787 8255423 12095142
8144 12095142 11302645 7888908 5656350 4424992 2169137 -28976 19423 860491 -293988
8135 -293988 -2059892 -830388 2777400 4652102 3892829 3565581 4772245 5177231 3863070
8126 3863070 2436660 546135 -4209352 -10383057 -12185811 -7431470 -1316277 476939
8118 476939 -1699418 -4436923 -6466523 -7663788 -6674758 -3055006 1117970 4384286 7346886
8109 7346886 8931289 6005110 -101355 -2126129 3346442 9690799 9441469 4693925
8101 4693925 1531360 -830433 -6244397 -10769153 -6817150 2770498 6441277 1340521
8093 1340521 -2286654 2252593 7998565 6925103 2793583 3091517 5787462 3832945
8085 3832945 -2168139 -5569541 -4922124 -4333106 -4384330 -1681342 3111321 5267182 4291790
8076 4291790 4279945 5406282 3180570 -2409192 -5276681 -3271074 -1722214 -3349315 -2667309
8067 -2667309 4210918 11279538 10920363 5136076 1419771 1541940 1752648 983334 1167732
8058 1167732 1306175 -1141536 -3736256 -1294773 5273120 9330375 8353179 6602949 6830049
8049 6830049 6359521 3770437 2735451 5625725 8964188 9254759 8468052 9596190 11234777
8040 11234777 11018991 10289639 10515086 9022589 3911331 -168713 2253650 8026390 8651338
8031 8651338 2504986 -2909984 -1729104 3297588 6441769 6543330 6315891 7718819 10453168
8022 10453168 12648524 11625850 6365555 53579 -2568372 -1120988 97806 -1687472
8014 -1687472 -4657188 -6341929 -6688206 -5710499 -2218180 2789253 5263623 3546612 1425576
8005 1425576 2752280 6005644 7339869 6116228 3994132 1385098 -1375752 -2082963
7997 -2082963 -209696 182796 -3885432 -7940683 -5377609 1962739 5196138 832474
7989 832474 -4726155 -5030530 -1981510 -1160240 -3543029 -5943709 -6538970 -5926337 -4486954
7980 -4486954 -2030115 890276 3502256 5596175 6334687 3994664 -1495946 -7435885
7972 -7435885 -11099811 -11743134 -9095400 -3023976 3703553 6146168 3567516 1510942
7964 1510942 3862443 6472676 3656593 -2040752 -3065287 1600690 5192726 3844379
7956 3844379 1567009 2453916 4108746 2463948 -1466799 -3703580 -3043522 -1153372 569673
7947 569673 1173011 -379216 -2982989 -3078237 552313 4287411 4988387 4636308 5750126
7938 5750126 5708888 1385989 -3099876 -559314 7768756 12443686 9087700 4281490 5041992
7929 5041992 8968197 9819119 7646863 6972028 8143519 7494759 4865488 4128547 5697061
7920 5697061 4841556 -362128 -4804869 -3643912 104852 -187048 -4952113 -7527446 -2963400
7911 -2963400 6023509 12849582 14061848 11188933 7777221 6553309 8311836 11356694
7903 11356694 12095824 8078022 1212655 -3168109 -1486099 4235611 8364603 7146690
7895 7146690 1625256 -4324986 -7623580 -7520503 -4849785 -995279 2450402 3984811
7887 3984811 3134892 1379570 1379433 4141338 7027706 6139103 1343911 -2783892 -2516773
7878 -2516773 237590 1106337 -245527 -451905 1148020 1135435 -1554885 -2598338 979860
7869 979860 4942359 3576013 -1177545 -2089681 2622458 6978359 6564222 4239878 3809020
7860 3809020 3236971 -1242463 -7700955 -10614549 -9008234 -7349830 -8198113 -8578827 -5099328
7851 -5099328 906183 5396413 6276879 3968440 -613570 -6118813 -9930867 -9865899 -6714111
7842 -6714111 -3430513 -1852237 -1611540 -1977047 -2790783 -3198696 -1521436 2187858 4754660
7833 4754660 2980391 -2088477 -5707233 -4781090 -1370691 230681 -862509 -1166181 2011231
7824 2011231 6082736 5867331 576570 -4311203 -3667822 571259 2011870 -1506923 -5264175
7815 -5264175 -4688633 -1643939 -965201 -3054589 -3801733 -1277271 1425955 1025227 -1315148
7806 -1315148 -2001805 114562 2618283 2487977 -739675 -4149376 -3764591 1036825 5643380
7797 5643380 4834510 -605931 -4511175 -3113607 878132 3158406 3216675 2530872 878488
7788 878488 -1868265 -2829250 556804 5561401 6875649 3879796 1161718 1740856 3791453
7779 3791453 4855123 5538274 7341803 9502728 9830764 7307788 3062486 -120556 384865
7770 384865 3834655 5365837 1092041 -6546768 -11595260 -12247938 -11851260 -12312779 -11320480
7761 -11320480 -7553526 -4110711 -4169547 -6683157 -8844280 -9636468 -8565491 -4367115 1871223
7752 1871223 5369681 3103543 -1649967 -3648411 -2460845 -1311062 -1127279 -2980
7744 -2980 2389484 4064456 4422306 5148803 6902305 7885119 6439675 3145046 -89932
7735 -89932 -1616006 -779700 1580427 3433052 3250629 1183658 -1529160 -3089439 -1297251
7726 -1297251 4148141 8996509 7662718 737826 -4402741 -2824412 2045208 4677671
7718 4677671 5097648 5784973 5291288 1257477 -3111827 -2617590 1323925 2549495 7935
7709 7935 -1235242 873408 2196166 -277608 -4197740 -6735994 -7989247 -7643658 -3880720
7700 -3880720 2101215 5718436 5521799 5113097 6436416 6609483 4029197 1910940 2328183
7691 2328183 2223626 -548818 -2265469 986018 7009017 11340647 13154994 12853426 8423175
7682 8423175 -226551 -7266768 -7403231 -3365065 -1263533 -1570791 -816666 782442 470271
7673 470271 -364928 1914445 5618065 5305725 707223 -2863573 -3139729 -3041886 -3664517
7664 -3664517 -2297388 1063636 2201375 114538 -320564 3899883 9055949 10728661
7656 10728661 9603206 8099321 6128134 3709837 3238116 5317961 6428465 4526550
7648 4526550 3031479 5275654 8932949 10391839 10835334 12742183 13609030 9259792 1522119
7639 1522119 -3397147 -3334253 -1459626 317133 3517429 8121336 10711538 9227305 5668940
7630 5668940 2687566 825781 111595 908866 2071259 1664936 622777 1975639 5095539
7621 5095539 5072419 436716 -2811397 806704 7262257 7415551 -650856 -9072022 -10671750
7612 -10671750 -7163274 -4608990 -4531795 -3485972 93596 2887495 1498786 -2554783
7604 -2554783 -4782197 -3507184 -1436271 -1267872 -1805331 29564 4377425 7888516 8309481
7595 8309481 7474381 8149380 9393082 7744881 3036599 124450 3036361 9145270 11743748
7586 11743748 8041694 2138071 -505157 678526 2045373 1061515 -1232785 -2658074
7578 -2658074 -2676645 -2012006 -800878 1528607 4554356 6035631 3837110 -1069122 -4518496
7569 -4518496 -3294519 1005548 3765896 2967918 1016490 487513 685090 235611 742828
7560 742828 4721540 10842324 14366365 12424977 6611778 500985 -3108052 -2815805 635896
7551 635896 3951717 4210890 2486470 1947436 2467520 721170 -3785872 -6973191 -6144818
7542 -6144818 -3647845 -2229794 -853614 1551939 2196780 -1032124 -4253184 -2456094
7534 -2456094 2166816 2890038 -1108840 -3441285 -710185 2196155 -80851 -5165503
7526 -5165503 -6503125 -1946259 5029746 10461691 12514314 10530104 5483523 1137876
7518 1137876 1268821 5030359 7601204 6253105 3523167 3071870 4442392 4379669 2559455
7509 2559455 2816316 7314015 12040079 11328917 6069350 3372471 6930289 11723870 11279447
7500 11279447 6762307 4149031 4406218 2529857 -3400964 -8275553 -7441314 -3261300
7492 -3261300 -671462 129368 2265730 5709988 6813964 3971212 223130 -439372 2512828
7483 2512828 5708963 4940645 -716414 -7146019 -9030866 -6399122 -5060531 -8659085
7475 -8659085 -12823596 -10390821 -834823 9035153 13045727 10996923 6350356 1983493
7467 1983493 -1052892 -2945223 -4216305 -4507137 -2852498 -266753 -212761 -4059344 -7806194
7458 -7806194 -6614239 -1299898 3315080 5283141 6358546 6775955 4585933 783501
7450 783501 -197472 3165796 7131141 8494555 8389819 8321450 7054036 4291497 3133111
7441 3133111 5294552 7401627 5644331 1060795 -3168607 -6405683 -8832318 -8444901
7433 -8444901 -4259491 268479 1697295 1975544 4525907 7534275 6912022 4045315 4065050
7424 4065050 7075382 7740508 4099404 516654 503761 2327400 3599699 4854636 6105362
7415 6105362 4693294 -345481 -5467956 -6931836 -4925167 -1564421 1739417 3172481
7407 3172481 843748 -3479687 -4998561 -2732357 -1404914 -3566759 -4816660 -1267180
7399 -1267180 2950195 1730043 -2699012 -2473056 4098377 10028270 9392426 4159107 223430
7390 223430 944001 5668015 10933600 12102501 7114502 -347221 -4153964 -2649161 476625
7381 476625 2086995 2703313 3300143 3130366 2251738 2618690 4611371 5354897 2606329
7372 2606329 -1904622 -4736033 -4363522 -1434443 2138358 3195197 -551625 -6679696
7364 -6679696 -9343282 -6528611 -2966734 -3212382 -5109556 -3898922 -94563 1564819
7356 1564819 -318391 -2247989 -1753810 -326299 292912 741613 1674703 2201910 2270039
7347 2270039 3709835 7217713 10687221 11919037 10536077 6160625 -1815231 -10527448
7339 -10527448 -13563116 -8415399 -1180612 764058 -1353957 -655852 3736421 4966332
7331 4966332 -294080 -5763385 -4698782 254778 1759947 -1443686 -4752594 -6464759
7323 -6464759 -9221049 -12692179 -11833891 -4781846 2941222 5279502 2654281 -836181
7315 -836181 -3215449 -3953313 -1221996 5172422 10276081 8586271 1490102 -4236977 -4927970
7306 -4927970 -2886263 -1154975 -91004 288545 -916799 -2921798 -3343325 -2474407 -3750218
7297 -3750218 -7968162 -10698911 -8173712 -2712725 714530 796299 -393511 -1670964 -3065391
7288 -3065391 -3358287 -1133549 2136983 3213785 1238099 -1610993 -3122546 -2405732 867874
7279 867874 5680920 8702285 7275497 3366428 1621773 3476184 6130683 7307045
7271 7307045 7483572 6908145 4252262 -228226 -3488374 -3524164 -1652080 632720 3873929
7262 3873929 7532653 8090487 3873729 -556600 925985 7626781 11929169 8017812
7254 8017812 -1538298 -8338955 -6209655 2915427 10588399 10554092 6011868 5395978 10374770
7245 10374770 12966577 7564901 370328 876763 7928107 11972009 9246569 5355181
7237 5355181 4919826 6202723 7266787 8950209 9213687 3182247 -7159504 -11733894
7229 -11733894 -6326377 116225 -1105793 -5345520 -3542868 2384612 3796662 546544
7221 546544 155169 3675640 4239919 84122 -2223827 344126 2525354 1151755 710714
7212 710714 4113680 6492077 3583381 -912686 -1942070 -824145 -861413 -947110 719974
7203 719974 1619050 -580695 -2895619 -1976934 -56731 -537948 -1767819 -852500 222248
7194 222248 -1794862 -5038247 -5425088 -2837144 602957 4489264 7092475 3365582 -7135447
7185 -7135447 -15009645 -11715620 -1633857 4957436 6893478 10087729 13756113 10838820
7177 10838820 1964478 -2965754 498008 5236956 4309715 -30196 -2354587 -1244631
7169 -1244631 2480484 7241693 8014088 188732 -11204862 -14555801 -7190665 739055
7161 739055 1469031 -672883 246530 1271767 -2169647 -6608545 -6389489 -3009075 -982169
7152 -982169 -41038 1251639 -37346 -5303911 -8606355 -5220985 -709100 -2354923 -6630882
7143 -6630882 -5578967 -1463897 -3040984 -9227107 -9251692 -109068 7855402 6095188 -1051096
7134 -1051096 -4653040 -2752570 976079 3988167 5593955 5129863 3171267 1749868
7126 1749868 1369398 736047 283857 2205641 6203731 9193646 9847525 9267501 6954519
7117 6954519 1235710 -5483379 -7436661 -3375211 1032218 669616 -3352607 -7056329
7109 -7056329 -8313671 -6732263 -3268443 -1410431 -4166197 -8584598 -8455064 -3917917
7101 -3917917 -2211643 -6257217 -9205063 -4893535 2128741 3090014 -2533800 -7437684
7093 -7437684 -7132152 -4220291 -2797606 -3459827 -4152294 -2854589 620440 3770706 3522975
7084 3522975 720519 235306 4461520 9283649 9296078 4571090 -827182 -4526126 -6433168
7075 -6433168 -6078505 -3824227 -3153021 -6981721 -12285712 -13021781 -8548471 -4615025 -4892580
7066 -4892580 -5747476 -1909609 5498001 9818468 7042863 649427 -2439365 490328
7058 490328 5657096 8034276 7046871 5582220 4970717 4053706 2819063 3030405 4174593
7049 4174593 2747866 -2087192 -5668714 -3933641 546485 2583400 2124291 3068136 5300334
7040 5300334 3481794 -4713836 -13385252 -14417026 -6962206 1491595 3191391 -2139822
7032 -2139822 -7873322 -8097532 -3630320 321683 1326890 1879326 4159884 6236952 5785190
7023 5785190 4627330 5988053 9054968 10300688 9213040 8290470 7525661 3936556 -2030365
7014 -2030365 -4648323 -777791 4276396 3511941 -1318964 -1648196 5407907 12159994 10567009
7005 10567009 2903451 -2161252 -1395478 659802 497467 539268 3251897 5873161 5111525
6996 5111525 3319218 4987874 9308664 11379271 9688627 7204113 5296789 1939621
6988 1939621 -3174446 -6655512 -6317628 -4086243 -2352004 -1149721 -627658 -2476117 -6631145
6979 -6631145 -9755717 -9202676 -5878098 -1815089 1906960 3634696 1512043 -2830179
6971 -2830179 -4953937 -3854415 -3167552 -4207585 -3163306 1694311 5726410 5274611 3906628
6962 3906628 5813187 7844690 4758454 -1406909 -4408080 -3569214 -3184585 -3968103 -2518991
6953 -2518991 1367501 3827910 3496718 2950596 3613169 4755177 7014941 10985783 12914563
6944 12914563 8316878 -277227 -5804267 -6772246 -7697803 -9314408 -6767232 536913
6936 536913 5605720 3894615 -443816 -2167207 -2270873 -3572035 -5073590 -5347163 -6261272
6927 -6261272 -8930199 -10910112 -11414874 -13746106 -18050276 -17780638 -9236055 948730
6919 948730 4556413 3108691 3132873 4678365 3107582 -980158 -2974533 -3617112 -7468111
6910 -7468111 -12302110 -10042858 -207569 6869396 4103420 -2750663 -4403901 -640829
6902 -640829 2014974 672306 -1830669 -2623633 -1486853 728652 2378975 1000204 -3528314
6893 -3528314 -7019504 -5459086 -345658 3613069 4942406 5864835 7007343 5882307
6885 5882307 1411450 -3640281 -6364006 -7170763 -7742237 -7669943 -5445644 -1709682 650130
6876 650130 -433560 -4131857 -7368936 -6900310 -1808313 4831122 7764201 4710639 -964772
6867 -964772 -4403440 -5112627 -6176237 -8330452 -8545898 -5295521 -1445862 136641 450330
6858 450330 953651 -416377 -5509536 -10524980 -9730805 -4061776 -497963 -2058714 -3772776
6849 -3772776 -771153 4459502 6377326 4242610 1515734 -171519 -2031828 -4209912
6841 -4209912 -4917929 -3436454 -841356 2276979 5952101 8656160 8147723 5419778 4969452
6832 4969452 9308430 15038724 16538757 12782979 8427280 7851850 9803128 9356934 4695908
6823 4695908 -20416 310823 5142770 8882373 7870203 4296398 2344690 2780092 3183645
6814 3183645 1967051 -91426 -1634310 -2096941 -1539017 -623989 -504024 -1370447 -1533118
6805 -1533118 466605 3037766 2647566 -1799054 -7043045 -8673293 -5569809 -714599
6797 -714599 1975303 1351704 -218500 209719 2591274 3986158 2477946 -202730 -1051470
6788 -1051470 141743 685034 -1392256 -5208615 -8580900 -10164977 -9609132 -6969653 -2911416
6779 -2911416 1259609 4530705 6649523 7244662 5504455 1845586 -948182 -244355 2577672
6770 2577672 2923285 -1099239 -5529096 -5747133 -3396799 -4267568 -9092291 -11110861 -5455787
6761 -5455787 2902289 5163931 583205 -3085372 -916022 2914325 2170550 -2574360
6753 -2574360 -5607211 -4079348 -685688 809889 -251399 -1984790 -2836959 -3122284 -4087493
6744 -4087493 -5719231 -6096381 -3848361 -686750 308856 -1072781 -1709580 587054 4342545
6735 4342545 6783797 7152863 6675313 6631237 7295987 7832787 7140706 5826643 6315184
6726 6315184 8899786 9315240 4165416 -2267735 -2126332 4671887 9438977 7169232 3423736
6717 3423736 4722472 8206231 7033298 1595802 -1909438 -1622303 -1403766 -2884294 -2988402
6708 -2988402 -50236 3304687 4643256 4624641 4497678 4659157 6142550 9392878 11214522
6699 11214522 7565606 236842 -4031833 -2525835 115052 -458870 -2228640 -1588942
6691 -1588942 76421 -928882 -4013318 -5035598 -2535604 911176 3410031 6034802
6683 6034802 9374143 10801222 7573657 1604263 -1330396 1973631 7807465 9271216
6675 9271216 4044998 -3388290 -7555312 -7743172 -6750446 -6308325 -6132486 -5884334 -5288927
6666 -5288927 -3259314 442438 3498675 3754707 2905377 4352018 7717818 8875547 5850297
6657 5850297 1604690 -20678 1305402 3147049 3581591 2691113 1788297 1666297 1461090
6648 1461090 148733 -680292 1893309 6828433 8759077 5710774 3055856 5185624
6640 5185624 7442251 3309917 -3393512 -2617987 6076077 11471958 6703934 -1669439
6632 -1669439 -4607057 -2506948 -577838 905554 4602738 8755028 8955667 5187352
6624 5187352 1610173 887002 2837371 6536880 9766955 8882462 3419619 -1577060 -1902194
6615 -1902194 -128919 -848650 -3114773 -3018308 -1059154 -672908 -1273823 408007 2850228
6606 2850228 764002 -5729154 -9664191 -6862717 -1271262 1647165 1731094 1558145 1686125
6597 1686125 1921660 3671678 7167554 8885906 5606349 -367965 -3433121 -1438077
6589 -1438077 2625263 5323291 6392598 7143909 7537376 6396055 3715850 1289852 746126
6580 746126 1816911 3155975 4149343 4812561 4485294 2526213 398953 764198 3581622
6571 3581622 5409233 4128785 2175566 2900765 5632228 7069359 6140192 4304820 1817526
6562 1817526 -2769218 -8920808 -12918240 -11770957 -6854104 -2610136 -2300015 -5385250
6554 -5385250 -8570906 -9168954 -7202151 -3764832 1545851 9116215 15619672 15766054 9221990
6545 9221990 2029800 -1155709 -2318601 -4468134 -5265513 -1402379 4158338 5774974
6537 5774974 3978278 3942299 6083618 5521309 1410782 -591984 2605522 6468060 5905153
6528 5905153 1953373 -1867863 -4801506 -6732765 -5542538 -1098849 1846272 -457452
6520 -457452 -4768714 -5436370 -2734621 -1748761 -4279896 -6680073 -5565086 -1637809 2608023
6511 2608023 5851419 7943691 9078328 9348013 7898462 3219877 -4178810 -10475429
6503 -10475429 -11931288 -8810218 -4248232 -487364 1828117 2256049 1223764 989039
6495 989039 3152101 6094543 7479568 7894234 8724381 8026485 3248421 -2515813 -2666932
6486 -2666932 3306300 7915798 6015742 1913452 1978599 4542033 3191668 -2235264 -4988237
6477 -4988237 -2096770 814376 -1831734 -7015978 -7346308 -961455 7041670 11639724
6469 11639724 12261558 10543336 7711364 5212706 4981063 7379076 10319875 11275989 9023963
6460 9023963 3618934 -3123782 -7071320 -4789375 1744856 6283221 5644992 3069589
6452 3069589 2569028 3406223 2924463 1261164 -795706 -5344958 -13223611 -18626648 -14867510
6443 -14867510 -5285483 -1107240 -6631640 -13380631 -12399162 -6092873 -2571631 -3173205
6435 -3173205 -2614911 843969 2810348 691988 -2051696 -1791901 -223947 -785336 -2554071
6426 -2554071 -1520624 2944365 6312556 4588516 -220370 -2258959 875511 4928414
6418 4928414 4170938 -1528036 -6817400 -7650780 -5548914 -4493382 -5901554 -8197410 -9662138
6409 -9662138 -9780496 -8672561 -6937267 -5680373 -5530470 -6045167 -6727256 -7573078 -7873464
6400 -7873464 -6171441 -2884560 -1160037 -2787588 -4659958 -2311263 3667063 8086309
6392 8086309 8191281 6704839 6733983 7259882 6293692 5554153 7874903 11201982 9974058
6383 9974058 3347904 -2364374 -2046767 1020622 345531 -3869092 -5568688 -3142590 -2433489
6374 -2433489 -7111295 -11845747 -9824959 -3028557 1009660 468658 635574 4411122 8174962
6365 8174962 8706321 8094824 8571737 7527711 2231337 -3797114 -4231323 1348129 6341820
6356 6341820 4857413 -2189676 -8867793 -10098460 -5519234 1033033 5362454 6475431
6348 6475431 6163925 5636558 4148360 985578 -3101550 -6782543 -8637587 -6873813 -1167268
6339 -1167268 5054906 7301182 5506367 3483345 2519540 31286 -4157938 -5611706
6331 -5611706 -2358691 744773 -1197085 -6021229 -8475334 -7528788 -5205727 -1933362
6323 -1933362 1736122 2370604 -1385225 -4216763 -1081803 3957879 3233233 -2207244 -4077247
6314 -4077247 1751 3525107 2171820 -534771 -776809 27125 83746 542959 776924
6305 776924 -2709264 -8821091 -10181293 -3790011 2835024 1943104 -3423850 -5217585 -2737924
6296 -2737924 -1739640 -3860336 -4533522 -938719 4173251 6914047 5792588 911904 -5921688
6287 -5921688 -10358069 -9156671 -5067155 -4186889 -8015352 -11799619 -11298509 -7439836 -3171187
6278 -3171187 720258 4603987 7469481 8040291 7368454 8042196 10555201 11843522 8595269
6269 8595269 1840147 -3382845 -4058737 -3078702 -4414030 -6041248 -2540355 5120188 8540395
6260 8540395 3440769 -3419174 -3705461 610003 1045777 -4651317 -10511883 -11926025 -10361980
6251 -10361980 -8213173 -5275971 -1843116 40326 337116 1589676 4007441 4269686
6243 4269686 1119506 -2000940 -2083142 -422744 945364 2733439 5440516 6528243 4023463
6234 4023463 151967 -1919237 -2403735 -2723600 -1828733 1270806 3652968 2022139 -1185080
6225 -1185080 -443940 4093071 5609140 -55505 -8284906 -11419709 -7738472 -1920230
6217 -1920230 1644684 3009899 4619998 7659152 11155615 13348058 13010642 9971324
6209 9971324 5287053 1137224 -203060 1733766 4700274 5711787 4344219 3092620
6201 3092620 3809028 5015086 4150073 1561450 179624 1309425 2948883 3036567 2382036
6192 2382036 2881954 4326819 5070764 5094589 5931405 7476728 7581015 6023395 6347716
6183 6347716 11171230 17199199 18329773 13623897 8717665 8239746 10108224 9564099 6075733
6174 6075733 2889599 1404519 -62947 -2229721 -3343982 -2436093 -897352 234046
6166 234046 1597397 2758009 1269101 -3132581 -5988709 -3058321 3579140 7632258
6158 7632258 6232165 2317829 -534654 -2261512 -4204445 -5863811 -6031310 -5415296 -5597281
6149 -5597281 -6091803 -4955748 -2458795 -1676075 -4162938 -6890362 -5656101 -805681 2880325
6140 2880325 2275345 -499445 -1745490 -1274105 -1545841 -2990478 -3107601 -440455 2880627
6131 2880627 3492129 456860 -3841827 -5505378 -2217091 3779680 6324400 1614457
6123 1614457 -6072085 -8210110 -2609238 3412198 2599948 -3018020 -6053057 -4082150
6115 -4082150 -1162038 -322888 -170906 230453 -1611060 -6837999 -11176002 -9568918 -3367936
6106 -3367936 594416 -1982520 -8213650 -11681098 -8974257 -2132759 4033998 6203427
6098 6203427 4719304 2343273 1228908 1413229 2071486 3044463 4138049 3786308 337694
6089 337694 -4935895 -7856755 -5767359 -998614 1801503 1359829 597395 1489765 1985196
6080 1985196 -3748 -2050704 -269943 4180809 6058453 3967108 2679134 5408705
6072 5408705 8179678 5801202 147909 -2671961 -1627185 -1454389 -4169796 -5844146
6064 -5844146 -3614717 -656715 -873743 -2579963 -1617606 1650034 2795261 -117070 -4139907
6055 -4139907 -5659631 -4231001 -1982456 -1371696 -3667940 -7709521 -9994889 -7786930
6047 -7786930 -2397207 2045069 3032717 1312199 -1638185 -5383827 -9054514 -10231987
6039 -10231987 -7088781 -956777 4453656 6339556 5033369 3436012 4392119 7885067
6031 7885067 10533912 8671392 2428294 -3905601 -6212911 -4752198 -3282414 -4218464
6023 -4218464 -5736891 -4497652 -755690 962044 -2460850 -7522853 -7221105 107749
6015 107749 7751714 8328929 2457189 -3018363 -3971944 -2396452 -1033125 987953 5013166
6006 5013166 8531287 7436935 1765170 -3570827 -4071528 -251256 3198915 2070104
5998 2070104 -3228581 -7559372 -5867883 990897 6307674 4854446 -863027 -3810090
5990 -3810090 -1226172 2703667 3415622 1898682 1888653 3633748 4020285 2146488 855337
5981 855337 1671818 1626741 -2298687 -7750985 -9441401 -6320529 -2871232 -2749999 -4396380
5972 -4396380 -4566278 -3428964 -3377417 -4341594 -3520440 259056 4500852 6087033 4703423
5963 4703423 2483642 1408716 1789788 2619072 2771300 1927141 382652 -1717010 -3965248
5954 -3965248 -4516839 -1272582 4683972 8954772 9126169 8151352 9582158 11354814 8487892
5945 8487892 1084714 -5182382 -6908204 -6370774 -5910670 -4086656 -94934 2678908 1429229
5936 1429229 -1225572 -1248726 796307 1906840 2208994 3635116 5110258 4343675 3131439
5927 3131439 5116797 8498930 7000665 -656026 -7745651 -8369838 -4700951 -2360210
5919 -2360210 -2266508 -879075 3513953 8266043 9559408 6092842 135752 -3991754 -3445636
5910 -3445636 377115 3663792 4737726 4758503 4097601 1460143 -2496296 -4569428 -4052912
5901 -4052912 -4513331 -7543864 -8502805 -2867852 5954523 10478709 9322298 7835108 8727685
5892 8727685 8151866 3006260 -3117306 -4862514 -2544153 -689817 -1144476 -1621318 -416338
5883 -416338 1159963 1505941 853228 -393170 -2893970 -6250183 -7637105 -5009857 -694538
5874 -694538 880864 -1032527 -2582818 -742520 2957596 5406276 6050623 5922843 4853625
5865 4853625 2737380 1927729 4580166 8286367 8353597 4537415 1462051 1641082 2320069
5856 2320069 837591 -984204 -247918 2721564 6163098 9676413 12255897 10821218
5848 10821218 4512595 -2080292 -3908851 -1738202 45419 -501478 -2842383 -7038207
5840 -7038207 -11702664 -11432338 -2787896 8359716 12362544 8501858 5005703 5840744
5832 5840744 5753924 1155618 -2516758 110411 4572648 3242654 -2362581 -3772076 1678933
5823 1678933 7664946 8753898 7181198 7820370 10917575 12581671 10162387 4893038
5815 4893038 -24065 -2841434 -4757796 -7746732 -11047510 -11523856 -8212576 -4113798
5807 -4113798 -1778455 253604 3976421 7477870 7735471 5978383 5892188 7550578 7755610
5798 7755610 5906129 4514259 3703772 705244 -3857284 -4894210 -858567 2425969
5790 2425969 60340 -4230444 -3956383 -90788 969418 -1894603 -2868885 1069087 5352643
5781 5352643 5383332 3371987 3509700 4430072 1791192 -3811678 -7128850 -6129883 -4492953
5772 -4492953 -5389915 -7422738 -8460471 -9097592 -9465232 -6647747 428488 6358497 4778698
5763 4778698 -2530117 -7176511 -4818804 593896 3825757 4223285 2573746 -2480663
5755 -2480663 -10681948 -16528274 -14625247 -7257658 -2152252 -3000515 -5835795 -4984030 450090
$$ [...]
##END NTUPLES=NMR SPECTRUM
##END=
