##TITLE=31Pdec_MTA2309
 CDcl3, 24 sc
 23.9.2020
##JCAMPDX= 6.0         $$ Bruker NMR JCAMP-DX V2.0
##DATA TYPE= NMR SPECTRUM
##DATA CLASS= NTUPLES
##ORIGIN= UXNMR, Bruker Analytische Messtechnik GmbH
##OWNER= root
$$ XWIN-NMR		Version 3.5
$$ Wed Sep 23 12:28:41 2020 Russian Standard Time (UT+4h)  she@DPX200
##.OBSERVE FREQUENCY= 81.013821
##.OBSERVE NUCLEUS= ^31P
##.ACQUISITION MODE= SIMULTANEOUS
##.ACQUISITION SCHEME= undefined
##.AVERAGES= 24
##.DIGITISER RES= 17
##SPECTROMETER/DATA SYSTEM= spect
##.PULSE SEQUENCE= zgpg30
##.SOLVENT NAME= CDCl3
##.SHIFT REFERENCE= (INTERNAL, CDCl3, 0, 182.463)
##AUDIT TRAIL= $$ (NUMBER, WHEN, WHO, WHERE, WHAT)
$$ ##TITLE= Audit trail, XWIN-NMR		Version 3.5
$$ ##JCAMPDX= 5.01
$$ ##ORIGIN= Bruker BioSpin GmbH
$$ ##OWNER= she
$$ F:/spectra/data/she/nmr/P31/1/pdata/1/auditp.txt
$$ ##AUDIT TRAIL=  $$ (NUMBER, WHEN, WHO, WHERE, WHAT)
(   1,<2020-09-23 12:27:57.98 +0400>,<she>,<DPX200>,
      <created by zg, POWCHK disabled, PULCHK disabled
       configuration hash MD5:
       00 E9 B6 7A A2 85 ED C7 34 08 36 98 17 FE 4E 26
       data hash MD5: 32K
       21 48 E7 FF BE 7A 5A 1A 2A AC 87 C4 CB F9 5F 50>)
(   2,<2020-09-23 12:28:00.17 +0400>,<she>,<DPX200>,
      <Start of raw data processing
       efp BC_mod = 2 LB = 1 FT_mod = 6 PKNL = 1 PHC0 = -2745.733 PHC1 = 80.00166 SI = 64K 
       data hash MD5: 64K
       33 61 69 22 3D B8 4F 8A A9 D3 08 DF B9 70 2D 5D>)
(   3,<2020-09-23 12:28:13.46 +0400>,<she>,<DPX200>,
      <pk PHC0 = -15.78439 PHC1 = 0 
       data hash MD5: 64K
       C8 67 27 07 AA 00 D4 A8 E7 52 21 BA A1 10 6D 65>)
(   4,<2020-09-23 12:28:16.84 +0400>,<she>,<DPX200>,
      <abs ABSG = 5 
       data hash MD5: 64K
       18 49 43 C0 48 25 27 B2 F2 E0 82 CE D9 FC B9 01>)
$$ ##END=
$$ 
$$ hash MD5
$$ 7C 3B 95 ED 2C B5 F9 FC 21 77 BE 14 2D A4 87 D4
##$RELAX= 
##$RELAX= 
##$RELAX= 
##$RELAX= 
##$RELAX= 
##$RELAX= 
##$RELAX= 
##$RELAX= 
$$ Bruker specific parameters
$$ --------------------------
##$DU= <F:/spectra>
##$EXPNO= 1
##$NAME= <P31>
##$PROCNO= 1
##$TYPE= <nmr>
##$USER= <she>
##$AMP= (0..31)
100 100 100 100 100 100 100 100 100 100 100 100 100 100 100 100 100 100 
100 100 100 100 100 100 100 100 100 100 100 100 100 100 
##$AQSEQ= 0
##$AQ_mod= 1
##$AUNM= <au_zg>
##$AUTOPOS= <>
##$BF1= 81.014009
##$BF2= 200.13
##$BF3= 200.13
##$BF4= 200.13
##$BF5= 200.13
##$BF6= 200.13
##$BF7= 200.13
##$BF8= 200.13
##$BYTORDA= 1
##$CFDGTYP= 0
##$CFRGTYP= 5
##$CHEMSTR= <none>
##$CNST= (0..31)
1 1 145 1 1 1 1 1 1 1 1 1 1 1 1 1 1 1 1 1 1 1 1 1 1 1 1 1 1 1 1 1 
##$CPDPRG= <waltz16>
##$CPDPRG1= <>
##$CPDPRG2= <waltz16>
##$CPDPRG3= <>
##$CPDPRG4= <mlev>
##$CPDPRG5= <mlev>
##$CPDPRG6= <mlev>
##$CPDPRG7= <mlev>
##$CPDPRG8= <mlev>
##$CPDPRGB= <>
##$CPDPRGT= <>
##$D= (0..31)
0 1 0 0 0 0 0 0 0 0 0 0.03 2e-05 3e-06 0 0 0 0 0 0 0 0 0 0 0 0 0 0 0 0 
0 0 
##$DATE= 1600849677
##$DBL= (0..7)
120 120 120 11 120 120 24 19 
##$DBP= (0..7)
150 150 150 150 150 150 150 150 
##$DBP07= 0
##$DBPNAM0= <>
##$DBPNAM1= <>
##$DBPNAM2= <>
$$ [...]
##$SUBNAM3= <"">
##$SUBNAM4= <"">
##$SUBNAM5= <"">
##$SUBNAM6= <"">
##$SUBNAM7= <"">
##$SUBNAM8= <"">
##$SUBNAM9= <"">
##$SW= 369.568048894756
##$SWIBOX= (0..15)
0 1 3 0 0 0 0 0 0 0 0 0 0 0 0 0 
##$SW_h= 29940.119760479
##$TD= 32768
##$TD0= 1
##$TE= 0
##$TE2= 300
##$TE3= 300
##$TEG= 300
##$TL= (0..7)
0 120 53 12 22 120 120 120 
##$TP= (0..7)
150 150 150 150 150 150 150 150 
##$TP07= 0
##$TPNAME0= <>
##$TPNAME1= <>
##$TPNAME2= <>
##$TPNAME3= <>
##$TPNAME4= <>
##$TPNAME5= <>
##$TPNAME6= <>
##$TPNAME7= <>
##$TPOAL= (0..7)
0.5 0.5 0.5 0.5 0.5 0.5 0.5 0.5 
##$TPOFFS= (0..7)
0 0 0 0 0 0 0 0 
##$TUNHIN= 0
##$TUNHOUT= 0
##$TUNXOUT= 0
##$USERA1= <user>
##$USERA2= <user>
##$USERA3= <user>
##$USERA4= <user>
##$USERA5= <user>
##$V9= 5
##$VALIST= <valist>
##$VCLIST= <CCCCCCCCCCCCCCC>
##$VD= 0
##$VDLIST= <DDDDDDDDDDDDDDD>
##$VPLIST= <PPPPPPPPPPPPPPP>
##$VTLIST= <TTTTTTTTTTTTTTT>
##$WBST= 1024
##$WBSW= 4
##$XGAIN= (0..3)
0 0 0 0 
##$XL= 0
##$YL= 0
##$YMAX_a= 12885
##$YMIN_a= -29381
##$ZGOPTNS= <>
##$ZL1= 120
##$ZL2= 120
##$ZL3= 120
##$ZL4= 120
##$ABSF1= 182.463
##$ABSF2= -187.1042
##$ABSG= 5
##$ABSL= 3
##$ALPHA= 0
##$AQORDER= 0
##$ASSFAC= 0
##$ASSFACI= 0
##$ASSFACX= 0
##$ASSWID= 0
##$AUNMP= <proc_1d>
##$AZFE= 0.1
##$AZFW= 0.5
##$BCFW= 0
##$BC_mod= 2
##$BYTORDP= 0
##$COROFFS= 0
##$CY= -3
##$DATMOD= 1
##$DC= 0
##$DFILT= <>
##$DTYPP= 0
##$F1P= 0
##$F2P= 0
##$FCOR= 1
##$FTSIZE= 65536
##$FT_mod= 6
##$GAMMA= 0
##$GB= 0
##$INTBC= 1
##$INTSCL= 5.30512e-09
##$ISEN= 30
##$LB= 1
##$LEV0= 0
##$LPBIN= 0
##$MAXI= 10000
##$MC2= 0
##$MEAN= 0
##$ME_mod= 0
##$MI= 50
##$NCOEF= 0
##$NC_proc= -7
##$NLEV= 6
##$NOISF1= 182.463
##$NOISF2= 159.3651
##$NSP= 0
##$NTH_PI= 0
##$NZP= 0
##$OFFSET= 182.463
##$PC= 4
##$PHC0= -2761.517
##$PHC1= 80.00166
##$PH_mod= 1
##$PKNL= yes
##$PPARMOD= 0
##$PSCAL= 0
##$PSIGN= 0
##$REVERSE= no
##$SF= 81.0140089999434
##$SI= 65536
##$SIGF1= 159.3651
##$SIGF2= -187.1042
##$SINO= 113.3802
##$SIOLD= 16384
##$SREGLST= <1H.CDCl3>
##$SSB= 0
##$STSI= 65536
##$STSR= 0
##$SW_p= 29940.119760479
##$SYMM= 0
##$S_DEV= 0
##$TDeff= 32768
##$TDoff= 0
##$TI= <>
##$TILT= no
##$TM1= 0
##$TM2= 0
##$TOPLEV= 0
##$USERP1= <user>
##$USERP2= <user>
##$USERP3= <user>
##$USERP4= <user>
##$USERP5= <user>
##$WDW= 1
##$XDIM= 65536
##$YMAX_p= 357120467
##$YMIN_p= -80116603
$$ End of Bruker specific parameters
$$ ---------------------------------
##NTUPLES= NMR SPECTRUM
##VAR_NAME=  FREQUENCY,     SPECTRUM/REAL,   SPECTRUM/IMAG
##SYMBOL=    X,             R,               I
##VAR_TYPE=  INDEPENDENT,   DEPENDENT,       DEPENDENT
##VAR_FORM=  AFFN,          ASDF,            ASDF
##VAR_DIM=   65536,         65536,           65536
##UNITS=     HZ,            ARBITRARY UNITS, ARBITRARY UNITS
##FACTOR=    0.456856943014862, 1,           1
##FIRST=     14782.0589164792, 0,            0
##LAST=      -15158.0608439998, 0,           0
##MIN=       -15158.0608439998, -80116603,   0
##MAX=       14782.0589164792, 357120467,    0
$$ Real data points
##PAGE= N=1
##DATA TABLE= (X++(R..R)), XYDATA
$$ [...]
39663g668892K915624O666426O610482J070091m748058m862933n92212J424286
$$ -7668892 -4753268 1913158 8523640 9593731 4845673 -17260 -609472 814814
39655H14814j263818l998041k682699K57001N11805j146546p82068J794509K707940
$$ 814814 -449004 -4447045 -7129744 -6872743 -6360938 -7507484 -8289552 -6495043 -3787103
39646c787103M00127j903642j246957Q45592J178551k97986q90758N48047K023528
$$ -3787103 -3386976 -5290618 -6537575 -5691983 -4513432 -4811418 -5702176 -5154129 -3130601
39637c130601J360452p88994j822421m14033K120049L552420K856035M49729k389288
$$ -3130601 -1770149 -2559143 -4381564 -4795597 -2675548 876872 3732907 4182636 1793348
39628A793348l683267j827448J986579L706682R39020l372376m352275j573285
$$ 1793348 -1889919 -3717367 -1730788 1975894 2914914 -457462 -4809737 -6383022
39620f383022J164192K037351L000567M653484M030558q4346l756797l233974
$$ -6383022 -5218830 -3181479 -180912 4472572 8503130 8418784 4661987 1428013
39612A428013m46496N81699K7796O21651J825757O22505k734912m464862k803177
$$ 1428013 981517 1563216 1591012 2212663 4038420 4660925 1926013 -2538849 -5342026
39603e342026J73811K381028L541760K970049l26280m324368m642948l42866L927652
$$ -5342026 -5168215 -2787187 754573 3724622 3398342 -926026 -5568974 -5911840 -1984188
39594a984188L615822j25145k470991r99067K138411L377218J730412m43454m59362
$$ -1984188 1631634 1506489 -964502 -1963569 174842 3552060 5282472 4839018 4379656
39585D379656J145824J281530j002627k665936j274076R53116P35673o87244K24338
$$ 4379656 5525480 6807010 5804383 3138447 1864371 2817487 3553160 2865916 3090254
39576C090254K677655K107087k390969o008066m966486j231612J264816J586711
$$ 3090254 5767909 7874996 5484027 -524039 -5490525 -6722137 -5457321 -3870610
39568c870610J028751M18997K37032J035111K086336J780513M72808L67019J520845
$$ -3870610 -2841859 -2422862 -2185830 -1150719 935617 2716130 3188938 3555957 5076802
39559E076802J082502j908764m177403k945585k27110L34401j184560j665384
$$ 5076802 6159304 4250540 73137 -2872448 -3099558 -2765157 -3949717 -5615101
39551e615101K78873K767428L427927J954692j1056p54796l03688q4273l46994
$$ -5615101 -5336228 -2568800 859127 2813819 2802763 2047967 1744279 1660006 1313012
39542A313012N16148K479874K098496k342466o108259l644604K353263L944197
$$ 1313012 1829160 4309034 6407530 4065064 -2043195 -5687799 -3334536 609661
39534F09661n9440k536894P981K110970m10751k844876q4330L959394K829610
$$ 609661 550221 -1986673 -1978692 132278 -278473 -3123349 -3207679 751715 3581325
39525C581325j576865k692466n04857o37903l830703m665272j013111K563426
$$ 3581325 2004460 -688006 -1192863 -1830766 -5661469 -10326741 -11339852 -8776426
39517h776426K233140j87604j409912r47233L75921K135031L114915J869109m27015
$$ -8776426 -6543286 -6730890 -8140802 -9088035 -8712114 -6577083 -3462168 -1593059 -2020074
39508b020074p73281J221872K617003J421903j123976k884569k823147o43604
$$ -2020074 -2793355 -1571483 1045520 2467423 1343447 -1541122 -4364269 -5007873
39500e007873K851386N087627M042849J088302q45141j169959j155084r23724
$$ -5007873 -2156487 2931140 6973989 8062291 7217150 6047191 4892107 3968383
39492C968383k13669o31734l165835m794962k214515K022447K275477j595506
$$ 3968383 3754714 3122980 -42855 -4837817 -7052332 -5029885 -2754408 -4349914
39484d349914l852796j474403K244366L592151K775976J136963r47235j951973
$$ -4349914 -8202710 -9677113 -7432747 -3840596 -1064620 72343 -874892 -2826865
39476b826865N4408L010222K246468k007563l888280q97120K068263Q52877j424286
$$ -2826865 -2772457 237765 2484233 476670 -3411610 -4308730 -2240467 -1387590 -2811876
39467b811876l13077K419988K414560J34797q51608l97969j153555k975574k952370
$$ -2811876 -3124953 -704965 1709595 1844392 992784 594815 -558740 -3534314 -6486684
39458f486684l48054K534350L970968M009564K772811O27694p42082k69679L83223
$$ -6486684 -6834738 -4300388 -329420 3680144 6452955 7080649 6338567 6068888 6452111
39449F452111p30425k517749k752701j892103j771428j750354J47280K909382
$$ 6452111 5721686 3203937 451236 -1440867 -3212295 -4962649 -4815369 -1905987
39441a905987L204504N47443j646227r23193J042824J133322j328879m196058
$$ -1905987 1298517 1845960 199733 -723460 319364 1452686 123807 -4072251
39433d072251m758801k179882J386752K604740R40379l01331J506491M283208
$$ -4072251 -8831052 -11010934 -9624182 -7019442 -6079063 -6380394 -4873903 -590695
39425e90695M157516J125913j324403j566326j274308j369736j94534K926674
$$ -590695 3566821 4692734 3368331 1802005 527697 -842039 -1036573 1890101
39417A890101N252102L850668m02409l876635m275482k325545j24676R16817O69058
$$ 1890101 7142203 10992871 10590462 6713827 2438345 112800 -11876 904941 1573999
39408A573999l23424j677598l205156m115047l093489j01226K635953K872505
$$ 1573999 1250575 -427023 -3632179 -7747226 -10840715 -10941941 -8305988 -5433483
39400e433483J274393N18628J470821K072124O42980j406808j521705L16712J483656
$$ -5433483 -4159090 -3640462 -2169641 -97517 545463 -861345 -2383050 -2066338 -582682
39391e82682K55881j879820k164817j44127J723488J147729j169400k448333j104250
$$ -582682 -326801 -2206621 -4371438 -4515565 -2792077 -1644348 -2813748 -5262081 -6366331
39382f366331J689232L503924K942228N38061j809394k328313j040098J90261
$$ -6366331 -4677099 -1173175 1769053 2307114 497720 -1830593 -2870691 -2680430
39374b680430q980o01693K43854K092555K561195P70185j369205j835627q24546
$$ -2680430 -2689410 -3291103 -3047249 -954694 1606501 2376686 1007481 -828146 -1652692
39365a652692K65707O37990J13296j202555k361021j972559j40396J101981K52622
$$ -1652692 -1386985 -748995 -635699 -1838254 -4199275 -6171834 -6312230 -5210249 -4957627
39356d957627j612589k084752j19120K974246M712700L605672P99278q54751k43042
$$ -4957627 -6570216 -8654968 -8774088 -5799842 -1087142 2518530 3317808 2463057 2220015
39347B220015N05364n65451j848157q36383J204613J009373r16108q39881J607438
$$ 2220015 2725379 2159928 311771 -524612 680001 1689374 773266 -66615 1540823
39338A540823K373811j27658k099911p38947J171976K96085j786947j966760r00468
$$ 1540823 3914634 3786976 1687065 948118 2120094 2416179 629232 -1337528 -2237996
39329b237996p59708p06495R09028K234093M55982k926912l751928j129263J979474
$$ -2237996 -2997704 -3704199 -2795171 -561078 -105096 -3032008 -6783936 -7913199 -5933725
39320e933725L140675K174364j74262k163698j329983J984753L481483P69211
$$ -5933725 -2793050 -618686 -792948 -2956646 -4286629 -2301876 1179607 1948818
39312A948818k233434j047872K024351J755345j205514j930534k01170n49262
$$ 1948818 -284616 -1332488 691863 2447208 1241694 -688840 -890010 -1439272
39304a439272l318354l317568R21370L694958J051358k908916k677352N18588
$$ -1439272 -4757626 -8075194 -7153824 -3458866 -2407508 -5316424 -7993776 -7475188
39296g475188J726166L0495j232502j30327J883647K881031K576188J726984R56472
$$ -7475188 -5749022 -5718527 -6951029 -7081356 -5197709 -2316678 259510 1986494 2942966
39287B942966M7195j821934m337968n138711k521127J470588L174955K171304
$$ 2942966 2990161 1168227 -3169741 -8308452 -10829579 -9358991 -6184036 -4012732
39279d012732J166749J398867J541336J138245J382275K061435J441107k57981
$$ -4012732 -2845983 -1447116 94220 1232465 2614740 4676175 6117282 5859301
39271E859301r59063p01863j441439k476225q44362K751170L587780K29946k948260
$$ 5859301 4900238 4198375 2756936 280711 -563651 2187519 5775299 6005245 3056985
39262C056985k780798j645761j987135j823126N42772K254320Q13552r91598J41490
$$ 3056985 276187 -1369574 -3356709 -5179835 -4637063 -2382743 -1569191 -2560789 -2419299
39253b419299K077923J162283j138692r00610J508107K739612K434887K452651
$$ -2419299 -341376 820907 -317785 -1218395 289712 3029324 5464211 7916862
39245G916862J935543j047176m043073k520166K339171L982776k49553n269731
$$ 7916862 9852405 8805229 4762156 2241990 4581161 8563937 8314384 3044653
39237C044653n490808j801547J020130P97245p31166j408707j179774j259109
$$ 3044653 -2446155 -4247702 -3227572 -2430327 -3161493 -4570200 -5749974 -7009083
39229g009083j831700j308606J372762M196648L987146J198657k60915Q11076
$$ -7009083 -8840783 -10149389 -8776627 -4579979 -592833 605824 344909 1155985
39221A155985P71798k344144m380476j419949K957800K409064k402415m884107
$$ 1155985 1927783 -416361 -4796837 -6216786 -3258986 -849922 -3252337 -8136444
39213h136444k367440J236417K559004K521244K147276M00601k100693k311245
$$ -8136444 -10503884 -9267467 -6708463 -4187219 -2039943 -1639342 -3740035 -6051280
39205f051280J53857J600088J27858j259023J01907K098774J636033l75701j001323
$$ -6051280 -5897423 -4297335 -4169477 -5428500 -5326593 -3227819 -1591786 -1967487 -2968810
39196b968810J35656J167207J110091L03226p52174j155987J38309K317316K847557
$$ -2968810 -2833154 -1665947 -555856 -252630 -1004804 -2160791 -2022482 294834 3142391
39187C142391J037100o83259m80067L05896l2587q08281j018873j501209k559115
$$ 3142391 4179491 3496232 3016165 3322061 3289474 2481193 1462320 -38889 -2598004
39178b598004k146209N22272K063688m99306m091900l043464K435848N883957
$$ -2598004 -4744213 -4221941 -2158253 -2657559 -6749459 -9792923 -7357075 -1473118
39170a473118L439680j072112j883947R68451K538110J86118l099754l058442
$$ -1473118 1966562 894450 -989497 -21046 2517064 2703182 -396572 -3455014
39162c455014J74381K436359J206173j076019o60710J933541K616403j16600k879500
$$ -3455014 -3280633 -844274 361899 -714120 -1374830 558711 3175114 3058514 179014
39153A79014k553779p37429m62957q92638R22985M083342M021296o14358n066177
$$ 179014 -2374765 -3112194 -3575151 -4467789 -3544804 538538 4559834 3945476 -1120701
39144a120701m509554l44533K127995P15309j795631k210350n79408J268801K531633
$$ -1120701 -5630255 -5974788 -3846793 -3131484 -4927115 -7137465 -7716873 -6448072 -3916439
39135c916439L275354K882358O72383k141614k930142p47269K188106K968803
$$ -3916439 -641085 2241273 2913656 772042 -2158100 -2905369 -717263 2251540
39127B251540J188357j228207k625213k729079j547448J069109M155264N303920
$$ 2251540 3439897 2211690 -413523 -3142602 -4690050 -3620941 534323 5838243
39119E838243K954626j328259l978501l133908o64930k1599k166910m243918k812600
$$ 5838243 8792869 7464610 3486109 352201 -312729 -334328 -2501238 -6745156 -9557756
39110i557756J857975N681164N267291J617706j463190j826409n93534K70331
$$ -9557756 -7699781 -2018617 3248674 4866380 3403190 1576781 983247 1253578
39102A253578L79962M76918P55065O02584k99821j264201j140082M24679K300940
$$ 1253578 1633540 2110458 2865523 3468107 3168286 1904085 764003 1188682 3489622
39093C489622K798862J504280k17960r26135q05953j086030k181139l177193l028262
$$ 3489622 6288484 7792764 7574804 6648669 5842716 4756686 2575547 -601646 -3629908
39084c629908j708577k09037M47108M44081J181346L099308L842232O73056m709546
$$ -3629908 -5338485 -5547522 -5100414 -4656333 -3474987 -375679 3466553 4139609 -569937
39075e69937o428470j536299N236621O732371K108163k854985l556229j156000
$$ -569937 -6998407 -8534706 -3298085 3434286 5542449 2687464 -868765 -2024765
39067b024765R44335J633929J559020P70920q22744j995808j216647J133531K701849
$$ -2024765 -1080430 553499 2112519 2883439 2060695 64887 -1151760 -18229 2683620
39058B683620J504683j814108m099475k703847J182518L364831J763943q78936
$$ 2683620 4188303 2374195 -1725280 -4429127 -3246609 118222 1882165 1003229
39050A003229j153987p503o71138k831187k720275R63609M893352N620593L195676
$$ 1003229 -150758 -158261 -829399 -3660586 -6380861 -5417252 -523900 5096693 8292369
39041H292369l90292l366334m101213k018031N10402K57623k074077k516910l3508
$$ 8292369 7902077 4535743 434530 -1583501 -1073099 -815476 -2889553 -5406463 -5439971
39032e439971J961921J516490J010411J985843J850814j044897l452076k355166
$$ -5439971 -3478050 -1961560 -951149 1034694 2885508 1840611 -1611465 -3966631
39024c966631j71513l03518j083717N84378K625931J002568k474120k197888K005449
$$ -3966631 -4138144 -4441662 -5525379 -4941001 -2315070 -1312502 -3786622 -5984510 -3979061
39015c979061M287971J971898q38023l95587J447937J505220J59797p26949j172101
$$ -3979061 308910 2280808 1442785 1047198 2495135 4000355 4160152 3433203 2261102
39006B261102j681127j515841p59186j342835l650702m696690k213319J674812
$$ 2261102 579975 -935866 -1695052 -3037887 -6688589 -11385279 -13598598 -11923786
38998a1923786L392273K590095J363383N37258n09131j481137j329694k65781
$$ -11923786 -8531513 -5941418 -4578035 -4040777 -4549908 -6031045 -7360739 -7626520
38990g626520N04168O62735P19675O48929K29880J51350J108339K291637K386364
$$ -7626520 -7122352 -6459617 -5739942 -5091013 -4861133 -4709783 -3601444 -1309807 1076557
38981A076557J596172J019624N12746q22850k165814j345850J536809K939766
$$ 1076557 2672729 3692353 4205099 3382249 1216435 -129415 1407394 4347160
38973D347160M4554m980618o883838l483846J788199M154317K850735Q88452M87142
$$ 4347160 4391714 -588904 -7472742 -10956588 -9168389 -5014072 -2163337 -1274885 -787743
38964g87743Q70344O00201j62025o77924j035341j188440k79308J455849J846893
$$ -787743 82601 682802 520777 -157147 -1192488 -2380928 -2660236 -1204387 642506
38955F42506N1693j034963J331694M678876M015591o27086l661559j964165Q07274
$$ 642506 694199 -340764 990930 5669806 9685397 9058311 5396752 3432587 4239861
38946D239861K05066k366510k479470K61033K038876Q71724r03310o25457J063423
$$ 4239861 4444927 2078417 -401053 -140020 1898856 2770580 1867270 1241813 2305236
38937B305236J756240P04693o33895q43544l47388o72865k100270k804280j260991
$$ 2305236 4061476 4766169 4132274 3288730 2941342 2268477 168207 -2636073 -3897064
38928c897064J043615J133864j104053k391662q40342J142909N89631j474464
$$ -3897064 -2853449 -1719585 -2823638 -5215300 -6055642 -4912733 -4323102 -5797566
38920e797566j812696O2141J649669J587239J114151J326839J531300Q78612l40209
$$ -5797566 -7610262 -7548121 -5898452 -4311213 -3197062 -1870223 -338923 539689 199480
38911A99480j544949k396103k269857q77057N29494M34409m17261L9156J563808
$$ 199480 -1345469 -3741572 -6011429 -6888486 -6358992 -5924583 -6341844 -6302688 -4738880
38902d738880J606783l35376j307223N11011K492396J332727j878726l328088
$$ -4738880 -3132097 -3467473 -4774696 -4263685 -1771289 -438562 -2317288 -5645376
38894e645376k019803m74537k26572J82391J981642L566309K677876k65553k524579
$$ -5645376 -7665179 -8139716 -8366288 -8183897 -6202255 -2635946 41930 -223623 -2748202
38885b748202k126223L86967K923327L808202K902756J249581j98680j350902
$$ -2748202 -4874425 -4487458 -1564131 2244071 5146827 6396408 6197728 4846826
38877D846826k434471l162946k965253j821564m36457K61442k61728j361867j054047
$$ 4846826 2412355 -750591 -3715844 -5537408 -5973865 -5712423 -5974151 -7336018 -8390065
38868h390065J925087N386019N090797L72250l874992l322141j97397M77511j156874
$$ -8390065 -6464978 -1078959 4011838 4384088 509096 -2813045 -3010442 -2532931 -3689805
38859c689805p35982K021585K271309j294797l360739r75688P16131k777883o271755
$$ -3689805 -4425787 -2404202 -132893 -1427690 -4788429 -5764117 -5047986 -7825869 -14097624
38850a4097624k234158O283038Q903045L191809k246465j127334K556357K968620
$$ -14097624 -16331782 -10048744 -1145699 2046110 -200355 -1327689 1228668 4197288
38842D197288J113594L60704l65499l054568m942453k624366J329373J915984
$$ 4197288 5310882 5671586 5306087 2251519 -2690934 -5315300 -3985927 -2069943
38834b069943l55442r03269J114033K288823J468494R69716J266866L9767k627527
$$ -2069943 -2425385 -3328654 -2214621 74202 1542696 2512412 3779278 3819045 1191518
38825A191518l218631n04252K095711J690405l27582j563194k130236k733874
$$ 1191518 -2027113 -2531365 -435654 1254751 927169 -636025 -2766261 -5500135
38817e500135k350130l13397J585384J417234j24971j072880p89814J43528J093429
$$ -5500135 -7850265 -8163662 -6578278 -5161044 -5286015 -6358895 -7148709 -7005181 -5911752
38808e911752J276462J22463j317345j068696R12991K561256K889215K858142
$$ -5911752 -4635290 -4512827 -5830172 -6898868 -5985877 -3424621 -535406 2322736
38800B322736K526501O32544j836517j531809J634130K705681j196952n583455
$$ 2322736 4849237 5481781 3645264 2113455 3747585 6453266 5256314 -327141
38792c27141m733680k33360J821712K43604n69345J104339J646336r18013k956298
$$ -327141 -5060821 -5294181 -3472469 -3228865 -3798210 -2693871 -1047535 -1965548 -4921846
38783d921846j192522J788989J805081k73627l97060J909207L067327J382699
$$ -4921846 -6114368 -4325379 -2520298 -2793925 -3190985 -1281778 1785549 3168248
38775C168248n60262k93690R89359R30080l32246j091214j144440j611555k387369
$$ 3168248 2607986 2314296 3303655 4233735 3901489 2810275 1665835 54280 -2333089
38766b333089k112042p34992K1665o13243j104819j5122J752384K436316J951623
$$ -2333089 -4445131 -5180123 -5158458 -5771701 -6876520 -6891642 -5139258 -2702942 -751319
38757g51319J443972J249400R43203P30871J008673R38280o96315l245775m464745
$$ -751319 692653 1942053 2885256 3616127 4624800 5563080 4866765 1620990 -2843755
38748b843755l184493m32799K033017L081147K468122J164133Q86718J752259
$$ -2843755 -6028248 -6461047 -4428030 -1346883 1121239 2285372 3172090 4924349
38740D924349J301622j999948n351003m714770p22277K098174J932397J492598
$$ 4924349 6225971 4226023 -1124980 -5839750 -6562027 -4463853 -2531456 -1038858
38732a038858K570610L143092J613924j29512l15338l77494j758467k887115k230938
$$ -1038858 1531752 4674844 6288768 6159256 5843918 5466424 3707957 820842 -1410096
38723a410096j247968j231363m25161K164744L365384O65619k418562j074129
$$ -1410096 -2658064 -3889427 -4314588 -2149844 1215540 1881159 -537403 -1611532
38715a611532K751624K897577j301874l953589j710252J784372K198670M08607
$$ -1611532 1140092 4037669 2735795 -1217794 -2928046 -1143674 1054996 1463603
38707A463603l41655M99088J232028R85838J30126p96575j133161m02581O62210
$$ 1463603 1121948 1621036 2853064 3838902 3969028 3172453 2039292 1636711 2298921
38698B298921P77231M5933l60030l60826q63761j689968j779565j243355r57428
$$ 2298921 3076152 3122085 2762055 2401229 1537468 -152500 -1932065 -3175420 -4132848
38689d132848n76809N34389J142530k4984j098192N70816L443144L477890N81530
$$ -4132848 -4709657 -4175268 -3032738 -3057722 -4155914 -3585098 -141954 3335936 3917466
38680C917466j361163j067867j156298k115540r69226K163865K412512j705730
$$ 3917466 2556303 1488436 332138 -1783402 -2752628 -588763 1823749 118019
38672A18019m365210j084333L809634L676399n63058k854075j333913O81936J128122
$$ 118019 -4247191 -5331524 -1521890 2154509 1591451 -1262624 -2596537 -1914601 -786479
38663g86479R92154P72377Q8096N178J366103J886917o78758l752571l122900
$$ -786479 205675 978052 1066148 1071326 2437429 4324346 3645588 -106983 -3229883
38654c229883J45429J202327q32545k159716j307225j005015k165354j775704
$$ -3229883 -3084454 -1882127 -2714672 -4874388 -6181613 -7186628 -9351982 -11127686
38646a1127686J233148L192240J501546j016007n87236K039196L539004K778124
$$ -11127686 -9894538 -6702298 -5200752 -6216759 -6803995 -4764799 -1225795 1552329
38638A552329R70370p33245j487848n18397J380398J936197O11325l01426O52895
$$ 1552329 2522699 1789454 301606 -216791 1163607 3099804 3711129 3409703 4062598
38629D062598J594425L39951k177320l558686l246485k254028j159026j55641
$$ 4062598 5657023 5996974 3819654 260968 -2985517 -5239545 -6398571 -6554212
38621f554212K55076J00844J49386L31853k64786j075332k28117J842814J952229
$$ -6554212 -6299136 -6198292 -6048906 -5717053 -5981839 -7057171 -7285288 -5442474 -3490245
38612c490245q63988l000338j392763J819159K660174Q85903r81531j940288k343978
$$ -3490245 -4354233 -7354571 -8747334 -6928175 -4268001 -3382098 -4363629 -6303917 -8647895
38603h647895j367071J548371M031105L309855N00065j069243q10785o03969n94242
$$ -8647895 -10014966 -8466595 -4435490 -1125635 -625570 -1694813 -2505598 -3109567 -3703809
38594c703809P09384K644765K785888J116571L2809J50545j17500q09676l24909
$$ -3703809 -2994425 -349660 2436228 3552799 3585608 3736153 3618653 2808977 2484068
38585B484068O86249k59672k487268k222729J033139K866761P43966k004070j704648
$$ 2484068 3170317 2910645 423377 -1799352 -766213 2100548 2844514 840444 -864204
38576h64204J97781N30429k02232M01309J975739K275304J051388j78812q55267
$$ -864204 -666423 -135994 -338226 63083 2038822 4314126 5365514 5186702 4331435
38567D331435j164515o39883M95979L19084j864679l419256j992160O29907J273170
$$ 4331435 3166920 2527037 3023016 3342100 1477421 -1941835 -3933995 -3304088 -2030918
38558b030918J48554m05621k25654p27319j378349n73602R14988J059733L40254
$$ -2030918 -1882364 -2287985 -2513639 -3240958 -4619307 -5192909 -4277921 -3218188 -2877934
38549b877934P36548J777611J403910L2415k50234J09804r56230k581267k085811
$$ -2877934 -2141386 -363775 1040135 1072550 822316 932120 -24110 -2605377 -4691188
38540d691188m14398j108348l455493k535170K398367N495730L008807r42368
$$ -4691188 -5105586 -6213934 -9669427 -12204597 -9806230 -4310500 -1301693 -2244061
38532b244061r49416J841973K719823P87292j063996j251843o14941J0988J98521
$$ -2244061 -3193477 -1351504 1368319 2155611 1091615 -160228 -775169 -764181 -565660
38523e65660o31630j791115j223470J155815K566001J891239J783703L529600
$$ -565660 -1197290 -2988405 -4211875 -3056060 -490059 1401180 3184883 6714483
38515F714483L695471j90927m281176l699418k93103M28086k029061l359128j981954
$$ 6714483 10409954 10219027 5937851 2238433 1945330 2373416 344355 -3014773 -4996727
38506d996727l64412N47004K212200L727801K087174j893749l365471n73996K628998
$$ -4996727 -5361139 -4814135 -2601935 1125866 3213040 1319291 -2046180 -2620176 8822
38497H822K854095J217265r5824p77412l61364K156048M772018L140797k832163
$$ 8822 2862917 4080182 3984358 3206946 2845582 5001630 9773648 12914445 10082282
38488A0082282p286097n885563j118120K357002L549978L462239J740238j336205
$$ 10082282 2796185 -3089378 -4207498 -1850496 1699482 5161721 6901959 5565754
38480E565754k983466j757308k59588n64764k85985K798348N489419L449875j626957
$$ 5565754 2582288 824980 565392 628 -285357 2512991 8002410 11452285 9825328
38471I825328m209937k748645m66934M68211P20877M43151j042483k358725j310624
$$ 9825328 5615391 2866746 2399812 2868023 3588900 4032051 2989568 630843 -679781
38462f79781R04901R30514j148806j680982O39939K991167L308048K676412J717732
$$ -679781 225120 1155634 6828 -1674154 -1034215 1956952 5265000 7941412 9659144
38453I659144r41310m605898n184444r72441L529332L135075r04782k969825j022641
$$ 9659144 8717834 4111936 -1072508 -2044949 1484383 4619458 3714676 744851 -277790
38444b77790J224846J87357k720202l484321j001214J746436J890400M22338M38842
$$ -277790 947056 1134413 -1585789 -5070110 -6071324 -4324888 -2434488 -2012150 -1573308
38435a573308K297612K770242j00545l522596l540909o52147J048213k04585j826436
$$ -1573308 724304 3494546 3394001 -128595 -3669504 -4321651 -3273438 -3478023 -5304459
38426e304459j143060J121150K642955K663346K090685J771507J613233P75879
$$ -5304459 -6447519 -5326369 -2683414 -20068 2070617 3842124 5455357 6231236
38418F231236j287438l301612k689351Q43307L651668K599922k32819p37223O02363
$$ 6231236 4943798 1642186 -1047165 -203858 3447810 6047732 5814913 5077690 5680053
38409E680053k1200k325150j728540K262844L781828k64539m637989l790932k98946
$$ 5680053 5658853 3333703 1605163 3868007 7649835 7385296 2747307 -1043625 -1342571
38400a342571L88795o81355J128522M559953L831803j162318l870195j413801
$$ -1342571 -953776 -1635131 -506609 4053344 7885147 6722829 2852634 1438833
38392A438833J283967J00548k095492j474857J68828l96933j422826N84300L996960
$$ 1438833 2722800 2823348 727856 -747001 -578173 -975106 -2397932 -1813632 2183328
38383B183328M070051N00858k254655j976716j209456k128067l075759j796392
$$ 2183328 6253379 6754237 4499582 2522866 1313410 -814657 -3890416 -5686808
38375e686808R46229K728562K418453N57814j452254j779165K84239K497886J654257
$$ -5686808 -4740579 -2012017 406436 964250 -488004 -2267169 -1982930 514956 2169213
38366B169213j731983l319969r94617J783457J119771j313542r36000K525547
$$ 2169213 437230 -2882739 -3877356 -2093899 -974128 -2287670 -3223670 -698123
38358f98123M567000K619130o57715j914431j647425k162075l384036l284827
$$ -698123 3868877 6488007 5830292 3915861 2268436 106361 -3277675 -6562502
38350f562502j352534P20608J556101J499160J376355J173317M13248q13928j623293
$$ -6562502 -7915036 -7194428 -5638327 -4139167 -2762812 -1589495 -1176247 -1990175 -3613468
38341c613468j099311O48700K311325K696275K108205J699582J571172O82594
$$ -3613468 -4712779 -4064079 -1752754 943521 3051726 4751308 6322480 7005074
38333G005074j124461k388505k012556p81990N442L56450R67457J689520J747934
$$ 7005074 5880613 3492108 1479552 697562 703004 1059454 2026911 3716431 5464365
38324E464365Q39613r19480l332890n406999n260257k147032K002384M317143
$$ 5464365 6303978 5384498 2051608 -3355391 -8615648 -10762680 -8760296 -4443153
38316d443153L800889J489197j232568l089602k712929Q488K700992K553805k44548
$$ -4443153 -642264 846933 -385635 -3475237 -6188166 -6179678 -3478686 -924881 -1169429
38307a169429k546765j839444J344102M480402N369267L553900N23858j619793
$$ -1169429 -3716194 -5555638 -4211536 268866 5638133 9192033 9715891 8096098
38299H096098k332247k729168l006138j597903J562855L177897Q19495k670203
$$ 8096098 5763851 3034683 28545 -1569358 -6503 3171394 3990889 1320686
38291A320686k647390N25940K322218J274138N37783J567828J385981j644502
$$ 1320686 -1326704 -800764 1521454 2795592 3333375 4901203 6287184 4642682
38283D642682l929026j914764K178948L625109J710923o28007j714848j986881
$$ 4642682 713656 -1201108 977840 4602949 6313872 5685865 3971017 1984136
38275A984136j417491J98708J288247L19077j089446l19756J532297R02000k249814
$$ 1984136 566645 765353 2053600 2372677 1283231 963475 2495772 3397772 1147958
38266A147958l705568j250727K040120K581263J193847P53853J278172M43986
$$ 1147958 -2557610 -3808337 -1768217 813046 2006893 2760746 4038918 4482904
38258D482904k050118l623183k463593J44138J821956J940536J528878J265404
$$ 4482904 2432786 -1190397 -3653990 -3509852 -1687896 252640 1781518 3046922
38250C046922P55360k87958j137652q68327L41552J314173J162836l719j512012
$$ 3046922 3802282 3514324 2376672 1508345 1849897 3164070 4326906 4323187 2811175
38241B811175k628788k715377j652110k07098P06894J097313J367456J009261
$$ 2811175 182387 -2532990 -4185100 -4392198 -3685304 -2587991 -1220535 -211274
38233b11274o75421k485488j976409R62526L189134K399763K97754k89902K16963
$$ -211274 -886695 -3372183 -5348592 -4386066 -1196932 1202831 1500585 1210683 1427646
38224A427646n67289k314262j979299J163403L632202K392837q48893k031785
$$ 1427646 860357 -1453905 -3433204 -2269801 1362401 3755238 2906345 874560
38216H74560j01197K163803K226877O42639n69459p56510p11657q12127n49507
$$ 874560 773363 2937166 5164043 5806682 5237223 4480713 3769056 2956929 2407422
38207B407422J22671L50221j71392m89291n5352J3104j244398k461569j603533
$$ 2407422 2530093 2880314 2708922 2219631 2164279 2177383 932985 -1528584 -3132117
38198c132117N91424J174512p37196k595298k103168l0258J747754K778591L072107
$$ -3132117 -2540693 -1366181 -2103377 -4698675 -6801843 -6832101 -5084347 -2305756 766351
38189G66351J793870r49106k775671j958779l93277r60933k799624k204866J752671
$$ 766351 2560221 1611115 -1164556 -3123335 -3516612 -4477545 -7277169 -9482035 -7729364
38180g729364N364086M972353J509028r83346l25723J553070J289111j688919
$$ -7729364 -2365278 2607075 4116103 3132757 2807034 4360104 5649215 3960296
38172C960296m345857l858210j303633R6905j07502Q23226L794151N670288L968631
$$ 3960296 -385561 -4243771 -5547404 -5450499 -5558001 -4734775 -940624 4729664 8698295
38163H698295Q39498l76608j58231j052619k769884k795906q84014O84203P14994
$$ 8698295 9537793 9161185 9002954 7950335 5180451 2384545 1500531 2184734 2899728
38154B899728l25181k487379n366060n780993j020420N518233O795657J418476
$$ 2899728 2574547 87168 -5278892 -11059885 -12080305 -6562072 233585 1652061
38146A652061m023161l720031M15785K982395K412250Q19688m76899j491209j385705
$$ 1652061 -2371100 -6091131 -5675346 -2692951 -280701 538987 62088 -1429121 -2814826
38137b814826N98254K727510K357035j54481j556247n9525K288949K311196l14200
$$ -2814826 -2216572 510938 2867973 2713492 1157245 1097720 3386669 5697865 5383665
38128E383665k713940k381286k92741N07165o97274j178415Q94772L150585K408415
$$ 5383665 2669725 288439 -4302 502863 -194411 -1372826 -478054 2672531 5080946
38119E080946l79843j828554j515245j733621k505405j470210R76255J418273
$$ 5080946 4701103 2872549 1357304 -376317 -2881722 -4351932 -3375677 -1957404
38111a957404m47567m73759K876314N042018K332804j913150k452759j28555J29421
$$ -1957404 -2404971 -2878730 -2416 5039602 7372406 5459256 3006497 2877942 3007363
38102C007363k727833m765760l258370J11562K371278K570743J650938R16685
$$ 3007363 279530 -4486230 -7744600 -7633038 -5261760 -2691017 -1040079 -123394
38094a23394P18114p8228k231787l518554p61943M481513O082920J621589l375944
$$ -123394 594720 516492 -1715295 -5233849 -5995792 -1514279 4568641 6190230 2814286
38085B814286k957371J181105L455128K727693J573258J89739k624430m334269
$$ 2814286 -143085 1038020 4493148 7220841 8794099 8983838 6359408 2025139
38077B025139j386005L641355M406351L96563k601761k150397k009825l738752
$$ 2025139 639134 4280489 8686840 9083403 6481642 4331245 2321420 -1417332
38069a417332l094431J724696N179062K668807j813686j882392J660629L281974
$$ -1417332 -4511763 -2787067 2391995 5060802 3247116 1364724 3025353 6307327
38061F307327J555591m63229j569103l085612m235545k602496P61085J857039
$$ 6307327 7862918 7399689 5830586 2744974 -1490571 -4093067 -3331982 -1474943
38053a474943L390j126949J79526Q64224j396491l836615k733019Q58014K820768
$$ -1474943 -1471553 -2598502 -2418976 -1554752 -2951243 -6787858 -9520877 -8662863 -5842095
38044e842095J876855M98283N08801Q93179M36982j35113J0657j28210j494958
$$ -5842095 -3965240 -3466957 -2958156 -2064977 -1627995 -1763108 -1752451 -1880661 -3375619
38035c375619k390281m12336L189846L996461L85216l506927k949699J069550
$$ -3375619 -5765900 -6178236 -2988390 1008071 1393287 -2113640 -5063339 -3993789
38027c993789L492045K075165o14453j897166k151676k348150j642013N59359
$$ -3993789 -501744 1573421 958968 -938198 -3089874 -5438024 -7080037 -6520678
38019f520678K414068J923286Q2477m54916Q34461J858945J048020o10935j034516
$$ -6520678 -4106610 -2183324 -2100847 -2555763 -1721302 137643 1185663 574728 -459788
38010d59788K40395J265263j84675l538773n282495k974421J324687L461821K513804
$$ -459788 -219393 1045870 861195 -2677578 -7960073 -10934494 -9609807 -6147986 -3634182
38001c634182J180579R67683L16858j483896k090591k5348K200697J792924P2940
$$ -3634182 -2453603 -1485920 -1169062 -2652958 -4743549 -4768897 -2568200 -775276 -702336
37992g02336j65058L17064j138138l481913k534671K397090O401984M983374m60502
$$ -702336 -867394 -550330 -1688468 -5170381 -7705052 -5307962 1094022 6077396 5616894
37983E616894m710577m447388p01163K906788L318933N59110k209447k043575
$$ 5616894 906317 -3541071 -4242234 -1335446 1983487 2542597 333150 -1710425
37975a710425L00971J590683O79739k20007O80018J933761J167390j405894l353441
$$ -1710425 -1409454 181229 860968 640961 1320979 3254740 4422130 3016236 -337205
37966c37205l011081q33279J611415K931587K614069J280558J39929o0646O89099
$$ -337205 -3348286 -4181565 -2570150 361437 2975506 4256064 4395993 4335347 5024446
37957E024446K052930L098235K140204j454369n281643n768512k646056M54451
$$ 5024446 7077376 10175611 12315815 10861446 5579803 -188709 -2834765 -2380314
37949b380314P88035l01475l72519K58733o562n81145K46331J752444J517846
$$ -2380314 -1592279 -1893754 -2266273 -2007540 -2014102 -2595247 -2348916 -596472 921374
37940I21374m52683j485319n32281K81530o22081j776624j378069r0391O76861
$$ 921374 468691 -1016628 -1548909 -1267379 -1889460 -3666084 -5044153 -5134544 -4457683
37931d457683J221146K169513K425510R10284j029122j526340j340730k192785
$$ -4457683 -3236537 -1067024 1358486 2268770 1239648 -286692 -1627422 -3820207
37923c820207k882300o37213L728543N824157L781896P54335k92594p49631k749707
$$ -3820207 -6702507 -7339720 -3611177 2212980 5994876 6749211 6456617 5706986 2957279
37914B957279m519607l084668K58107J279338r44310k906728k020832K73626J559582
$$ 2957279 -1562328 -4646996 -4388889 -3109551 -4053861 -6960589 -8981421 -8707795 -7148213
37905g148213J671008J569026J300684O25823J15410K93027P37489Q54078N25168
$$ -7148213 -5477205 -3908179 -2607495 -1981672 -1866262 -1573235 -835746 18332 543500
37896E43500l69268j744516k411450j132657J043768J500217l08969k078657k223547
$$ 543500 174232 -1570284 -3981734 -5114391 -4070623 -2570406 -2879375 -4958032 -7181579
37887g181579j704668j209328M96280L373284M195811R15722l182938l240600
$$ -7181579 -8886247 -10095575 -9599295 -6226011 -2030200 -1114478 -4297416 -7538016
37879g538016N37742L541017L286057J651231P59151L10529l58051p85487r58549
$$ -7538016 -7000274 -3459257 -173200 1478031 2237182 2547711 2189660 1404173 445624
37870D45624j648641k216657p61520K379346L939438K101735p99216j737152r97701
$$ 445624 -1203017 -3419674 -4181194 -1801848 2137590 4239325 3440109 1702957 705256
37861G05256o75843j095973j151042p83609n58754K65236K560155M693273L845271
$$ 705256 29413 -1066560 -2217602 -3001211 -3559965 -3294729 -734574 3958699 7803970
37852G803970K64263k248096j049667J944412K803974L88917k668388l341781
$$ 7803970 8068233 5820137 4770470 6714882 9518856 9907773 7239385 3897604
37844C897604j526540K04752k67026k137514k665270n14696K644305M245043L653577
$$ 3897604 2371064 2575816 2308790 171276 -2493994 -3008690 -364385 3880658 7534235
37835G534235K061605M00853j218015k335533k087361o85902L57073J17278n92508
$$ 7534235 9595840 9996693 8778678 6443145 4355784 3669882 4026955 4144233 3551725
37826C551725n70641J12631M76382l8458j274492k761178l649043k820344j04621
$$ 3551725 2981084 3093715 3570097 3531639 2257147 -504031 -4153074 -6973418 -7078039
37817g078039K758406L338635J017861k148525l266281j202429K417181M503177
$$ -7078039 -4319633 -980998 36863 -2111662 -5377943 -6580372 -4163191 339986
37809C39986L122637n88612l233961k457995N25716K232017Q14042j887625k512053
$$ 339986 3462623 2874011 -359950 -2817945 -2292229 -60212 753830 -1133795 -3645848
37800c645848J0437L300059M147584J901236j060871k128952j169153j6948J77911
$$ -3645848 -3635411 -335352 3812232 5713468 4652597 2523645 1354492 1337544 1515455
37791A515455K196K18781N96689R17633J696337K712847K219810n29657l005224
$$ 1515455 1517651 1736432 2333121 3250754 4947091 7659938 9879748 9350091 6344867
37782F344867k084574J396472L449647K403207O87812M87798P38769K9042m63307
$$ 6344867 4260293 5656765 9106412 11509619 12197431 12685229 13423998 13453040 12989733
37773A2989733O40094J908486J253618o48975j814855k166337k391446j394292
$$ 12989733 13629827 15538313 16791931 16142956 14328101 12161764 9770318 8376026
37765H376026J496925L331280J006413k904813k888358Q78354K245015j219869
$$ 8376026 9872951 13204231 14210644 11305831 8417473 9295827 11540842 10320973
37757A0320973m100208j716913K435196K383257j175679k859399j276758m621
$$ 10320973 6220765 4503852 6939048 9322305 8146626 5287227 4010469 4005848
37749D005848q44437j578110q29532l74957j272988j545455L90728K740439K705613
$$ 4005848 3161411 1583301 753769 378812 -894176 -2439631 -2048903 691536 3397149
37740C397149R9538k789321l644645j687129J776645L820844K461257p30658k141739
$$ 3397149 3496687 707366 -2937279 -4624408 -2847763 973081 3434338 2703680 561941
37731E61941o61043J101171P36413q31794j272304j75708J032200J360526J021334
$$ 561941 -99102 1002069 1738482 906688 -365616 -541324 490876 1851402 2872736
37722B872736O33201P58113J654697K609350K109548m04470l351108m400235k969866
$$ 2872736 3505937 4264050 5918747 8528097 10637645 10233175 6882067 2481832 -488034
37713d88034q24861j27348j045348j476040M46402L574319M493416J688692k197890
$$ -488034 -1312895 -1440243 -2485591 -3961631 -3515229 59090 4552506 6241198 4043308
37704D043308l521930k003953k69971L7708m87654j043885j333702m28797K240797
$$ 4043308 521378 -1482575 -1752546 -1714838 -2202492 -3246377 -4580079 -5008876 -2768079
37695b768079M448944K826161j966974m723117k216429K255081L227119P9822
$$ -2768079 1680865 4507026 2540052 -2183065 -4399494 -2144413 1082706 1162528
37687A162528l006654k976773r79507L24185J92488j27575N09738J742513K197484
$$ 1162528 -1844126 -4820899 -5800406 -5476221 -5283733 -5411308 -4901570 -3159057 -961573
37678i61573J268819L1451l00893k95744j150797j979984o71615K172333L068053
$$ -961573 307246 338697 37804 -257940 -1408737 -3388721 -4060336 -1888003 1180050
37669A180050P35593j567785r13008Q80214O13102r32613p95492O81925O05921
$$ 1180050 1915643 347858 -565150 315064 928166 -4447 -799939 -118014 487907
37660D87907q53502l30770K631241L891604R69211k830148l204792q46486N18694
$$ 487907 -365595 -696365 1934876 5826480 6795691 3965543 760751 -85735 432959
37651D32959N1999J86556J859604K810241J163644j834706l713993l669997k413856
$$ 432959 484958 671514 2531118 5341359 6505003 4670297 956304 -2713693 -5127549
37642e127549m53088J934506L551708K766690l55516l402572l949855k139785
$$ -5127549 -5580637 -3646131 -94423 2672267 2316751 -1085821 -5035676 -7175461
37634g175461j28578P41258J072478J604932J712646O63820o62501p42340L44060
$$ -7175461 -7304039 -6562781 -5490303 -3885371 -2172725 -1508905 -2171406 -2913746 -2569686
37625b569686J022355M82373m85179r78368r76082n66751M07305J295821N98933
$$ -2569686 -1547331 -1064958 -1550137 -2528505 -3504587 -4071338 -3664033 -2368212 -1769279
37616a769279j853298l638124k191309J730840M477037L680816Q58152q33965
$$ -1769279 -3622577 -7260701 -9452010 -7721170 -3244133 436683 1294835 460870
37608D60870n18299o8363r05251j859211j135031N87639P42800j304002k760227
$$ 460870 -57429 -125792 -1031043 -2890254 -4025285 -3437646 -2694846 -3998848 -6759075
37599f759075r28982K815698M291361J627211k441104l874957j724549J555202
$$ -6759075 -7688057 -4872359 -580998 1046213 -1394891 -5269848 -6994397 -5439195
37591e439195L243904K680595Q61442r91244k042837j776035q7373K394914M289678
$$ -5439195 -2195291 485304 1346746 355502 -1687335 -3463370 -3550743 -1155829 3133849
37582C133849M075968J235835k820107n286678m278030r26628J491235J069494
$$ 3133849 7209817 8445652 5625545 338867 -3939163 -4865791 -3374556 -2305062
37574b305062p03140j239958m58858m58697j674154j595439J386310M651052M210350
$$ -2305062 -3008202 -4248160 -4707018 -5165715 -6839869 -8435308 -7048998 -2397946 1812404
37565A812404L06595k302520j69294M575031O754452L847897j708370n234356
$$ 1812404 2118999 -183521 -352815 4222216 10976668 14824565 13116195 7881839
37557G881839m236303o03718J407842j52557k646826k266463Q55770K936873J916972
$$ 7881839 3645536 3041818 4449660 4297103 1650277 -616186 239584 3176457 5093429
37548E093429m8227m19085L8522o32478j924064k052652j463747k042304l308360
$$ 5093429 5045202 4626117 4664639 4032161 2108097 55445 -1408302 -3450606 -6758966
37539f758966k654855J64082J917107P24157o45218J253190M915936N373566J128716
$$ -6758966 -9413821 -9249739 -7332632 -6608475 -7253693 -6000503 -1084567 4288999 5417715
37530E417715l441661l849459j215960J38284o85460l76703K572951M719048K646606
$$ 5417715 1976054 -1873405 -3089365 -2951081 -3636541 -4013244 -1440293 3278755 5925361
37521E925361j533699k847865k60798K586108K954038J791397O12668q48438k567065
$$ 5925361 4391662 1543797 1282999 3869107 6823145 8614542 9227210 8378772 5811707
37512E811707k860710j000651J044053J254567J11749r04623j325405q66735R69510
$$ 5811707 2950997 1950346 2994399 4248966 4360715 3456092 2130687 1263952 2233462
37503B233462K857571K026560j118347j828008K339099O511932M415930k569379
$$ 2233462 5091033 7117593 5999246 4171238 6510337 13022269 17438199 14868820
37495A4868820p011211n285653j049338J237070J449742J182963K33027j828784
$$ 14868820 7857609 2571956 1522618 2759688 4209430 5392393 5625420 3796636
37487C796636l280909k028222J411476M247852M091067Q07099l316278n129693
$$ 3796636 515727 -1512495 -101019 4146833 8237900 9044999 5728721 599028
37479E99028l457355k63014J934886K794568K774966P94820l688324p427710o191644
$$ 599028 -2858327 -3121341 -1186455 1608113 4383079 5177899 1489575 -5938135 -12129779
37470a2129779q44687L184952L039426J293106Q84725J236891J066360J191854
$$ -12129779 -12974466 -9789514 -6750088 -5456982 -4572257 -3335366 -2269006 -1077152
37462a077152K065397J725565q65743k938081j485531J959728L145472P89034
$$ -1077152 988245 2713810 1848067 -1090014 -2575545 -615817 2529655 3318689
37454C318689k134373k472368l31187J599199J081896j281443k513247o98050
$$ 3318689 1184316 -1288052 -1619239 -20040 1061856 -219587 -2732834 -3430884
37446c430884K354420L195781J060181j778421l442837l696495k237311Q52727
$$ -3430884 -1076464 2119317 3179498 1401077 -2041760 -5738255 -7975566 -7122839
37438g122839K952329J189045k498810k947355M67994K568918P89076o73192J527867
$$ -7122839 -4170510 -2981465 -5480275 -8427630 -7959636 -5390718 -4601642 -5274834 -3746967
37429c746967L653987J341515k353540j745498J866620K415429q06427k480215
$$ -3746967 -92980 1248535 -1105005 -2850503 -983883 1431546 625119 -1855096
37421a855096n78704O47311j578337l910523k584181R06596K785015K280605J180827
$$ -1855096 -2433800 -1786489 -3364826 -7275349 -9859530 -8952934 -6167919 -3887314 -2706487
37412b706487N32036J91188K759l08702j078836j549092l76671J952812L085399
$$ -2706487 -2174451 -1983263 -1980504 -2289206 -3368042 -4917134 -5293805 -3340993 -255594
37403b55594K016414N01335L59563J148005J464680R34213l6950j044212j476783
$$ -255594 1760820 2262155 2621718 3769723 5234403 6168616 6131666 5087454 3610671
37394C610671r22160l05036j043526k557690k453018j2150K320639K153815L44376
$$ 3610671 2688511 2383475 1339949 -1217741 -3670759 -3682909 -1362270 791545 1135921
37385A135921m63850N21515J573130J042703o16697j709456j612095j554549k642177
$$ 1135921 672071 1193586 2766716 3809419 3192722 1483266 -128829 -1683378 -4325555
37376d325555l619997k080922J787239M523092L623999P18974j068688j117665
$$ -4325555 -7945552 -10026474 -8239235 -3716143 -92144 626830 -441858 -1559523
37368a559523n64261N53038K461153L375401J531088j241477j529816M30265J240454
$$ -1559523 -2123784 -1570746 890407 4265808 5796896 4555419 3025603 3455868 4696322
37359D696322O833n69817N59017O93741j746896l980021k942423J42936J858127
$$ 4696322 4703155 4133338 4692355 5386096 3639200 -340821 -3283244 -3140308 -1282181
37350a282181J295943L14097M12101J318236J902743J316251m6956m17815J171185
$$ -1282181 13762 327859 739960 2058196 3960939 5277190 5230234 4812419 5983604
37341E983604K698675J369211j940070l403061j970380q70283j980929k414587
$$ 5983604 8682279 10051490 8111420 4708359 2737979 1867696 -113233 -2527820
37333b527820O68606M909899N791596K860855l97442j661756j635082j479693
$$ -2527820 -1859214 3050685 8842281 11703136 11305694 9643938 8008856 6529163
37325F529163j227373p26601j26762O05624J283279J000499p31774k918803m208907
$$ 6529163 5301790 4575189 4448427 5054051 6337330 7337829 6606055 3687252 -521655
37316e21655m285471l219675p51579K430867M055441K729224J27490j040903n33984
$$ -521655 -4807126 -8026801 -8778380 -6347513 -2292072 437152 564642 -476261 -1010245
37307a010245k89494j161971j808611r29966Q03526J622113Q89513m5885M60557
$$ -1010245 -1299739 -2461710 -4270321 -5200287 -4396761 -2774648 -1885135 -1931020 -1470463
37298a470463J889458J869714l12590k116791j508629n93174k325123m869234
$$ -1470463 418995 2288709 1976119 -140672 -1649301 -2242475 -4567598 -9436832
37290i436832l655208J123564M139697L066580J736779K960062L593694M83637
$$ -9436832 -13092040 -11968476 -7828779 -4762199 -3025420 -65358 3528336 4011973
37282D011973l363704l317310l33528J352814J058125J125774J673819R95745
$$ 4011973 648269 -2669041 -3002569 -1649755 -591630 534144 2207963 3203708
37274C203708k34520p3087N13845o33825k040126n46061K570994K735074o46318
$$ 3203708 2969188 2896101 3409946 2776121 735995 189934 2760928 5496002 4849684
37265D849684l195072k394134m75279M40467J288774K647000K701154N76838j741118
$$ 4849684 1654612 -739522 -1214801 -774334 514440 3161440 5862594 6439432 4698314
37256D698314k467521k012970q90151J101886K647821J439774j853325l658000
$$ 4698314 2230793 217823 -672328 429558 3077379 4517153 2663828 -994172
37248i94172k745562j676237j663030k59142L554977O019739L547832j874510
$$ -994172 -3739734 -5415971 -7079001 -7338143 -3783166 2236573 5784405 3909895
37240C909895n268512m424796p13486L408220N307998L154056j363277l562581
$$ 3909895 -1358617 -5783413 -6496899 -3088679 2219319 5373375 4010098 447517
37232D47517j555199Q90616q0247k631869k416793O86737K903347K233564M0618
$$ 447517 -1107682 -217066 -297313 -2929182 -5345975 -4659238 -1755891 477673 518291
37223E18291k087303l390447k484751J320408N189240M898108O03615k642655
$$ 518291 -1569012 -4959459 -7444210 -6123802 -934562 3963546 4567161 1924506
37215A924506j372720J931064K634288J21018k066083j438102L77069M22534j244854
$$ 1924506 551786 2482850 5117138 5238156 3172073 1733971 2111040 2533574 1288720
37206A288720j743408K12865K142306J338056j146538k380438k202358k753496
$$ 1288720 -454688 -241823 1900483 3238539 2092001 -288437 -2490795 -5244291
37198e244291l790251k427723J587054M274489K987633K16788m31853R76180K385958
$$ -5244291 -9034542 -11462265 -9875211 -5600722 -2613089 -2396301 -2828154 -1851974 533984
37189E33984L255932L622322K520745L21512k62486J270992R50171l328959o676304
$$ 533984 3789916 7412238 9932983 10254495 9992009 11263001 12213172 8884213 2207909
37180B207909l828155K010458L559633Q19597L38773L426809L531092k503159
$$ 2207909 -1620246 390212 3949845 4769442 5108215 8535024 12066116 9562957
37172I562957q317720p210677j293033L117705M201551L781093K101654r22536
$$ 9562957 1245237 -5965440 -7258473 -4140768 60783 3841876 5943530 5020994
37164E020994k387799m6421K861277J899529j156736r51157K509923L777150R45160
$$ 5020994 2633195 2586774 5448051 7347580 6190844 5239687 7749610 11526760 12471920
37155A2471920j567626p40357L81617j425156l858444l075525O7211J770928J049759
$$ 12471920 10904294 10163937 10545554 9120398 5261954 2186429 2253640 4024568 5074327
37146E074327M143j32195K19600J068104K498222L011132J314628q22155o40680
$$ 5074327 5078470 4946275 5165875 6233979 8732201 11743333 13057961 12235806 11595126
37137A1595126J101800J094578j096518k289663j053971M3662q47961j563025
$$ 11595126 12696926 13791504 12694986 10405323 9351352 9395014 8547053 6984028
37129F984028J14025K218346J635758p47361j515738j27809P49721j29188j040719
$$ 6984028 7098053 9316399 10952157 10204796 8689058 8561249 9310970 9181782 8141063
37120H141063o19486K57548N88375P49677J080236J083352Q30897J262424K342288
$$ 8141063 7521577 7779125 8367500 9117177 10197413 11280765 12111662 13374086 15716374
37111A5716374K700776J813454Q22541N64850N65562O09713J350074K523141K571900
$$ 15716374 18417150 20230604 21053145 21617995 22183557 22793270 24143344 26666485 29238385
37102B9238385J150856J42240R35737K408358K913366K702333L041794M301667
$$ 29238385 30389241 30531481 31467218 33875576 36788942 39491275 42533069 46834736
37094D6834736O056663P733382Q347236P308071O268550Q184140J3916988K2290395
$$ 46834736 52891399 60624781 68972017 76280088 82548638 90732778 104649766 126940161
37086A26940161L3633568M8472502O0500912N6724128L0849196n972791l3988877
$$ 126940161 160573729 209046231 269547143 326271271 357120467 351147676 317158799
37079C17158799m3868548m2019634l8295353l5297323l1029929k5361514j9747874
$$ 317158799 273290251 231270617 192975264 157677941 126648012 101286498 81538624
37072H1538624j4374612r356431o381133o139049o154674m022043j163885o59303
$$ 81538624 67164012 57807581 51426448 45287399 39132725 35110682 33946797 33287494
37064C3287494k615190m355462m354517l441699k511904j410380k26156K16509
$$ 33287494 30672304 26316842 21962325 18520626 16008722 14598342 14372186 14588695
37056A4588695l23010q99867n72882M86276J311523J172118K40491n75993n92561
$$ 14588695 14265685 13365818 12792936 13279212 14590735 15762853 16003344 15427351 14834790
37047A4834790j14844J15058N1032J79205L40596k32240j528214k431401k076962
$$ 14834790 14719946 14835004 14886036 15065241 15405837 15173597 13645383 11213982 9137020
37038I137020o54457J224052K844251L002448P60571k924025n607663n895612
$$ 9137020 8482563 9706615 12550866 15553314 16313885 13389860 7782197 1886585
37030A886585m358706j742912J818071N051662N262968J670682k477285l331243
$$ 1886585 -2472121 -4215033 -2396962 2654700 7917668 9588350 7111065 3779822
37022C779822j186265L79886k93584j088609N6501J824677J731049K09621J9186
$$ 3779822 2593557 2973443 2679859 1591250 1647751 3472428 5203477 5413098 5432284
37013E432284J640399J936084j068827m196080k878804J912519M282627J636261
$$ 5432284 7072683 9008767 7939940 3743860 865056 2777575 7060202 8696463
37005H696463j715734j358866P06691J79260k034722j714758R18995J375606j198417
$$ 8696463 6980729 5621863 6328554 6507814 4473092 2758334 3677329 5052935 3854518
36996C854518k364660j5184K147626J244818o4695R60527J812015n64970l601173
$$ 3854518 1489858 1474674 3622300 4867118 4802423 5762950 7574965 7009995 3408822
36987C408822k910814M25956J858168Q89378R95122K765795K748057l57799l286608
$$ 3408822 498008 923964 2782132 3671510 4666632 7432427 10180484 9822685 6536077
36978F536077l303242j725899q88781r04799r14674p51165j03657J402387K347556
$$ 6536077 3232835 1506936 618155 -286644 -1201318 -1952483 -2056140 -653753 1693803
36969A693803N75060k818095l689958p45253J863066K87369l241382l568930L6017
$$ 1693803 2268863 -549232 -4239190 -4984443 -3121377 -2834008 -6075390 -9644320 -9608303
36960i608303L141355K425726l74161j478294K32663K805701M152958L824841
$$ -9608303 -6466948 -4041222 -4415383 -5893677 -5661014 -2855313 1297645 5122486
36952E122486K239438k27779k652786l189834q82007K345485L262460J310387
$$ 5122486 7361924 7134145 4481359 1291525 409518 2755003 6017463 7327850
36944G327850q31791j355159j610497k731560k699631K30968L330006K638720
$$ 7327850 6496059 5140900 3530403 798843 -1900788 -1669820 1660186 4298906
36936D298906p50288k137072n21578N33912j57000P39362M127147M960733k13216
$$ 4298906 3548618 1411546 889968 1423880 1266880 2006242 6133389 11094122 10880906
36927A0880906o439009o253050J49992N808549O485386M077135J305933j455916
$$ 10880906 4441897 -1811153 -1661161 4147388 10632774 14709909 16015842 14559926
36919A4559926l370561k291512J201045K854880L47649l076829l060161J19360
$$ 14559926 11189365 8897853 10098898 12953778 13301427 10224598 7164437 7283797
36911G283797K776954K937197J565211m6790j485072k362120k389432j999656
$$ 7283797 10060751 12997948 14563159 14516369 13031297 10669177 8279745 6280089
36903F280089j406898J30408K476639L308451J048247j899006j910578L16949
$$ 6280089 4873191 5003599 7480238 10788689 11836936 9937930 8027352 8344301
36895H344301O27345j880483l171772r36548J286896j54497k684806j435636K665712
$$ 8344301 8971646 7091163 3919391 2982843 4269739 4115242 1430436 -5200 2660512
36886B660512M053349J104033j900908k067400j723983k903484l049665J63908
$$ 2660512 6713861 7817894 5916986 3849586 2125603 -777881 -3827546 -3663638
36878c663638L620581K868917r77781k994043j676461j1409p78m35454k06676
$$ -3663638 -43057 2825860 1848079 -1145964 -2822425 -2833834 -2834612 -3270066 -3476742
36869c476742Q7325L45500J251731J816434J84676k356840j997765J603148L789067
$$ -3476742 -3389417 -3043917 -1792186 24248 208924 -2147916 -4145681 -2542533 1246534
36860A246534J556740j782424j576586J390510K732483J228494j50494N96286
$$ 1246534 2803274 1020850 -555736 834774 3567257 4795751 4645257 5241543
36852E241543J855278J434156l41763j597814j526758j103274j632410k940000
$$ 5241543 7096821 8530977 8189214 6591400 5064642 3961368 2328958 -611042
36844f11042l241015j409586R59134J308589j1151P9519K572489M409474L016099
$$ -611042 -3852057 -5261643 -4302509 -2993920 -3005071 -2925552 -353063 4056411 7072510
36835G072510J59969j198591j495868k721547l905674k527094M77322J460273
$$ 7072510 7232479 6033888 4538020 1816473 -2089201 -4616295 -4138973 -2678700
36827b678700n4982m70642J884555L785009K109031j367461k753858j444611k8147
$$ -2678700 -2733682 -3204324 -1319769 2465240 4574271 3206810 452952 -991659 -1019806
36818a019806l9578l64945L91652J836197K390067J125374j123825k342962j446529
$$ -1019806 -1059384 -1424329 -1032677 803520 3193587 4318961 3195136 852174 -594355
36809e94355K55216N39043q75461k138223j879543m66340J432272L556020M777302
$$ -594355 -339139 199904 -675557 -2813780 -4693323 -5159663 -3727391 -171371 4605931
36800D605931L303093n57352l581187l115621r5896K658993L725860L299977J756964
$$ 4605931 7909024 7351672 3770485 654864 558968 3217961 6943821 10243798 12000762
36791A2000762j73454j098974p76337j084739l160208m783668l193337L51784
$$ 12000762 11827308 10728334 9951997 8867258 5707050 923382 -2269955 -1918171
36783a918171J826453J04517j716415j198760K25406K79148m43847J59337K137117
$$ -1918171 -91718 12799 -1703616 -2902376 -2676970 -2397822 -2841669 -2682332 -545215
36774e45215L337398K222184n90337l172270l718926j763333J086452K241750
$$ -545215 2792183 5014367 4424030 1251760 -2467166 -4230499 -3144047 -902297
36766i02297R18959p40979k72498J986920L427491K373691l46318k749678l494184
$$ -902297 16662 -724317 -996815 990105 4417596 6791287 6444969 3695291 201107
36757B01107k393599j97212J896084L104066L509594L303508K067620l27815k499279
$$ 201107 -2192492 -2389704 -493620 2610446 6120040 9423548 11491168 11163353 8664074
36748H664074k544206n30631J095570K34883k360998l948455k863143j93504J608425
$$ 8664074 6119868 5589237 6684807 6919690 4558692 610237 -2252906 -2446410 -837985
36739h37985J422473M43181L94786J240368J440051L77119p15616p82342n88587
$$ -837985 584488 1027669 1422455 2662823 4102874 4479993 3764377 2982035 2393448
36730B393448j231354k156158k185916j541976r38815M09389L276471N427369
$$ 2393448 1162094 -994064 -3179980 -4721956 -5660771 -5251382 -1974911 3452458
36722C452458L544422j261969l520100p94405K370521Q86727l214454l656023
$$ 3452458 6996880 5734911 2214811 1420406 3790927 4677654 1463200 -2192823
36714b192823Q92311N031077M327544P24447j235591l91972J084837J614358J469022
$$ -2192823 -1300512 3730565 8058109 8782556 7546965 7154993 8239830 9854188 11323210
36705A1323210R46571m08129k472694l839626l210955j144490K41716l29343j602700
$$ 11323210 12269781 11861652 9388958 5549332 2338377 1193887 1435603 1106260 -496440
36696d96440j486921l04039m96210k346102k446509J328016N477552N049677R52093
$$ -496440 -1983361 -2287400 -2783610 -5129712 -7576221 -6248205 -770653 4279024 5231117
36687E231117j247509K64162J244432j095975l238164j227384K506433K647641
$$ 5231117 3983608 4247770 5492202 4396227 1158063 -69321 2437112 5084753
36679E084753r05478l108364j284311J615934J826956l53111j740767m78062K049614
$$ 5084753 4179275 1070911 -213400 1402534 3229490 2876379 1135612 657550 2707164
36670B707164K899826J004722j059864R2624L690738M957505J663611k220203
$$ 2707164 5606990 6611712 5551848 5644472 9335210 14292715 15956326 13736123
36662A3736123k138291L91266P17018j278202j587444M11339N49821k838635n510025
$$ 13736123 11597832 11989098 12706116 11427914 9840470 10251809 10801630 7962995 2452970
36653B452970l808654l03677M70080j266211j811126J31360K552641L916123M412203
$$ 2452970 -1355684 -1659361 -1189281 -2455492 -4266618 -4135258 -1582617 2333506 6745709
36644F745709L994296K208983o6467j238116j409833j980721k828070k233442
$$ 6745709 10740005 12948988 12882521 11644405 10234572 8253851 5425781 3192339
36636C192339j4723J555275R12253n85622q72895j41724l0205q18679j250679
$$ 3192339 3177616 4732891 5645144 5059522 4186627 4044903 4014698 3196019 1945340
36627A945340q29398m12794j96183R87999L190262L849829R69698l046778l539033
$$ 1945340 1115942 703148 506965 1494964 4685226 8535055 9504753 6457975 2918942
36618B918942J36785L315174K196721j369228l216625k477099j125405o79J255113
$$ 2918942 3055727 6370901 8567622 7198394 3981769 1504670 379265 378586 1633699
36609A633699J681844K61817j094943J44973K286202J348039k035180k751942
$$ 1633699 3315543 3577360 2482417 2627390 4913592 6261631 4226451 1474509
36601A474509O11675L080754J157165j742159j269060R31298P99838j172782j629074
$$ 1474509 2086184 5166938 6324103 4581944 3312884 4244182 5044020 3871238 2242164
36592B242164m96750k97846r77461m63843P43156M96916k95184J032680L347431
$$ 2242164 1745414 1447568 470107 6264 749420 1246336 951152 1983832 5331263
36583E331263K817411k26709j090349J574354L367444J398128j273281j236974
$$ 5331263 8148674 7921965 6831616 8405970 11773414 13171542 11898261 10661287
36575A0661287n2894m41746j232496k85428P71075o51942k799270j844127J758601
$$ 10661287 10608393 10166647 8934151 8648723 9419798 8767856 5968586 4124459 5883060
36566E883060L767714K557290P05947J5833q58025k742358l637825j990927M84364
$$ 5883060 9650774 12208064 12914011 12929844 12071819 9329461 5691636 3700709 4185073
36557D185073J415750J198123J575063K269993J557009m10938j347647k40210
$$ 4185073 5600823 6798946 8374009 10644002 12201011 11790073 10442426 10202216
36549A0202216J046781N49457r61141j410109p01992o10033j573311j815242m12669
$$ 10202216 11248997 11798454 10837313 9427204 8725212 8115179 6541868 4726626 4313957
36540D313957Q50045L07510o31774K87699K130321J922665m54387j758975l60140
$$ 4313957 5164002 5471512 4839738 5127437 7257758 9180423 8726036 6967061 6606921
36531F606921J467099J542332J011648J481930J693658o918j933255j251735J284331
$$ 6606921 8074020 9616352 10628000 12109930 13803588 13796670 11863415 10611680 11896011
36522A1896011K340796J159682M9579k38772j615568m138586m394830p19957L150724
$$ 11896011 14236807 15396489 15446068 15207296 13591728 9453142 5058312 4338355 7489079
36513G489079K837597l81242j587995N66891K510700J687329P7367L20069J385827
$$ 7489079 10326676 9945434 8357439 8924330 11435030 13122359 13199726 13519795 14905622
36504A4905622P15641j136825j163075J102887K240085k79036m029055m322919
$$ 14905622 15621263 14484438 13321363 14424250 16664335 16385299 12356244 8033325
36496H033325k49412L884924L524222r59628m891667m567880r88266J821605J526957
$$ 8033325 7783913 11668837 15193059 14233431 9341764 4773884 3785618 5607223 7134180
36487G134180k58828n01311J336917K872949K117510k8528j185407m34875J166794
$$ 7134180 6875352 6374041 7710958 10583907 12701417 12672889 11487482 11052607 12219401
36478A2219401K379468K756182K024197K1610k255786k841663j082481R88023
$$ 12219401 14598869 17355051 19379248 19400858 17145072 14303409 13220928 14208951
36470A4208951P92921j414812k571456p22391K044162J838295j972610n425847
$$ 14208951 15001872 13587060 11015604 10293213 12337375 14175670 12203060 6777213
36462F777213m562160k18520L333578L789022K567983J259531o21640k963315
$$ 6777213 2215053 1996533 5330111 9119133 11687116 12946647 12325007 9361692
36454I361692l173408J47259L688780L195096k76099j733289L32047K089854P47169
$$ 9361692 6188284 6335543 10024323 13219419 12943320 11210031 11542078 13631932 14379101
36445A4379101j372898j080510Q85224J920973J595440P85124q01209l107864
$$ 14379101 13006203 11925693 12810917 14731890 16327330 17112454 16311245 13203381
36437A3203381l795570j304420J677967J480168r53246j674169k32494p5990k201507
$$ 13203381 9407811 8103391 9781358 11261526 10308280 8634111 8401617 8325627 6124120
36428F124120l119660p23980K035534J916031L67131M67849J472506M06096k160051
$$ 6124120 3004460 2280480 4316014 6232045 6599176 7067025 8539531 8945627 6785576
36419F785576k184707J555317M828481L376936j250954l649001j519622J689762
$$ 6785576 4600869 6156186 10984667 14361603 13110649 9461648 7942026 9631788
36411I631788J706656q98060j899049L47192K534837J423067j184091j199324
$$ 9631788 11338444 10440384 8541335 8888527 11423364 12846431 11662340 10463016
36403A0463016J275704J874922j367466m960878n170532l038485j569083n75189
$$ 10463016 11738720 13613642 12246176 7285298 2114766 -923719 -2492802 -3067991
36395c067991J942172M767994M225576J50906k910127j882346P68568J278991
$$ -3067991 -1125819 3642175 7867751 8018657 5108530 3226184 3994752 5273743
36387E273743J90559P34370L265046M749305L501968J225363l43431j964627m460921
$$ 5273743 5464302 6198672 9463718 14213023 17714991 18940354 18596923 16632296 12171375
36378A2171375n932815l878776P68407M108514L846985J515826k38934p80160
$$ 12171375 6238560 2359784 3128191 7236705 11083690 12599516 12360582 11580422
36370A1580422r74039j069664n95191L09465Q48303O72475N0540p79163j452549
$$ 11580422 10606383 9536719 8941528 9250993 10099296 10771771 10822311 10043148 8590599
36361H590599j078583O95899K389929K021051k0248j078243Q4358J363926L84552
$$ 8590599 7512016 8207915 10597844 12618895 12598647 11520404 11604762 12968688 13353240
36352A3353240j889921k521349q41790Q46109Q06464l8475j83494K52080O00270
$$ 13353240 11463319 8941970 8100180 8946289 9752753 9714278 9530784 9782864 10383134
36343A0383134J320546K918045M276522L973862K611820J821222J350586m51145
$$ 10383134 11703680 14621725 18898247 22872109 25483929 27305151 28655737 28204592
36335B8204592l131491l925170k135639r73575k894565n351326m226656j89671
$$ 28204592 25073101 21147931 19012292 18038717 15144152 9792826 5566170 5376499
36327E376499J922247l4401k707433k269497O13884K474553J676313m57990j912682
$$ 5376499 7298746 7264345 4556912 2287415 2901299 5375852 7052165 6594175 4681493
36318D681493j785799n08337O75647Q74411N07598L79939J38095p77656j131834
$$ 4681493 2895694 2387357 3063004 3937415 4445013 4824952 4963047 4185391 3053557
36309C053557N43716K466585J240490k233672k749204J218955M045651J129283
$$ 3053557 3597273 6063858 7304348 5070676 2321472 3540427 7586078 8715361
36301H715361l588894l404215R80630L260250J669232M28762J350282J121081
$$ 8715361 5126467 1722252 2702882 5963132 7632364 8061126 9411408 10532489
36293A0532489j597350k964426o15137K078454J772523L60019O67738J237949
$$ 10532489 8935139 5970713 5355576 7434030 9206553 9566572 10234310 11472259
36285A1472259k86396k067779j049398J447503J631606q92681l137096l264507
$$ 11472259 11185863 9118084 8068686 9516189 11147795 10255114 7118018 3853511
36277C853511j675157R26703L254421K954829k02449k516883j233246J021683
$$ 3853511 2178354 3105057 6359478 9314307 9111858 6594975 5361729 6383412
36269F383412O65234o40048O36811K731225J251251k393080k556536P26277J203698
$$ 6383412 7048646 6408598 7045409 9776634 11027885 8634805 6078269 6804546 8008244
36260H008244k796375m960631j477700K555400J871045m26350R37423L960968
$$ 8008244 5211869 251238 -1226462 1328938 3199983 2773633 3711056 7672024
36252G672024L149728q02955k388356m13271J170281P55873P93144J781968P33466
$$ 7672024 10821752 10018797 7630441 7217170 8387451 9143324 9936468 11718436 12451902
36243A2451902l040527n780818m710925j460135J408478L288097L524341Q40539
$$ 12451902 9411375 3630557 -1080368 -2540503 -1132025 2156072 5680413 6520952
36235F520952l050018l352123J252365N309055L412533k169990m569996j515454
$$ 6520952 3470934 118811 1371176 6680231 10092764 7922774 3352778 1837324
36227A837324K501598K957906O37259p04028L79029J669469N64762k320532l427138
$$ 1837324 4338922 7296828 7934087 7230059 7609088 9278557 9843319 7522787 4095649
36218D095649n32902L922005N408057L089490O49188O24312Q52784j342463m060364
$$ 4095649 3562747 7484752 12892809 15982299 16631487 17255799 18108583 16766120 12705756
36209A2705756l333999N77770L113547J580156j797319l547273k923013j262293
$$ 12705756 9371757 9949527 13063074 14643230 12845911 9298638 6375625 5113332
36201E113332K90145J109645P93167k18428p86582n98958n10675r28088j114587
$$ 5113332 5403477 6513122 7306289 7087861 6301279 5702321 5191646 4263558 3148971
36192C148971n58977K81448R85712J456432R41958j272203l589154k861708J196152
$$ 3148971 2589994 2871442 3857154 5313586 6255544 4983341 1394187 -1467521 -271369
36183b71369M525043L618739J73221j456744r6212J608273J632305Q05294M92582
$$ -271369 4253674 7872413 8045634 6588890 6492678 8100951 9733256 10538550 11031132
36174A1031132N77950N28596O21193J111684J314635L44492j731131l723906m002261
$$ 11031132 11609082 12137678 12758871 13870555 15185190 15529682 13798551 10074645 6072384
36165F072384j826025J318528K596109J208785j81169P90300K208567N41348l250770
$$ 6072384 4246359 5564887 8160996 9369781 9188612 9978912 12187479 12728827 9478057
36156I478057m070451j27908L716878K516049j735877l091537q9657K722231J712113
$$ 9478057 5407606 5279698 8996576 11512625 9776748 6685211 6595554 9317785 11029898
36147A1029898j038394j421113P31594J897431K28847j903285j492072P42387
$$ 11029898 9991504 8570391 9301985 11199416 11428263 9524978 8032906 8775293
36139H775293J413353o17881k630371k150253n90912p83785k250045j809292J310101
$$ 8775293 10188646 9570765 6940394 4790141 4199229 3415444 1165399 -643893 666208
36130F66208L972819L546910J204031m89581r60175q74184j6622J844685L275751
$$ 666208 4639027 8185937 9389968 8900387 7940212 7066028 7049406 8894091 12169842
36121A2169842K585620K77785j567290j703576k81816J822923K833067P91033
$$ 12169842 14755462 15033247 13465957 11762381 11480565 13303488 16136555 16927588
36113A6927588l545242o064946m069907l48878M69763j448238j757338J205988
$$ 16927588 13382346 7317400 3247493 2898615 3368378 1920140 162802 1368790
36105A368790M164553M123381K040974p5753k177935m167660m011167p85041K500461
$$ 1368790 5533343 9656724 11697698 11621945 9444010 5276350 1265183 480142 2980603
36096B980603K261023o00990j900890n562K177771J393911j704938l329337q31978
$$ 2980603 5241626 4640636 2739746 2734184 4911955 6305866 4600928 1271591 439613
36087D39613M166063O909377M306073j336315m552992l026974J24378J209426
$$ 439613 4605676 11515053 15821126 14484811 9931819 6904845 7029223 8238649
36079H238649O70143P93136J017059q16091l535360l326466K6056J772360q76381
$$ 8238649 8908792 9701928 10718987 9902896 6367536 3041070 3067126 4839486 3963105
36070C963105m030566k643643J741620L076070k17479k958568r02607L294152
$$ 3963105 -67461 -2711104 -969484 2106586 1889107 -1069461 -1972068 1322084
36062A322084M285770J411289j406236j642218n30973L02273J181453K413428
$$ 1322084 5607854 7019143 5612907 3970689 3439716 3741989 4923442 7336870
36054G336870K663343R56085j349510k165513j218805J97254J031315R47370n6222
$$ 7336870 10000213 10956298 9606788 7441275 6222470 6419724 7451039 8398409 8342187
36045H342187j406851k098829j850093j209016j07051K041949M120048L514325
$$ 8342187 6935336 4836507 2986414 1777398 1670347 3712296 7832344 11346669
36037A1346669P0438k572044j830351m1702o08594k533101k559712r85341p11721
$$ 11346669 11417107 8845063 7014712 6973010 6364416 3831315 1271603 286262 -425459
36028d25459j411396J61589L754752M777897J405266k157489j779281J104656
$$ -425459 -1836855 -1675266 2079486 6857383 8262649 6105160 4325879 5430535
36020E430535K555318J367388j089843l177897k997698O30327N003571N000631
$$ 5430535 7985853 9353241 8263398 5085501 2087803 2718130 7721701 12722332
36012A2722332K72565l056942j111444J760688K32268l128865k433778J283261
$$ 12722332 12994897 9937955 8826511 10587199 10819467 7690602 5256824 6540085
36004F540085J847594j401534k600860M26355K486652j08470l544511l072803
$$ 6540085 8387679 6986145 4385285 4811640 7298292 7189822 3645311 572508
35996E72508l90074P6313j335081o06955L107308N988747M672126N8435m059279
$$ 572508 182434 258747 -1076334 -1683289 1424019 7412766 12084892 12143327 8084048
35987H084048m553863j443827K029212K295261p96249l831166l836597j251899
$$ 8084048 3530185 2086358 4115570 6410831 5614582 1783416 -2053181 -3305080
35979c305080J510089K899549K884410K265053K185756L063628L478127J625258
$$ -3305080 -1794991 1104558 3988968 6254021 8439777 11503405 14981532 16606790
35971A6606790j720379l596249k824025j484164j519559k097068j661822n04993
$$ 16606790 14886411 11290162 8466137 6981973 5462414 3365346 1703524 1198531
35963A198531L45624R63585J531686J147657n64091j997401j483162L76768J700371
$$ 1198531 1544155 2507740 4039426 5187083 4622992 2625591 1142429 1519197 3219568
35954C219568J588845L53497j091029j100837J486955M763307M693388M78613
$$ 3219568 4808413 5161910 4070881 2970044 4456999 9220306 13913694 14392307
35946A4392307l426321l046458k99400L51373j427033k312814j185531k59219
$$ 14392307 10965986 7919528 7620128 7971501 6544468 4231654 3046123 2786904
35938B786904n31391j41094J911736L679627L120342O71466j907419l204953k205404
$$ 2786904 2255513 2114419 4026155 7705782 10826124 11497590 9590171 6385218 4179814
35929D179814R73683L766314L077644m90227k691040j119220J678641K154704
$$ 4179814 5153497 8919811 11997455 11507228 8816188 7696968 9375609 11530313
35921A1530313O00930k02038M23986N39575q21584k042239j394937N61747J910643
$$ 11530313 12131243 11929205 12353191 12892766 12071182 10028943 8634006 9195753 11106396
35912A1106396J760641Q43827J59894r9243j67302j5159L37923L23737l73470
$$ 11106396 12867037 13710864 13870758 13771515 13604213 13589054 13926977 14250714 13877244
35903A3877244p67264K65694J674777J035245j508760k363679N18799L770184
$$ 13877244 13109980 13375674 15050451 16085696 14576936 12213257 12732056 16502240
35895A6502240K744010j611119l716177j295105J481800K73534l236496m068598
$$ 16502240 19246250 17635131 13918954 12623849 14105649 14379183 11142687 7074089
35887G074089r79601K238007K100244m00346j655012l0916K516608L122731J325565
$$ 7074089 6094488 8332495 10432739 10032393 8377381 8346465 10863073 13985804 15311369
35878A5311369r30700k094046k433908k400040j354238P20366J838537M84021
$$ 15311369 14380669 12286623 9852715 7452675 6098437 6818803 8657340 9141361
35870I141361j583592j460301O28678J885430J343105O25270L35043p94176k446834
$$ 9141361 7557769 6097468 6726146 8611576 9954681 10579951 10914994 10120818 7673984
35861G673984k066719Q35475L014368K077739k07039j241964j219754j016911
$$ 7673984 5607265 6442740 9457108 11534847 11327808 10085844 8866090 7849179
35853G849179L46015K917572L418273k47174m223174l153398J682975L551264
$$ 7849179 8195194 11112766 14531039 14283865 10060691 6907293 8590268 12141532
35845A2141532l34994n097535m978113k13094M421557N287664K634322n05433
$$ 12141532 11806538 6709003 1730890 1517796 5939353 11227017 13861339 13355906
35837A3355906j159484O52290J847868M50888j300275m45375J529378R03183j659024
$$ 13355906 12196422 12848712 14696580 15147468 13847193 13401818 14931196 15834379 14175355
35828A4175355j670143J470501K746615m70836l836387k760061O90635J804184
$$ 14175355 12505212 13975713 16722328 16251492 12415105 9655044 10345679 12149863
35820A2149863N44634l802J67419j198895l043991j830803K042072L727923Q37046
$$ 12149863 12694497 12690695 12858114 11659219 8615228 6784425 8826497 12554420 13391466
35811A3391466l286270m516541k701330q4059J860213K402279J148053n72876
$$ 13391466 10105196 5588655 2887325 2803266 4663479 7065758 8213811 7640935
35803G640935k35365K246341L541277J330763k267372l659246k428712q79369
$$ 7640935 7405570 9651911 13193188 14523951 12256579 8597333 6168621 5289252
35795E289252l04262o0409M18444Q95330J315409J692042J205068q62918l245350
$$ 5289252 4984990 4924581 5343025 6238355 7553764 9245806 10450874 9587956 6342606
35786F342606l364936l84681L481625N218533L911022J081311j245532k245809
$$ 6342606 2977670 2592989 6074614 11293147 15204169 16285480 15039948 12794139
35778A2794139k245267j613191l49510J179192J943158J438832O01908N58104
$$ 12794139 10548872 8935681 8586171 9765363 11708521 13147353 13749261 14307365
35770A4307365R73168Q63280M78567O55440O66658j007991l578655m124419j708502
$$ 14307365 15280533 16143813 16622380 17277820 17944478 16936487 13357832 9233413 7524911
35761G524911J050306J689089Q99141M11301K59033Q691M32801J650160J647817
$$ 7524911 8575217 10264306 11163447 11574748 11833781 11842472 12275273 13925433 15573250
35752A5573250p26777l122831k846251q95740K80845J173863L372508M892220
$$ 15573250 14846473 11723642 8877391 7981651 8262496 9436359 12808867 17701087
35744A7701087K485122j592179p52657O342851J2302297J0042101J715972m748253
$$ 17701087 20186209 18594030 17841373 24184224 36486521 46528622 48244594 43496341
35736D3496341n513187l611832l124941m133710m008798j717588M28947m81883
$$ 43496341 37983154 34371322 31246381 27112671 23103873 21386285 21815232 21333349
35728B1333349l743681m977455j680974K689556K985831k99790j888750J71235
$$ 21333349 17589668 12612213 10931239 13620795 16606626 16306836 14418086 14589321
35720A4589321J926663L05365k283568k654105j846932k038058k082830q2702
$$ 14589321 16515984 16821349 14537781 11883676 10036744 7998686 5915856 5833154
35712E833154K457294L015836K186460J626123M84263j927881k673317M87854
$$ 5833154 8290448 11306284 13492744 15118867 15603130 13675249 11001932 11489786
35704A1489786L679730J805730k742046k987840J577554M130829J513386j368380
$$ 11489786 15169516 16975246 14233200 11245360 12822914 16953743 18467129 17098749
35696A7098749n53848O70864j469658m236623l370508n15829O7781j020206l3116
$$ 17098749 16544901 17215765 15746107 11509484 8138976 7623147 7690928 6670722 6637606
35687F637606K716997L214203O25321j501220j224478p28919j807531k770912
$$ 6637606 9354603 12568806 13194127 11692907 10468429 9739510 7931979 5161067
35679E161067j622079M92877R57972p43813k532527k024213J141876M514427M620544
$$ 5161067 3538988 4031865 4989837 4246024 1713497 -310716 831160 5345587 9966131
35670I966131P61577l418052l783263p35943J592703R34755q08175j219060o22265
$$ 9966131 10727708 7309656 3526393 2790450 4383153 5317908 4509733 3290673 2668408
35661B668408l51750k7498J340250K852871K593655N94235r86639p56818L73931
$$ 2668408 2316658 2289160 3629410 6482281 9075936 9670171 8683532 7926714 8300645
35652H300645Q85695N19104j61034q92840j469008j289040l64695n2287j216971
$$ 8300645 9186340 9705444 9544410 8651570 7182562 5893522 5528827 5476540 4259569
35643D259569k133706l56916L122729M145121J016339k602472k619370k29585
$$ 4259569 2125863 1768947 4891676 9036797 10053136 7450664 4831294 4601709
35635D601709L38011j622322k751181j302642N49122P74581K78351L14264L14262
$$ 4601709 4939720 3317398 566217 -736425 -187303 587278 865629 1179893 1494155
35626A494155l7493N12667K098871K432682L58210j764450j526538L8151Q12718
$$ 1494155 1456662 1969329 4068200 6500882 6859092 5094642 3568104 3606255 4418973
35617D418973R75630J294983O04734j677801k851078o43260K314178K032713m27809
$$ 4418973 5394603 6689586 7294320 5616519 2765441 2122181 4436359 6469072 6041263
35608F041263r62129L25123m57226l342039l403443J087030M961453L438299j322314
$$ 6041263 5079134 5404257 4947031 1604992 -1798451 -711421 4250032 7688331 6366017
35599F366017m087001l281631o13796K655075N313621M803536L65162m124186
$$ 6366017 2279016 -1002615 -1616411 1038664 6352285 11155821 11520983 7396797
35591G396797m305148j112544J155505J300469J734877L178000L269812J075395
$$ 7396797 3091649 1979105 3134610 4435079 6169956 9347956 12617768 13693163
35583A3693163r95916j188948j021664k025881k650285r39189J543171J336200
$$ 13693163 12697247 11508299 10486635 8460754 5810469 4871280 6414451 7750651
35575G750651j931338m624290l536109L67551L329057L038997P72188m56994O53835
$$ 7750651 5819313 1195023 -2341086 -1973535 1355522 4394519 5166707 4709713 5363548
35566E363548K362964K058307n16856k784538k306532K76963J936516Q33539j485183
$$ 5363548 7726512 9784819 9267963 6483425 4176893 4453856 6390372 7223911 5738728
35557E738728j982548R1527K183602J603817j005238k429355j006707J345207
$$ 5738728 3756180 3847707 6031309 7635126 6629888 4200533 3193826 4539033
35549D539033J904106P59598J91725R68220J222970m18520k341905k066461Q8668
$$ 4539033 6443139 7202737 7394462 8362682 9585652 9167132 6825227 4758766 4847434
35540D847434J326982K34916j516205j832804q83398p1532K57837N53336N09607
$$ 4847434 6174416 6409332 4893127 3060323 2176925 2105393 2363230 2916566 3426173
35531C426173l43122j015137l3367K009403K864200J838926O42127N72626R57688
$$ 3426173 3083051 2067914 2034547 4043950 6908150 8747076 9389203 9961829 10919517
35522A0919517J131058J677291K437281J597943j281494l358695k137837M74843
$$ 10919517 12050575 13727866 16165147 17763090 16481596 13122901 10985064 11459907
35514A1459907O11741j890926l270273j208278K337572M216866L728418K263751
$$ 11459907 12071648 10180722 6910449 5702171 8039743 12256609 15985027 18248778
35506A8248778R69209q4171j098893j710962j178467K45287N66933j640582m070540
$$ 18248778 19217987 19133816 18034923 16323961 15145494 15390781 15957714 14317132 10246592
35497A0246592k580742K505921N327939K311680k280406k555651K87809P66234
$$ 10246592 7665850 10171771 15499710 17811390 15530984 12975333 13263142 14029376
35489A4029376j541460k014385L01151J106579j018828j822728R12257L182144
$$ 14029376 12487916 10473531 10774682 11881261 10862433 9039705 9951962 13134106
35481A3134106J583274j259999j848689j298533j568383j055559J346101K248256
$$ 13134106 14717380 13457381 11608692 10310159 8741776 7686217 9032318 11280574
35473A1280574q74926m182132k970263O56984J614723L95417J208314L696781
$$ 11280574 10405648 6223516 3253253 3910237 5524960 5920377 7128691 10825472
35465A0825472L555190M60041j466294j007486j196451k886969l178975j228743
$$ 10825472 14380662 14840703 13374409 12366923 11170472 8283503 5104528 3875785
35457C875785J34309j39876L58033K325547L052435J460412O705R6087L24756
$$ 3875785 4010094 3870218 4228251 6553798 9606233 11066645 11073350 11169437 11494193
35448A1494193M58835J964740L328008P41033m601041o151351j770895K457817
$$ 11494193 11953028 13917768 17245776 17986809 13385768 7234417 5463522 7921339
35440G921339J786130k27943R27681K547239J55683l804412l814185l96324J606768
$$ 7921339 9707469 9479526 10407207 12954446 13110129 9305717 5491532 5095208 6701976
35431F701976J403223J993266L262187K245073m93347j273902Q5971J78974j377287
$$ 6701976 8105199 10098465 13360652 15605725 15112378 13838476 13924447 14103421 12726134
35422A2726134j223813J286768K724015J687142P72959J115531L37082k229337
$$ 12726134 11502321 12789089 15513104 17200246 17973205 19088736 19425818 17196481
35414A7196481l345632j214021J425081J868457J027075K36035j271652l138306
$$ 17196481 13850849 12636828 14061909 15930366 16957441 17193476 15921824 12783518
35406A2783518k322389K030138N733839M953932J432846q44159j248702j427612
$$ 12783518 10461129 12491267 18225106 23179038 24611884 23767725 22519023 21091411
35398B1091411j399861l95195O11337O58405J084067K851440L859823K392642
$$ 21091411 19691550 19296355 19907692 20566097 21650164 24501604 28361427 30754069
35390C0754069Q69043K154061M295911L458066L58408j102100l50888o2117l89959
$$ 30754069 31623112 33777173 38073084 41531150 41889558 40787458 40436570 40374453 39984494
35381C9984494J015878L288800K728675r1095J96359M890763P741108L918566
$$ 39984494 41000372 44289172 47017847 46926752 47123111 52013874 59754982 63673548
35373F3673548k531172m703649k348269k78159j78430K99431J617279J243731
$$ 63673548 61142376 56438727 54090458 53812299 53633869 53933300 55550579 56794310
35365E6794310j154545k200010L4506K832055K638538k55609k600816k377828
$$ 56794310 55639765 53439755 53474261 56306316 58944854 58689245 56088429 53710601
35357E3710601o62968J39143q61306k014221j275352N82056L86230k788258n333187
$$ 53710601 53047633 53186776 52325470 50311249 49035897 49617953 50004183 47215925 41882738
35348D1882738l760616j32659L87855l164401o258724n255545j706714Q33900
$$ 41882738 38122122 37989463 38377318 35212917 28954193 23698648 21991934 22825834
35340B2825834J257240N14791o42630j532072j072835N84967J469698N28750n34948
$$ 22825834 24083074 24597865 23955235 22423163 21350328 21935295 23404993 23933743 23398795
35331B3398795J26775J577663J700270L97235q59884j557605k082471k058075
$$ 23398795 23525570 25103233 26803503 27200738 26340854 24783249 22700778 20642703
35323B0642703r67318J84124k0110j057046j239322m11860J75972K80575P06622
$$ 20642703 19675385 19859509 19839399 18782353 17543031 17131171 17307143 17587718 18294340
35314A8294340J150033L77704j303836k071241j440146q89359j154549j147955
$$ 18294340 19444373 19822077 18518241 16447000 15006854 14117495 12962946 11814991
35306A1814991k84461L84525L75217Q81351K291693K699635P82751j521456j501759
$$ 11814991 11530530 11915055 12290272 13171623 15463316 18162951 18945702 17424246 15922487
35297A5922487K40918O75939j011242k129282m92971K178764K353193n48858l027436
$$ 15922487 16163405 16839344 15828102 13698820 13205849 15384613 17737806 17188948 14161512
35288A4161512j610520K829571N970027N089707J862735m30574r57258j136124
$$ 14161512 12550992 15380563 21350590 26440297 28303032 27872458 26915200 25779076
35280B5779076j557021j334946l23690K06217m62439j498465j870031j256476
$$ 25779076 24222055 22887109 22563419 22769636 22307197 20808732 18938701 17682225
35272A7682225M05677K536621L126850N94935l269219m678164k726695k40163
$$ 17682225 18087902 20624523 23751373 24346308 21077089 16398925 13672230 13432067
35264A3432067R57380K298888M443684M652444J172410k667534k552683M62407
$$ 13432067 14389447 16688335 21132019 25784463 26956873 24289339 21736656 22199063
35256B2199063J632324m99422k753746k644170j265970m57876m01858q55387j923320
$$ 22199063 23831387 23331965 20578219 17934049 16668079 16210203 15808345 14952958 13029638
35247A3029638k633276j267511J764490L606418K753342J223544J477461K714596
$$ 13029638 10396362 9128851 10893341 14499759 17253101 18476645 19954106 22668702
35239B2668702K003858j534278n146440n302630j664887K244160K822179N72208
$$ 22668702 24672560 23138282 17991842 12689212 11024325 13268485 16090664 16662872
35231A6662872q38730J44868R69566m57789j964350o77605J833129J815722n87365
$$ 16662872 15824142 15969010 16938576 16480787 14516437 13838832 15671961 17487683 16900318
35222A6900318j810599q84503m26798j354772j265028P66977K117106J039884
$$ 16900318 15089719 14205216 13778418 12423646 11158618 11925595 14042701 15082585
35214A5082585p05146j389709j641248j435010J012317M923314N866584K187567
$$ 15082585 14377439 12987730 11346482 9911472 10923789 15847103 21713687 23901254
35206B3901254j536439j202725O20402l37605k668235k423777o64620j434189
$$ 23901254 22364815 21162090 21782492 21444887 18776652 16352875 15688255 14254066
35198A4254066l870018l091741J336126M332147L424734J895833K304996K556216
$$ 14254066 10384048 7292307 8628433 12960580 16385314 18281147 20586143 23142359
35190B3142359P80709q76885l75014M12956p50530k338379j654439R50327L211895
$$ 23142359 23923068 23046183 22671169 23084125 22333595 19995216 18340777 19291104 22502999
35181B2502999M049296L146929o3368m318450n727246k095745L528276O233386
$$ 22502999 26552295 29699224 29635856 25317406 19590160 17494415 21022691 27256077
35173B7256077M705446J131271k374357m551613m036711q09187K405290K853290
$$ 27256077 31961523 33092794 30718437 26166824 22130113 21320926 23726216 26579506
35165B6579506R76995j126074k729565l492881j761793K528212N184596K437870
$$ 26579506 27556501 26430427 23700862 20207981 18446188 20974400 26158996 28596866
35157B8596866k902887m792495k760803j895060l781228l689254J064803N732423
$$ 28596866 25693979 20901484 18140681 16245621 12464393 8775139 9839942 15572365
35149A5572365M928818M43635k190674j733237j064599j161877l10485J503324
$$ 15572365 20501183 20944818 18754144 17020907 15956308 14794431 14483946 15987270
35141A5987270K134435J371775J395286K468390J888833j445466m523040m081236
$$ 15987270 18121705 19493480 20888766 23357156 25245989 23800523 19277483 15196247
35133A5196247q35294J800979J643077q98647l888995n072303l332611j02540
$$ 15196247 14360953 16161932 17805009 16906362 13017367 7945064 4612453 4509913
35125D509913J818566J631770J220726J678256J324793j095494l326395k409849
$$ 4509913 6328479 7960249 9180975 10859231 12184024 11088530 7762135 5352286
35117E352286O45069K039449O17175r56723p20823J472k69411k61288J667184
$$ 5352286 5997355 8036804 8653979 7697256 6976433 6977905 6708494 6447206 8114390
35108H114390M067889L885204P28307k505333l224161j710473K8574O18139K03057
$$ 8114390 12182279 16067483 16795790 14290457 11066296 9355823 9384397 10002536 10205593
35099A0205593r7498N94490J677380J349810j007495l239761k670668J74699J861139
$$ 10205593 10108095 10702585 12379965 13729775 12722280 9482519 6811851 6986550 8847689
35090H847689N28757j641900j528827P36797K212419J083204j377728k670949
$$ 8847689 9376446 7734546 6205719 6942516 9154935 10238139 8860411 6189462
35082F189462j693470O15150K357674K220443N53676r26853q71288L58334J380545
$$ 6189462 4495992 5111142 7468816 9689259 10242935 9316082 8444794 8803128 10183673
35073A0183673J448391Q51053Q5507n62799q85086j050835j751629l007620l183565
$$ 10183673 11632064 12483117 12568624 12005825 11120739 10069904 8318275 5310655 2127090
35064B127090q10222K460642K742978j057694m792637l710607J273583M446802
$$ 2127090 1316868 3777510 6520488 5462794 670157 -3040450 -1766867 2679935
35056B679935K648874q07218j005335J868297L367948J533671n35156J63964J772497
$$ 2679935 5328809 4521591 3516256 5384553 8752501 10286172 9751016 9914980 11687477
35047A1687477N55185l052264m780284k743302L6424L42308r78487j375664p14180
$$ 11687477 12242662 9190398 4410114 1666812 1703236 2045544 1067057 -308607 -1022787
35038a022787l41432J54556J959381L715135K774626j82781j353723M59850J698176
$$ -1022787 -1364219 -1209663 749718 4464853 7239479 7056698 5702975 6162825 7861001
35029G861001n83446m054728m368700j106055K306100L416242K732418J434338
$$ 7861001 7277555 3222827 -1145873 -2251928 54172 3470414 6202832 7637170
35021G637170k33243k020526l102268k962081j695947N11765L034878M290104
$$ 7637170 7403927 5383401 2281133 -680948 -2376895 -1865130 1169748 5459852
35013E459852L138236O91731q10068q54904p75749j114870r11027m2281j09839
$$ 5459852 8598088 9289819 8479751 7624847 6849098 5734228 4823201 4780920 4671081
35004D671081j772315k928913j331405J933139L447877J806999o91431j199368
$$ 4671081 2898766 -30147 -1361552 571587 4019464 5826463 5135032 3935664
34996C935664Q5338O29977o47160j906148j293420J54710J73093j028671j140118
$$ 3935664 4021002 4650979 4003819 2097671 804251 958961 1132054 103383 -1036735
34987a036735J92800N94470p66137j237765Q59416K790348J651056l76776P11978
$$ -1036735 -843935 -249465 -1015602 -2253367 -1393951 1396397 3047453 2670677 3382655
34978C382655L756103L750276r5281k902465j751402L07320p8517j546675j639619
$$ 3382655 7138758 10889034 10793753 7891288 6139886 6447206 6368689 4822014 3182395
34969C182395j359130k326710k630922J02222L575890L269411q31178l911352
$$ 3182395 1823265 -503445 -3134367 -3032145 543745 3813156 2981978 -929374
34961i29374k673168J139439L751855L466494J527469N23477J800237L561481
$$ -929374 -3602542 -2463103 1288752 4755246 6282715 6806192 8606429 12167910
34953A2167910K694117o45146k537100r88110Q33963k88642k393816k009655k15681
$$ 12167910 14862027 14216881 11679781 10691671 11525634 11236992 8843176 6833521 6617840
34944F617840k60333j377313n20533J278677M57641j928863j332249J786634J768283
$$ 6617840 6357507 4980194 4459661 5738338 6195979 4267116 2934867 4721501 6489784
34935F489784k392745m297252l02076M323117L709312L2538j273135j02054J95999
$$ 6489784 4097039 -200213 -502289 3820828 7530140 7562678 6289543 6187489 6383488
34926F383488m82774l4123Q07275M2482j054727k22006R13456m47193k455975
$$ 6383488 5900714 5866591 6673866 6716348 5661621 5439615 6353071 5905878 3449903
34917C449903j181049K328498L485242J908820J518571K980014K581710m18426
$$ 3449903 2268854 4597352 8082594 9991414 11509985 14489999 17071709 16653283
34909A6653283j842768n3322P56710k147526m884321l170490O17999J242676j532659
$$ 16653283 14810515 14757193 15513903 13366377 8482056 5311566 5929565 7172241 5639582
34900E639582l504005k592507n57803Q58403J679610J862641Q96946n10688o40823
$$ 5639582 2135577 -456930 -1014733 -156330 1523280 3385921 4282867 3772179 3131356
34891C131356J009168L096879L912196K541768o45310l600631l835389j399476
$$ 3131356 4140524 7237403 11149599 13691367 13046057 9445426 5610037 4210561
34883D210561O34726J60755j015492k08017J750777J960060L56380j26103J638516
$$ 4210561 4845287 5006042 3990550 3782533 5533310 7493370 7849750 7723647 9362163
34874I362163L177887K362472M08016o27213j158439k673128m294296l378354
$$ 9362163 12540050 14902522 15310538 14683325 13524886 10851758 6557462 3179108
34866C179108L52294L488656K939085j3865j353764K96393J881444K92972l132690
$$ 3179108 3531402 7020058 9959143 9945278 8591514 8887907 10769351 11062323 7929633
34857G929633m344441k036272Q73621J418320J19452n85150J99952J294433J404708
$$ 7929633 3585192 1548920 2422541 3840861 3960313 3375163 3575115 4869548 6274256
34848F274256L85862r73130j623658j100667l5203P26947J371389K296516K350648
$$ 6274256 6660118 5686988 4063330 2962663 2927460 3654407 5025796 7322312 9672960
34839I672960M9381l116242l339845J73678L209631K030612j485678k949923j682119
$$ 9672960 9722341 6606099 3266254 3439932 6649563 8680175 7194497 4244574 2562455
34830B562455l85927J0680J135508L053298L368907J220555j168312k001730k016780
$$ 2562455 2176528 2187208 3322716 6376014 9744921 10965476 9797164 7795434 5778654
34821E778654j900152o09151J940745L170106J199440j911196k673978p30994
$$ 5778654 3878502 3269351 5210096 8380202 9579642 7668446 4994468 4263474
34813D263474J232490J268584o3983j092544n23969J892518M660025N053702J925920
$$ 4263474 5495964 6764548 6700565 5608021 5084052 6976570 11636595 16690297 18616217
34804A8616217k363355m242415k857033m45207P65172N68110q4834m98491o40511
$$ 18616217 16252862 12010447 9153414 8708207 9473379 10041489 9956655 9458164 8817653
34795H817653j042689k111685k878340j410594K173032M294932J911574k634549
$$ 8817653 7774964 5663279 2784939 1374345 3547377 7842309 9753883 7119334
34787G119334l762231j09753L293833J912812k031127k960394J16507K576828
$$ 7119334 3357103 3247350 6541183 8453995 6422868 3462474 3578981 6155809
34779F155809R89815k345470l037029n23361J782534J323450q31493k216031k100201
$$ 6155809 7145624 4800154 1763125 1239764 3022298 4345748 3514255 1298224 -801977
34770h01977j304539r4327J945285M089988M441518K563277O45714O24018J317020
$$ -801977 -2106516 -2200843 -255558 3834430 8275948 10839225 11484939 12108957 13425977
34761A3425977M17131j472603j498657O71531J848381L26452j144383J72272K066890
$$ 13425977 13843108 12370505 10871848 11543379 13391760 13718212 12573829 12746101 14812991
34752A4812991M97865l715132n499495k908383K21896K96448j062808m94891J519963
$$ 14812991 15310856 11595724 6096229 3187846 3409742 3706190 2643382 2148491 3668454
34743C668454J832071k02137k066321k103292j185774k29419J217183L052681
$$ 3668454 5500525 5298388 3232067 1128775 -56999 -286418 930765 3983446
34735C983446L529819J530287j374262k556181j414701K87803Q74955N19460L67738
$$ 3983446 7513265 9043552 7669290 5113109 3698408 3986211 4861166 5380626 5748364
34726E748364O86324P18002L45250P26453K240085K714382j91720m826564o361831
$$ 5748364 6434688 7152690 7497940 8224393 10464478 13178860 12987140 8160576 1798745
34717A798745k912034J618725K689146P70146p88802j273452k172226k707038
$$ 1798745 -1113289 505436 3194582 3964728 3175926 1902474 -269752 -2976790
34709b976790n48761L073454L829473R53907j104334M02937K307611R99088j830135
$$ -2976790 -3525551 -452097 3377376 4331283 3226949 3629886 5937497 6936585 5106450
34700E106450k561466j560526j437612j724641M6767L191440M338476K697911
$$ 5106450 2544984 984458 -453154 -2177795 -2131028 1060412 5398888 8096799
34692H096799Q50716L47288K65713K29917J067824J989196Q00793k168078l699081
$$ 8096799 8947515 9294803 9560516 9790433 10858257 12847453 13648246 11480168 7781087
34683G781087k227899L55778K237779L587706M012407K056464j085713j449703
$$ 7781087 5553188 5908966 8146745 11734451 15746858 17803322 16717609 15267906
34675A5267906J584513K991710o88379n386775n097291p20440J738406K39160
$$ 15267906 16852419 19844129 19155750 13768975 8671684 7951244 9689650 9928810
34667I928810j432936o34407O05180J76377m74288N98393K404511K863615J790518
$$ 9928810 8495874 7861467 8466647 8643024 8168736 8767129 11171640 14035255 15825773
34658A5825773K18020j285907k054965j063844J087311J766406l04301k886100
$$ 15825773 16043793 14757886 12702921 11639077 12726388 14492794 14188493 11302393
34650A1302393l275807j895277p61366R432J471282K724535J709973r87985k202551
$$ 11302393 8026586 6131309 5369943 5379375 6850657 9575192 11285165 10297180 8094629
34641H094629p53381O97803l67958k646639l056509r95131J361739K253573K012146
$$ 8094629 7341248 8039051 7671093 5024454 1967945 972814 2334553 4588126 6600272
34632F600272J689361J494647R68478o7839j060663j070542J48207J295565O39296
$$ 6600272 8289633 9784280 10752758 10684919 9624256 8553714 8701921 9997486 10636782
34623A0636782j438582k192676j09228K338360J638455j527415k695067J51797
$$ 10636782 9198200 7005524 6896296 9234656 10873111 9345696 6650629 6802426
34615F802426L454206K870253q97215l486237k860645j123558n55399n64011M94718
$$ 6802426 10256632 13126885 12229670 8743433 5882788 4759230 4203831 3639820 4134538
34606D134538K346489L084386J699676o68934j900443j040162O27452R68276k50821
$$ 4134538 6481027 9565413 11265089 10596155 8695712 7655550 8283002 9251278 9000457
34597I000457q85100M56987K045409J554539j42186l67281P23481L33862j766176
$$ 9000457 8115357 8572344 10617753 12172292 12030106 11662825 12386306 12720168 10953992
34588A0953992k165889L93784K081755j33346l014974j739742K250123L206683
$$ 10953992 8788103 9181887 11263642 11130296 8115322 6375580 8625703 11832386
34580A1832386K1187k292200q01021R55041q33338l998005l969161p79217J546184
$$ 11832386 11853573 9561373 8760352 9715393 8882055 4884050 914889 135672 1681856
34571A681856J282693Q04037K035774L365351K347022m12511j754085j5915K573767
$$ 1681856 2964549 3768586 5804360 9169711 11516733 11104222 9350137 9334222 11907989
34562A1907989K362365r54180l392195j771178J520205J463286k314440m771793
$$ 11907989 14270354 13316174 9923979 8152801 9673006 11136292 8821852 4050059
34554D050059k850273K69397O39616m11492N22303K506814J904569r92866k140018
$$ 4050059 1199786 1469183 2108799 1697307 2219610 4726424 6630993 5638127 3498109
34545C498109m01795R39645Q6375o46730L43978R94926k17161j126830J16046
$$ 3498109 3096314 4035959 4122334 3475604 3819582 4814508 4597347 3470517 3586563
34536C586563J390227L92204r17147L36083K428077J395243k307439m061426j869386
$$ 3586563 4976790 5368994 4451847 4787930 7216007 8611250 6303811 2242385 372999
34527C72999J219016K045562J143882N19726N75216O71830O36886M12938l05679
$$ 372999 1592015 3637577 4781459 5301185 5876401 6548231 7185117 7598055 7292376
34518G292376j244836j592651j224851o38956K29004J541856K247875J257783
$$ 7292376 6047540 4454889 3230038 2591082 2820086 4361942 6609817 7867600
34510G867600l61334p28372l58969j120857k154122n97466K948084L914481N77274
$$ 7867600 7506266 6777894 6418925 5298068 3143946 2546480 5494564 9409045 9986319
$$ [...]
##END NTUPLES=NMR SPECTRUM
##END=
