##TITLE=31Pdec_LR725-RM1-C1
 CDCl3, 24 sc
 22.10.2020
##JCAMPDX= 6.0         $$ Bruker NMR JCAMP-DX V2.0
##DATA TYPE= NMR SPECTRUM
##DATA CLASS= NTUPLES
##ORIGIN= UXNMR, Bruker Analytische Messtechnik GmbH
##OWNER= root
$$ XWIN-NMR		Version 3.5
$$ Thu Oct 22 10:46:43 2020 Russian Standard Time (UT+4h)  she@DPX200
##.OBSERVE FREQUENCY= 81.013821
##.OBSERVE NUCLEUS= ^31P
##.ACQUISITION MODE= SIMULTANEOUS
##.ACQUISITION SCHEME= undefined
##.AVERAGES= 24
##.DIGITISER RES= 17
##SPECTROMETER/DATA SYSTEM= spect
##.PULSE SEQUENCE= zgpg30
##.SOLVENT NAME= CDCl3
##.SHIFT REFERENCE= (INTERNAL, CDCl3, 0, 182.463)
##AUDIT TRAIL= $$ (NUMBER, WHEN, WHO, WHERE, WHAT)
$$ ##TITLE= Audit trail, XWIN-NMR		Version 3.5
$$ ##JCAMPDX= 5.01
$$ ##ORIGIN= Bruker BioSpin GmbH
$$ ##OWNER= she
$$ F:/spectra/data/she/nmr/P31/1/pdata/1/auditp.txt
$$ ##AUDIT TRAIL=  $$ (NUMBER, WHEN, WHO, WHERE, WHAT)
(   1,<2020-10-22 10:45:37.18 +0400>,<she>,<DPX200>,
      <created by zg, POWCHK disabled, PULCHK disabled
       configuration hash MD5:
       00 E9 B6 7A A2 85 ED C7 34 08 36 98 17 FE 4E 26
       data hash MD5: 32K
       A2 41 08 BE 82 67 4E 3B 49 BC CB 1F 6E 6F 0A D4>)
(   2,<2020-10-22 10:45:39.60 +0400>,<she>,<DPX200>,
      <Start of raw data processing
       efp BC_mod = 2 LB = 1 FT_mod = 6 PKNL = 1 PHC0 = -2433.535 PHC1 = 195.6006 SI = 64K 
       data hash MD5: 64K
       FF 11 CA A9 2E 1D D9 79 61 DC 73 CD B3 FB 29 CE>)
(   3,<2020-10-22 10:45:59.75 +0400>,<she>,<DPX200>,
      <pk PHC0 = 56.78393 PHC1 = -123.4 
       data hash MD5: 64K
       F4 4A 61 63 8B 37 E4 54 CF 18 84 DF 1C 88 E8 08>)
$$ ##END=
$$ 
$$ hash MD5
$$ B5 EF 4D 4B 53 89 0A EF 92 5A 79 D9 08 3A 9C 54
##$RELAX= 
##$RELAX= 
##$RELAX= 
##$RELAX= 
##$RELAX= 
##$RELAX= 
##$RELAX= 
##$RELAX= 
$$ Bruker specific parameters
$$ --------------------------
##$DU= <F:/spectra>
##$EXPNO= 1
##$NAME= <P31>
##$PROCNO= 1
##$TYPE= <nmr>
##$USER= <she>
##$AMP= (0..31)
100 100 100 100 100 100 100 100 100 100 100 100 100 100 100 100 100 100 
100 100 100 100 100 100 100 100 100 100 100 100 100 100 
##$AQSEQ= 0
##$AQ_mod= 1
##$AUNM= <au_zg>
##$AUTOPOS= <>
##$BF1= 81.014009
##$BF2= 200.13
##$BF3= 200.13
##$BF4= 200.13
##$BF5= 200.13
##$BF6= 200.13
##$BF7= 200.13
##$BF8= 200.13
##$BYTORDA= 1
##$CFDGTYP= 0
##$CFRGTYP= 5
##$CHEMSTR= <none>
##$CNST= (0..31)
1 1 145 1 1 1 1 1 1 1 1 1 1 1 1 1 1 1 1 1 1 1 1 1 1 1 1 1 1 1 1 1 
##$CPDPRG= <waltz16>
##$CPDPRG1= <>
##$CPDPRG2= <waltz16>
##$CPDPRG3= <>
##$CPDPRG4= <mlev>
##$CPDPRG5= <mlev>
##$CPDPRG6= <mlev>
##$CPDPRG7= <mlev>
##$CPDPRG8= <mlev>
##$CPDPRGB= <>
##$CPDPRGT= <>
##$D= (0..31)
0 1 0 0 0 0 0 0 0 0 0 0.03 2e-05 3e-06 0 0 0 0 0 0 0 0 0 0 0 0 0 0 0 0 
0 0 
##$DATE= 1603349136
##$DBL= (0..7)
120 120 120 11 120 120 24 19 
##$DBP= (0..7)
150 150 150 150 150 150 150 150 
##$DBP07= 0
##$DBPNAM0= <>
##$DBPNAM1= <>
##$DBPNAM2= <>
##$DBPNAM3= <>
##$DBPNAM4= <>
##$DBPNAM5= <>
##$DBPNAM6= <>
##$DBPNAM7= <>
##$DBPOAL= (0..7)
0.5 0.5 0.5 0.5 0.5 0.5 0.5 0.5 
##$DBPOFFS= (0..7)
$$ [...]
##$SUBNAM2= <"">
##$SUBNAM3= <"">
##$SUBNAM4= <"">
##$SUBNAM5= <"">
##$SUBNAM6= <"">
##$SUBNAM7= <"">
##$SUBNAM8= <"">
##$SUBNAM9= <"">
##$SW= 369.568048894756
##$SWIBOX= (0..15)
0 1 3 0 0 0 0 0 0 0 0 0 0 0 0 0 
##$SW_h= 29940.119760479
##$TD= 32768
##$TD0= 1
##$TE= 0
##$TE2= 300
##$TE3= 300
##$TEG= 300
##$TL= (0..7)
0 120 53 12 22 120 120 120 
##$TP= (0..7)
150 150 150 150 150 150 150 150 
##$TP07= 0
##$TPNAME0= <>
##$TPNAME1= <>
##$TPNAME2= <>
##$TPNAME3= <>
##$TPNAME4= <>
##$TPNAME5= <>
##$TPNAME6= <>
##$TPNAME7= <>
##$TPOAL= (0..7)
0.5 0.5 0.5 0.5 0.5 0.5 0.5 0.5 
##$TPOFFS= (0..7)
0 0 0 0 0 0 0 0 
##$TUNHIN= 0
##$TUNHOUT= 0
##$TUNXOUT= 0
##$USERA1= <user>
##$USERA2= <user>
##$USERA3= <user>
##$USERA4= <user>
##$USERA5= <user>
##$V9= 5
##$VALIST= <valist>
##$VCLIST= <CCCCCCCCCCCCCCC>
##$VD= 0
##$VDLIST= <DDDDDDDDDDDDDDD>
##$VPLIST= <PPPPPPPPPPPPPPP>
##$VTLIST= <TTTTTTTTTTTTTTT>
##$WBST= 1024
##$WBSW= 4
##$XGAIN= (0..3)
0 0 0 0 
##$XL= 0
##$YL= 0
##$YMAX_a= 11013
##$YMIN_a= -11832
##$ZGOPTNS= <>
##$ZL1= 120
##$ZL2= 120
##$ZL3= 120
##$ZL4= 120
##$ABSF1= 0
##$ABSF2= 0
##$ABSG= 0
##$ABSL= 0
##$ALPHA= 0
##$AQORDER= 0
##$ASSFAC= 0
##$ASSFACI= 0
##$ASSFACX= 0
##$ASSWID= 0
##$AUNMP= <proc_1d>
##$AZFE= 0.1
##$AZFW= 0.5
##$BCFW= 0
##$BC_mod= 2
##$BYTORDP= 0
##$COROFFS= 0
##$CY= -3
##$DATMOD= 1
##$DC= 0
##$DFILT= <>
##$DTYPP= 0
##$F1P= 0
##$F2P= 0
##$FCOR= 1
##$FTSIZE= 65536
##$FT_mod= 6
##$GAMMA= 0
##$GB= 0
##$INTBC= 1
##$INTSCL= 5.30512e-09
##$ISEN= 30
##$LB= 1
##$LEV0= 0
##$LPBIN= 0
##$MAXI= 10000
##$MC2= 0
##$MEAN= 0
##$ME_mod= 0
##$MI= 50
##$NCOEF= 0
##$NC_proc= -6
##$NLEV= 6
##$NOISF1= 182.463
##$NOISF2= 159.3651
##$NSP= 0
##$NTH_PI= 0
##$NZP= 0
##$OFFSET= 182.463
##$PC= 4
##$PHC0= -2376.751
##$PHC1= 72.2006
##$PH_mod= 1
##$PKNL= yes
##$PPARMOD= 0
##$PSCAL= 0
##$PSIGN= 0
##$REVERSE= no
##$SF= 81.014009
##$SI= 65536
##$SIGF1= 159.3651
##$SIGF2= -187.1042
##$SINO= 113.3802
##$SIOLD= 16384
##$SREGLST= <1H.CDCl3>
##$SSB= 0
##$STSI= 65536
##$STSR= 0
##$SW_p= 29940.119760479
##$SYMM= 0
##$S_DEV= 0
##$TDeff= 32768
##$TDoff= 0
##$TI= <>
##$TILT= no
##$TM1= 0
##$TM2= 0
##$TOPLEV= 0
##$USERP1= <user>
##$USERP2= <user>
##$USERP3= <user>
##$USERP4= <user>
##$USERP5= <user>
##$WDW= 1
##$XDIM= 65536
##$YMAX_p= 470195961
##$YMIN_p= -8995379
$$ End of Bruker specific parameters
$$ ---------------------------------
##NTUPLES= NMR SPECTRUM
##VAR_NAME=  FREQUENCY,     SPECTRUM/REAL,   SPECTRUM/IMAG
##SYMBOL=    X,             R,               I
##VAR_TYPE=  INDEPENDENT,   DEPENDENT,       DEPENDENT
##VAR_FORM=  AFFN,          ASDF,            ASDF
##VAR_DIM=   65536,         65536,           65536
##UNITS=     HZ,            ARBITRARY UNITS, ARBITRARY UNITS
##FACTOR=    0.456856943014862, 1,           1
##FIRST=     14782.0589164895, 0,            0
##LAST=      -15158.0608439895, 0,           0
##MIN=       -15158.0608439895, -8995379,    0
##MAX=       14782.0589164895, 470195961,    0
$$ Real data points
##PAGE= N=1
##DATA TABLE= (X++(R..R)), XYDATA
$$ [...]
43209 1872297 438299 -1580621 -3254543 -3552236 -2321829 -910579 -796105 -1488167 -989399
43200 -989399 1276551 3352916 3373877 2022635 1172911 1140735 824300 -82546 -690232
43191 -690232 -543316 -177461 12832 249683 617514 854041 910501 796684 44291 -1587384
43181 -1587384 -3046333 -2889607 -1252767 295969 873724 976828 1036120 741317 98644
43172 98644 -209702 59093 425017 780244 1467434 2055640 1596024 488322 374562 1520201
43162 1520201 2080638 914549 -630950 -951509 -508833 -439130 -403415 380674 1234431
43153 1234431 1091677 500666 593113 857071 -35804 -1795806 -2960452 -3270655 -3452660
43144 -3452660 -3051811 -985174 1704509 2285771 208423 -1818981 -1645430 -442076 -289734
43135 -289734 -885876 -499944 1020467 2141324 1975167 1064152 57910 -953228 -1722204
43126 -1722204 -1674150 -852476 -293711 -963392 -2546755 -3594992 -2983393 -1257029 -294660
43117 -294660 -1280379 -3197315 -3909444 -2637407 -628538 606655 782257 385149 -175056
43108 -175056 -427963 167073 1310733 1710928 720778 -461612 -187518 1423887 2614328
43099 2614328 2181714 707076 -407337 -439291 190252 462285 -270552 -1521128 -1987897
43090 -1987897 -985088 647046 1462931 999997 -24447 -811679 -1099564 -822465 17088
43081 17088 912596 966261 -62038 -1119122 -759117 1299107 3783065 5133146 4994108
43072 4994108 4263140 3774917 3388235 2616598 1694528 1341592 1572194 1479760 399949
43063 399949 -1288429 -2732402 -3392919 -3017791 -1520768 580212 2096356 2169786 1159793
43054 1159793 161317 -116117 269698 815889 892250 121556 -1116862 -1854865 -1565900
43045 -1565900 -722420 -65528 201772 139703 -421317 -1512079 -2581206 -3011588 -2805568
43036 -2805568 -2345258 -1848108 -1415475 -1102522 -568283 658894 2106943 2427070 1244210
43027 1244210 34780 235379 1366658 2128969 2407326 2757483 2759469 1688917 311915
43018 311915 73494 720419 701028 -121147 -270405 603681 1020608 312057 -214411 290874
43008 290874 710033 161011 -245955 491648 1086484 -145346 -2404574 -3431235 -2594480
42999 -2594480 -1092128 230996 1315141 1618923 463054 -1408563 -2382211 -2154580 -1805066
42990 -1805066 -1760051 -1431366 -991206 -1574810 -3126158 -3793031 -2423970 -298371 674695
42981 674695 362912 -102427 -327294 -825565 -1649085 -2119401 -1947162 -1677249 -1770065 -1860188
42971 -1860188 -1312052 -244816 402851 -54714 -1138544 -1696628 -1267174 -489169 -59833
42962 -59833 64311 86019 -238748 -947504 -1318027 -883177 -394206 -687650 -1137832 -554072
42952 -554072 782858 1496770 1314852 1208701 1325239 631420 -988588 -2106726 -1907963
42943 -1907963 -1304750 -1126374 -892633 -324905 -286520 -950386 -785423 995420 2561006
42934 2561006 1984611 312912 -60103 1009005 1864575 2252653 3246836 4246600 3107241
42925 3107241 -122897 -2323978 -1386272 970703 1880478 1097647 470585 892760 1469802
42916 1469802 1126394 -260069 -1994449 -2986937 -2500249 -1134781 -454289 -1019003 -1598350
42907 -1598350 -1080434 -208576 -315587 -1124201 -1221512 -365433 122005 -630203 -1813230
42898 -1813230 -2119697 -1358856 -416303 -31000 -63358 25212 148358 -605365 -2711980 -4927263
42888 -4927263 -5153399 -2925617 -190105 984629 671796 281749 322550 181701 -328866
42879 -328866 -653177 -777146 -1532830 -3158955 -4518065 -4384979 -2956657 -1543976 -1115815
42870 -1115815 -1554742 -2049013 -1797838 -510356 1332915 2643659 2510281 1150079 -20797
42861 -20797 277485 1627548 2247905 1343330 413808 1166597 2665090 2297791 -268032
42852 -268032 -2126642 -1104275 1169146 1801173 757225 263697 1033120 1613561 1286168
42843 1286168 1053490 1274326 657399 -1317632 -2822235 -1925679 754613 2901317 3178203
42834 3178203 2041970 590150 -424412 -873933 -1215926 -1779990 -1903201 -695639 1040615
42825 1040615 1029904 -1465790 -4082060 -4025486 -1435856 1146393 1913136 1093268 -217590
42816 -217590 -1055231 -741983 536470 1362981 475221 -1527299 -2917636 -3111528 -2983381
42807 -2983381 -2988797 -2424774 -961910 359904 447744 -325317 -707280 -256750 231245 -115577
42797 -115577 -1135188 -1848058 -1661014 -1055543 -776766 -607147 263684 1595367 1943517
42788 1943517 735369 -599864 -577124 205961 177380 -684843 -978620 -141122 978052
42779 978052 1652362 1886844 1577493 612660 -174158 219842 1102240 712087 -992501
42770 -992501 -1983083 -1120746 370496 1110134 1317906 1339560 405050 -1596286 -2823649
42761 -2823649 -1883895 -217265 -43599 -938355 -686930 1044659 2222327 1594217 254465
42752 254465 -269875 191255 975152 1491444 1250516 243729 -451112 307335 1902576
42743 1902576 2516208 1745765 1145202 1685537 2312047 1920316 1284069 1734806 2999324
42734 2999324 3751358 3611241 3220204 2762083 1782375 360372 -784705 -1491343 -2398182
42725 -2398182 -3687069 -4482729 -4011622 -2749463 -1848909 -1752927 -1879699 -1535381 -691307
42716 -691307 162208 583758 482703 125698 42413 699424 1934119 2815229 2475441 1112569
42706 1112569 -246818 -1025094 -1588461 -2314343 -2907905 -3133357 -3496352 -4369794 -4952592
42697 -4952592 -4114598 -2049994 -92200 1026114 1743298 2534309 3264141 3782839 4118423
42688 4118423 3912850 2783854 1494115 1488492 2778430 3603644 2951903 2089320 2460373
42679 2460373 3219361 2355550 -384412 -3174676 -4384615 -3896724 -2424296 -811161 60893
42670 60893 -147620 -672861 -582009 -129225 -190160 -604798 -353742 678762 1458538 1406220
42660 1406220 899788 42418 -1530401 -3231888 -3571454 -2392140 -1515236 -2117940 -2922487
42651 -2922487 -2331627 -1045056 -813488 -1536194 -1608053 -720676 -226288 -579881 -378380
42642 -378380 1345832 3364620 3766372 2325207 508663 -317219 -58949 320664 -218491
42633 -218491 -1667658 -2675309 -1937274 31064 1293603 866738 -207894 -483455 263817
42624 263817 1594298 3382426 5145564 5372505 3063886 -395236 -2331593 -1778081 -206698
42615 -206698 752282 1046149 1339312 1662756 1695316 1641452 2050533 3088123 4409939 5407130
42605 5407130 5341138 3803791 1429321 -373479 -817772 -402206 126149 751983 1557145
42596 1557145 1865329 1021436 -353271 -957354 -616842 -517581 -1452430 -2710681 -3130216
42587 -3130216 -2610581 -2020230 -1925230 -1950725 -1417648 -315295 559234 509750 -130676 -359326
42577 -359326 87657 260911 -554256 -1469806 -1048501 465346 1177064 138298 -1200704
42568 -1200704 -918407 778516 1906170 1285347 -287294 -1453006 -1883855 -2076634 -2289878
42559 -2289878 -2338624 -2114812 -1639098 -621074 1380127 4029577 5909208 5761587 4010509
42550 4010509 2480042 2406899 3202159 3480670 2816173 1913608 1373629 1028453 492129
42541 492129 -262603 -1002433 -1452791 -1388325 -966406 -896387 -1627644 -2380223 -1837857 -44979
42531 -44979 1297727 981467 -38275 106570 1779699 3516425 3885997 2936330 1836403
42522 1836403 1654222 2497637 3466901 3482019 2389385 1053043 163717 -585603 -1733092
42513 -1733092 -2964443 -3456172 -3000822 -2142705 -1421284 -1093145 -1340088 -2032176 -2443467
42504 -2443467 -1917057 -727863 323017 947888 1293984 1147061 231031 -795247 -777027
42495 -777027 295875 1093535 702809 -318803 -967188 -975436 -597931 -95658 140001 -146896
42485 -146896 -214391 1253534 4138564 6269633 5799782 3503913 1715316 1571794 2365495
42476 2365495 3079233 3303191 2882929 1959508 1415456 2113352 3454502 3714083 2135173
42467 2135173 -241095 -2211456 -3864175 -5656674 -6857884 -6099485 -3399817 -656530
42459 -656530 263922 -611302 -1829242 -2405485 -2528192 -2467161 -1802235 -373720 782444
42450 782444 599540 -256590 -175733 814896 915845 -435281 -1255329 -50976 1483668
42441 1483668 909783 -877703 -649086 2280180 4890199 4802701 3312660 2830808 3396416
42432 3396416 3502920 2878670 2437144 2352079 2106459 1967831 2644026 3718637 4066379
42423 4066379 3709825 3679569 4045925 3743157 2562789 1654245 1546979 1271318 227666
42414 227666 -524270 97407 1449672 2229075 2315030 2288642 1948373 797793 -486544
42405 -486544 -649744 201236 715537 440255 408478 1246411 2067652 1910255 1119243 475730
42395 475730 -40085 -573939 -299955 1641948 4381033 5785666 4909723 3077168 2285933
42386 2285933 3247492 5205775 6909980 7333391 6085975 3786272 1758892 823580 483755
42377 483755 -310376 -1734800 -2871703 -2929109 -2265129 -1958626 -2536234 -3401466 -3573067
42368 -3573067 -2764849 -1495749 -274618 815938 1586798 1494975 596339 223880 1602011
42359 1602011 3847718 4624591 3190750 1530814 1608287 2655084 2550502 1079130 19925
42350 19925 158623 94630 -1430112 -3535788 -4448918 -3679956 -2053707 -455585 479022
42341 479022 190009 -1144887 -2223675 -1975603 -1021883 -819885 -1649807 -2479153 -2564181
42332 -2564181 -2027469 -1001142 479328 1657816 1563734 714293 901014 2599857 3910719
42323 3910719 3030274 629813 -1368900 -2326571 -2765408 -2602904 -1361888 167277 378153
42314 378153 -808614 -1694447 -1312562 -629437 -622421 -743593 -323776 -87105 -836496 -1700281
42304 -1700281 -1395166 -577740 -1027785 -2635118 -3196376 -1714664 -98821 -447801 -1927534
42295 -1927534 -1875863 525025 3169509 3713914 2194320 505949 40723 547913 1065514
42286 1065514 1234842 1380605 1648641 1641639 1071439 351627 142903 551213 1243169 2127153
42276 2127153 3205618 3794170 2855775 549427 -1393303 -1600183 -780057 -582439 -1113929
42267 -1113929 -786422 1215054 3425745 3719746 1829917 -445809 -1309782 -667409 172071
42258 172071 32910 -1013382 -1839426 -1426858 129078 1749882 2457602 2238848 1888204
42249 1888204 2202064 3353203 4807739 5704301 5482806 4335259 3021420 2205575 2022055
42240 2022055 2159663 2076998 1212120 -462752 -1873253 -1466391 935694 3277018 3193079
42231 3193079 856012 -1037939 -545729 1134390 1401184 -258241 -1814055 -1678408 -694795
42222 -694795 -491922 -1085238 -1379060 -1313582 -1833790 -2741433 -2333809 24239 2307083
42213 2307083 2085057 -350153 -2451567 -2667571 -1832435 -1249534 -827366 157597 1411528
42204 1411528 1783641 830899 -523041 -969364 -140975 1023789 1111660 -396135 -2452112
42195 -2452112 -3390442 -2710375 -1615249 -1549397 -2525034 -3251456 -2690275 -1086050 425086
42186 425086 851544 32790 -1323238 -2132064 -1643512 94763 2265706 3654630 3240090
42177 3240090 931020 -2122827 -4326536 -4989688 -4670839 -4153339 -3590562 -2894141 -2315372
42168 -2315372 -2015748 -1484452 -186001 1326436 1723889 484590 -1404655 -2529769 -2376336
42159 -2376336 -1387969 -196755 783994 1260353 1077347 493258 180527 620971 1406820
42150 1406820 1438713 194632 -1342648 -1604111 -374436 828313 595676 -823940 -2238544
42141 -2238544 -2945453 -2699514 -1132641 1492798 3471773 3211116 1572551 1028900 2172810
42132 2172810 2805207 1318179 -703739 -744395 966589 1911626 965663 -234315 189470
42123 189470 1957951 3378471 3514658 2908030 2625480 3139598 4005797 4412614 4066952
42114 4066952 3408454 2855814 2295566 1711001 1723067 2690322 3678833 3362662 1799917
42105 1799917 266456 -608948 -1358561 -2224402 -2530184 -1977179 -1362052 -1327055 -1439531
42096 -1439531 -1240573 -1162525 -1509978 -1537361 -669852 195790 -114190 -1205765 -1816817 -1827478
42086 -1827478 -2052166 -2342014 -1606684 139592 1345556 976214 -328407 -1609091 -2769922
42077 -2769922 -3731786 -3666832 -2106429 957 1304553 1587037 1541052 1577532 1643314 1793803
42067 1793803 2191460 2761604 3319115 3716011 3585474 2551967 1077102 326668 637789
42058 637789 927720 330722 -420810 -150113 1003860 2014212 2463247 2490040 1908621
42049 1908621 681939 -249422 -20141 651468 425780 -541713 -990857 -735520 -634189
42040 -634189 -510548 778712 2856015 3571528 2102495 387685 326436 1239799 1480503
42031 1480503 1079751 1158534 1789714 2121671 1936864 1611177 1096682 318873 60857 1064356
42021 1064356 2609362 3254024 2689612 1747679 996916 529660 681297 1596229 2373109
42012 2373109 2001745 948176 488751 706025 613430 152245 440642 1826131 3189702
42003 3189702 3589606 3304926 2844915 2170072 1399057 1165220 1703073 2484078 3151503
41994 3151503 3854492 4269858 3357819 755276 -2290767 -3915210 -3183624 -684545 1750106
41985 1750106 2148995 246482 -1958304 -2610495 -2544199 -3785607 -5906640 -6245454 -4053744
41976 -4053744 -1834939 -1577629 -2142735 -1855250 -1294223 -1465019 -1280311 578234 2771018
41967 2771018 2981327 1517303 589125 689750 425802 -426943 -569295 6063 -348107
41958 -348107 -1861990 -2476506 -1066445 662244 775427 -190292 -524742 87613 712725
41949 712725 814211 449396 -374808 -1411127 -1914079 -1630748 -1366497 -1679734 -1800326
41940 -1800326 -913972 163007 -107641 -1677144 -2724920 -1884693 224105 1888874 2094031
41931 2094031 1175948 122301 -435637 -578536 -649004 -710528 -609785 -306876 208745 1055962
41921 1055962 1993652 2108906 756675 -1305211 -2574579 -2573477 -2050705 -1465419 -493321
41912 -493321 653048 709934 -1048956 -3600372 -5325138 -5713111 -5305418 -4668104 -4140245
41903 -4140245 -3993277 -4119797 -4008132 -3538627 -3254676 -3386339 -3317527 -2606547 -1808548 -1589351
41893 -1589351 -1679262 -1432302 -841954 -326871 -83514 -240253 -963053 -1815216 -1844433 -987297
41883 -987297 -451933 -939761 -1587705 -1603040 -1582070 -1811717 -710091 2902917 6903087
41874 6903087 7726634 4944189 1670777 308399 146679 -359435 -1172803 -1514900 -1343332
41865 -1343332 -857613 149901 1473500 2152679 1752899 904083 -42711 -1569736 -3485412
41856 -3485412 -4364857 -3546838 -2306794 -1851106 -1522262 -429798 501011 1079 -1008276
41847 -1008276 -497084 1507953 2916104 2639339 1706070 1145835 660517 -104361 -679672
41838 -679672 -897623 -1414625 -2262339 -2247610 -869279 356181 -171281 -1696138 -2059739
41829 -2059739 -672418 896135 1229201 637312 170781 203217 513015 905826 1122946
41820 1122946 767097 5319 -118543 1166266 3138753 4265527 4012169 3233314 2731973
41811 2731973 2302881 1589735 1118023 1702386 3128194 4132127 3707270 2024261 135398
41802 135398 -867265 -537931 614700 1491236 1354464 342726 -1075680 -2644796 -3868213
41793 -3868213 -3716384 -1841734 240011 461562 -1214198 -2738496 -2757385 -2158899 -2322870
41784 -2322870 -3160130 -3803817 -4078961 -4075816 -3210986 -1197102 630312 544368 -1172549
41775 -1172549 -2496009 -2343693 -1610624 -1354079 -1381300 -1189519 -1081054 -1504230 -2089471
41766 -2089471 -2142895 -1607424 -962046 -609855 -779924 -1505283 -2291996 -2410273 -1981263 -2120909
41756 -2120909 -3377020 -4602086 -4150840 -1855663 836307 2354570 2050582 253609
41748 253609 -1863250 -2778952 -1924795 -447179 72903 -459424 -820469 -411164 24842
41739 24842 -210442 -723280 -868118 -822902 -1208878 -2155750 -3220490 -3781730 -3210374 -1327401
41729 -1327401 844251 1559700 341222 -1135293 -1023184 364978 1261621 1036953 714770
41720 714770 924014 809965 -480919 -2390867 -3787952 -4379919 -4520377 -4292983 -3648381
41711 -3648381 -2981847 -2736874 -2742869 -2678178 -2848849 -3658963 -4505570 -4109167 -2029466 787818
41701 787818 2978418 3707626 2822186 866821 -996594 -1832739 -1854951 -1941800 -2284549
41692 -2284549 -2261176 -1611581 -783599 3245 944461 1576081 743021 -1604977 -3639051
41683 -3639051 -3727094 -2564573 -2123013 -2982307 -3900670 -3797139 -2962426 -2218668 -1886934
41674 -1886934 -1839928 -1791649 -1254673 140077 1966619 3136561 2995737 1955635 888359
41665 888359 258545 13140 -7222 195773 696680 1338629 1560447 868528 -345619 -939834
41655 -939834 -401541 384943 377485 -80898 142698 1109007 1647658 1150289 467696 616923
41645 616923 1394055 1772604 1159345 -122236 -1187129 -1212394 -154603 1028772 1375613
41636 1375613 1144579 1327880 1890611 1497204 -587435 -3254504 -4859783 -5010373 -4297934
41627 -4297934 -2956281 -835417 1554138 2988876 2752475 1430855 343916 374681 1307067
41618 1307067 2184757 2380167 2166637 1920299 1139039 -804040 -3008173 -3489934 -1809828
41609 -1809828 5479 78809 -874578 -910320 254753 1218618 1236662 1001746 1204363 1745496
41599 1745496 2445067 3210954 3334946 1929304 -537958 -2254827 -2082810 -671634 753257
41590 753257 1702665 2097913 1712410 699051 -55595 159127 1050345 1824038 1976243
41581 1976243 1287823 -193356 -1689133 -2001849 -926732 322347 730178 789435 1392204
41572 1392204 2102506 1616955 -356631 -2670348 -4096478 -4314541 -3602707 -2320543 -833940
41563 -833940 534730 1556362 1866631 985740 -981387 -2953780 -3740583 -3148345 -1856202
41554 -1856202 -566054 240583 222197 -374610 -556349 300106 1453279 1728213 1095461
41545 1095461 403466 -37023 -389169 -152797 1320965 3109900 3218565 1319262 -555004
41536 -555004 -803444 -245205 -311303 -726196 -459759 137671 -98080 -1080184 -1681008 -1666438
41526 -1666438 -1761924 -1909731 -1124161 723423 2448362 3176611 3089553 2316024 609171
41517 609171 -1393232 -2211812 -1727354 -1896281 -4074971 -6806294 -7630690 -6180073 -4037039
41508 -4037039 -2299492 -934717 -76923 -154036 -691128 -582694 171764 355769 -562623
41499 -562623 -1723411 -2377076 -2699949 -2637131 -1462187 603257 1692469 479891 -1888625
41490 -1888625 -3305930 -3315867 -2846015 -2085003 -402503 1813930 3036008 2651438 1685294
41481 1685294 987001 94697 -1307291 -2074171 -1018510 1056009 2088697 1360755 189225
41472 189225 -103896 172618 20616 -487973 -367125 567889 1180435 667337 -8277 716251
41462 716251 2602064 3500392 2058054 -427686 -1683977 -1284450 -652274 -611312 -353139
41453 -353139 916078 2551619 3322161 2807640 1347618 -552774 -2033119 -1952259 -229143
41444 -229143 1441161 1403922 287893 167301 1541235 2591633 1889972 463136 146338
41435 146338 828048 716691 -940119 -2739965 -2970955 -1539038 422706 2011595 2872931
41426 2872931 2680161 1388172 -19342 -24876 1739129 3867954 4671088 3851595 2324931
41417 2324931 928244 25239 8664 1151911 2807860 3655903 3229829 2592096 2946835
41408 2946835 4068778 4780646 4664499 4449136 4672387 4812215 4191736 3151090 2595268
41399 2595268 2584388 2207335 1098738 313328 954833 2338835 2562367 1031682 -625643
41390 -625643 -772131 -1154 -156224 -1640936 -2970867 -2965058 -2165130 -1749746 -2065840 -2740912
41380 -2740912 -3376377 -3495456 -2541113 -693416 820297 983798 218652 -297032 -190229
41371 -190229 -56256 -297126 -587502 -554806 -387798 -528102 -1016542 -1356640 -1125769 -741644
41361 -741644 -1207156 -2583769 -3214542 -1621104 1003118 1834348 306303 -990875 -341839
41352 -341839 254339 -1707722 -4865922 -5655700 -3565931 -1639715 -1675991 -2021982 -1009613
41343 -1009613 207597 -205263 -1934288 -3517807 -4470137 -4755890 -3743666 -1540920 -14358
41334 -14358 -465594 -1367401 -467937 1810530 3314266 3680590 4291753 5039075 4010869
41325 4010869 865362 -2092927 -3147811 -3260544 -3808350 -4323201 -3958150 -3382447 -3395813
41316 -3395813 -3075624 -1341449 622197 683566 -971943 -2013516 -1346348 -320689 -248558
41307 -248558 -579901 -299063 385712 755772 882117 1169340 1376933 1072344 493743 90363
41297 90363 -296196 -941133 -1399102 -1078857 -284438 264983 614912 1196898 1537848 684892
41287 684892 -1019074 -2001056 -1711140 -1433649 -2122422 -2754847 -2001709 -501292 -13628
41278 -13628 -917773 -2044256 -2660733 -3061976 -3235681 -2587014 -1379842 -965130 -1845189
41269 -1845189 -2694535 -2170841 -769938 23302 -317545 -1167773 -1862977 -2031005 -1298848
41260 -1298848 291401 1788198 2174348 1665778 1461799 2254338 3574479 4501987 4462073
41251 4462073 3482782 2240881 1689091 2080419 2572853 2356891 1820780 1829797 2172350 1752196
41241 1752196 308024 -1075300 -1407791 -919753 -460247 -479257 -911120 -1451125 -1649419
41232 -1649419 -1269093 -779298 -924535 -1580935 -1672343 -546598 1164958 2438751 3004688
41223 3004688 3085694 2534984 1004768 -1159366 -2863261 -3311537 -2830112 -2466398 -2846537
41214 -2846537 -3561846 -3755288 -3173548 -2311124 -1514627 -521285 783687 1775139 1925236
41205 1925236 1751936 2043473 2433519 1796417 26865 -1633381 -2233989 -2121685 -2013669
41196 -2013669 -1962365 -1685492 -1234535 -905015 -941465 -1468942 -2183723 -2222095 -1184559 -181086
41186 -181086 -709249 -2443913 -3500732 -3145779 -2687252 -3116697 -3539996 -2938829 -1917889
41177 -1917889 -1369151 -765983 640142 2062345 2376915 2210419 2960334 4319629 4700183
41168 4700183 3833749 3073138 3140722 3335428 3084134 2587400 1667729 -372818 -3237115
41159 -3237115 -5367773 -5768443 -4973822 -3809173 -2343943 -548038 1067292 1979019 2054699
41150 2054699 1270879 -74798 -933758 -512290 274154 -249491 -2024675 -3308303 -3409509
41141 -3409509 -3498598 -4163743 -4221410 -2994319 -1847526 -2032774 -2635868 -2266115 -1391520
41132 -1391520 -1285543 -1831480 -2112728 -2126335 -2133818 -1373669 555901 1947950 928666
41123 928666 -1398562 -2129838 -646412 872670 1024874 736263 795759 365399 -1025224
41114 -1025224 -2144725 -2030052 -1563388 -1744415 -1923749 -1220406 -363902 -471869 -986515
41105 -986515 -560158 597619 899836 -335841 -2161418 -3430778 -3759955 -3134551 -1708392
41096 -1708392 -120951 873732 1239910 1507344 1877995 2130507 2216714 2200398 1789441 766530
41086 766530 -238943 -302804 499989 1241755 1578436 2049657 2801313 3076396 2419061 1473571
41076 1473571 978512 687409 -11614 -916025 -1188010 -478131 699801 1578187 1696116
41067 1696116 996610 -233910 -1541464 -2610953 -3315795 -3440653 -2677238 -1040675 1014732
41058 1014732 2987326 4463363 4899283 4018127 2668615 2389416 3482586 4316893 3451187
41049 3451187 1791952 1441653 2735274 3751072 2840648 464297 -1731514 -2577118 -1800474
41040 -1800474 77827 1687606 1645103 201407 -731086 60040 1466185 1635112 416407
41031 416407 -830535 -1289547 -1296227 -1164304 -691296 69626 609397 771020 952244 1374860
41021 1374860 1925953 2751513 4053056 5113138 4564373 2137498 -634821 -2012170 -1827866
41012 -1827866 -1332740 -1793295 -3472061 -5359723 -5726911 -3750301 -867129 433313 -412155
41003 -412155 -1339174 -571712 960710 1217574 23762 -1072078 -1329039 -1494429 -1981706
40994 -1981706 -1973995 -845419 687028 1512063 1508205 1382686 1568574 1779078 1496770 663317
40984 663317 -101146 -82696 598677 986378 498341 -356880 -952828 -1567744 -2580850 -3268526
40974 -3268526 -2657462 -1270236 -608805 -936776 -1086430 -670639 -773683 -1742181 -1986947
40965 -1986947 -336938 1653199 1512665 -557922 -1693064 -128800 2495434 3280280
40957 3280280 1580192 -575899 -1273170 -921002 -1216998 -2499199 -3185346 -2110455 -410314
40948 -410314 -113915 -1427172 -2657658 -2666865 -2034959 -1599896 -1225116 -600406 -99000 -91963
40938 -91963 -340884 -734032 -1656701 -2917142 -3354057 -2426381 -1227600 -909107 -1008878 -435475
40928 -435475 786483 1936993 2849450 3422160 2857249 1011448 -346384 479413 2497493
40919 2497493 3428689 3174620 3511952 4586301 4521110 2956408 2114129 3163708 4078672
40910 4078672 2806284 458247 -654755 -458467 -347361 -283220 818212 2408598 2477038
40901 2477038 492572 -1775477 -2693685 -2463314 -2044716 -1747405 -1364165 -688393 483870
40892 483870 2064561 3204846 2929447 1385593 -293307 -1397395 -2090227 -2469595 -2182149
40883 -2182149 -1210335 -228311 74564 -537423 -1906539 -3187978 -2815475 -122951 2948141
40874 2948141 3352666 725149 -1794217 -1410336 957978 2381061 1896187 1112550 1303933
40865 1303933 1677113 917166 -764036 -1846986 -1254034 631735 2496401 3337614 3170192
40856 3170192 2564482 1666375 76356 -2186627 -4122125 -4595611 -3478418 -1587485 172236
40847 172236 1159278 886621 -648317 -2456681 -2993471 -1497679 1144495 2994850 2719456
40838 2719456 944810 -150727 862179 2786520 3045647 1026056 -948192 -735807
40830 -735807 642033 512077 -1630358 -3476257 -2986720 -581294 1930612 3141221 2428411
40821 2428411 85912 -2218647 -2494304 -888764 94158 -1089490 -2690129 -2107461 305915
40812 305915 1791428 1178393 328683 1237097 3331924 4428440 3266060 379105 -2675731
40803 -2675731 -4243181 -3440192 -879962 1834538 3746408 5166698 6392849 6719905
40795 6719905 5496809 3488525 2224425 2310475 3156793 4020904 4496822 4306328 3556230
40786 3556230 3012169 3161626 3173668 1892905 -174822 -1156097 -342364 887560 1204691
40777 1204691 1041399 1242503 1231155 -74957 -2228453 -3598362 -3444895 -2373916 -1013685
40768 -1013685 347318 932063 -73073 -1898538 -2536282 -1327567 141600 483315 448908
40759 448908 1280214 2357458 2111366 583693 -643042 -863124 -984623 -1722119 -2520053
40750 -2520053 -2707782 -2501433 -2259167 -1745623 -850913 -253857 -552249 -1211060 -1150324 -192667
40740 -192667 665262 427978 -775691 -1802734 -1678920 -651077 174282 349328 648930
40731 648930 1579111 2077086 897663 -1140349 -1897040 -936214 -63411 -401083 -782910
40722 -782910 -16064 1055266 1227693 1152685 1971389 2847816 2051371 -68640 -1384106
40713 -1384106 -1105959 -501258 -376192 63318 1316322 2443342 2623571 2265146 1695754
40704 1695754 263330 -2118057 -3780502 -3062001 -586207 1376620 1440254 159103 -1037733
40695 -1037733 -1203029 -433215 347470 312981 -370260 -924549 -1156698 -1519195 -2007509 -2047043
40685 -2047043 -1635717 -1442991 -1555014 -1463048 -1571969 -2988709 -5133796 -5486520 -2956262
40676 -2956262 220780 1479214 1200107 1184790 1422785 712290 -605301 -1092621 -795989
40667 -795989 -901991 -1195778 -385590 1169958 1660665 933655 802476 1752878 1919436
40658 1919436 226743 -1840325 -2706819 -2701342 -2321998 -796189 1888049 3522619 2430809
40649 2430809 267468 -136086 1268545 2128705 1397261 458677 643181 1505050 1880839
40640 1880839 1316517 124359 -1065029 -1677061 -1768653 -2059754 -2812166 -3188773 -2527946
40631 -2527946 -1616403 -1583802 -2040634 -1635494 -252827 648854 -22670 -1729283 -3054709
40622 -3054709 -2910703 -1096085 1475859 3190968 3200207 2364957 2034085 2280433 2319624
40613 2319624 2183624 2547833 3038472 2340013 367912 -1114796 -809365 259884 117003
40604 117003 -1571175 -3150782 -3009788 -1312638 369692 903413 849809 1633034 3483771
40595 3483771 4858895 4357708 2601994 1457897 1815311 2951469 3746500 3674259 2873316
40586 2873316 2059257 2051244 2623419 2390593 802615 -504008 243150 2179729 2837733
40577 2837733 1584427 56537 -732539 -1484418 -2443648 -2404898 -828727 946421 1700376
40568 1700376 1902492 2207002 2018513 869831 -229155 -281065 72454 -136528 -370120
40559 -370120 388405 1655479 2023096 1090458 -439494 -1893942 -2699709 -2198896 -706636
40550 -706636 95177 -819449 -2244823 -2521741 -1844262 -1232902 -420558 1159770 2288959
40541 2288959 1383136 -523408 -854121 564219 1287279 215599 -928037 -780729 -429521
40532 -429521 -1147666 -2221002 -2432808 -1959757 -1420860 -582857 638610 1306393 961640
40523 961640 710188 1457670 2304596 2117765 1491310 1566552 1957460 1529739 372096 -691141
40513 -691141 -1735915 -3082913 -3732302 -2506008 -369199 500836 -99511 -244337 878883
40504 878883 1718096 1043464 -55387 -1880 908097 1297840 879141 554114 917540 1706767
40494 1706767 2388427 2500884 1772300 596655 23668 571049 1346812 1047217 -376011
40485 -376011 -1691838 -1910515 -1244114 -594939 -590379 -1149093 -1632714 -1421660 -606067 -12236
40475 -12236 -271498 -1021742 -1366429 -942989 -99513 822096 1731108 2233332 1570332 -331301
40465 -331301 -2141674 -2216808 -495999 1285673 1591428 793080 357207 743885 1066830
40456 1066830 858497 975075 2005209 2710716 1369350 -1566754 -3476800 -2549665 208281
40447 208281 2344935 2498101 1071871 -781429 -2043756 -2160753 -1296304 -177343 690642
40438 690642 1380275 1856723 1542386 158183 -1507222 -2401384 -2431772 -2209245 -1996548
40429 -1996548 -1742158 -1752769 -2280007 -2670664 -2104859 -1126306 -1123492 -2058613 -2102578 -187240
40419 -187240 2272311 3162976 2338726 1467918 1744831 2718966 3109550 2013241 -410477
40410 -410477 -2777304 -3390964 -2115340 -987428 -2048006 -4780545 -6681902 -6273386 -4459030
40401 -4459030 -2777303 -1505192 -114565 1291401 1964324 1651710 966689 538024 275873
40392 275873 -289197 -1156607 -1645721 -1123656 235814 1630199 2427864 2485973 1910209
40383 1910209 1169662 1346210 3174869 5462072 5698285 3177642 417690 134886 1696083
40374 1696083 2298729 1055495 -276226 -565314 -828731 -1717251 -1787783 167148 2745741
40365 2745741 3742392 3239690 3017160 3538728 3450014 1934547 -121853 -1515358 -1927077
40356 -1927077 -1488423 -337470 1008105 1819739 2131277 2744783 3853027 4389713 3294559
40347 3294559 940412 -1215536 -2133671 -1950239 -1412597 -955729 -455983 228793 718490
40338 718490 358283 -1019474 -2850885 -4341168 -4903019 -4272357 -2828178 -1722649 -1783174
40329 -1783174 -2165657 -1227068 892489 1905056 402436 -2054377 -3023215 -2158166 -704208
40320 -704208 764271 2196263 2577838 935159 -1473979 -2287380 -1433151 -1127260 -2150555
40311 -2150555 -2528763 -806691 1575837 2537644 2200624 1909826 1790004 996757 -431859
40302 -431859 -1524176 -1758281 -1400586 -872906 -572237 -746972 -886991 -15839 1723681
40293 1723681 2744116 2119156 982813 811466 1353013 1466519 1021305 568878 28300
40284 28300 -735892 -802684 573373 2164383 2114711 863628 778395 2732740 4904538
40275 4904538 5453996 4745405 4139348 3902351 3290268 1900917 108310 -1426064 -2186091
40266 -2186091 -2066418 -1436680 -712222 -12758 397545 -123671 -1556758 -2497982 -1724567
40257 -1724567 -127165 443449 125985 979472 3571673 5587241 4943132 2781405 1908147
40248 1908147 3208453 5058838 5718924 4910725 3276343 1573623 536506 528538 979843
40239 979843 759684 -549598 -1997706 -2071065 -174097 2551217 3921103 2669517 -79802
40230 -79802 -1749628 -1048567 646887 1057411 -291083 -1758146 -1773700 -598354 283654
40221 283654 35851 -695701 -778152 -92125 296426 -486523 -1937120 -2713432 -2155513 -821162
40211 -821162 394365 1143743 1560196 1782347 1768390 1355052 434869 -751747 -1612460
40202 -1612460 -1744972 -1310714 -639074 132204 644488 219627 -1031821 -1680129 -748811
40193 -748811 549713 478123 -154837 1216772 4655746 6646589 4645530 749791 -1116533
40184 -1116533 -270982 774016 600572 512298 1763696 3503957 4286503 3903973 2768499
40175 2768499 870056 -1499915 -3036106 -2725886 -1301499 -281629 -6036 265826 656405
40166 656405 434817 -433190 -856187 -303411 184480 -472525 -1703798 -2208525 -1944195
40157 -1944195 -1867246 -2008877 -1416715 -211813 -17340 -1529804 -3096727 -2908485 -1488255
40148 -1488255 -588807 -488192 -40358 1088052 1949380 1893458 1004600 -881225 -3801091
40139 -3801091 -6247789 -6133199 -3709358 -1667761 -1554697 -1920832 -1086938 139220 157903
40130 157903 -523224 -204787 971987 1075208 -580939 -2272704 -2216669 -855215 -154969
40121 -154969 -1252985 -3304148 -4481016 -3884384 -2345013 -1220897 -730736 -79712 1036384
40112 1036384 2057659 2628305 2825444 2257437 437329 -1637985 -2052325 -801321 -184134
40103 -184134 -1329777 -2316268 -1269560 600494 1092462 473141 439883 956220 835921
40094 835921 577329 1678972 3472817 3539049 1448242 -510074 -704223 123293 947218
40085 947218 1872392 2733741 2499462 1064143 -169859 -415453 -596337 -1514971 -2464091
40076 -2464091 -2469773 -1564068 -201094 1262235 2083784 1598985 501712 96537 99219 -931034
40066 -931034 -2787377 -3552664 -2815253 -2398801 -3049548 -3094554 -1651827 -427655 -601136
40057 -601136 -586482 921328 2123816 945423 -1384543 -2415738 -2430088 -3287650 -4681427
40048 -4681427 -4767624 -3675697 -3174657 -3267295 -2248609 -124297 1008894 344396 -521384
40039 -521384 -361576 185896 468096 903017 1469996 1149010 -239298 -1334286 -1250033
40030 -1250033 -891476 -1519584 -3159075 -4908679 -5753743 -4907087 -2604299 -631353 -652118
40021 -652118 -1959793 -2372971 -1274779 12956 796047 1749447 2818323 2762060 1559187
40012 1559187 1011112 1864957 2400291 1171207 -726128 -1583815 -1623503 -2044596 -2915309
40003 -2915309 -3558428 -3901774 -4064308 -3664385 -2746756 -2235786 -2343156 -1903926 -507225
39994 -507225 344893 -273774 -823338 144433 1247259 571371 -708892 28184 2444343
39985 2444343 3650765 2770344 1889042 2139535 1977704 330966 -1309216 -1354690 -424702
39976 -424702 353980 1428099 3506300 5682267 6559004 6111337 5010957 3315937 1324426
39967 1324426 432330 1265121 1975510 511099 -2079053 -2837338 -1114887 721515 960225
39958 960225 586815 947530 1532034 1362044 893624 946506 927875 -174605 -1763206 -2285198
39948 -2285198 -1576925 -968867 -1094510 -1070834 -113904 1290542 2260603 2578222 2489439 2319996
39938 2319996 2589881 3545396 4219127 3085678 324484 -1637932 -832840 1761721 3453760
39929 3453760 2967143 1303332 -19266 -405384 -67694 451943 641209 642120 1277385 2673750
39919 2673750 3356282 1916464 -720855 -2135070 -1528214 -526486 -580987 -1063690 -611562
39910 -611562 900897 2581869 3725071 3945974 2962675 1131680 -426083 -997818 -1010870
39901 -1010870 -995571 -604076 511662 1592881 1642453 990531 914339 1801843 2585043 2103786
39891 2103786 477453 -971562 -934666 594851 2162269 2378613 1624026 1494039 2453030
39882 2453030 3165299 2636236 1731041 1613490 1847890 1371619 449253 153772 544848
39873 544848 935223 1486720 2812339 4194420 4014965 2144444 255301 -592735 -1104960
39864 -1104960 -1964927 -2439106 -1655294 -86751 1216049 2005919 2554439 2715010 2197974
39855 2197974 1322245 696957 416451 121190 -399323 -1056044 -1623025 -1797014 -1456728
39846 -1456728 -985804 -807541 -535809 588644 2163444 2542404 949634 -1177529 -1865693
39837 -1865693 -1036389 -249443 -337816 -409669 608747 2268803 3002573 2026175 379296
39828 379296 -234472 456694 969122 260845 -453588 772563 3554680 5205045 4243060
39819 4243060 2360593 1939615 2926820 3576739 3337374 3205896 3556564 3452538 2416045
39810 2416045 1356431 1061571 907692 -45446 -1399383 -1810932 -805942 526301 715224
39801 715224 -568057 -2215572 -2757782 -1756789 -190955 571196 76438 -1064237 -2067398
39792 -2067398 -2562558 -2404255 -1569918 -485113 94686 -67132 -345493 -199931 -103393
39783 -103393 -897365 -2373202 -3217776 -2513842 -698706 1184685 2546763 3152291 2659684
39774 2659684 1102616 -512849 -1053646 -665634 -435910 -628074 -337150 802792 1754453
39765 1754453 1605092 908432 600726 545221 269666 224225 853976 1155725 -91394 -2089468
39755 -2089468 -2923194 -2479553 -2305216 -2475050 -1183622 1727803 3477101 2241987 131050
39746 131050 26723 1213907 910578 -905580 -1329373 852769 3283289 3570611 2405933
39737 2405933 1955246 2855256 4166854 5133827 5619153 5481057 4706243 3844976 3462351
39728 3462351 3389048 3129059 2718362 2588148 2796994 2943362 2752557 2381334 2219329 2592851
39718 2592851 3452744 4120167 3608649 1610505 -835538 -1956984 -768434 1923911 4133918
39709 4133918 4537295 3662192 2903311 2508336 1440265 -471099 -1463244 -44648 2563782
39700 2563782 3709744 2685854 1216236 628564 371987 -166781 -196533 1009304 2550358
39691 2550358 3183799 3222861 3708499 4357205 3951508 2572676 1833714 2544525 3445064
39682 3445064 2984292 1525178 883639 1938934 3449708 3432472 1379835 -1183160 -2333798
39673 -2333798 -1682699 -462863 116612 125677 395803 1199178 1859632 1574556 339323
39664 339323 -974984 -1381425 -631710 689941 1909197 2845286 3483958 3506968 2742272
39655 2742272 1850982 1776789 2447400 2737772 1879687 234294 -1493175 -3030147 -4216913
39646 -4216913 -4690210 -4412841 -3978488 -3936326 -4245071 -4647427 -4979006 -4855784 -3857669 -2447599
39636 -2447599 -1847225 -2389052 -2826566 -2035957 -595807 261175 548375 1222636 2436475
39627 2436475 3319774 3395193 3148149 3100018 3143538 2969330 2614407 2504153 3202511 4842256
39617 4842256 6498322 6660495 4867225 2383672 760313 357331 808132 1952182 3365555
39608 3365555 3931341 3149972 2125338 1948919 1938842 1037666 76536 599968 2008095
39599 2008095 2251448 1252259 1088895 2392700 3127391 1899163 161952 -219423 353152
39590 353152 513507 284992 462915 900544 1048999 1248684 1991138 2695576 2543802 1764661
39580 1764661 934237 -48517 -1042677 -807480 1370212 4027924 5107104 4544879 3862630
39571 3862630 3945311 4773455 6551110 9404989 12796396 17050129 24267224 34915783
39563 34915783 44108599 44822215 35781046 23461947 15044584 11641019 9777320 7078573
39555 7078573 4132883 2194750 1651102 2509226 4467828 6297967 6473504 4803320 2754405
39546 2754405 1961903 2734191 3911566 3943812 2354829 325391 -511727 103636 968294
39537 968294 1093534 622491 20458 -520666 -548292 518183 2075931 2399290 951155
39528 951155 -471381 -63538 1442410 1909278 799166 -424500 -567215 52496 628688
39519 628688 934636 1163994 1534653 2123752 2479136 1666631 -430050 -2139144 -1482798
39510 -1482798 1304668 3788092 4087839 2704950 1303104 593774 46444 -852749 -1766549
39501 -1766549 -1943806 -1211918 -347537 -262911 -869744 -1221745 -885875 -425564 -171962 454710
39491 454710 1539811 1645114 -337788 -2948754 -3567241 -1925005 -391761 -530461 -1247824
39482 -1247824 -1075823 -499481 -720584 -1394513 -1162458 216034 1668932 2454891 2811190
39473 2811190 3060646 3109547 2944609 2836759 2839742 2596974 1796670 504762 -933200 -2008164
39463 -2008164 -2180549 -1339335 -174589 277711 -343097 -1298352 -1523531 -853320 -309136
39454 -309136 -892340 -2142406 -2454935 -1106255 723013 1583567 1708119 2243708 3085975
39445 3085975 3053717 2177546 2055320 3389752 4754121 4675066 3578343 2655136 2083018
39436 2083018 1587316 1562194 2131516 2079795 449412 -1449757 -1432966 485150 2144154
39427 2144154 2218140 1436935 854107 697819 1208597 2811107 4800386 5413595 4055985
39418 4055985 2209428 1349570 1180277 798369 367278 442962 583772 -17991 -1038568
39409 -1038568 -1355006 -579624 728845 2091518 3323487 3863084 2936418 641659 -1761578
39400 -1761578 -2893045 -2338910 -821594 383996 419748 -359771 -746367 -154874 628659
39391 628659 629791 138750 216683 1026142 1557267 1056418 -45910 -805508 -758723 -130416
39381 -130416 345036 -267076 -2176587 -3951491 -3416997 -217774 3124844 3687771 1414974
39372 1414974 -1100890 -2001603 -1992682 -2344648 -2569058 -1508395 176905 620694 -217598
39363 -217598 -282816 1100956 1618195 -550964 -3331852 -3234479 -348324 1846648 1557844
39354 1557844 738337 1348176 2298561 1786471 531240 415774 1215762 1112896 -84573
39345 -84573 -548087 641360 2088676 2120488 837222 -446246 -838089 -473787 -159139
39336 -159139 -653035 -1763371 -2221800 -1142920 590104 1292160 656944 -86879 -105947
39327 -105947 196785 387078 688179 1027760 683815 -395693 -1017499 -413610 355110
39318 355110 -263004 -2049097 -3142236 -2331881 -406834 909826 831445 55396 -319217
39309 -319217 -44171 365748 748402 1530056 2514928 2445391 832047 -532324 504386
39300 504386 3209594 4376705 2269951 -1427645 -4057717 -4735657 -3969114 -2291145 -512818
39291 -512818 64007 -862748 -1871579 -1811362 -1458806 -1895808 -2430493 -1789336 -362845
39282 -362845 603698 1222531 2318377 3242274 2646797 1126935 650063 1343058 1387152
39273 1387152 452897 514029 2310652 3661856 2856658 1412185 1469843 2391212 2339975
39264 2339975 1786971 2658753 4698745 5495444 4187606 2609686 2204940 2078798 1192722
39255 1192722 614713 1954632 4565350 5912133 4491320 1271206 -1711012 -3284656
39247 -3284656 -3533326 -2977423 -1893525 -356046 1359838 2672522 3103814 2687005 1807454
39238 1807454 732143 -477394 -1624562 -2204584 -1689890 -9628 2155088 3633171
39230 3633171 3716364 2976894 2661377 3031870 2958593 1700137 381954 690481 2443208
39221 2443208 3622091 2844457 727941 -1349521 -2705246 -3154788 -2484194 -923694 581965
39212 581965 1365434 1793850 2409227 2900787 2668072 1865381 1041033 176643 -1002259
39203 -1002259 -2114015 -2529744 -2478295 -2673632 -2917312 -2228191 -524352 945552 1204227
39194 1204227 575485 -263543 -1160681 -1838432 -1540188 -321974 251440 -1027061 -3067061
39185 -3067061 -3781036 -2943309 -2226026 -2441181 -2432049 -1213571 324302 876332 781060 1326146
39175 1326146 2567334 3133853 2115255 104692 -1742132 -2842437 -3158338 -2746930 -1774195
39166 -1774195 -661615 80880 105778 -628541 -1747484 -2619749 -2927646 -2926507 -2830462 -2288023
39156 -2288023 -1048490 205037 602356 510058 1036135 1954135 1540507 -756111 -2806255
39147 -2806255 -2346971 -211677 692855 -617167 -2062801 -1744196 -577843 -578392 -1715593
39138 -1715593 -2049675 -607030 1336612 2030461 1192206 -278633 -1683043 -2887020 -3712108
39129 -3712108 -3744398 -2857567 -1528707 -474433 -118594 -422099 -1023440 -1461276 -1428959
39120 -1428959 -982146 -482257 -254498 -310031 -444439 -537121 -598365 -485812 223036 1795198
39110 1795198 3724061 4822733 4276391 2627005 1392797 1469421 2087784 1699808 -140760
39101 -140760 -2200282 -3028760 -2592850 -2050033 -2171704 -2611401 -2773499 -2733401 -2857499 -2937367
39091 -2937367 -2372229 -1186374 -240252 -125385 -273346 306316 1534372 2179818 1576432
39082 1576432 835628 1541043 3366892 4041508 2181004 -731282 -2183803 -1915305 -2012555
39073 -2012555 -3736616 -5700682 -5817501 -3868441 -1198442 1188129 3007508 3843350
39065 3843350 3404157 2494640 2345729 2799971 2401185 649636 -1005833 -1068905 22430
39056 22430 573058 -308886 -1964920 -3022501 -2502496 -635536 994677 789723 -892812
39047 -892812 -1915822 -1145448 -32865 -332091 -1261766 -707426 1211032 1914882 107239
39038 107239 -2208589 -2514239 -1103796 -188562 -651208 -1390534 -1558760 -1719843 -2401375
39029 -2401375 -2837876 -1987596 -68899 1714835 2583564 2633643 2205608 1597757 1336128
39020 1336128 1887991 2863887 3218444 2659081 2211625 2779623 3715172 3700162 2696574
39011 2696574 1962441 2206113 2844423 3214960 3300006 2892381 1415853 -666704 -1614632
39002 -1614632 -718264 376451 106290 -419522 733273 2727124 2763703 408610 -1573616
38993 -1573616 -1323030 -241907 -56535 -2320 1104878 2004948 812663 -1443169 -1850198
38984 -1850198 152361 2089220 2148194 1238557 781406 577836 -28688 -531968 -222587
38975 -222587 257075 -320202 -1969690 -3541060 -4216299 -4067449 -3394403 -2400663 -1520598
38966 -1520598 -1361697 -2103008 -3246377 -4032361 -3977923 -3139060 -2041879 -1248552 -840471
38957 -840471 -429913 266874 1083038 1729349 2246302 2941957 3938793 4856160 4987235 3969963
38947 3969963 2355581 1215984 1011229 1230515 1380521 1700857 2383484 2812021 2474934
38938 2474934 2011840 2173299 2244070 1018344 -868156 -1354622 46491 1404609 1089193
38929 1089193 -316300 -1562975 -2489689 -3119797 -2621009 -692256 1225992 1712259 1378477
38920 1378477 1625449 2366096 2633479 2506334 2527582 1993359 -27580 -2471798 -3366242
38911 -3366242 -2910021 -3083828 -4148567 -4127450 -2322066 -772987 -1117046 -2218222 -2283376
38902 -2283376 -1390234 -415926 751652 2186482 2642626 1249525 -630786 -1109135 -391483
38893 -391483 100681 245093 789329 1192045 244923 -1451579 -1961799 -1028607 -402473
38884 -402473 -860047 -1088236 -170305 929442 1361514 1937372 3290693 4080651 2772699
38875 2772699 238001 -1149417 -553941 641438 959329 323104 -572573 -1266589 -1656101
38866 -1656101 -1852808 -2156278 -2763596 -3475306 -3968199 -4126995 -3736445 -2266150 340783
38857 340783 2888421 3750247 2586263 690544 -463469 -551647 -204647 4146 86647
38848 86647 353933 807622 917703 228706 -772047 -872853 379085 1820454 1929728
38839 1929728 737177 -249732 -52189 599206 434838 -547705 -1054885 -202650 1271642
38830 1271642 1864836 1220550 599581 1096616 1971503 1681933 361023 -47161 1485361
38821 1485361 3507572 4112738 3395432 2714050 2473330 2140473 1779060 1884860 2119647
38812 2119647 1945696 2143882 3653791 5080968 3863206 359216 -1835599 -712015
38804 -712015 1487730 1927437 1095652 954843 1261656 473064 -1003529 -1303535 -175772
38795 -175772 978440 1683047 2701075 4257803 6161500 8967486 12595011 14825174
38787 14825174 14280235 13871432 17388531 23649239 29391196 37719786 55943623 81605052
38779 81605052 97998146 90788615 65459306 41121387 29045620 24661502 19859237
38772 19859237 14257955 11297388 10390165 8555679 6103850 5463902 6143267 5239469 2260105
38763 2260105 -150728 -205321 1127994 2324428 3000213 3037250 2022413 284133 -846394
38754 -846394 -511826 662345 1384941 1035655 117652 -234527 665167 2150900 2743809
38745 2743809 1928567 818018 571554 836145 460102 -815482 -2144680 -2648248 -2076345
38736 -2076345 -812715 292276 584499 452914 814418 1483500 1151735 -485387 -1888940
38727 -1888940 -1821754 -1010899 -578353 -208731 658684 1134226 258294 -871443 -368330
38718 -368330 1626907 3272599 3667687 3359993 2803705 2275374 2728354 4478180 5484024
38709 5484024 3476400 -333527 -2320251 -1333876 249971 704282 1081382 2239448 2865937
38700 2865937 2120750 1559765 2465162 3587102 3601234 3577873 4644093 5280328 3780027
38691 3780027 1755539 2032961 4090904 4815183 3297003 1721553 1525390 1745919 1619107
38682 1619107 1910328 2749105 2690643 1170522 -222009 -233943 177914 -78775 -21402 1676505
38672 1676505 3948734 4391869 2579411 520432 -137307 179573 321426 154342 220134
38663 220134 443175 122633 -870776 -1632198 -1342646 -477173 -297165 -1192813 -2211571
38654 -2211571 -2397141 -1812752 -877447 309568 1197757 417346 -2418788 -5262478 -5690285
38645 -5690285 -4069982 -2793315 -2461794 -1159709 1846906 4085979 3139065 188812
38637 188812 -1653054 -1473361 -981896 -1416074 -2116007 -2207000 -1880538 -1548930 -1092685 -494597
38627 -494597 -188113 -275816 -237366 194947 673671 1078952 1805624 2706990 2677019 1083958
38617 1083958 -1045884 -2168325 -2119113 -1973712 -2250299 -2189915 -913179 1402226 3640527
38608 3640527 4552812 3502064 1088619 -912355 -1029347 212385 806103 -189230 -1476520
38599 -1476520 -1508072 -718110 -638213 -1381658 -1497949 -303548 1137640 1807963 2178831
38590 2178831 3028978 3856655 3573431 2191302 760684 -55053 -413706 -517840 -282879
38581 -282879 290942 1117780 2259712 3509045 4034201 3312967 2218729 2170853 3213971
38572 3213971 3932035 3341910 1856693 245511 -1205562 -2156842 -2054281 -1155838 -675307
38563 -675307 -1131219 -1502093 -888066 -30509 -20032 -349660 240446 1483010 1847974 1011815
38553 1011815 316487 406174 135471 -1288534 -2581153 -2151773 -550840 439945 523847
38544 523847 915467 1817721 1802217 233302 -1386444 -1533530 -854518 -966350 -1980419
38535 -1980419 -2631090 -2272023 -1276272 164867 2030350 3341570 2756504 642405 -976378
38526 -976378 -1078243 -800862 -1245618 -1614531 -634241 1347329 2940375 3548173 3509831
38517 3509831 3200802 3059522 3667471 4642017 4324365 1929966 -762141 -1372343 33177
38508 33177 1380041 1492100 892615 175100 -548830 -731439 222482 1545605 1769606
38499 1769606 951914 636616 1408899 2084138 1641560 539206 -167939 211779 1885301
38490 1885301 4073105 4930402 3597260 1900699 2057977 3248174 2991536 1450268 1072899
38481 1072899 1891598 1027493 -2112402 -4041311 -2452466 283280 1223938 1121508 1712437
38472 1712437 1809334 -368991 -3285787 -4190090 -3435250 -3188656 -3349287 -2377294 -949639
38463 -949639 -1008662 -1985815 -1684054 -340299 -90902 -781785 -191500 1559762 1744512
38454 1744512 -318566 -2036624 -1820402 -1200580 -1650395 -2443142 -2796287 -3200641 -3483303
38445 -3483303 -2433574 -542107 -199363 -1792240 -2495554 -608006 1663330 1712333 378754
38436 378754 96739 1181123 2167189 2381445 2222125 1988000 1926445 2430014 3171882 3236664
38426 3236664 2717122 2563173 2432132 921912 -1431381 -2077333 -417813 1031323 855027
38417 855027 1006552 2867804 4160881 2518444 -486655 -1898998 -1772374 -1866302 -1860706
38408 -1860706 -278671 2111222 3101145 2474689 1860594 1951023 2349850 3202653 4484187
38399 4484187 4751529 3185689 1752707 2637836 4635447 4911867 3298057 1874386 1292118
38390 1292118 664208 281641 1103104 2046134 1082798 -1200495 -2216997 -1340397 -311708
38381 -311708 251 252536 362976 -344741 -976160 -46844 1699909 2432874 2563556
38372 2563556 3629567 4629716 3383841 1077907 1166959 3755555 5428863 4958536 4716001
38363 4716001 5820776 6410311 5714899 5537654 6620037 7683986 8906139 11924895 15650245
38354 15650245 16923651 16204583 17317604 20607710 22379147 22540593 26013581 34232165
38346 34232165 42371179 48102495 55684248 67664314 80622251 93822553 113356815
38339 113356815 142280983 177416392 223604818 296303779 392426402 468132929 470195961
38332 470195961 392926932 286381587 203626771 155980039 125222363 99480563 80863346
38325 80863346 69540438 59597902 49337937 42618814 39420396 34579858 26539657 19552101
38317 19552101 16335209 14973663 13771375 13337569 13053431 10796780 7251284 5820344
38309 5820344 7154720 7963400 6341663 4317396 3831288 3827251 2879744 1648196 1185416
38300 1185416 1308033 1824082 3018339 3999593 3062765 693126 -304978 1164450 2767375
38291 2767375 2334762 774004 -167754 -745843 -1863601 -2802859 -2533262 -1865351 -2019934
38282 -2019934 -2070827 -188580 3032602 4772355 3629799 1209263 -297421 -500447 -161770
38273 -161770 452204 1492447 2536264 2767619 2048277 1155306 952699 1712313 3095046
38264 3095046 4292811 4300993 2763253 720910 -179182 417463 1196671 1237588 1519563
38255 1519563 3220372 5210924 5001535 2250188 -399483 -604650 990519 2210385
38247 2210385 2221072 1806208 1697786 1887140 2112482 2025969 1222026 -178154 -1422327
38238 -1422327 -2147210 -2757867 -3183928 -2344986 59284 2198951 2000568 -164427 -2025969
38229 -2025969 -2226017 -1291670 -225150 434496 317818 -620043 -1606807 -1829119 -1642166
38220 -1642166 -1960795 -2658119 -2791815 -2300907 -2148631 -2681899 -3101114 -2825436 -2323469
38211 -2323469 -2261844 -2629983 -2914235 -2541278 -1230745 491773 1477093 1353105 1159767
38202 1159767 1696368 2104074 1428417 636536 1144909 2016457 1019510 -1670921 -3365297
38193 -3365297 -2770773 -1501437 -1028583 -695518 88890 183897 -1026751 -1817151 -647569
38184 -647569 1128292 1369593 736754 1635969 4134541 5459734 3811307 664814 -1336646
38175 -1336646 -1309680 -220417 852612 1589336 1984062 1832036 876894 -725346 -2386124
38166 -2386124 -3688793 -4698405 -5284511 -4647672 -2471442 -224550 114640 -1180749 -1619798
38157 -1619798 113987 2279529 2549020 1055315 -282349 -456564 18154 529489 1000138
38148 1000138 1368355 1506258 1472195 1147690 100739 -1472329 -2318159 -1530732 166092
38139 166092 1358468 1542659 998112 -104251 -1417123 -1989497 -1298455 -141366 513269
38130 513269 834598 1229874 1113071 19972 -926787 -426462 719190 584119 -974040
38121 -974040 -2228958 -2218097 -1627469 -1125539 -673442 -543219 -1125362 -1528409 -308957
38112 -308957 2024856 3187887 2371355 1387987 1769957 2650626 2684338 2301920 2498102
38103 2498102 2699558 1608121 -509315 -1913591 -1559825 -133625 918551 728693 -361555
38094 -361555 -1075489 -478310 842693 1514473 1294718 1116738 1060764 -63498 -2290547
38085 -2290547 -3339747 -1427654 1874934 3329791 1976085 -226458 -1339314 -1396272
38077 -1396272 -1380782 -1703172 -2102600 -2114401 -1311724 215890 1465623 1298917 -180083
38068 -180083 -1598035 -1875945 -1390588 -1393176 -2538220 -4095215 -4556338 -3176516 -933062
38059 -933062 475798 696647 1052106 2389316 3524808 2858454 922890 -100307 587452
38050 587452 1254989 117318 -2105114 -3130338 -2151320 -793835 -875975 -2151964 -2954190
38041 -2954190 -2497312 -1501583 -613048 539088 2169223 3373093 3383474 2914847 2914834 2647782
38031 2647782 733317 -2202260 -3867624 -3480983 -2642187 -2517156 -2189924 -828353 432168
38022 432168 298827 -446010 -220187 856540 1332684 574009 -801444 -1920237 -1940443
38013 -1940443 -310356 1999839 2652709 829864 -1194923 -1074582 286312 548856 -153492
38004 -153492 123018 1309160 1305073 -201207 -943256 323421 2132925 2958072 2988014
37995 2988014 2437620 764459 -1230125 -1190060 1217998 2918369 1635762 -647259 -794660
37986 -794660 744636 1074114 -476106 -1752013 -1395601 -323060 527587 1534899 2922020
37977 2922020 3802867 3438760 2208800 848435 -274192 -896156 -882133 -660691 -696505
37968 -696505 -569598 311931 1193516 642258 -1029386 -1588703 141324 2471044 3046437
37959 3046437 1849347 756846 750979 1003267 683956 317157 715012 1417418 1170613
37950 1170613 -226253 -1494028 -1606702 -1171559 -1362290 -2047400 -2133062 -1632546 -1947319
37941 -1947319 -3569864 -4879773 -4326788 -2781104 -2243328 -2837180 -2812392 -1437105 -56000
37932 -56000 258152 437141 1662638 3094099 2959369 1433904 710076 1906027 3408516
37923 3408516 3217916 1831917 1327210 2094811 2371325 1321611 583775 1479464 2391669
37914 2391669 1062997 -1501922 -2111141 -202995 1294490 600970 -303269 737631 2429572
37905 2429572 2334220 868573 215454 498316 42808 -1153218 -1257498 68974 1047523
37896 1047523 942681 1168567 2408836 3117499 2115455 562776 -59162 -118814 -516471
37887 -516471 -837849 -474830 -221404 -966400 -1808212 -1249495 419459 1569345 1555118
37878 1555118 1086188 693468 305791 133350 637770 1696511 2845245 4116224 5603605
37869 5603605 6541632 5997184 4264114 2451448 953522 -449059 -1216249 -254567 2328077
37860 2328077 4896736 5985706 5385852 3590149 1393040 137968 908228 2909233
37852 2909233 3842319 2583307 534279 -352591 50326 494084 403440 419780 1181658
37843 1181658 2415645 3255855 3035040 1852418 629431 386233 1203217 2120729 2243337
37834 2243337 1641023 995813 748791 861026 1096899 1255103 1276458 1224276 1036404 504684
37824 504684 -137432 -2353 1277324 2436138 1808954 -242032 -1423388 -432257 1499299
37815 1499299 2552396 2388889 1377588 -645288 -3263033 -4439352 -2725143 209355
37807 209355 1512495 1255221 2048072 4426693 5550061 3657362 1106852 865336 2018714
37798 2018714 1518749 -769934 -1814916 -61202 2493843 3485063 3042066 2396777 1660252
37789 1660252 510101 -373269 -257695 177778 -76678 -508376 53410 1162161 1112750
37780 1112750 -415820 -1748914 -1644480 -892414 -835113 -1478532 -1913376 -1712552 -985085
37771 -985085 314495 2146368 3785178 4356794 3916722 3323593 3028399 2551784 1300915
37762 1300915 -475818 -1787996 -1911273 -1220115 -849482 -1323876 -1730407 -770002 1411706
37753 1411706 3145460 3213446 2199742 1434902 1253359 989783 286730 -396045 -520890
37744 -520890 -145429 211577 71632 -626271 -1480976 -2023841 -2125825 -1774844 -705309
37735 -705309 1050313 2404601 2179488 1092441 1410469 3836221 6026217 5415950 2483846
37726 2483846 -197583 -1256067 -1206579 -578035 614120 1716256 1759476 1142332 1234377
37717 1234377 2050205 2101550 939509 -52822 -54955 -79148 -879511 -1457070 -999193 -639299
37707 -639299 -1572459 -2730101 -2286625 -646256 60816 -903498 -2074471 -2041083 -983253
37698 -983253 141401 660690 291008 -760507 -1698365 -2013787 -2321196 -3343843 -4305194
37689 -4305194 -3617439 -1244213 882859 1149784 -39811 -1185656 -1410585 -880124 -260441
37680 -260441 -152586 -566539 -830951 -529917 -366771 -1269908 -2756046 -3262753 -2235616
37671 -2235616 -771859 111557 716394 1648892 2607611 2914918 2474481 1491413 -77986
37662 -77986 -2056938 -3579428 -3837500 -2964496 -1675754 -485041 249247 119902 -759624
37653 -759624 -1430293 -1110216 -274286 -14034 -533593 -974063 -622221 353836 1365972
37644 1365972 2047591 2360693 2463051 2548654 2594654 2311417 1518656 431760 -562272 -1156700
37634 -1156700 -1044880 -81184 1170393 1628276 1010427 484964 1273785 2961443 4051148
37625 4051148 3975409 3528049 3269909 2639797 1091424 -859852 -2447793 -3764293 -5137454
37616 -5137454 -5927249 -5142548 -3223300 -1991061 -2363238 -3111485 -2675981 -1429018 -988357
37607 -988357 -1672077 -2040588 -1157893 42095 319774 -74873 -222969 -337687 -1391904
37598 -1391904 -3245533 -4469547 -4165192 -2930274 -1825157 -1276484 -1215969 -1454133 -1639329
37589 -1639329 -1550248 -1562884 -2079406 -2529550 -1994806 -883381 -640299 -1454703 -1782007 -876170
37579 -876170 -231755 -1311340 -3204160 -4066019 -3775951 -3418034 -3043419 -2036501 -1174966
37570 -1174966 -1940388 -3660046 -3678237 -1102768 1653504 2173844 1149411 776057 1457000
37561 1457000 1905835 1700142 1752577 2330794 2358503 1176210 -256536 -642278 -44259
37552 -44259 436007 221599 -226466 -296939 16823 334050 363402 -40632 -866562 -1628951
37542 -1628951 -1441247 -45500 1349641 1061199 -988082 -2912113 -3060312 -1894247 -943232
37533 -943232 -510893 391651 1941597 2660933 1301149 -1201092 -2466799 -1214474 1427193
37524 1427193 3163801 2877349 1667096 1543304 3149605 5117539 5846006 5361497 4799471
37515 4799471 4520911 3835646 2618577 2017250 2922392 4476481 4887841 3432015 1046521
37506 1046521 -904958 -1932048 -2458954 -2958517 -3300972 -2993102 -1938315 -667083 308262
37497 308262 974702 1308885 758459 -1046341 -3309600 -4681117 -4871181 -4814411 -5125543
37488 -5125543 -5331478 -4946091 -4339254 -3932670 -3344010 -2161947 -1037534 -1050339 -2108053
37479 -2108053 -2768503 -1841672 255550 1932698 2022426 791677 -626066 -1606147 -2440754
37470 -2440754 -3291029 -3458402 -2433057 -1172718 -1211945 -2549191 -3556583 -3201542 -2254597
37461 -2254597 -1885277 -2129627 -2385220 -2507801 -2624229 -2512955 -1916008 -1003475 14274
37452 14274 1228070 2516918 3259085 3019346 2012202 614668 -875097 -1800154 -1480283
37443 -1480283 -357191 302423 269223 611187 1595424 2015822 1497245 1519219 2661940
37434 2661940 2830931 454387 -2214542 -1845986 930366 2367589 1109243 -373619
37426 -373619 -106962 844863 1129137 1475929 2740057 3890484 3761001 3046893 2817466
37417 2817466 2540912 1355884 25980 -227558 141866 -119625 -809344 -723142 134750
37408 134750 618949 481296 574016 1000196 794304 -174199 -557681 407883 1371008 500682
37398 500682 -1873828 -3305867 -1987905 1174491 3570410 3685866 2450229 1752311 2213097
37389 2213097 3005320 3473725 3872910 4305239 3975503 2243645 -154330 -1711148 -1751609
37380 -1751609 -879584 -6298 549573 1001792 1469683 1541067 578600 -1333684 -2963450
37371 -2963450 -2999072 -1545403 2859 605828 508602 541013 1201805 2481428 3817009
37362 3817009 4153677 2899306 916688 -313076 -527839 -649065 -1001562 -1003174 -732474
37353 -732474 -1046689 -1670128 -1084896 807792 1885003 929607 -351946 -102785 684713
37344 684713 46680 -1554628 -2160151 -1641346 -1572263 -2372734 -3030627 -3308060 -3809519 -4056883
37334 -4056883 -2949623 -1134676 -433831 -724309 52314 2311849 3864577 3367076 2247382
37325 2247382 2016786 1972960 1052737 -97253 -641002 -1406473 -3291314 -5120798 -5056858
37316 -5056858 -3314438 -1758032 -1390939 -1705161 -1978381 -1868918 -1155917 -43919 667927
37307 667927 613821 489621 876303 1267596 1157289 1104122 1621381 2014309 1577373 960642
37297 960642 972160 1051856 524158 319306 1491753 2860285 2377807 400655 -730642
37288 -730642 -202464 551564 683389 918965 1231798 187591 -2225315 -3427192 -1537194
37279 -1537194 1880096 3943583 3865530 2681706 1063121 -680839 -1551497 -930373 -26537
37270 -26537 -262869 -780899 288599 2394476 2856897 857989 -1275575 -1590669 -1048037
37261 -1048037 -1222590 -1511956 -612636 684834 575039 -571889 -553680 1106926 2248342
37252 2248342 1335836 -345883 -835984 -239603 51135 -274024 -392666 8944 499658
37243 499658 912270 1263614 1001264 -271384 -1514569 -1230341 206953 783223 -231610
37234 -231610 -1203978 -711282 353856 465983 35929 689150 2557679 3896678 3423215
37225 3423215 1819192 668211 778939 1830693 2988982 3519622 3203240 2454842 1928741
37216 1928741 1953197 2368986 2719603 2514631 1636332 619721 102683 -121724 -843384
37207 -843384 -1958333 -2143106 -661367 1313836 2100364 1588275 895757 547998 314255
37198 314255 505267 1832733 3731587 4240335 2292590 -688487 -2155698 -995212 1598749
37189 1598749 3391614 3035653 1107871 -610753 -1044191 -755655 -690429 -674350 -54127
37180 -54127 747910 669393 -177429 -565850 -144000 71322 -496795 -1123136 -1230710 -1274744
37170 -1274744 -1501869 -1278830 -577426 -687064 -2195074 -3533373 -3078858 -1695557 -1448175
37161 -1448175 -2496774 -3178097 -2847723 -2650958 -3299046 -3909290 -3637117 -2973104 -2637442
37152 -2637442 -2333387 -1442702 -114645 1130494 2241507 3357104 4174111 4244722 3585086
37143 3585086 2534679 1348733 278415 -367320 -602883 -770098 -826270 -190906 1207486
37134 1207486 2301181 2029266 807686 144345 886223 2378280 3266060 2733088 1184626
37125 1184626 154226 1154635 3921594 6069055 5356829 2253300 -595831 -1436898
37117 -1436898 -958656 -624570 -665927 -437212 160128 596748 570164 95393 -861479 -2042313
37107 -2042313 -2626570 -2244815 -1882761 -2637484 -3816258 -3665012 -2064948 -940691 -1437560
37098 -1437560 -2239831 -1768146 -729012 -881201 -2038213 -2164319 -414706 1593177 1991234
37089 1991234 832634 -580544 -1425660 -1520569 -604896 1311653 3106221 3191682 1355637
37080 1355637 -716136 -1218255 -201018 649442 10357 -1795766 -3518502 -4383240 -4432097
37071 -4432097 -3972683 -3358866 -3070009 -3180876 -2767235 -779168 2246074 4328405 4407171
37062 4407171 3573634 3197083 2880550 1526359 -392527 -1345674 -1277657 -1769526 -3267959
37053 -3267959 -3842300 -1756951 1770123 3615246 2218819 -862904 -2778638 -2144020
37045 -2144020 69325 1994816 2866548 3329712 3904882 3934938 2672927 781662 -320763
37036 -320763 -372513 -395680 -939230 -1377465 -1182900 -800597 -872474 -1481541 -2434986 -3406659
37026 -3406659 -3663818 -2732121 -1476593 -1236683 -1677115 -1087998 688247 1470072 -101643
37017 -101643 -2341167 -2892675 -1877985 -1031420 -950210 -1092909 -1529426 -2581624 -3299477
37008 -3299477 -2448620 -830198 -560853 -1929911 -2902427 -2123228 -633670 58862 99267
36999 99267 561604 1658087 2578368 2570900 1615877 344014 -523444 -931531 -1496695 -2361356
36989 -2361356 -2625346 -1720314 -666178 -743446 -1477663 -1421866 -511145 64448 27672 81090
36979 81090 -94320 -1607124 -3767145 -4166222 -2238039 -405825 -391814 -656747 670099
36970 670099 2367852 2084161 329715 -222773 1152076 2408293 2001953 696297 -267437
36961 -267437 -794005 -1059421 -703473 166122 409035 -694346 -2221086 -2691060 -1812284
36952 -1812284 -451324 641040 1356368 1772287 1848445 1587964 1133469 674643 392201
36943 392201 359803 365715 37072 -636134 -1075162 -737676 59611 319010 -442767 -1494205
36933 -1494205 -1806020 -1482442 -1588444 -2434110 -2914217 -2159419 -1026229 -874747 -1417109
36924 -1417109 -1221446 -226432 -85846 -1550930 -3067161 -2899614 -1413257 -133511 395140
36915 395140 476751 -151441 -1940052 -4022452 -4658620 -3343752 -1297089 278321 1266924
36906 1266924 1752246 1319365 -51228 -1253253 -1099190 247073 1545426 2039235 2188698
36897 2188698 2774797 3663276 3804938 2506987 434928 -981587 -1071202 -425069 143853
36888 143853 550755 1073498 1624498 1893628 1838982 1582540 1161643 760009 721490 904119
36878 904119 607774 -271350 -683081 136087 1255725 1158486 -149499 -1341643 -1867416
36869 -1867416 -2495181 -3655931 -4588639 -4586250 -3953773 -3111611 -1746403 296460 1976865
36860 1976865 1912224 84782 -1967895 -2618693 -1447081 697662 2445969 2785818 1647914
36851 1647914 -144152 -1529147 -1915048 -1471953 -962996 -1152996 -2033046 -2653245 -2082648
36842 -2082648 -569557 602576 493192 -580572 -1589543 -1894448 -1575884 -922947 -13859
36833 -13859 1025440 1582958 931405 -641256 -1575974 -731788 867468 1081519 -405271
36824 -405271 -1532761 -880138 201440 -288654 -1959803 -2878650 -2698893 -2837912 -3675187
36815 -3675187 -3757628 -2329408 -783709 -665727 -1681871 -2720025 -3604168 -4601731 -5105217
36806 -5105217 -4214433 -2284880 -734853 -334198 -509326 -432438 -190892 -572550 -1814429
36797 -1814429 -2813521 -2032183 522356 2801404 2987152 1786289 1265822 1709813 1332241
36788 1332241 -610675 -2287645 -1863674 -100810 958333 813386 530869 677458 754437
36779 754437 380827 -262147 -1023902 -1751632 -1867397 -1057096 -231587 -658340 -2069913
36770 -2069913 -2688270 -1398583 910391 2452221 2341221 1035634 -434646 -1286725 -1279804
36761 -1279804 -521827 818726 2383549 3359266 3052072 2013856 1839697 3235753 4907618
36752 4907618 5097221 3688294 1989454 963423 655040 963427 1806318 2590720 2582432
36743 2582432 1915901 1395891 1248294 911281 148868 -501123 -633387 -586151 -798391 -1072125
36733 -1072125 -818268 184498 1392314 1811742 978307 -264871 -556347 103398 138182
36724 138182 -1270720 -2705536 -2573905 -1663474 -1863949 -2925175 -2644388 -324408 2097986
36715 2097986 2878657 2424506 1646039 335593 -1536877 -2588457 -1736935 -45409 687965
36706 687965 311849 -135654 -357520 -618277 -358554 1121920 2920038 3352938 2494950
36697 2494950 2027964 2376178 2017617 334730 -885595 -189295 947147 223311 -1754071
36688 -1754071 -2178218 -374403 958376 -294371 -2463787 -2562618 -692461 262035 -924930
36679 -924930 -2071079 -1085217 811830 1083958 -132382 -256026 1722398 3589761 2955286
36670 2955286 337534 -1892794 -2571019 -2428448 -2295192 -2030403 -1370734 -771816 -806674
36661 -806674 -1158033 -820038 565856 1885364 1532419 -611187 -2648019 -2655048 -874146
36652 -874146 834429 1464143 1678576 2108574 2224090 1557128 823555 760257 742016 -184922
36642 -184922 -1475141 -1632836 -325458 1314309 2391112 2994824 3209195 2705630 1689466
36633 1689466 1044112 918587 187611 -1855449 -3993882 -4222598 -2100293 749243 2354028
36624 2354028 2100507 859132 -106625 -291852 -205694 -519915 -1135103 -1465686 -1496011 -1785414
36614 -1785414 -2271480 -2026009 -794907 101710 -601046 -2175186 -2804449 -2157323 -1690548
36605 -1690548 -2254165 -2825202 -2295361 -1305284 -1173850 -1766426 -1779476 -893156 -276791 -720701
36595 -720701 -1457613 -1451261 -932258 -763244 -867510 -389937 695864 1226642 437101 -926006
36585 -926006 -1691479 -1896417 -2483618 -3548123 -3851050 -2465376 -227813 1147030 1110484
36576 1110484 655532 630737 560894 -321600 -1519225 -1673110 -416148 1043815 1410346
36567 1410346 686454 -221833 -622571 -294530 742782 2010270 2542209 1874297 835050
36558 835050 588416 1080908 1287083 812004 128085 -810481 -2743999 -5284338 -6323992
36549 -6323992 -4542423 -1593989 -247947 -788040 -959089 473582 1929309 1481968 -446096
36540 -446096 -2134575 -3202083 -4502919 -5836805 -5632155 -3345374 -744535 70354 -926518
36531 -926518 -2068387 -2118142 -1180356 -71696 245216 -976380 -3334920 -4907578 -4077511
36522 -4077511 -1830924 -913002 -2317991 -4016786 -3956042 -2912638 -2958998 -4101874 -4337029
36513 -4337029 -2788054 -916910 -238952 -409615 -342577 -409 -40802 -451238 -601183
36504 -601183 -300597 83994 427844 1011316 1828991 2270439 1680046 49250 -1860676
36495 -1860676 -2993688 -2744399 -1422501 49349 927980 1092729 887242 821799 1282243
36486 1282243 2108469 2564871 2194847 1522427 1264182 1071368 34372 -1577960 -2295724
36477 -2295724 -1507908 -338335 121375 231204 598936 695516 -23997 -576844 352179
36468 352179 2176805 3019137 2407782 1787562 2203321 2964094 3027904 2426741 1716970 1059407
36458 1059407 519801 475718 1062893 1786985 2153501 2131309 1682430 583260 -823712
36449 -823712 -1456354 -720554 624867 1389525 1226450 505869 -411187 -1085201 -830256
36440 -830256 427346 1518425 1256890 129594 -204157 912293 2426218 3225357 3540010
36431 3540010 4197437 5175354 5558554 4607098 2388206 -351626 -2488211 -3038395 -2026480
36422 -2026480 -706406 -290472 -510049 -152594 937869 1376374 236844 -1407028 -1904303
36413 -1904303 -1352538 -1233565 -1978678 -2361030 -1558061 -395287 114150 198901 372343
36404 372343 205846 -669631 -1246904 -399310 1046121 1137134 -454703 -2111293 -2735916
36395 -2735916 -2885463 -3125164 -2984084 -2320506 -2180478 -3128116 -3858859 -2799447 -414689
36386 -414689 1260453 988266 -664502 -2232392 -2461620 -1073575 690001 823843 -1180246
36377 -1180246 -3319816 -3292547 -1159118 1285635 3080943 4449311 5015860 3727074 909791
36368 909791 -1386779 -1900270 -1599654 -1771564 -2006260 -1259828 122936 835749 482310
36359 482310 -232343 -802719 -1248894 -1429078 -1243441 -1433659 -2931195 -5198929 -6337477
36350 -6337477 -5290765 -3081881 -1366147 -512205 254460 1352072 2218630 2031907 613335
36341 613335 -1295025 -2472390 -2204762 -1023234 -151683 -79831 -150630 219926 564029
36332 564029 142574 -815242 -1400230 -1318862 -1194136 -1607376 -2385772 -2861051 -2482985 -1301729
36322 -1301729 -147331 -2709 -768282 -1105629 -137171 1224797 1546126 965978 779139
36313 779139 1216169 1194692 402828 -33027 475180 904637 442615 -10452 651267 1880141
36303 1880141 2488024 2591172 3027553 3490284 2862844 1122662 -578280 -1606058 -2239589
36294 -2239589 -2449836 -1719653 -263116 845341 1059548 834336 518750 -155993 -1235986
36285 -1235986 -2204429 -2767567 -3096097 -3125505 -2561973 -1710536 -1270094 -1149844 -554576 612358
36275 612358 1591980 2150850 2785066 3311690 2794146 1368998 542702 890731 1036515
36266 1036515 -50149 -1261604 -1175992 -309918 33563 59343 808785 1907248 1888008
36257 1888008 581008 -470077 -116644 1090901 1843979 1408308 40179 -1151776 -955181
36248 -955181 589645 1927712 1841979 1005175 720217 810202 156475 -1096026 -1498230
36239 -1498230 -486852 848977 1458801 1554920 1785076 2202760 2458292 2271176 1491483
36230 1491483 312173 -592033 -781156 -677745 -713187 -308673 1137059 2636888 2518112
36221 2518112 915067 -199090 278643 1329672 1675312 1416380 1179346 964915 662965
36212 662965 609710 801743 516189 -454857 -1062734 -409336 740545 730259 -1028455 -3392257
36202 -3392257 -4465738 -3052456 271748 3326709 4237026 3315030 2319598 1972093 1422550
36193 1422550 231981 -687863 -593529 158516 1307715 3144531 4907485 4596373 1828524
36184 1828524 -766330 -809617 544947 662652 -386181 -185983 2012866 4222891 4775352
36175 4775352 4136299 3188655 1784411 -125716 -1578474 -1843888 -1433152 -1071041 -723994
36166 -723994 -352480 -500968 -1225286 -1373349 9180 2156072 3415877 3208180 2322483
36157 2322483 1585337 1056950 466225 -246084 -944797 -1472386 -1679308 -1454399 -820180
36148 -820180 -55595 249360 -460884 -1961446 -3058993 -2675524 -1067690 511928 1242823
36139 1242823 1235974 790774 39529 -587615 -473303 298696 960171 1248916 1684311 2262985
36129 2262985 1962436 345340 -1288443 -1478756 -688505 -514968 -1154069 -1118020 334339
36120 334339 1859890 1855712 720691 335992 1641566 3592566 4552636 4061857 2947773
36111 2947773 2121209 1747609 1528875 1292848 1001224 453914 -537904 -1677742 -2313926
36102 -2313926 -2204875 -1806058 -1575509 -1326792 -610416 494618 1386866 1689584 1651206
36093 1651206 1741683 2060461 2246912 1957170 1423524 1387681 2187906 2993454 2503940 622671
36083 622671 -1149149 -1439219 -609405 -14419 -131290 -322055 -203791 -144774 -252123 66379
36073 66379 1038087 1844400 1615913 525253 -631555 -1328327 -1230928 -3814 1867760
36064 1867760 2641090 944277 -2248480 -4365660 -4062087 -2333594 -738952 309815
36056 309815 1038943 1250472 707776 -48300 -189717 348080 929407 1051298 598373 -328784
36046 -328784 -1221622 -1220565 -137727 900038 711048 -253282 -500064 243218 514418 -767467
36036 -767467 -2716293 -3698069 -3355726 -2553422 -1812725 -823972 563374 1771979 2186605
36027 2186605 1843669 1156891 386819 -327721 -784526 -943446 -1082419 -1319392 -1179600
36018 -1179600 -176976 1210575 1774773 1010830 -215510 -766466 -477246 153650 942698
36009 942698 1914992 2604254 2425243 1642855 1034046 612481 -271896 -1465461 -1835194
36000 -1835194 -949638 193976 659771 689686 707927 413727 -249509 -401452 353476 867968
35990 867968 130639 -961649 -1017274 -480450 -802196 -1916852 -2486211 -2336645 -2611333
35981 -2611333 -3439331 -3435089 -1962865 -255195 257413 -570394 -2076290 -3430945 -3610649
35972 -3610649 -2127803 7302 1392420 2259483 3789659 5551603 5745985 4234697
35964 4234697 3027245 3148790 3307834 2486063 1497669 910201 -156281 -1753181 -2047859
35955 -2047859 -332586 1177488 665195 -240825 848860 3172219 4309521 4158472 4475666
35946 4475666 5342990 5037751 3127288 1125359 114698 -123054 263106 1354874 2305558
35937 2305558 1967738 766891 308952 1112904 2144048 2419934 1777156 434271 -904811
35928 -904811 -1044746 321517 1884768 2519449 2805209 3574704 4388293 4908369 6036539
35919 6036539 7905454 8782877 8162925 8650708 12053204 16016728 17772682 18671197 21269694
35910 21269694 24781614 27899381 32914483 41571898 50934553 61249336 83397548 125381383
35902 125381383 171015674 187011355 158614321 107869103 68424116 51126859 43750132
35895 43750132 35717231 28752044 25942214 24396032 21506890 19002638 17592593 14599436
35887 14599436 9550103 6091749 5825750 5522043 2867825 150466 -240629 421278 464141
35878 464141 877306 2505683 3683981 3251379 2849982 3780793 4428411 3222855 1500175
35869 1500175 977190 838835 -140421 -783614 507748 2679406 3510907 2934994 2601751
35860 2601751 3084709 3487534 3141271 2195065 1167412 865835 1741051 2566505 1214758
35851 1214758 -2307787 -5186241 -5252147 -3522509 -2148054 -1552602 -1036813 -629535 -686132
35842 -686132 -820110 -627977 -426850 -279757 339955 1001586 222377 -1895894 -2911070
35833 -2911070 -1473163 436430 531816 -412047 -383549 407294 391320 -375809 -653434 -420112
35823 -420112 -360557 119221 1800648 3379572 3022709 1659224 1845412 3546751 4068811
35814 4068811 2519269 1340789 2374241 3985174 3705149 1875574 843630 1556532
35806 1556532 2618897 2449682 1165929 75933 -146146 -246789 -1081097 -1936171 -1271739
35797 -1271739 668793 1514385 11425 -1867166 -1639174 114872 959912 482069 472056
35788 472056 1526940 2045627 975403 -696301 -1817160 -2442561 -2634501 -1839842 -431835
35779 -431835 -108188 -1540993 -3031886 -2699786 -812283 1170976 2651384 3678347 3772285
35770 3772285 2574827 1100736 805100 1566678 1869444 994687 -97293 -308567 85146
35761 85146 -46920 -1143283 -2419469 -2799004 -2060816 -924725 -137293 227494 510821
35752 510821 921380 1473381 1988986 1776057 -45495 -3112486 -5288817 -4758463 -2453465
35743 -2453465 -1114225 -1848411 -2960698 -2570607 -994997 323435 1101787 2135292 3459032
35734 3459032 3901599 2623404 317597 -1410438 -1519209 -282054 1156153 1819274 1612389
35725 1612389 1179859 1209470 1888341 2842561 3482666 3543390 3291988 2948196 2080171 317871
35715 317871 -1328978 -1097508 967532 2372776 1286091 -833693 -1362815 -391080 -331266
35706 -331266 -2004744 -3575111 -3775590 -3788125 -4791075 -5643436 -4641267 -2243703 -358403
35697 -358403 278693 467267 791855 948874 684618 262398 -69775 -332531 -556800 -787020
35687 -787020 -1160587 -1543345 -1404706 -546705 363744 497449 -135531 -750851 -596513 495928
35677 495928 1924631 2544922 1749162 534410 652448 2332192 3803092 3620680 2407932
35668 2407932 1494674 941180 120704 -625330 -458395 247170 221702 -654527 -995515 71532
35658 71532 1619465 2187220 1622606 1085012 1505372 2457444 2618460 1318731 -529147
35649 -529147 -1410470 -1067454 -731635 -1348351 -2420044 -3062626 -3287152 -3438755 -3157643
35640 -3157643 -1941202 -225988 1119042 1992161 2755698 3100914 2330919 641205 -878343
35631 -878343 -1475926 -1170969 -169983 1243251 2401337 2746699 2511291 2129411 1341475
35622 1341475 -124143 -1405108 -1359808 -379323 46520 -448634 -751489 -239681 404232
35613 404232 659751 932865 1352900 1297734 798196 926701 1856541 1963019 132467 -2177951
35603 -2177951 -2666366 -1214409 269614 539619 100381 -172586 -131951 24625 175491
35594 175491 155405 16562 387472 1688639 2996928 2740235 814345 -954531 -1002351
35585 -1002351 71985 506587 -241571 -1000916 -653205 498897 1481521 2103576 2937146
35576 2937146 4081188 4830641 4832071 4760191 5184402 5355889 4112384 1805338 288160
35567 288160 798374 2660858 4302214 4782247 4110854 2900247 2051579 1995745 1940868
35558 1940868 792394 -863660 -963265 1104372 3081034 2610145 396751 -932097 -407160
35549 -407160 547753 562929 -317634 -1705152 -3467297 -4869630 -4758233 -3287786 -2158812
35540 -2158812 -2466065 -3522020 -4437227 -5462034 -6796175 -7428873 -6553744 -5143713 -4589565
35531 -4589565 -4495747 -3502896 -1858498 -1264134 -2042166 -2304203 -669616 1627653 2403007
35522 2403007 1331323 -56283 -615254 -609936 -599161 -425735 281046 1300304 2097480
35513 2097480 2585560 3023059 3225646 2548662 999387 -163937 316259 1966806 2933580
35504 2933580 2274351 1073364 748184 1044526 662382 -602057 -1541964 -1388689 -890547
35495 -890547 -1184123 -2380275 -3682734 -4287418 -3781360 -2241015 -390168 800395 1072653
35486 1072653 1032269 1069446 747211 -271441 -1340355 -1612190 -1261411 -1100352 -1229843
35477 -1229843 -967005 -125508 484829 156452 -687119 -995745 -401225 304508 8805
35468 8805 -1506297 -3253422 -4010352 -3536496 -2653321 -2237892 -2496871 -3115054 -3503719 -2889600
35458 -2889600 -1016181 950171 1184190 -480368 -1871798 -1001630 1471534 3295681
35450 3295681 3424617 2530794 1350272 100563 -681767 -377892 494209 768636 526985
35441 526985 977675 2143920 2394567 983707 -594602 -835397 -342137 -419881 -814557
35432 -814557 -440473 520851 932710 613316 331724 171773 -501175 -1427818 -1354089 66139
35422 66139 1505306 1665141 832079 145365 8880 -99013 -564148 -939232 -337292 1599281
35412 1599281 4092324 5686511 5496512 3940975 2185740 1139013 1095276 1834011 2631538
35403 2631538 2567080 1332629 -466574 -2096002 -3355826 -4158446 -4096692 -3049114 -1714126
35394 -1714126 -897607 -667295 -682711 -737607 -462211 590422 1747124 1186913 -1608164
35385 -1608164 -4327022 -4404371 -2431066 -1113563 -1311153 -1356851 -350078 321784 -445634
35376 -445634 -1449789 -980263 836032 2715609 4069670 4978061 5260012 4765539 3984395
35367 3984395 3448847 3066496 2677167 2525170 2532041 1974658 681258 -260497 185462 1706802
35357 1706802 3348532 4621351 5133806 4201605 1969285 48990 -218442 524410 850954
35348 850954 729515 1144298 2148912 2815769 2781756 2376473 1455864 -372019 -2426307
35339 -2426307 -3382380 -3169197 -3040766 -3543170 -3816486 -3294320 -2705360 -2747223 -2959344 -2692044
35329 -2692044 -2219126 -2055669 -1968859 -1550139 -1173611 -1481363 -2262160 -2642268 -2214382 -1327216
35319 -1327216 -398098 415313 870101 611365 -229277 -807676 -381841 704912 1266136
35310 1266136 687332 -267187 -510399 -207602 -495909 -1611546 -2336184 -1817435 -947242
35301 -947242 -980578 -1512052 -1051568 721089 2499161 3085537 2505573 1385757 296326
35292 296326 -186860 179427 703581 458822 -282018 -390905 171330 75237 -1226089 -2409760
35282 -2409760 -2195826 -1192207 -759456 -984491 -1043795 -884592 -1108714 -1495741 -1103964
35273 -1103964 13259 427342 -846414 -2939547 -4012316 -3055386 -530948 2241977
35265 2241977 3916429 3730533 1923753 -318751 -1604699 -1336509 -194890 399461 -413112
35256 -413112 -1998990 -2791295 -1962330 -345434 519181 47943 -960625 -1397696 -981554
35247 -981554 -335751 -211448 -709219 -1168488 -837948 298720 1457499 1833985 1263118
35238 1263118 93424 -1204019 -2052298 -1776511 -131142 2200946 4016966 4578639 4012529
35229 4012529 2869291 1705165 1137242 1774655 3620851 5676240 6581408 5796322 3935692
35220 3935692 1921087 179805 -1152041 -1792814 -1711713 -1619082 -2139894 -2525774 -1310035
35211 -1310035 1370050 3289410 2839303 1190357 508173 834766 445659 -1044063 -1926862
35202 -1926862 -1109896 258445 742099 691986 1162731 1887674 1792261 938009 542740 1163922
35192 1163922 1963533 1947515 1243960 939310 1886621 3605049 4357407 2854141 31494
35183 31494 -1671095 -1204152 -151506 -446282 -1886716 -2963090 -3217087 -3333939 -3444089
35174 -3444089 -2931882 -1825639 -928730 -451223 209106 1137457 1597244 1394283 1407208
35165 1407208 2242504 3247088 3376369 2405893 955040 -121914 -276115 95911 -401192
35156 -401192 -2578949 -4980403 -5048067 -2392007 339878 558486 -1341763 -2968245 -2908992
35147 -2908992 -1705444 -463490 422137 1247194 2297018 3146700 2691065 501705 -1848392
35138 -1848392 -1965954 391270 2706826 2815732 1435292 580374 671895 712897 459298
35129 459298 644923 1401835 2078025 2496818 2932290 2958665 1892179 431282 222583
35120 222583 1448384 2374797 1830352 689661 167919 -10615 -745696 -1915050 -2697535
35111 -2697535 -2860977 -2780087 -2685172 -2659615 -2868000 -3112538 -2748658 -1711290 -931006 -931939
35101 -931939 -777840 500926 2036728 2017432 234209 -1559945 -1926555 -1248545 -714047
35092 -714047 -775642 -1023676 -859187 91863 1665207 2968908 3043320 1969390 825079
35083 825079 356966 268989 32189 -308728 -567292 -1015398 -1913327 -2816655 -2978120 -2263378
35073 -2263378 -1188145 -233246 405698 589149 347166 184370 681594 1664708 2272573
35064 2272573 2060081 1556411 1381720 1248148 447355 -832908 -1422913 -675064 481469
35055 481469 514017 -880031 -2400757 -2610193 -1405667 11213 338690 -683231 -2054620
35046 -2054620 -2422197 -1446438 -153947 396943 488932 1060510 1859572 1467521 -505075
35037 -505075 -2472935 -2926764 -2375743 -2128909 -2053827 -1097277 456280 1053045 295272
35028 295272 -402238 -108571 172781 -770000 -2376183 -3186877 -2926893 -2546116 -2563592 -2435776
35018 -2435776 -1567772 -222465 715831 567240 -505842 -1528981 -1605551 -867401 -179461
35009 -179461 91480 364422 829189 1074992 1097886 1653378 2913210 3725832 3162151 1995203
34999 1995203 1531199 1634343 1200751 139148 -536457 -409974 -50450 318778 1094860
34990 1094860 1943255 1572160 -472357 -2851937 -4010011 -3846410 -3108275 -1987715 -377286
34981 -377286 992256 908012 -693945 -2312955 -2500301 -1432099 -451834 -300746 -369101
34972 -369101 156484 958990 1035856 286551 -205949 267733 1032714 1139194 751609 607907
34962 607907 662927 310970 -346868 -575702 -303283 -284455 -836148 -1362806 -1368142 -1073393
34952 -1073393 -760647 -318798 232946 520731 471401 516455 795171 802369 205393 -574731
34942 -574731 -977489 -990103 -894363 -809715 -796053 -986815 -1362702 -1727854 -1993964 -2132525
34932 -2132525 -1970798 -1553163 -1426024 -1777674 -1644164 -160305 1573464 1425982 -707016
34923 -707016 -2424234 -2084326 -968441 -1060552 -2010709 -1860797 -65885 1748609 1910939
34914 1910939 517194 -887389 -837465 685646 2091914 1835287 424020 -93619 988896
34905 988896 1923244 1129916 -349351 -423320 949433 1903029 1454790 499596 79254
34896 79254 150191 295966 405125 204112 -930926 -3103836 -5279098 -5922079 -4237086
34887 -4237086 -952345 1946830 2690720 1365489 -199346 -420073 646648 2010144
34879 2010144 2881609 2647557 868402 -1769279 -3455476 -3268651 -2344919 -1993419 -1675968
34870 -1675968 -305425 1344384 1401093 -238407 -1541072 -935817 1038221 2748104 3045314
34861 3045314 1862781 178848 -741780 -773961 -1096944 -2244421 -3003699 -2358543 -1281275
34852 -1281275 -980283 -617733 1098285 3091338 3236012 1840896 1090294 1390839 1198071
34843 1198071 397825 666032 2013490 2196315 548369 -642331 60371 901520 110009
34834 110009 -1131019 -891267 413191 1148577 961038 318138 -773584 -1789567 -1099975
34825 -1099975 1683046 4235303 4313252 2657891 1313111 600824 -145731 -341357 876911
34816 876911 2479639 2801070 2234078 2381128 3173710 3169291 2263253 1769592 1957360 1676270
34806 1676270 525777 -452714 -418626 365990 1211266 1380690 275868 -1484211 -1986219
34797 -1986219 -583835 488110 -945837 -3475185 -4013269 -2448367 -1423860 -1764532
34789 -1764532 -1440352 367616 1395686 -83731 -2287118 -2369593 -215273 1805024 1768657
34780 1768657 -268755 -2752298 -3786214 -2665225 -795654 -201765 -905910 -1010166 457024
34771 457024 2335653 3352198 3667168 3785763 3576416 3193704 3425795 4175527 4022058
34762 4022058 2308488 378463 -246289 322700 1269486 2427012 3558918 3601054 2005437
34753 2005437 -122238 -1467196 -2177257 -2924204 -3297427 -2522447 -1017157 128458 619151
34744 619151 702543 203941 -797101 -1017319 633701 3024836 3849797 2732207 1727614
34735 1727614 2416406 3913810 4418988 3630538 2714635 2526022 2841711 3219716 3790050
34726 3790050 4880169 6270021 7269219 7505849 7345039 7508760 8553435 10687453 13677085
34717 13677085 16909476 20076673 23784538 28756612 34587178 40575096 47808330 58547634
34709 58547634 73382871 92066660 118108945 157148381 205210464 241797433 243460582
34702 243460582 206988590 153968886 109819543 82837838 66031377 52553417 42088195
34695 42088195 35138100 29368945 23172821 17840949 14405291 11713938 8989020 7370119
34687 7370119 7538956 8204592 8181144 7871622 7602361 6545067 4513106 2946842 2765637
34678 2765637 2882773 2260982 1942605 3374193 5790965 7012690 6306477 4951949 4190123
34669 4190123 3925895 3557878 3052406 2764762 2701452 2410848 1604934 688272 408692 913859
34659 913859 1508489 1591879 1392020 1342808 1248882 741785 114012 -149125 -343715 -1122530
34649 -1122530 -2276836 -2839851 -2293142 -871098 1095287 3219787 4694268 4939073 4514040
34640 4514040 4391811 4495757 4030919 3058828 2484270 2548292 2636698 2570819 2685709 2554489
34630 2554489 1214666 -971164 -2225595 -1740535 -784051 -729929 -1259562 -1338335 -823796
34621 -823796 -164049 564216 1363609 1770142 1434566 714838 93704 -436241 -986526 -1450263
34611 -1450263 -1890505 -2408325 -2335719 -698359 1955875 3380335 2156640 -534617 -2498063
34602 -2498063 -2949516 -2482903 -1617817 -583202 133351 276209 542615 1794884 3731321
34593 3731321 5101305 5067288 3855761 2411721 1805475 2455321 3584392 4114932 4279099
34584 4279099 5175177 6362573 5660914 2516768 -173746 419804 2941097 3622687 1537015
34575 1537015 -559066 -638586 83717 -77477 -446024 399787 1868559 2249902 1505930
34566 1505930 1161348 1658346 1810810 1366533 2327705 6329214 11584725 14145161 12315986
34557 12315986 8464646 5884564 5078140 4221464 2374250 564508 -129536 77693 574288
34548 574288 1147852 1383831 685469 -370523 -123584 1675565 2817222 1495603 -925781
34539 -925781 -1725837 -536911 722625 1090217 1482497 2332820 2588516 1773806 1105782
34530 1105782 1449727 1733753 748639 -713855 -1111281 -693089 -968993 -1914230 -1642128
34521 -1642128 624457 2896974 2920228 1296983 548652 1413725 1905999 593807 -911147
34512 -911147 -256016 1900637 2519587 466209 -1931645 -2256484 -1040139 -195165 28539
34503 28539 755225 2113814 3102829 3459646 3845270 4177937 3500345 1818705 524226
34494 524226 392052 451398 -402909 -1722040 -2304960 -1954326 -1523538 -1581516 -1792812 -1562509
34484 -1562509 -852114 -286760 -480179 -1150255 -1138797 234827 2009278 2421770 926830
34475 926830 -1243726 -2553904 -2508191 -1477163 -42717 1114650 1373296 781769 205197
34466 205197 485464 1588393 2684624 2909889 2134034 1219913 1260732 2191474 2600803
34457 2600803 1555667 90187 -114279 865737 1395835 740893 -155425 -530785 -883516
34448 -883516 -1600081 -1935718 -1307488 -497014 -498920 -962341 -807732 157830 1126717 1345288
34438 1345288 573198 -1000782 -2600793 -3127505 -2282253 -999636 -229923 88727 284021
34429 284021 55682 -743002 -1211555 -525998 481883 145603 -1737585 -3526688 -3711732
34420 -3711732 -2391624 -743579 183221 68455 -603757 -976096 -767171 -601563 -885923
34411 -885923 -809560 603867 2682206 3472470 2116429 -28270 -940899 60484 2096469
34402 2096469 3834322 4467826 4075398 3390061 3074522 3185049 3483991 3961078 4565972
34393 4565972 4725812 3853491 2244007 763860 -292662 -1283969 -2185972 -2394699 -1820818
34384 -1820818 -1354230 -1748175 -2583863 -2832020 -2141574 -1219724 -1066144 -1913503 -2769076
34375 -2769076 -2179050 167746 2811409 4032048 3734192 3074636 2471754 1142981 -1189450
34366 -1189450 -3293926 -3744601 -2485449 -564018 1015009 1702996 1415782 747956 615293
34357 615293 1158514 1553463 1313653 1015438 1193241 1414753 1235725 1159282 1603126 1778456
34347 1778456 942209 29656 309316 806258 -819914 -4503039 -6951346 -5663704 -2198280
34338 -2198280 -50933 -389804 -1471234 -1605915 -946884 -369131 -136285 -159197 -499673
34329 -499673 -1012677 -1166756 -713946 -43630 457323 834389 1005813 448897 -925433
34320 -925433 -2101295 -1988214 -915342 -290638 -775135 -1572977 -1714183 -1286735 -962632
34311 -962632 -915012 -871516 -906056 -1397835 -2180099 -2419674 -1657215 -507609 123981 285252
34301 285252 890273 2311507 3536544 3147482 1020216 -1373952 -2478662 -2140592 -1385132
34292 -1385132 -1064025 -1201750 -1510331 -1869516 -2096490 -1831972 -1086111 -472798 -390780 -334363
34282 -334363 319297 1099261 907170 -268043 -1076976 -659765 113861 -13337 -795482
34273 -795482 -974504 -338953 -94886 -1000140 -2159392 -2191133 -878742 889567 2238029
34264 2238029 2770859 2483277 1964330 2265930 3671304 4840278 4199412 2155766 810377
34255 810377 1208907 2036399 1686703 585958 418161 1716781 3423575 4522834 4907548
34246 4907548 4681527 3842836 2940756 2910445 3674769 3820766 2412530 436334 -406067
34237 -406067 138547 827390 741553 144526 -469214 -1136683 -1826091 -1896627 -891894 503255
34227 503255 1022987 291694 -801125 -1205437 -661802 532698 2043096 3355718 3676454
34218 3676454 2716311 1364692 825519 1160133 1499112 1641206 2263726 3205951 2955782
34209 2955782 892022 -1105241 -814136 1236380 2536610 2111019 1358655 1334972 1294015
34200 1294015 593386 42355 143475 -299463 -2205958 -4154698 -4131432 -2456876 -1071376
34191 -1071376 -509126 347866 1723267 2374934 1967334 1999234 3437886 4976191 4798852
34182 4798852 3004317 1131572 69659 -417401 -596420 -338567 335595 1135949 1933227
34173 1933227 2730558 3298853 3419611 3430095 3887222 4539638 4202451 2087779 -969749
34164 -969749 -3083390 -3188165 -1999399 -900410 -283101 428975 1325690 1518644 413367
34155 413367 -1353636 -2803959 -3707906 -4089077 -3425711 -1436766 814198 1799594 1340416
34146 1340416 538657 192065 391349 1313749 2935870 4088543 3443933 1574234 354125
34137 354125 121139 -592430 -2014277 -2193921 -363644 1072561 -14133 -1835120 -1116990
34128 -1116990 1891756 3731876 2783412 1151802 993282 1518866 931421 -513319 -1033351
34119 -1033351 47469 1610020 2280381 1687282 473083 -204227 552435 2405330 3718337
34110 3718337 3074543 877629 -1014588 -1345824 -765726 -807283 -1793818 -2326872 -1121331
34101 -1121331 1156435 2587942 2321028 1269765 490963 44878 -131749 446505 1672457
34092 1672457 2174553 1073889 -419509 -539771 597710 1538273 1756612 1635071 761731
34083 761731 -1565668 -4213379 -4866268 -3225142 -1475261 -1019751 -908233 -340251 -387537
34074 -387537 -1719271 -2626589 -1285058 1431872 3344675 4002591 4320018 4178357 2687114
34065 2687114 393512 -976572 -997753 -921227 -1500013 -2152713 -2452093 -2781644 -3159352
34056 -3159352 -2869457 -1668462 -117553 1508511 3328835 4718778 4613362 3329784
34048 3329784 2518872 2759384 2809794 1947949 1268101 1514583 1387648 -277813 -2032038
34039 -2032038 -1661339 245883 883513 -729538 -2487410 -2444620 -1370602 -1051934 -1548899
34030 -1548899 -1559721 -675340 211529 511159 657142 1052999 1354369 1262255 1209492 1544754
34020 1544754 1593871 493404 -1210386 -1858227 -836689 531228 812005 262943 -80614
34011 -80614 -277687 -1039742 -1819015 -1058999 1351354 3407281 3465328 2152533 1010958
34002 1010958 448622 125537 310303 1391035 2635941 2903241 2308054 1853654 1612776
33993 1612776 708525 -861365 -1862779 -1686187 -1276309 -1565645 -2031342 -1606664 -278266
33984 -278266 1036963 1728978 1890177 1771688 1465637 1036159 567981 89650 -415123
33975 -415123 -962124 -1439046 -1402295 -410878 998726 1284486 -180876 -1648345 -913451
33966 -913451 1414917 2367132 760271 -1046534 -628408 1048017 1338689 -209555 -1748822
33957 -1748822 -2156017 -2035618 -1892488 -1331824 -357550 233511 227839 382520 997876 1369003
33947 1369003 1086021 651018 370856 -95624 -593716 -234827 1007892 1806304 1455944
33938 1455944 1037430 1495014 1810597 577184 -1505904 -2363212 -1331093 275841 1153699
33929 1153699 1198793 826244 411973 470894 1245600 2010343 1762330 602126 -540053
33920 -540053 -1379888 -2243664 -2633022 -1359451 1486323 4044888 4746048 3736508 1824562
33911 1824562 -604743 -2850326 -3501910 -2076045 -90502 778689 832056 1304808 1915149
33902 1915149 1142740 -1234907 -3497848 -4118202 -3288430 -2053323 -1086506 -732515 -1213225
33893 -1213225 -2207941 -2950395 -3155190 -3172998 -2996251 -2057569 -459093 629426 561465
33884 561465 311263 1007197 2087968 2110940 956529 -102809 -433011 -752249 -1495620
33875 -1495620 -1761643 -703385 913087 1593375 1164820 898370 1560894 2267374 1693076
33866 1693076 -152990 -1942141 -2557941 -2039808 -1047070 -18488 852802 1326619 1359799
33857 1359799 1399086 1804091 2041676 1154339 -811550 -2538044 -2953795 -2403781 -1832418
33848 -1832418 -1432252 -829792 -119662 235372 331481 697848 1273077 1459718 1300415 1571796
33838 1571796 2349346 2471018 1086756 -1005406 -2319728 -2428338 -1985434 -1454085 -687288
33829 -687288 387979 1460204 2246514 2661051 2574966 1904763 943969 174548 -247774
33820 -247774 -463086 -475727 -211217 51316 -183534 -934850 -1535949 -1265095 -57722 1362020
33810 1362020 1945523 1129396 -577789 -1992196 -2413088 -2130093 -1697427 -1263309 -886643
33801 -886643 -774630 -653797 285952 1952157 2650198 1120120 -1210314 -1563119 612321
33792 612321 2889739 2998977 1364452 -7477 5025 1015872 2100102 2601994 2420708
33783 2420708 1946626 1450528 634015 -602259 -1280642 -353804 1599428 3062099 3843566
33774 3843566 4911643 5895485 5021620 2269442 219314 361197 747994 -766005 -2883975
33765 -2883975 -2884453 -865133 693283 740943 384055 283926 -26464 -323967 290886 1345550
33755 1345550 1240907 -103891 -930966 -318004 816663 1654874 2320814 2469189 1323462
33746 1323462 -351890 -703073 68877 -459485 -2943037 -4783897 -4139197 -2771471 -2863089
33737 -2863089 -3438130 -2565543 -1103998 -1157106 -2114899 -1475397 980666 2864084 2854683
33728 2854683 1903077 706306 -1212638 -3427169 -4281019 -3591066 -3389326 -4787822 -6101968
33719 -6101968 -5508954 -3865285 -3160002 -3381215 -2819788 -944427 773675 951652 -93659
33710 -93659 -1151637 -1638849 -1813752 -1946630 -1862200 -1356308 -694253 -332372 -239069 9629
33700 9629 360585 159973 -732582 -1397618 -1060538 -236846 93282 -135108 -420323 -789154
33690 -789154 -1365426 -1384257 -108295 1537353 1841654 821009 241776 940663 1789655
33681 1789655 1749077 1248115 829244 107487 -890424 -892210 749688 2538085 2654081 1443737
33671 1443737 638079 746881 730957 -49262 -947426 -1108530 -440951 517445 1069556 902486
33661 902486 637299 1287803 2624789 2980825 1600287 167837 608885 2211704 2685508
33652 2685508 1533669 358045 -25563 -542397 -1546267 -1773552 -628817 343721 -290347
33643 -290347 -1489171 -1209629 623949 2194615 2363309 1731778 1301907 1301382 1420613 1329631
33633 1329631 874829 331575 272212 640169 450201 -751929 -1693548 -884614 990547
33624 990547 1710032 643712 -341968 350789 1869380 2439634 1827636 1006290 288677
33615 288677 -657582 -1354616 -683913 1316956 3090505 3415833 2732529 2186270 2059645
33606 2059645 1621305 127794 -2282380 -4407107 -4809031 -3407645 -2047519 -2529961 -4087715
33597 -4087715 -4028791 -1223191 2351520 4214506 4210626 3665609 2975175 1718950 473376
33588 473376 565293 1986947 3197566 3303049 2992935 2869045 2269676 574069 -1442174
33579 -1442174 -2564697 -2740445 -2808190 -3158107 -3514242 -3656097 -3526428 -2874557 -1582213
33570 -1582213 -249854 218564 -373070 -1416972 -2353548 -3087680 -3555023 -3455234 -2682509
33561 -2682509 -1694340 -1127181 -1078711 -950309 -114162 1282603 2364315 2511399 2076126
33552 2076126 1821171 1898202 1924134 1909479 2293862 2895253 2701521 1246511 -475412 -1164439
33542 -1164439 -811718 -377361 -214065 258585 1301183 2157268 1980540 926804 -82859
33533 -82859 -371175 76877 928569 1733780 1884986 939347 -650257 -1498933 -611720 1268624
33523 1268624 2236735 1323461 -528598 -1784350 -1902247 -1231132 -221568 482292 6069
33514 6069 -1560814 -2570797 -1755783 -251913 -102618 -1108278 -1157385 243035 1030709
33505 1030709 -101386 -1597569 -1496063 -215376 612705 626352 432640 55575 -619565
33496 -619565 -873715 -331455 -181225 -1428751 -2781496 -2265412 -346284 651654 -68809
33487 -68809 -1017682 -938611 -124061 841195 1776737 2171207 1469873 260467 -408607 -797825
33477 -797825 -1747550 -2389185 -927265 2079334 3737145 2799402 1215163 802608 857603
33468 857603 368454 157123 990000 1643406 950944 81532 584009 1590163 1294740
33459 1294740 123193 16532 1250436 2258130 2234785 1852113 1634138 1467801 1456378
$$ [...]
##END NTUPLES=NMR SPECTRUM
##END=
