##TITLE=31Pdec_LR715-M1
 CDCl3, 124 sc
 22.10.2020
##JCAMPDX= 6.0         $$ Bruker NMR JCAMP-DX V2.0
##DATA TYPE= NMR SPECTRUM
##DATA CLASS= NTUPLES
##ORIGIN= UXNMR, Bruker Analytische Messtechnik GmbH
##OWNER= root
$$ XWIN-NMR		Version 3.5
$$ Thu Oct 22 10:58:06 2020 Russian Standard Time (UT+4h)  she@DPX200
##.OBSERVE FREQUENCY= 81.013821
##.OBSERVE NUCLEUS= ^31P
##.ACQUISITION MODE= SIMULTANEOUS
##.ACQUISITION SCHEME= undefined
##.AVERAGES= 124
##.DIGITISER RES= 17
##SPECTROMETER/DATA SYSTEM= spect
##.PULSE SEQUENCE= zgpg30
##.SOLVENT NAME= CDCl3
##.SHIFT REFERENCE= (INTERNAL, CDCl3, 0, 182.463)
##AUDIT TRAIL= $$ (NUMBER, WHEN, WHO, WHERE, WHAT)
$$ ##TITLE= Audit trail, XWIN-NMR		Version 3.5
$$ ##JCAMPDX= 5.01
$$ ##ORIGIN= Bruker BioSpin GmbH
$$ ##OWNER= she
$$ F:/spectra/data/she/nmr/P31/1/pdata/1/auditp.txt
$$ ##AUDIT TRAIL=  $$ (NUMBER, WHEN, WHO, WHERE, WHAT)
(   1,<2020-10-22 10:57:11.85 +0400>,<she>,<DPX200>,
      <continue with go, POWCHK disabled, PULCHK disabled
       configuration hash MD5:
       00 E9 B6 7A A2 85 ED C7 34 08 36 98 17 FE 4E 26
       data hash MD5: 32K
       94 02 02 C7 EF 97 E4 52 F1 8E 52 85 71 D1 EE C5>)
(   2,<2020-10-22 10:57:14.18 +0400>,<she>,<DPX200>,
      <Start of raw data processing
       efp BC_mod = 2 LB = 1 FT_mod = 6 PKNL = 1 PHC0 = -2376.751 PHC1 = 72.20061 SI = 64K 
       data hash MD5: 64K
       56 58 D0 72 63 D6 5F 3F 8B CF 19 5F 25 32 3F 37>)
(   3,<2020-10-22 10:57:38.31 +0400>,<she>,<DPX200>,
      <pk PHC0 = 4.289968 PHC1 = 0 
       data hash MD5: 64K
       5F C6 BE 02 9D 80 E4 C8 75 15 91 59 11 FB F4 53>)
(   4,<2020-10-22 10:57:40.81 +0400>,<she>,<DPX200>,
      <abs ABSG = 5 
       data hash MD5: 64K
       42 2C 22 27 25 08 FA 41 F1 8C EB A6 80 9B 2F 3A>)
$$ ##END=
$$ 
$$ hash MD5
$$ E7 38 D3 42 17 53 2F 84 9F 1F 01 58 11 B3 CF 8E
##$RELAX= 
##$RELAX= 
##$RELAX= 
##$RELAX= 
##$RELAX= 
##$RELAX= 
##$RELAX= 
##$RELAX= 
$$ Bruker specific parameters
$$ --------------------------
##$DU= <F:/spectra>
##$EXPNO= 1
##$NAME= <P31>
##$PROCNO= 1
##$TYPE= <nmr>
##$USER= <she>
##$AMP= (0..31)
100 100 100 100 100 100 100 100 100 100 100 100 100 100 100 100 100 100 
100 100 100 100 100 100 100 100 100 100 100 100 100 100 
##$AQSEQ= 0
##$AQ_mod= 1
##$AUNM= <au_zg>
##$AUTOPOS= <>
##$BF1= 81.014009
##$BF2= 200.13
##$BF3= 200.13
##$BF4= 200.13
##$BF5= 200.13
##$BF6= 200.13
##$BF7= 200.13
##$BF8= 200.13
##$BYTORDA= 1
##$CFDGTYP= 0
##$CFRGTYP= 5
##$CHEMSTR= <none>
##$CNST= (0..31)
1 1 145 1 1 1 1 1 1 1 1 1 1 1 1 1 1 1 1 1 1 1 1 1 1 1 1 1 1 1 1 1 
##$CPDPRG= <waltz16>
##$CPDPRG1= <>
##$CPDPRG2= <waltz16>
##$CPDPRG3= <>
##$CPDPRG4= <mlev>
##$CPDPRG5= <mlev>
##$CPDPRG6= <mlev>
##$CPDPRG7= <mlev>
##$CPDPRG8= <mlev>
##$CPDPRGB= <>
##$CPDPRGT= <>
##$D= (0..31)
0 1 0 0 0 0 0 0 0 0 0 0.03 2e-05 3e-06 0 0 0 0 0 0 0 0 0 0 0 0 0 0 0 0 
0 0 
##$DATE= 1603349643
##$DBL= (0..7)
120 120 120 11 120 120 24 19 
##$DBP= (0..7)
150 150 150 150 150 150 150 150 
##$DBP07= 0
##$DBPNAM0= <>
##$DBPNAM1= <>
##$DBPNAM2= <>
$$ [...]
##$SUBNAM3= <"">
##$SUBNAM4= <"">
##$SUBNAM5= <"">
##$SUBNAM6= <"">
##$SUBNAM7= <"">
##$SUBNAM8= <"">
##$SUBNAM9= <"">
##$SW= 369.568048894756
##$SWIBOX= (0..15)
0 1 3 0 0 0 0 0 0 0 0 0 0 0 0 0 
##$SW_h= 29940.119760479
##$TD= 32768
##$TD0= 1
##$TE= 0
##$TE2= 300
##$TE3= 300
##$TEG= 300
##$TL= (0..7)
0 120 53 12 22 120 120 120 
##$TP= (0..7)
150 150 150 150 150 150 150 150 
##$TP07= 0
##$TPNAME0= <>
##$TPNAME1= <>
##$TPNAME2= <>
##$TPNAME3= <>
##$TPNAME4= <>
##$TPNAME5= <>
##$TPNAME6= <>
##$TPNAME7= <>
##$TPOAL= (0..7)
0.5 0.5 0.5 0.5 0.5 0.5 0.5 0.5 
##$TPOFFS= (0..7)
0 0 0 0 0 0 0 0 
##$TUNHIN= 0
##$TUNHOUT= 0
##$TUNXOUT= 0
##$USERA1= <user>
##$USERA2= <user>
##$USERA3= <user>
##$USERA4= <user>
##$USERA5= <user>
##$V9= 5
##$VALIST= <valist>
##$VCLIST= <CCCCCCCCCCCCCCC>
##$VD= 0
##$VDLIST= <DDDDDDDDDDDDDDD>
##$VPLIST= <PPPPPPPPPPPPPPP>
##$VTLIST= <TTTTTTTTTTTTTTT>
##$WBST= 1024
##$WBSW= 4
##$XGAIN= (0..3)
0 0 0 0 
##$XL= 0
##$YL= 0
##$YMAX_a= 60332
##$YMIN_a= -35714
##$ZGOPTNS= <>
##$ZL1= 120
##$ZL2= 120
##$ZL3= 120
##$ZL4= 120
##$ABSF1= 182.463
##$ABSF2= -187.1042
##$ABSG= 5
##$ABSL= 3
##$ALPHA= 0
##$AQORDER= 0
##$ASSFAC= 0
##$ASSFACI= 0
##$ASSFACX= 0
##$ASSWID= 0
##$AUNMP= <proc_1d>
##$AZFE= 0.1
##$AZFW= 0.5
##$BCFW= 0
##$BC_mod= 2
##$BYTORDP= 0
##$COROFFS= 0
##$CY= -3
##$DATMOD= 1
##$DC= 0
##$DFILT= <>
##$DTYPP= 0
##$F1P= 0
##$F2P= 0
##$FCOR= 1
##$FTSIZE= 65536
##$FT_mod= 6
##$GAMMA= 0
##$GB= 0
##$INTBC= 1
##$INTSCL= 5.30512e-09
##$ISEN= 30
##$LB= 1
##$LEV0= 0
##$LPBIN= 0
##$MAXI= 10000
##$MC2= 0
##$MEAN= 0
##$ME_mod= 0
##$MI= 50
##$NCOEF= 0
##$NC_proc= -8
##$NLEV= 6
##$NOISF1= 182.463
##$NOISF2= 159.3651
##$NSP= 0
##$NTH_PI= 0
##$NZP= 0
##$OFFSET= 182.463
##$PC= 4
##$PHC0= -2372.461
##$PHC1= 72.20061
##$PH_mod= 1
##$PKNL= yes
##$PPARMOD= 0
##$PSCAL= 0
##$PSIGN= 0
##$REVERSE= no
##$SF= 81.014009
##$SI= 65536
##$SIGF1= 159.3651
##$SIGF2= -187.1042
##$SINO= 113.3802
##$SIOLD= 16384
##$SREGLST= <1H.CDCl3>
##$SSB= 0
##$STSI= 65536
##$STSR= 0
##$SW_p= 29940.119760479
##$SYMM= 0
##$S_DEV= 0
##$TDeff= 32768
##$TDoff= 0
##$TI= <>
##$TILT= no
##$TM1= 0
##$TM2= 0
##$TOPLEV= 0
##$USERP1= <user>
##$USERP2= <user>
##$USERP3= <user>
##$USERP4= <user>
##$USERP5= <user>
##$WDW= 1
##$XDIM= 65536
##$YMAX_p= 347269641
##$YMIN_p= -94584533
$$ End of Bruker specific parameters
$$ ---------------------------------
##NTUPLES= NMR SPECTRUM
##VAR_NAME=  FREQUENCY,     SPECTRUM/REAL,   SPECTRUM/IMAG
##SYMBOL=    X,             R,               I
##VAR_TYPE=  INDEPENDENT,   DEPENDENT,       DEPENDENT
##VAR_FORM=  AFFN,          ASDF,            ASDF
##VAR_DIM=   65536,         65536,           65536
##UNITS=     HZ,            ARBITRARY UNITS, ARBITRARY UNITS
##FACTOR=    0.456856943014862, 1,           1
##FIRST=     14782.0589164895, 0,            0
##LAST=      -15158.0608439895, 0,           0
##MIN=       -15158.0608439895, -94584533,   0
##MAX=       14782.0589164895, 347269641,    0
$$ Real data points
##PAGE= N=1
##DATA TABLE= (X++(R..R)), XYDATA
$$ [...]
46091c581156J791613L55426k450217n288280k711397O403302J2386670N658749
46083A2564710q028574j3551875o879421J998061O708451J0892069J4269389Q767916
46075B6740726m366695j0136753l218893M74924r832392j7997784n640748J4711472
46067i266143J6439981Q84547n502164N877282J4595615P047582m396305p007670
46059A8672725o698020q947177m638432R116699J5221679K137339j4915531j7453956
46051g504674j1521097j1334313j1727808j331467J0561290P623486k952101j892883
46043c0079567P414549N638655n323123m185285J0187945J4145320n3896j0844922
46035a3100324m622708L962349K250323R27860Q181282J0050271k421797j1152350
$$ plain form
46091 -3581156 -1789543 -1434117 -3884334 -9172614 -11884011 -5480709 6905961 12564710
46083 12564710 4536136 -9015739 -15895160 -13897099 -7188648 3703421 17972810 26740726
46075 26740726 22374031 12237278 9018385 9493309 -339083 -18336867 -23977615 -9266143
46067 -9266143 7173838 8058385 2556221 8433503 23029118 30076700 25680395 18672725
46059 18672725 11974705 3027528 -1610904 7505795 22727474 24864813 9949282 -7504674
46051 -7504674 -19025771 -30360084 -42087892 -43419359 -32858069 -25234583 -28186684 -30079567
46043 -30079567 -22665018 -17026363 -22349486 -26534771 -16346826 -2201506 -2255402 -13100324
46035 -13100324 -17723032 -13760683 -11510360 -10582500 -2401218 7649053 5227256 -5925094
46027e925094l98249J3247271P161855q792494r330556L997431Q101334k387478
46019E674020j0756314q521098k462928N279362J6925795K1546462O548337j3939739
46011B0293897j2597170O839941J1453492p808745j9693123l840220J5379234
46004A0027306R523384q302211q881454L459155K053794j3062755j4779231L253592
45996a6708420J3557205j192479k0032077j5734257N799354J7851280J2034345
45989d425049M289166O046593Q980761K549151p745539r044882p95150M785183
45981D640234N91766o227308n678140J865870R047775J2379825J2300539O543222
45973C5463783o388038j7951124j5323650J37404J0686455M859273o538339o019421
$$ plain form
46027 -5925094 -6323343 6923928 14085783 5293289 -4037267 -39836 8061498 5674020
46019 5674020 -5082294 -13603392 -16066320 -10786958 6138837 27685299 34233636 20293897
46011 20293897 7696727 14536668 25990160 18181415 -1511708 -5351928 10027306
46004 10027306 19550690 11248479 2367025 5826180 7879974 -5182781 -19962012 -16708420
45996 -16708420 -3151215 -4343694 -24375771 -40110028 -34310674 -16459394 -4425049
45989 -4425049 -135883 5910710 14891471 17440622 9695083 650201 -144949 4640234
45981 4640234 5232000 -995308 -6673448 -4807578 4240197 16620022 28920561 35463783
45973 35463783 29075745 11124621 -4199029 -4061625 6624830 11484103 4945764 -1073657
45965a073657N719992J1913264M127320p158443q491780p79505M584867J930425
45957A0772483k577211j029113M275164L274401o512950j2434089j798922J7355035
45949A1324798K1969684M462707j4350255j2624544K175057N461489p341149j4950698
45941c872911l719599J1641855J0396783m879621j4419501q807080K679449P563175
45933c417450K750388o564096j1162235l004063J4430700K3370801J0504145j2466830
45925A4441360j9689325l976430J4538269J6180497M002102q393107j6372615
45918G30751k0064513j3798512L999922J9001082J6674659M422136K9078K544773
45910A3539376l643858j6658219j4995365N484034J8337193N454416j3099845
$$ plain form
45965 -1073657 4646335 16559599 20686919 13528476 5036696 4257191 8842058 10772483
45957 10772483 8195272 7166159 11441323 14715724 8202774 -4231315 -6030237 11324798
45949 11324798 33294482 37757189 23406934 10782390 12957447 18418936 11077787 -3872911
45941 -3872911 -7592510 4049345 14446128 9566507 -4852994 -13660074 -10980625 -3417450
45933 -3417450 -667062 -7231158 -18393393 -21397456 -6966756 16404045 26908190 14441360
45925 14441360 -5247965 -9224395 5313874 21494371 25496473 17103366 730751
45918 730751 -19333762 -33132274 -29132352 -10131270 6543389 10965525 10994603 13539376
45910 13539376 9895518 -6762701 -21758066 -16274032 2063161 7517577 -5582268
45903e582268r627066Q031406J0714071m520021j1175258K729762J6613527J1736111
45895A8920264p78913j179424P482311P660389l093579r890988n172603R14339
45887A4861796k055549r044029q160044J283162P427093K301060o859497p197350
45879g443358J743139O896163L23794q924791q057083M98924L351895l367274
45871a4978591r269014o502204k16862J975421J612486L924571P449838O779764
45863i224591K604468K258391R837105J8974176J7131810j061404k3585471k8873274
45855a1938790r981937J3080055J5063368k326129j2868675k238347J3154555
45848A944100J1516888l815545j2699716q364993k908656m570449n264005M219905
$$ plain form
45903 -5582268 -15209334 -7177928 3536143 -983878 -12159136 -9429374 7184153 18920264
45895 18920264 18141351 16961927 24444238 32104627 29011048 19120060 13947457 14861796
45887 14861796 12806247 3762218 -4397826 -3114664 4312429 6613489 -246008 -7443358
45879 -7443358 -5700219 1195944 1519738 -7405053 -15462136 -14963212 -11611317 -14978591
45871 -14978591 -24247605 -30749809 -30966671 -28991250 -27378764 -23454193 -16004355 -9224591
45863 -9224591 -6620123 -4361732 5475373 24449549 41581359 40519955 16934484 -11938790
45855 -11938790 -21920727 -8840672 6222696 3896567 -8972108 -11210455 1944100
45848 1944100 13460988 9645443 -3054273 -11419266 -14327922 -18898371 -24162376 -19942471
45840a9942471J7190804J7919181K545994j3738408j3046096L493062J4689035
45833I111101L430936k0816963l0676638j2847341J6304163L0783590K3081326
45826A8370174O067896o439529j1237079j0470246n301198K346980Q023699Q729051
45818A0089748O310639M550753L955685J186893n830555j3018022j2755671l240038
45810h750568P053682Q008958l63606q994187j1043860o734821J442126J0798898
45802h583378J5763698J1552797K402600j596666J924069M812465J167061n382628
45794B2060018r363860r387027m179737O663414J4918996R163624p055768j5854103
45786F965557j0379314m503254p816400q047584O152589K0239617J2817969r886916
$$ plain form
45840 -19942471 -2751667 15167514 17713508 3975100 -9070996 -5577934 9111101
45833 9111101 12542037 -8274926 -38951564 -51798905 -35494742 -4711152 18370174
45826 18370174 24438070 17998541 6761462 -3708784 -9009982 -6663002 1360697 10089748
45818 10089748 16400387 20951140 24906825 26093718 20263163 7245141 -5510530 -8750568
45810 -8750568 -1696886 6312072 5948466 -3045721 -14089581 -20824402 -19382276 -8583378
45802 -8583378 7180320 18733117 21135717 19539051 21463120 26275585 27442646 22060018
45794 22060018 12696158 3309131 -870606 5792808 20711804 29875428 22819660 6965557
45786 6965557 -3413757 -7917011 -15733411 -23780995 -17628406 2611211 15429180 5542264
45778E542264k1418845j2701412j66113L057342K528156N405483O952458J543244
45770i257423o178071p929608r65878J1686125K1707812J7666007j935812k0047086
45762D746066j9282292o223088r60739n020649j593323J1057598J2719002l279827
45754g837252j3683701j029174J6213329J1224791r679289j8321569p619111K950612
45746b7781364J550195j813345J504188L738711k451775q936558m892455O602664
45738c2479739J5138266J7971853J8402384J5226814M859006q345487j4270245
45731A6502852j0668683o297743p671186r974914n961941K257559P361364Q365039
45723f087653R163987Q308830J538712n713449k151824R401274J1264656j581315
$$ plain form
45778 5542264 -15876581 -28577993 -28744106 -25686764 -23158608 -17753125 -10800667 -9257423
45770 -9257423 -15435494 -23365102 -24330980 -12644855 9062957 26728964 24793152 4746066
45762 4746066 -14536226 -20759314 -21720053 -26740702 -28334025 -17276427 -4557425 -7837252
45754 -7837252 -21520953 -22550127 -6336798 4887993 -4791296 -23112865 -30731976 -27781364
45746 -27781364 -26231169 -28044514 -26540326 -22801615 -25253390 -34189948 -39082403 -32479739
45738 -32479739 -17341473 630380 19032764 34259578 39118584 30773097 16502852
45731 16502852 5834169 -463574 -8134760 -18109674 -24071615 -21814056 -14452692 -6087653
45723 -6087653 3076334 11385164 12923876 7210427 5058603 14459877 25724533 24143218
45715B4143218r617084J248768J3443046L098649j9496228k2374375j094810J4453127
45707C804311O355531p889813q957701m692788q154439j0889804j025954J0282260
45699b1168397O132696m970465j832282J3050310J6705371L046700q895020o858886
45691d789973j811376n266486j0137152n108186O191402J1809750Q309017J892630
45683A089626j216121Q06011N481167O492422o37941j0685238j2700126m235091
45675a5605291N096702O818806L216676N30494k12262p64236O9749L944991P976555
45666A1072184P136327P49528n864212o087259J416047R867700J0140013J372920
45658B9803248p455660r438962p947828p901427n832848K092792Q161486K238494
$$ plain form
45715 24143218 14526134 15774902 29217948 32316597 12820369 -9554006 -10648816 3804311
45707 3804311 10159842 2270029 -6687672 -11380460 -19534899 -30424703 -31450657 -21168397
45699 -21168397 -15035701 -20006166 -21838448 -8788138 7917233 10963933 2068913 -4789973
45691 -4789973 -6601349 -11867835 -22004987 -27113173 -20921771 -9112021 -803004 1089626
45683 1089626 -126495 679516 6160683 12653105 12015164 1329926 -11370200 -15605291
45675 -15605291 -10508589 -3689783 -473107 57387 -154875 -919111 -849362 3095629 11072184
45666 11072184 18208511 18958039 13093827 7006568 8422615 18290315 28430328 29803248
45658 29803248 22347588 12908626 4960798 -2940629 -8773477 -6680685 1480801 3719295
45650C719295r903125j1812225l41190J0158234J0386310P974409J0966748J3545297
45642C4693753P588533k538932p303066o154250m517575l300987j127329j488431
45634A5851716p734696j4627018j3825223n187569M622515J1334830J3778077
45627D212632R787039M1720p337814n187945J736336K880988k831042o948708
45619c646794n594883l736130m566478m066191J049486P294239R270565N207960
45611A211774l470633j2338434j3758132m123292Q030506J0063213L058705J073712
45603a0252581Q768715J2224991P72797j3432375j1492801L669189J1393371L896515
45595E547821m815541m002254k584573j0383913j7225279p113323J3610119K0636625
$$ plain form
45650 3719295 -6183830 -17996055 -18337245 -8179011 2207299 10181708 21148456 34693753
45642 34693753 42282286 39743354 32440288 26286038 21768463 18467476 17340147 15851716
45634 15851716 8117020 -6509998 -20335221 -25522790 -20900275 -9565445 4212632
45627 4212632 13999671 14041391 6703577 1515632 3251968 6132956 3301914 -3646794
45619 -3646794 -9241677 -12977807 -17544285 -21610476 -20560990 -13266751 -3996186 1211774
45611 1211774 -2258859 -14597293 -28355425 -32478717 -24448211 -14384998 -11326293 -10252581
45603 -10252581 -1483866 10741125 11513922 -1918453 -13411254 -9742065 1651306 5547821
45595 5547821 732280 -3269974 -5854547 -16238460 -33463739 -40577062 -26966943 -6330318
45587f330318N393010j1685675q575107R619173K0052392J3073696Q85282l280928
45579A9151525j704810l122977o944539n979271p08754J10331n473488o888392
45571a1560375L317922J5283333J3220899j817932j1961684o752516M031992O985134
45563A0746773L603254K823798L845465l50097p012799o156779J213779K289523
45555A1002917o723033j2819850n875519N750022Q260330J901104k726616j408384
45547b639029Q11444k63657l782664p420387q495397m365447K739470N334405
45539a8081262O45563m269289l398252j043081k285600j683004P380104J7864990
45531d869831J6737440M472352n901960p555048n059737k081964K635777O533160
$$ plain form
45587 -6330318 -937308 -12622983 -21198090 -11578917 8473475 21547171 22432453 19151525
45579 19151525 17446715 14323738 7379199 1399928 691174 801505 -4671983 -11560375
45571 -11560375 -8242453 7040880 20261779 18443847 6482163 -270353 3761639 10746773
45563 10746773 14350027 17173825 21019290 20669193 13656394 7499615 8713394 11002917
45555 11002917 4279884 -8539966 -14415485 -8665463 -405133 1495971 -1230645 -2639029
45547 -2639029 -1827585 -2091242 -5873906 -13294293 -21789690 -26155137 -23415667 -18081262
45539 -18081262 -17435699 -21704988 -25103240 -26146321 -28431921 -30114925 -22734821 -4869831
45531 -4869831 11867609 16339961 10438001 2882953 -2176784 -4258748 -1622971 4910189
45523D910189L892163k870973n064853k463258k811018m812531K279907J6891379
45515I951005K0168824L376878j4371767j0418080R075955J7094654J988874j8977674
45507A7888669k3022893p822281R416646J2832063L909453k807381J316129Q051954
45499A9762359M813788n910913r930981l560068R95732l514306p349255j426751
45491f120395N547572L38558j3207575j9806347j4774413o981281k785907O5303
45483e7724485L421405N409677O877917J1142078J5927245J4049610L802600q018303
45475e112256j4214400j2660594m707054N307868J0260224P315257L635713P144104
45467c031138J3108619R960032j429860o339547J738127R161950J284206j4273515
$$ plain form
45523 4910189 8802352 5931379 866526 -1596732 -4407750 -9220281 -6940374 9951005
45515 9951005 30119829 33496707 19124940 8706860 17782815 34877469 36866343 17888669
45507 17888669 -5134224 -12956505 -3539859 9292204 13201657 10394276 11710405 19762359
45499 19762359 24576147 18665234 8734253 5174185 6169917 2655611 -4693644 -6120395
45491 -6120395 -572823 -234265 -13441840 -33248187 -48022600 -55003881 -57789788 -57724485
45483 -57724485 -54303080 -48893403 -42015486 -30873408 -14946163 -896553 2906047 -5112256
45475 -5112256 -19326656 -31987250 -36694304 -31386436 -21126212 -13810955 -10175242 -3031138
45467 -3031138 10077481 20037513 18607653 12268106 14006233 23168183 24452389 10178874
45459A0178874j5928876J603164J7798748J2784709n370286j1083419L006287
45452A2989201J4710188L428537j9452912k5684902r337046P612213Q882239K833009
45444d019473J285288l64123q286893j2423067k207583J1582474J0984686j101680
45436d550371q010421q265379j3323836j8594095m446526K7564397M5543194K8122100
45428D4039063n556508k3048846j9660922j3379462j1175882l701511J0039108
45421b2444960J5471052N315748o605186l763888J0369138J7694478R205917n422988
45413A9819311j1797712p458655j427823j120410m908967p283975o109606k307536
45405b2595373L503251R894174J2679959Q642209K47275o732702r137266p394086
$$ plain form
45459 10178874 -5750002 -4146838 13651910 26436619 21066333 9982914 12989201
45452 12989201 27699389 31127926 11675014 -14009888 -23346934 -15734721 -6852482 -4019473
45444 -4019473 -2734185 -3098308 -11385201 -23808268 -26015851 -14433377 -3448691 -4550371
45436 -4550371 -12560792 -20826171 -34150007 -52744102 -57190628 -29626231 15916963 44039063
45428 44039063 38482555 15433709 -4227213 -17606675 -28782557 -32484068 -22444960
45421 -22444960 -6973908 -1658160 -8263346 -12027234 -1658096 16036382 25242299 19819311
45413 19819311 8021599 562944 -864879 -1985289 -6894256 -14178231 -20287837 -22595373
45405 -22595373 -19092122 -9197948 3482011 12124220 12371495 5638793 -3498473 -10892559
45397a0892559l188533M96814K16423k923813k682982L025509O626963J250695
45389h071483p501227q433890o93257N961243N315590O11622k785822k602847
45381a8200071J476909O545199N914204k194410q335075l532302O233926Q422042
45373c669578L229893R72393K944869J056784m027876k452622M678444L475724
45365F208031q757676j6152325r379965n46228j701438m686751L059900J5468609
45357a6487843J6871993N751882n585297r648905q944443o205384p92937O763552
45349a8277382J4006968J8105232J4819449K196571j1741263j4537195o666087
45342b093707j955941n885357p743296j498498K288243l453039p381870J83701
$$ plain form
45397 -10892559 -14081092 -13584278 -13367855 -16291668 -18974650 -15949141 -9322178 -8071483
45389 -8071483 -15572710 -24006600 -24699857 -18738614 -13423024 -12811402 -15597224 -18200071
45381 -18200071 -16723162 -10177963 -4263759 -6458169 -14793244 -18325546 -12091620 -3669578
45373 -3669578 -439685 532708 3477577 4534361 506485 -1946137 2732307 6208031
45365 6208031 -2549645 -18701970 -28081935 -28628163 -30329601 -35016352 -31956452 -16487843
45357 -16487843 384150 6136032 550735 -9098170 -18042613 -24247997 -25040934 -18277382
45349 -18277382 -4270414 13834818 28654267 30850838 19109575 4572380 -2093707
45342 -2093707 -4049648 -9935005 -17678301 -19176799 -16888556 -20341595 -27723465 -27539764
45334b7539764Q471982N538922J163803Q943959J8651305J1715175m866053p636844
45326A4442485M502321Q526403m737077j7113110j2765581J256056J1064803J3107297
45318A8283597Q264430l573181j5431766j5142691k619924P827757P627086L172187
45310H407495J079096j015887m085755l041318J823433K913062L23802L937544
45302A0341472J4362664J7371313N797291p438165q169905o60999J706258m478924
45294B8831005j1811868j2246749k182798J3792896K0902934P914524j3725832
45287C1474112j9381053m741105P425267J492182r397762p948153J63275P92633
45279a20604l104607p73758L277396k570801j2924908j1023024M148782J5835787
$$ plain form
45334 -27539764 -19067782 -13528860 -12365057 -3421098 15230207 26945382 22079329 14442485
45326 14442485 18944806 27471209 22734132 5621022 -7144559 -5888503 5176300 18283597
45318 18283597 26548027 22974846 7543080 -7599611 -10219535 -2391778 5235308 8407495
45310 8407495 9486591 8470704 4384949 1343631 3167064 6080126 6403928 10341472
45302 10341472 24704136 42075449 47872740 40434575 32264670 31603671 33309929 28831005
45294 28831005 17019137 4772388 2589590 16382486 37285420 45199944 31474112
45287 31474112 12093059 7351954 14777221 16269403 6871641 -1076512 -913237 -120604
45279 -120604 -3225211 -3998969 -721573 -3292374 -16217282 -27240306 -23091524 -7255737
45271g255737J4732348R059587P270880N680467j878049j2690383j8564754j4892255
45263a8537896m314305M928271N464305o70944l027410L909552J3122420J5143975
45255A6017968R628670J867205m922041p885282l469446M731330N849060k476136
45247A9341328p748205j261752P528540O636009N15183o54248k18539o524591
45239A7613725j3394927q278643M903864J0004330L214103m375975o605177o605758
45231c524458l119417P974021J8119173J2429866n239020j3361774m272728M728702
45223A3734365j93958q526165m875328O037385Q684379J124431m489102r40526
45215A0555481O285410Q452338K750463o842875j2781944r620995J06218P464228
$$ plain form
45271 -7255737 7476611 16536198 23807078 29487545 27609496 14919113 -3645641 -18537896
45263 -18537896 -22852201 -17923930 -12459625 -13130569 -16157979 -12248427 873993 16017968
45255 16017968 25646638 27513843 22591802 14706520 11237074 15968404 21817464 19341328
45247 19341328 11593123 10331371 17859911 24495920 25011103 24356855 24138316 17613725
45239 17613725 4218798 -4059845 844019 10848349 14062452 9686477 3081300 -3524458
45231 -3524458 -6643875 1330146 19449319 31879185 26640165 13278391 9005663 13734365
45223 13734365 13540407 5014242 138914 6176299 14860678 15985109 11496007 10555481
45215 10555481 16840891 25293229 28043692 21200817 8418873 -1202122 -1095904 6368324
45207F368324O514597J04890m264056j904885N123211R065726L755056o418663
45199A8344200r617763k840014K257223k983663r640047n593928M112215O507696
45191E45919L223955N087836Q646520J12632j6975553k1153596n749628Q945101
45183a7316814N438615p182050j0250559j211806R268745J3881536J1796074M971982
45175I395723m19248J869525P179095M304995n109137o325327L701776Q731734
45167B3329136m14245r900173o179215J577503j352278r749428q738299N09271
45159a0917728M162427j321213o634592o405126m183884l082291k781864l126146
45151c4290417k109727M804767J5713531J9645547J0888043j997671q884150j0001954
$$ plain form
45207 6368324 12882921 12987811 8723755 6818870 11942081 21007807 24762863 18344200
45199 18344200 8726437 5886423 8143646 5159983 -4480064 -10073992 -5961777 545919
45191 545919 3769874 8857710 17504230 17616862 641309 -20512287 -26261915 -17316814
45183 -17316814 -11878199 -19060249 -29310808 -30522614 -21253869 -7372333 4423741 9395723
45175 9395723 8976475 10846000 18025095 22330090 17220953 10895626 14597402 23329136
45167 23329136 22914891 13014718 6835503 8413006 7060728 -2688700 -11426999 -10917728
45159 -10917728 -6755301 -8076514 -14711106 -21116232 -25300116 -28382407 -31164271 -34290417
45151 -34290417 -36400144 -31595377 -15881846 3763701 14651744 12654073 3769923 -6232031
45143f232031q039222j280818O461370M301850o152572o945798O627953J2515318
45135A256050k994380j7837958p831773J1666657J0617996m383890k860519J3712187
45127A344370J2688646j1450037k3977077o799714J2564444Q423117k980802K873963
45119g313090J4935311Q423973j0374544j5393518n121159k185392j2311039j5032805
45111d4372263K13782J5302314J1832748q54670j000558J3112888K1795433J2521380
45103B8551054l615194q433116q42120M456854o67133p888664p889581m895603
45095a223503p356358j2062824r067047J731724J0558973J2305086J0290461P124479
45087A2300991K591415o52089Q8322O65564l323370o308002j648165L358182k740351
$$ plain form
45143 -6232031 -14271253 -15552071 -9090701 -4788851 -10941423 -17887221 -11259268 1256050
45135 1256050 -1738330 -19576288 -27408061 -15741404 -5123408 -9507298 -12367817 1344370
45127 1344370 14033016 2582979 -21394098 -28193812 -15629368 -7206251 -10187053 -7313090
45119 -7313090 7622221 16046194 5671650 -9721868 -14843027 -17028419 -29339458 -44372263
45111 -44372263 -44158481 -28856167 -17023419 -17878089 -18878647 -5765759 16029674 28551054
45103 28551054 24935860 16502744 15660624 20117478 19450345 11561681 3672100 -1223503
45095 -1223503 -8579861 -20642685 -29709732 -27978008 -17419035 -5113949 5176512 12300991
45087 12300991 14892406 14240317 14328639 14994203 11670833 5362831 3714666 7072848 4332497
45078D332497j3750540j2616348O33175Q418118M987026L735456R720583Q559025
45070A4018992o648262j9239247j4263296j322995L548342K552281N760660J0223235
45062e370290P587196J607523M72017P37193m285451q502416k645742O950570
45054c449400O749352j421310l269864M728130J0766267O619768j731272l993194
45046A4998477K476135J0824482R925720m893762k2257378k3350539n529828J2441995
45038e364698J5300481Q936992M309001r06816j0485384j4434307m601088O241788
45030a004031K137986q309610m957443R480856J3134938J123186p420533j496296
45022B689053O084420K421821n807116o230001N01090N868644P115100P281900
$$ plain form
45078 4332497 -9418043 -22034391 -21401216 -12983098 -7996072 -4260616 5459967 14018992
45070 14018992 7370730 -11868517 -26131813 -27454808 -23906466 -21354185 -15593525 -5370290
45062 -5370290 2216906 3824429 4296446 5033639 748188 -7754228 -10399970 -3449400
45054 -3449400 3299952 1878642 -1391222 3336908 14103175 20722943 18991671 14998477
45046 14998477 17474612 28299094 38224814 33331052 11073674 -12276865 -17806693 -5364698
45038 -5364698 9935783 18872775 23181776 22274960 11789576 -2644731 -7245819 -1004031
45030 -1004031 1133955 -7175655 -12133098 -2652242 10482696 11605882 4185349 2689053
45022 2689053 8773473 11195294 5388178 -841823 -340733 5527911 12643011 19924911
45014A9924911P994999P575857L058572o047636j2971048q252910M579141P147777
45006B3009663q671782k3932171j7175230L033990J0442920j25303r263731n496868
44998b8178512K708599P861965J2424200J4103863N648487o376792n695530N787187
44990H283467P891888m120294j1066077l325021L810229q5513k394417N448189
44982D442451Q983806j655774r712480n05151R932089J462334j3791400j1522876
44974a2367001K712326L838563q899110j1525692L087446J4463013R400755L95069
44966A105369R49310M665222j11107j0538511j4813263q098598L610503R526181
44958a3704894K961861r361228j0337359N817175K0723732J4394013m986462j1784954
$$ plain form
45014 19924911 27919910 35495767 38554339 32506703 19535655 11282745 15861886 23009663
45006 23009663 14337881 -9594290 -26769520 -23735530 -13292610 -13417913 -22681644 -28178512
44998 -28178512 -25469913 -17607948 -5183748 8920115 14568602 8191810 2496280 8283467
44990 8283467 16175355 12055061 988984 -2336037 1474192 1388679 -1005738 4442451
44982 4442451 13426257 11770483 2058003 1552852 11484941 12947275 -844125 -12367001
44974 -12367001 -9654675 -5816112 -14715222 -26240914 -23153468 -8690455 710300 1105369
44966 1105369 2054679 6719901 6608794 -3929717 -18742980 -26841578 -23231075 -13704894
44958 -13704894 -10743033 -20104261 -30441620 -24624445 -3900713 10493300 5506838 -6278116
44950f278116n26024Q263744J623384q074945o126561K695586N933772K307841
44942a81319k181241n281680n710060j05938P800852O002006p242632j4725561
44934b1625573l494819J2607049J0221781q812094j8592986o059895J1056489
44927b4700048J0826671k380433p174769K581162J0956424O154194k017780L14163
44919e440416P453503L003740j2142270j8391251o950270O351305N713278j121745
44911b1524126J809790J1125796J0262656k113111r241311k354410P533699P728381
44903C227364n82613r592696j4901140j3045453j390952J2772724J4258394p10592
44895i964964j6329768j6422221l747451P796595J2080883J2270068J0081588
$$ plain form
44950 -6278116 -6804140 1459604 3082988 -4991957 -11118518 -8422932 -2489160 -181319
44942 -181319 -2362560 -7644240 -13354300 -13460238 -5659386 342620 -6900012 -21625573
44934 -21625573 -25120392 -12513343 -2291562 -11103656 -29696642 -35756537 -24700048
44927 -24700048 -13873377 -16253810 -23428579 -20847417 -9890993 -3736799 -5754579 -5440416
44919 -5440416 2013087 5016827 -7125443 -25516694 -32466964 -26115659 -20402381 -21524126
44911 -21524126 -19714336 -8588540 1674116 -438995 -9680306 -12034716 -4501017 3227364
44903 3227364 2644751 -6947945 -21849085 -34894538 -36285490 -23512766 -9254372 -9964964
44895 -9964964 -26294732 -42716953 -46464404 -38667809 -26586926 -14316858 -4235270
44888d235270M581089j422425l374372k084205j540941j349252J728824O158051
44880a538501O412967J084986n197752p654659n057154J059507O723181O930326
44872B762901J169784m411025m773268l216514n376600q918798o811752J80534
44864b9394738K959149k018026o066016o8110J2184928J7961473J0776514k918336
44856C416838j1834727j1336804o112481l237377m122404l982054R27275P515295
44848b8766439R657645O954927N770552R860184J3584683Q581111m323194j4892424
44840F427045j5814291j0112492l759534L393525J3159946J9515094J3342362
44833B6151655k486386j2549894q033066J835469M299509J373008L464204J0122884
$$ plain form
44888 -4235270 345819 -1076606 -4450978 -6535183 -8076124 -9425376 -7696552 -1538501
44880 -1538501 4874466 5959452 761700 -6892959 -11950113 -10890606 -4167425 2762901
44872 2762901 3932685 -478340 -5251608 -8468122 -13844722 -22763520 -29575272 -29394738
44864 -29394738 -26435589 -28453615 -34519631 -34587741 -22402813 -4441340 6335174 3416838
44856 3416838 -8417889 -19754693 -25867174 -29104551 -33226955 -37209009 -36281734 -28766439
44848 -28766439 -19108794 -12153867 -6383315 3476869 17061552 25642663 21319469 6427045
44840 6427045 -9387246 -19499738 -23259272 -19865747 -6705801 12809293 26151655
44833 26151655 23665269 11115375 3082309 4917778 9217287 10590295 14054499 24177383
44825B4177383J0652840L270764n97494M647505Q365231N62229j1048255j2349792
44817B7680411m892596l387389j2548667j9392082j2059232L883767J4272437
44810f443351J4633407J1916077J1259625R123414M61797j2863910k3353473k4687974
44802a9954388j5671649k07461J4186362J9831845J4296520K687251p087920j1280430
44794c199870j1443208r891063o863420k467134J241709J782902q81492l617158
44786c5338734k210391M537150J1625870J1086649J615784p042396m553808N779147
44778a4500729R884229J750166p572843m507759Q825907J7616691J3183290J899992
44770B6578944n123314n331726m259720m770894k246373P002834J6071417J3075261
$$ plain form
44825 24177383 34830223 38100987 37503493 42150998 50516229 51078458 40030203 27680411
44817 27680411 22787815 19400426 6851759 -12540323 -24599555 -20715788 -6443351
44810 -6443351 8190056 20106133 31365758 40489172 40950969 28087059 4733586 -19954388
44802 -19954388 -35626037 -35833498 -21647136 -1815291 12481229 15168480 8080560 -3199870
44794 -3199870 -14643078 -24534141 -31397561 -33864695 -32622986 -30840084 -31721576 -35338734
44786 -35338734 -37549125 -33011975 -21386105 -10299456 -8683672 -15726068 -20279876 -14500729
44778 -14500729 -4616500 -2866334 -10439177 -14946936 -6121029 11495662 24678952 26578944
44770 26578944 21455630 16123904 11864184 7093290 4846917 11849751 27921168 40996429
44762D0996429k201014j4949700j4052647o709349n301653o712354J036367J5146958
44754G253037J8893374P791303l177965l784759j852960m230326l453195M210514
44746B1649023N929771n735292j4813585o259092O394333J860135j2221089j1385822
44738a4581618M066179J0019119n90289q796742m841296j775146n763083k541611
44730b4804487J3198681K2088133J1201054k627375n27320Q119230N726724j246777
44722C1127863L213617J0860944j01872k5231426l4407655j5771223O391024P179524
44714a6739204n722024q515412K659227R864101L343815l992174K155177J3788611
44706c157883J1318375n825744j5694204n758878Q290693Q302871K752852R149337
$$ plain form
44762 40996429 38795415 23845715 9793068 3083719 -2217934 -8930288 -7893921 7253037
44754 7253037 26146411 33937714 30759749 26974990 25122030 20891704 17438509 21649023
44746 21649023 27578794 21843502 7029917 770825 7165158 9025293 -3195796 -14581618
44738 -14581618 -10515439 -496320 -1086609 -9883351 -14724647 -16499793 -22262876 -24804487
44730 -24804487 -11605806 10482327 21683381 19056006 18528686 26647916 32374640 31127863
44722 31127863 34341480 45202424 45100552 19869126 -14538529 -30309752 -23918728 -16739204
44714 -16739204 -22461228 -30976640 -28317413 -18453312 -15109497 -19101671 -16946494 -3157883
44706 -3157883 8160492 2334748 -13359456 -19118334 -10827641 -2524770 228082 9377419
44698I377419J8767890P893747j8631296k7653119p832954J2314461R747378j52973
44690C830553M344492J3975001R035844n073437j1547906j3274900j9720819j8320308
44682c6751480O306528L4535691L0566937l108122k5870198j6698065K070829
44675h947880N889739L24095p69864q29537o523461r720506k057949P986930Q910109
44666e738324M591334M468462O329842L021836k353369j537366M097143N392921
44658A8272479q10344q048474r028734l550646J313740j285451p986534o894727
44650a8018691M847615J2535748M483588o753561j439543J4493406J6516333Q33480
44642B7498375r259125j912737M796191m825799j7007670j1469136O312201J4950109
$$ plain form
44698 9377419 28145309 36039056 17407760 -10245359 -18078313 -5763852 3983526 3830553
44690 3830553 8175045 22150046 31185890 26112453 14564547 1289647 -18431172 -36751480
44682 -36751480 -30444952 4090739 34657676 31549554 5679356 -11018709 -8947880
44675 -8947880 -3058141 -2734046 -3503910 -4333447 -10856908 -20577414 -22635363 -14648433 -5738324
44666 -5738324 -1146990 3321472 9651314 12673150 10319781 8782415 12879558 18272479
44658 18272479 17462135 9413661 384927 -3165719 -1851979 -3137430 -11123964 -18018691
44650 -18018691 -13171076 -635328 3848260 -2905301 -4344844 10148562 26664895 27498375
44642 27498375 18239250 16326513 21122704 16296905 -710765 -12179901 -5867700 9082409
44634I082409P412978n338549j2042574q825398K342656J1822558Q402256l807325
44626I049011p043129K673261O553237n945822j6340522o030980J1862744J3648879
44618H426679L883235M798466J5572450J2930616q580816k6056104k3126969j0627231
44610b2779674m149444j865852M622419J3354460J6917670J3424169M899549n819180
44602A8604117j1626132n243811Q183557J3322798M790044n594107p307693n513121
44594I615652q986776j3967162j0849880n82697O706296O889919O081097R388793
44586D295242J2838303R267851j662969j2594333j6432077j2364941l663684O607686
44578a3708922J4266748J2467749o54090j4057649j3793893k592831K417119m022296
$$ plain form
44634 9082409 16495387 11156838 -885736 -9711134 -7368478 4454080 12856336 9049011
44626 9049011 2005882 4679143 11232380 5286558 -11053964 -17084944 -5222200 8426679
44618 8426679 12309914 17108380 32680830 45611446 37030630 10974526 -12152443 -22779674
44610 -22779674 -26929118 -28794970 -24172551 -10818091 6099579 19523748 24423297 18604117
44602 18604117 6977985 1734174 9917731 23240529 28030573 22436466 15128773 9615652
44594 9615652 628876 -13338286 -24188166 -24770863 -18064567 -11174648 -5093551 4295242
44586 4295242 17133545 26401396 24738427 12144094 -4287983 -16652924 -20316608 -13708922
44578 -13708922 557826 13025575 12371485 -1686164 -15480057 -18072888 -15655769 -19678065
44570a9678065n512514R729874K6610321K2946890K201770j1801061q196284J099212
44562A7400143L562112N51491k125885k921556q64399M239832O353384K32377
44554B6427499o049235J08861J3872064J6030824R54452j5052647j8089328j2674753
44546E527737o980942O04630J0268407J2033120J101533j0559675j1017016o000806
44538e023012o485826q658502j649397J1517980J6546013Q684640k552165q472436
44530C907295r533002q574482n567052o75361L851044N882808M497006P95608
44522e416136n81121M015832R028441M296261q253258j3409300m949828L603322
44514a1665787J218198j496413P941926J7189661N752680j7484100k0864030K906019
$$ plain form
44570 -19678065 -25190579 -15460705 11149616 34096506 36298276 24497215 16300931 17400143
44562 17400143 20962255 21513746 19387861 16466305 15601906 19841738 26195122 26427499
44554 26427499 20378264 20487125 34359189 50390013 51344465 36291818 18202490 5527737
44546 5527737 -1453205 -848575 9419832 21452952 22554485 11994810 977794 -5023012
44538 -5023012 -11508838 -20167340 -21816737 -10298757 6247256 14931896 12379731 3907295
44530 3907295 -5625707 -14200189 -19767241 -20442602 -16591558 -10708750 -6211744 -5416136
44522 -5416136 -5997257 -1981425 7047016 11343277 3090019 -10319281 -15269109 -11665787
44514 -11665787 -10447589 -11944002 -4002076 13187585 18940265 1456165 -19407865 -16501846
44506a6501846K2829307J3580194r561984j6559663n677936J056457m638463q264178
44498b3738112k49129Q482217N229787n170067r305860m367600J295852J875094
44490b5947818n18550k318805k663774o55153N233779J2755181J5352666R247892
44482A0485418j313458q610547r607045p140828m507520j980633J478591N576762
44474a5619260Q446533Q316927N954202N461434R897089J4936003J1475281j590408
44466D7277801j2145971r463762l31684n13501j1001994j5130835l134951J2422485
44458G977588J4011671K610916p092752q817524r255195j2565430j3205665o869202
44450c3205593J425824M837235L469649J345255K06173O40058M266449R575072
$$ plain form
44506 -16501846 6327461 19907655 10345671 -6213992 -11891928 -10835471 -15473934 -23738112
44498 -23738112 -23987241 -15505024 -10275237 -15445304 -24751164 -29118764 -27822912 -25947818
44490 -25947818 -26466368 -28785173 -31448947 -32104100 -26870321 -14115140 1237526 10485418
44482 10485418 9171960 561413 -9045632 -16186460 -20693980 -22674613 -21196022 -15619260
44474 -15619260 -7172727 1144200 7098402 12559836 22456925 37392928 48868209 47277801
44466 47277801 35131830 25668068 25336384 24822883 13820889 -1309946 -4444897 7977588
44458 7977588 21989259 24600175 17507423 8689899 -565296 -13130726 -26336391 -33205593
44450 -33205593 -31779769 -26942534 -23472885 -22127630 -21921457 -21281399 -17014950 -7439878
44442g439878R716633P99899j0045386j1970162n247679j121355m927996p707205
44434c7943129n49018R864938J0395896K551765Q85433Q649766J0343553k935380
44426A263824j4812815n987149J3805357J6624029k637462j7694122q981659R293374
44418i126623J1905659k553808j4505202j1646708K99494R739816R651451O6452
44410f169469r298985m206412J5311579K7853812J5999696p246493j4445909k885357
44402A4912462K481517j2420061k9766364k6409084n503741J0735429R763126
44395c6206716j329572q261551k861224J1359209K0545719J2939554m993157j2422205
44387b1229943n1179J6783578J8938901Q114786j98162k17382J560264J982150
$$ plain form
44442 -7439878 2276755 3076654 -6968732 -18938894 -24186573 -25307928 -30235924 -37943129
44434 -37943129 -38492147 -28627209 -18231313 -15679548 -14794115 -6144349 4199204 1263824
44426 1263824 -13548991 -19536140 -5730783 10893246 8255784 -9438338 -18419997 -9126623
44418 -9126623 2779036 225228 -14279974 -25926682 -25627188 -15887372 -6235921 -6169469
44410 -6169469 -15468454 -19674866 -4363287 23490525 39490221 32243728 17797819 14912462
44402 14912462 17393979 4973918 -24792446 -51201530 -56705271 -45969842 -36206716
44395 -36206716 -37536288 -45797839 -48659063 -37299854 -16754135 -3814581 -8807738 -21229943
44387 -21229943 -21281122 -4497544 14441357 22556143 22357981 22140599 23700863 25683013
44379B5683013L762275L849351m858297j7801010j9462224n476350Q370671P142701
44371A210130l164633o063746K100250J0098548R571187M156135O19987l82302
44363A8145556j658407l171603k440860Q09461L412202K524869l17507m11538
44355A6892173L391459M772392k864480j5013797j8232282p286687O050770P825573
44347d464879L73210l153405O57636K443550k033610m408672O92098N084122J230568
44338c579382l436829J062612Q015556K518964j3832640k2711056j4552391N25064
44330d5990102J0503326J5479868J8153669J4944556O037727J568640N983484
44323B6681168P179439m870831j8207056j4632459J057186P135109j917751r131960
$$ plain form
44379 25683013 29445288 33294639 28436342 10635332 -8826892 -14303242 -5932571 1210130
44371 1210130 -1954503 -8018249 -5917999 4180549 13751736 17907871 18527858 18145556
44363 18145556 16487149 13315546 10874686 11684147 15096349 17621218 17303711 16892173
44355 16892173 20283632 25056024 22191544 7177747 -11054535 -18341222 -12290452 -4464879
44347 -4464879 -4091669 -7245074 -6587438 -4143888 -6177498 -10586170 -9894072 -4809950 -3579382
44338 -3579382 -7016211 -5953599 2061957 4580921 -9251719 -31962775 -46515166 -45990102
44330 -45990102 -35486776 -20006908 -1853239 13091317 19129044 20697684 26681168
44323 26681168 33860607 28989776 10782720 -3849739 -2792553 4342556 2424805 -6707155
44315f707155m392497J259418j213379j533471R597098J8884054Q681964j2156267
44307A2419765j6820139J840751K1544082K1581905O779790o287549j2214751
44300B8843854j4628871j1875157n6393J3182882J2863770k422934j5136263j0367659
44292D03229N114138J3043992P495984r09586k609830m93115j438133n494869
44284A5111810q672599r734328p942260K15409J3952708K1841389J2477968q981986
44276B8268111k4064444k2124771j0149724M42252P603193J4026262J6378868
44269A0379747Q005407r383218k3386090k1937054n049098J4208060K0565832
44262f596414J0777975k835179n927682J553262P343314M368340j357152k246940
$$ plain form
44315 -6707155 -11099652 -9840234 -11053613 -12587084 -2989986 15894068 24576032 12419765
44307 12419765 -4400374 -2559623 18984459 40566364 47346154 41058605 28843854
44300 28843854 14214983 2339826 2283433 15466315 28330085 25907151 10770888 403229
44292 403229 5517367 18561359 26057343 25147757 22537927 22044812 20606679 15111810
44284 15111810 6439211 -3295117 -11237377 -11021968 2930740 24772129 37250097 28268111
44276 28268111 4203667 -17921104 -28070828 -27628576 -20025383 -5999121 10379747
44269 10379747 18385154 9001936 -14384154 -36321208 -41370306 -27162246 -6596414
44262 -6596414 4181561 1346382 -4581300 -3028038 4315276 8683616 7326464 5079524
44254E079524j50222o95574l284561l247844L90748N027208Q518365Q255803J021987
44245B0915434j0508178j6138991r999904K01925L132684r00606k696905J328203
44237a4666338O434621R053437R703448P710857K100339l030456k829506k46757
44229A4229645r17403j431314N233525J3179702P626580j0731460k0773653q906825
44221b491203J0882862J6400380O770695j162883L0058J94545r308009k1242852
44213G3593k2130487r001828Q333710J8149863J6123047N553054p477333j6877444
44205g253825j6794344n370200Q980363J1954283J230838o297692L657503J9122261
44197I229187J6530805k837992j2579014j943044P074034l722961j8052536j1972091
$$ plain form
44254 5079524 4929302 4233728 949167 -2298677 -1907929 3119279 11637644 19893447 20915434
44245 20915434 10407256 -5731735 -15731639 -15529714 -12397030 -13297636 -15994541 -14666338
44237 -14666338 -8231717 821720 10525168 18236025 20336364 17305908 14476402 14229645
44229 14229645 13312242 11880928 17114453 30294155 37920735 27189275 6415622 -2491203
44221 -2491203 8391659 24792039 31562734 30399851 30429909 30624454 21316445 73593
44213 73593 -22056894 -31058722 -22725012 -4575149 11547898 17100952 9623619 -7253825
44205 -7253825 -24048169 -29418369 -20438006 -8483723 -7252885 -13550577 -9893074 9229187
44197 9229187 25759992 22922000 10342986 8399942 15473976 11751015 -6301521 -18273612
44189a8273612O959450J3802886P004380N144741R525408K557979j5577003k1130968
44181i986739n769128Q110931L701640n397405l132287R90267o662713j4834113
44173c2979547n429474J3318224J8336312Q314347K975594R046109J1614600J344237
44165B6540402j0969495j2704987o369775j964494l291823o403150m786027M264037
44157a5685312J3091122Q885725o669812j2842139J515465J6187056P161569j3426820
44149a783146j2771783J0506917K2082469M901679j6389417j7180521q259005
44142a8892807r100319j2620001l317159R499136O624479n854446o371053M973185
44134c5058985Q978515L408488O041222J9815185K4391054J0149630n592284p653961
$$ plain form
44189 -18273612 -11314162 2488724 9493104 14637845 24163253 26721232 11144229 -9986739
44181 -9986739 -15755867 -7644936 -3943296 -9340701 -12472988 -11482721 -18145434 -32979547
44173 -32979547 -38409021 -25090797 -6754485 1559862 4535456 13581565 25196165 26540402
44165 26540402 15570907 2865920 -3503855 -5468349 -8760172 -15163322 -19949349 -15685312
44157 -15685312 -2594190 6291535 -378277 -13220416 -11704951 4482105 11643674 -1783146
44149 -1783146 -14554929 -4048012 18034457 22936136 6546719 -10633802 -18892807
44142 -18892807 -27993126 -40613127 -43930286 -34431150 -27806671 -33661117 -40032170 -35058985
44134 -35058985 -26080470 -22671982 -16630760 3184425 27575479 37725109 32132825 24478864
44126B4478864n062477r552611j2453522j870297J2159048J0999956k517201q126034
44118H055726P03003Q631297L467477o716850p721521O52932O838194M286556
44110A8196814j476051j636509M692552R608270N897290m030355j0517825q172775
44102A2561411k101160n23945l735459m315930K013980R405677P776605n058051
44094A6023128j8782948j9809898n876445J0456106J5387118R260329L897623
44087A0555013N273620O012121j478513j1268657j1118341m39132Q145579O200722
44079A1882412l49930k759062l098401p839355j2953667p659197O685598J4530723
44071a560879Q539704J712576O636887J3523078N473258j0874331j1761718N526863
$$ plain form
44126 24478864 19416387 9863776 -2589746 -4460043 7699005 18698961 16181760 8055726
44118 8055726 8758729 17390026 20857503 14140653 6419132 7072064 13910258 18196814
44110 18196814 16720763 15084254 19776806 29385076 35282366 31252011 20734186 12561411
44102 12561411 10460251 9936306 6200847 1884917 3898897 13304574 21081179 16023128
44094 16023128 -2759820 -22569718 -28446163 -17990057 -2602939 6657390 10555013
44087 10555013 15828633 21840754 20362241 9093584 -2024757 -2463889 5681690 11882412
44079 11882412 11532482 8773420 5675019 -2164336 -15118003 -22777200 -16091602 -1560879
44071 -1560879 6978825 8691401 15328288 28851366 34324624 23450293 11688575 17215438
44063A7215438J4559444l33303j7622953r668754J5856504K7846723J5527510
44056F3380609l181902j2596267j4357748j1245227j80784J2668205J1630862
44049D6117748m114307j4576007p864795K609089J991492k793045M00161N499829
44041B7270165J473522m014105K287774J1273662L124488j6212438j8271335M197090
44033A1128823K3635383J8194136J657098l104137P5677o446711j9339781j8635671
44025G164817k475947P596561n12409j2338623j0605754N43391N614564k99740
44017e313140j0623428j8543812j8322168m734039J6125548K3901873P451914
44010a0057252j4628512j4853085M895317J6612009Q612665R69316J0049174K0846354
$$ plain form
44063 17215438 31774882 31441579 13818626 4149872 20006376 47853099 63380609
44056 63380609 60198707 47602440 33244692 21999465 21818681 34486886 46117748
44049 46117748 42003441 27427434 19562639 22171728 24163220 21370175 21770336 27270165
44041 27270165 28743687 24729582 27017356 38291018 41415506 25203068 6931733 11128823
44033 11128823 34764206 52958342 54615440 51511303 51586980 45140269 25800488 7164817
44025 7164817 4688870 12285431 11773022 -565601 -11171355 -10627964 -5013400 -5313140
44017 -5313140 -15936568 -34480380 -52802548 -57536587 -41411039 -17509166 -10057252
44010 -10057252 -24685764 -39538849 -34643532 -18031523 -9418858 -8449542 1599632 22445986
44002B2445986J1564129j1522835k4282684j8510639n143337P725515J8648791
43995I24926K0594898P884953o650743m071093J0770221J4488606K334182m842799
43987D1433151K990695P838936m359169j8292107j4131374O06277M811791l478314
43979A7419886q654954l423885N514092J1881076J3853474Q959468o46231l591503
43971D1311423O110569J6282274J2630046N63168m460321j363552q86756m287495
43963F5899356l374697J279687L46691p405077j4210836j6590544j4265178j870439
43955I808963J9382554K8861906R633944j9877241k5139928n374025O810862j557665
43947B2549370o418289P035346J7178993N703506p825683O74637J7397383J3943100
$$ plain form
44002 22445986 34010115 22487280 -1795404 -20306043 -25449380 -17723865 924926
43995 924926 21519824 29404777 22754034 18682941 29453162 43941768 46275950 41433151
43987 41433151 44423846 52262782 47903613 29611506 15480132 16086409 20898200 17419886
43979 17419886 8764932 5341047 10855139 22736215 36589689 45549157 44902926 41311423
43971 41311423 47421992 63704266 76334312 76897480 72437159 71073607 70186851 65899356
43963 65899356 62524659 63804346 64151037 56745960 42535124 25944580 11679402 9808963
43955 9808963 29191517 58053423 67687367 47810126 22670198 17296173 24107035 22549370
43947 22549370 16131081 23166427 40345420 46048926 38223243 38897880 56295263 70238363
43939G0238363n276487j2980257m774364r46176q119542j1761387o313588k494259
43931A7572303j973031O625129K1002695K1840687N109429p236407m97595J1303176
43923G3746386J0858734L906528L602670O194357J496188n653875m710192j022160
43915H8418636p528394j9834366j9752945l410691J1863997J1607402Q94459p126867
43907E5131231p687794m392643j531577j241836k709459j934322K751234N584854
43899D3969688Q99987n728354l802024M934368P744096J057106m390005k835739
43891D1849123k323330o075764k054547J4500378K3961849R138155j1988754p235712
43883E9771398K0293274L3698008J6874536l703311m194794K44834j2830740l0307267
$$ plain form
43939 70238363 64961876 51981619 47207255 46261079 38141537 26380150 20066562 17572303
43931 17572303 15599272 22224401 43227096 65067783 70177212 62940805 62443210 73746386
43923 73746386 84605120 88511648 92114318 98308675 99804863 94150988 89440796 88418636
43915 88418636 80890242 61055876 41302931 37892240 49756237 61363639 62258098 55131231
43907 55131231 47443437 43050794 41519217 40277381 37567922 35633600 38384834 43969688
43899 43969688 44869675 39141321 35339297 40273665 48017761 49074867 44684862 41849123
43891 41849123 39525793 33450029 31395482 45895860 69857709 78995864 67007110 59771398
43883 59771398 80064672 113762680 130637216 126933905 122739111 122983945 110153205 79845938
43875G9845938k4307929q86751P545906o210244j5126565m093205P913191L075600
43867D7755941o560079k793518Q725386J1718298N693523j58448n732576j3320708
43859D5327819j3994438j090077J2063650Q948515k886769l219451P595311J0293739
43851F3038299o00859j0258013j1118644j2253399j6077371j0401946O694353
43844I022420J6955205R841952l19516j3966Q42355r199855j7469772p795638
43836A863185P654738N652787p601223m589687J6602240K6053694R206504j0527909
43828D4314329j0221063j238496m269275j2669357o939802Q361983J1077382p02970
43820B7712731n397417N505000J3147451K075589j5169776j6955564k132385J2451551
$$ plain form
43875 79845938 55538009 54651258 62197164 55986920 40860355 36767150 44680341 47755941
43867 47755941 41195862 38402344 47127730 58846028 64539551 64381103 58648527 45327819
43859 45327819 31333381 30243304 42306954 51255469 48368700 45149249 52744560 63038299
43851 63038299 62437440 52179427 41060783 28807384 12730013 2328067 9022420
43844 9022420 25977625 35819577 35500061 35486095 36328450 27128595 9658823 1863185
43836 1863185 9517923 15170710 7569487 2979800 19582040 45635734 54842238 44314329
43828 44314329 34093266 32854770 28585495 15916138 8976336 17338319 28415701 27712731
43820 27712731 22315314 27820314 40967765 43043354 27873578 10918014 8785629 21237180
43812B1237180J5156700Q455115J31122m468282m354546l762798q099974j5097078
43804I197439j5490493o507633K826249N259241N480043R056271J0248032J745532
43796B1814681j0369146j3694052o951519J481643Q118341J4540596J6715625
43789C1656169Q798698l756492r523121q989010j1591814j4838475n107131J6316462
43781B965286K7347850J4801173o522099j6049728j3846491j1068000p757528
43774a0129537K208511J3404089J4945044R299930P380405Q150949J335468j0386523
43766C6208336j1226148J881854J1202271L826283r566329j2106910m984491j212765
43758A4022101k967727j94987R856281J5740871Q722440l126939n232291L557960
$$ plain form
43812 21237180 36393880 44848995 44980117 40511835 36157289 32394491 24294517 9197439
43804 9197439 -6293054 -12800687 -9974438 -4715197 764846 9821117 20069149 21814681
43796 21814681 11445535 -2248517 -9200036 -7718393 399948 14940544 31656169
43789 31656169 40454867 36698375 27175254 18186244 6594430 -8244045 -13351176 2965286
43781 2965286 30313136 45114309 38592210 22542482 8695991 -2372009 -10129537
43774 -10129537 -7921026 5483063 20428107 29728037 37108442 45259391 46594859 36208336
43766 36208336 24982188 26864042 38066313 41892596 32326267 20219357 15234866 14022101
43758 14022101 11054374 10859387 20715668 36456539 45178979 42052040 36819749 40377709
43750D0377709R558301L151551p902175q526508M290565J8629243K3295807J9346737
43742A02221230J4119315J0677463Q070156P114272R467182J3102886J4265282
43735A79037786J2944582J2231605J3666125J7018156K2256575K7000530K4868999
43728C09024358J3105048M22314p61398Q828599J3761525K889195j5844966k5018196
43720C06406479j9117568j0213912j1881181k2588516k8904436k3134625j2162050
43713A78404191o904230q570838j1209256j3937337k0896714k8616495k4598005
43706F3671316m705648J6032334J8706698K781483j4477146j8418832r994300
43699E3595905R2395L379627o55467o108666o743743k396137J513159J402359
$$ plain form
43750 40377709 49936010 53087561 45185386 36658878 40949443 59578686 82874493 102221230
43742 102221230 116340545 127018008 135088164 142202436 151669618 164772504 179037786
43735 179037786 191982368 204213973 217880098 234898254 257154829 284155359 309024358
43728 309024358 322129406 322551720 321790322 330618921 344380446 347269641 331424675 306406479
43720 306406479 287288911 277074999 265193818 242605302 213700866 190566241 178404191
43713 178404191 171499961 162929123 151719867 137782530 116885816 88269321 63671316
43706 63671316 58965668 74998002 93704700 96486183 82009037 63590205 53595905
43699 53595905 53688300 57067927 56412460 50303794 43560051 41163914 42677073 44079432
43691D4079432q64504k715858m013769l590383P09279N347565K210492q732527
43683C2429727j6154095j3164652p526606p601006p337840K746019J6725384J9561611
43675A9678542Q858096k787599n540425r47784N377631Q618775M334122n890473
43667C1700885j0983353l844846N407760K604744q014761r984893o48497O367870
43659A2604909M272654M46231r27898m726922r569039n576574O309430J0867416
43651A3700207K338358n470343j731601N310464M833275P3815k503270n208243
43643A1342662q596637m572848O947390J0428208j049984r830988m3985J5115950
43635A9739768J4096903K169850O29703R564710R418768l155984r451417j912118
$$ plain form
43691 44079432 43214928 40499070 36485301 32894918 33604197 38951762 41162254 32429727
43683 32429727 16275632 3110980 -4415626 -12016632 -19354472 -16608453 116931 19678542
43675 19678542 28536638 25749039 20208614 19260830 24638461 33257236 37591358 31700885
43667 31700885 20717532 16872686 22280446 24885190 16870429 6885536 6237039 12604909
43659 12604909 16877563 17323794 16395896 11668974 2099935 -3476639 2832791 13700207
43651 13700207 16038565 10568222 8836621 14147085 18980360 19054175 16550905 11342662
43643 11342662 2746025 -1826823 5120567 15548775 14498791 4667803 4623818 19739768
43635 19739768 33836671 36006521 36636224 46200934 55619702 52463718 43012301 41100183
43627D1100183L260418n096790j4844248j2857364o242922o786043r347498k160380
43619a2974644J1295176J6884895J0851069K092978l371679p019930q137400k745830
43611F874635N565685N607228n108319j3504242q300981K897344M353294m108041
43603e723397p303365J013381Q741864O273721K223795O442787R760703j459226
43595A9970263j8055669j6862219M428456K2702778K2604247J3033125M981939
43588E2802920m377652j5192456j5204499k095120M789538o035432j5745214n021152
43580f079067J0918201N489741j3730962j5940731J806818J0060307l145145j2584305
43572b3205143J720088K2247505K3120590R019511K795798Q774201J0934452J025093
$$ plain form
43627 41100183 44360601 39263811 24419563 11562199 5319277 -1466766 -10814264 -12974644
43619 -12974644 -1679468 15205427 26056496 28149474 24777795 17757865 9620465 6874635
43611 6874635 12440320 18047548 12939229 -565013 -8865994 -5968650 -1615356 -5723397
43603 -5723397 -13026762 -12013381 -3271517 3002204 5225999 11668786 21429489 19970263
43595 19970263 1914594 -14947625 -10519169 12183609 34787856 47820981 52802920
43588 52802920 48425268 33232812 18028313 15933193 20722731 14687299 -1057915 -6079067
43580 -6079067 4839134 10328875 -3402087 -19342818 -17536000 -7475693 -10620838 -23205143
43572 -23205143 -21485055 762450 23883040 32902551 35698349 44472550 55407002 56432095
43564E6432095j0856262j2875860n130526M075603P157484K547040l675309l260097
43556C4414168L712887Q063892M699363L09472K458879P256565N678645j650625
43548F4943246m403697K939450J2555847J1271878m565306k2982684k6451140
43541C3307594j0310734J0337922J6153463M737641q749293j0802787k558244
43534C2115562O285057Q687665L571593n104178r802602n419731M041125R438203
43526D3812694P610569L070135q47728n015783q283476o655342q19144K930936
43518C5802861J407090k534813o568668j0549547j1123195m387584M378375M405477
43510A0829996l743186o164193M072290J5173784J2926692K15677q575657o753128
$$ plain form
43564 56432095 45575833 32699973 27569447 31645050 38802534 41349574 37674265 34414168
43556 34414168 38127055 46190947 50890310 51199782 53658661 60915226 66593871 64943246
43548 64943246 60539549 63478999 76034846 87306724 82741418 59758734 33307594
43541 33307594 22996860 33334782 49488245 54225886 45476593 34673806 32115562
43534 32115562 38400619 47088284 50659877 45555699 35753097 30333366 34374491 43812694
43526 43812694 51423263 54493398 53645670 48629887 40346411 33691069 32871925 35802861
43518 35802861 37209951 34675138 28106470 17556923 6433728 2046144 6424519 10829996
43510 10829996 7086810 922617 4994907 20168691 33095383 33311060 24735403 17982275
43502A7982275l01289K887880J466966n81545P56505N092890P755887O039569
43494D1099138L150058J421655m307607j7637631k8170606k0984617J005769J7449298
43486f974543J6246955O413956J757605M380920R098202J2062952R992411K377804
43478E5356262k018517N732051J6368455J0445488j0428668k0981244j0040767
43471D4433060J504049m850367j5147212q412905O874456P950615m066428r624950
43463A8660318o254069r127383j8525442j5917029L342150J8844838J4943077
43456E966460J513282m343187j123038J954674J28532m970615r427762p835173
43448a8136827J532653R705811N100651r025049j5892474o992090P718624J4505677
$$ plain form
43502 17982275 17680986 20568866 22035832 21454287 22210792 27303682 35059569 41099138
43494 41099138 44249196 45670851 41363244 23725613 -4444993 -25429610 -24423841 -6974543
43486 -6974543 9272412 15686368 17443973 21824893 30923095 42986047 52978458 55356262
43478 55356262 53337745 59069796 75438251 85883739 75455071 54473827 44433060
43471 44433060 45937109 41086742 25939530 17526625 24401081 32351696 28285268 18660318
43463 18660318 12406249 3278866 -15246576 -31163605 -27821455 -8976617 5966460
43456 5966460 7479742 3136555 2013517 3968191 4096723 -873892 -10301654 -18136827
43448 -18136827 -16604174 -6898363 -1797712 -10822761 -26715235 -33707325 -25988701 -11483024
43440a1483024J0949773L342495j793838q25390M316281N626843p42293n531193
43432C859654J489464J3016572J2594408Q41512m294191L466309Q130047k433999
43424C6669776j6572854j6381641k397354J0948418J4868301J0548314K180143
43417C9863103m435705l317458L141308M004220m339520j0390858m096553P309859
43409B7738396J0165310L778410k145725l798772n251460p474547o544136j887643
43401A4579833K491443M453554M470586J535544m749733r499687o927138J155434
43393G509836P084672P006415L514944n91836n517438j0568191j1438994m024902
43385g025494R510237J9576116J6571242K035638j0140820q762615M45702K822321
$$ plain form
43440 -11483024 -533251 2809244 1015406 190016 4506297 10133140 9390847 3859654
43432 3859654 5349118 18365690 30960098 31801610 27507419 30973728 39103775 36669776
43424 36669776 20096922 3715281 1317927 12266345 27134646 37682960 39863103
43417 39863103 35427398 32109940 35251248 39255468 34915948 24525090 20428537 27738396
43409 27738396 37903706 41682116 39536391 35737619 30486159 23011612 16467476 14579833
43401 14579833 17071276 21524830 25995416 27530960 22781227 13281540 6354402 7509836
43393 7509836 14594508 21600923 25115867 24524031 19006593 8438402 -3000592 -7025494
43385 -7025494 2484743 22060859 38632101 40667739 30526919 21764304 22210006 25032327
43377B5032327m495913r724248n169497K596679N245699M296111M014615K702487
43369B4498260j385948m045493k727762k051027m279530l268866L593312P141369
43361A7474315P73773o383327l476462L433650J890651m572850k105995Q883492
43353A5917247J3331049O067410q09891J669061P474537Q899096P136582L550293
43345F3235384n677491j8233341k1601560j0224054L352190M986475j660957l321311
43337A0855335J999159M740190P95814l567796l496585j424807P57256O230507
43329A6889073J5735177K1897512J6692637K441111q724136o921224N098520J4367178
43321G7475848J1147615o73351q845597p824152l672135k378604m49312O525274
$$ plain form
43377 25032327 20536414 10812166 5642669 8239348 13485047 17781158 21795773 24498260
43369 24498260 23112312 19066819 16339057 14288030 10008500 6739634 10332946 17474315
43361 17474315 18248088 11864761 8388299 11821949 13712600 9139750 7033755 15917247
43353 15917247 29248296 35315706 34505815 36174876 43649413 52548509 59685091 63235384
43345 63235384 57557893 39324552 17722992 7498938 10851128 15837603 14176646 10855335
43337 10855335 12854494 17594684 18390498 14822702 11326117 9901310 10658566 16889073
43329 16889073 32624250 54521762 71214399 73655510 64931374 58010150 63108670 77475848
43321 77475848 88623463 87950112 79104515 71280363 67608228 65229624 64780312 71305586
43313G1305586J2035652O387205n616326p925502K610937Q853347j194526j3597343
43305G2859030p893919J0057840J3963543m017331k0408110j4243022L900875
43298E4218906J0437669K653957m377832o326103j2798145k2590542j8292765
43291B925145O001972K8643715K5118747p13886k2144537k1292704n345021O265685
43283A9459116L066642p834949j0875113p82647R037204L410081j0773547j0654137
43275e947350Q907499K3633170J3026032q648870j1893987O144641J9709014J2140802
43267E7070951m733824j2645142j0442946p146256m876749j01347N299979M694480
43259B7119146l403573j2090216j2394885j450797J3403696J9445293J2267881
$$ plain form
43313 71305586 83341238 89728443 84112117 76186615 78797552 87650899 86456373 72859030
43305 72859030 64965111 75022951 88986494 84969163 64561053 50318031 54218906
43298 54218906 64656575 67310532 62932700 56606597 43808452 21217910 2925145
43291 2925145 8927117 37570832 62689579 61975693 39831156 18538452 13193431 19459116
43283 19459116 22525758 14690809 3815696 3033049 12070253 15480334 4706787 -5947350
43275 -5947350 2960149 26593319 39619351 30970481 19076494 25221135 44930149 57070951
43267 57070951 52337127 39691985 29249039 22102783 17226034 17124687 22424666 27119146
43259 27119146 23715573 11625357 -769528 -2220325 11183371 30628664 42896545
43252D2896545L279711N958085J5448939J2999967o366658k3137369j8573753
43245C2505467p04284P013104k505928j3059991r728524K251685P794128K235571
43237B5801228n916829q117494m294004J106793N339669P410199O072010J700406
43229B9101978j456136J018406P472517J0992051P441229m4875n577656o630675
43221D2316839m466192j582435l82496j724644l799039n148999p772124j1790330
43213E650580r015305P473569K6140895K4203041m11944j9604328j1471690P454665
43205C0419483O394321j2857930j9217492p26552J8116805J4635323j392079q802348
43197B6569531o299326n193103o010392j659079N404233P226646N724599Q070098
$$ plain form
43252 42896545 46176256 52134341 67583280 80583247 74216589 51079220 32505467
43245 32505467 31801183 38814287 36308359 23248368 13519844 15771529 23565657 25801228
43237 25801228 19884399 11766905 7472901 8579694 13919363 21329562 27401572 29101978
43229 29101978 27645842 28664248 36136765 47128816 54570045 54525170 48947514 42316839
43221 42316839 37850647 36268212 35885716 34161072 30362033 25213034 17440910 5650580
43213 5650580 -3364725 4108844 30249739 54452780 54040836 34436508 22964818 30419483
43205 30419483 36813804 23955874 4738382 4011830 22128635 36763958 35371879 26569531
43197 26569531 20270205 15077102 9066710 7407631 12811864 20038510 25763109 33833207
43189C3833207J1430355P465913j576107n826401l855650j503666K270255J2497230
43181E4735136K2387812J7457006k097131j8363446j9105528j0901113n030283
43174C9082453l505414m057287o130093n893931K566059J4695621J6454553N252670
43166E8464631k941644L043349J1822350P541620n296991j0197335l942183K408829
43158F0902626K515787j078649p839900j7543805j9980662m871510J6795176K0428661
43150D9327724J936703j4084853q804324N392784O560456m291090r075280j629117
43142B5333003P258957R873688R808341J0185256Q032206K785771r71750j777023
43134G0528449k663766k688894K812707J1265778J2745675M858708k135444m04910
$$ plain form
43189 33833207 45263562 52729475 51153368 45326967 41471317 39967651 42237906 54735136
43181 54735136 77122948 94579954 92482823 74119377 55013849 44112736 39082453
43174 39082453 35577039 31519752 25389659 19495728 22061787 36757408 53211961 58464631
43166 58464631 55522987 58566336 70388686 77930306 72633315 62435980 58493797 60902626
43158 60902626 63418413 62339764 54499864 36956059 16975397 12103887 28899063 49327724
43150 49327724 51264427 37179574 28375250 33768034 40328490 36037400 26962120 25333003
43142 25333003 32591960 42465648 52273989 62459245 70491451 73277222 72305472 70528449
43134 70528449 67864683 65175789 67988496 79254274 91999949 96858657 94723213 94318303
43126I4318303M245854K809257l115480n732048l392773n31011O33100P13862
43118H9949064j621527p741924j3696258j3035769n062488L693872O067737N19779
43110E9072486p266140q044228J869673J3967451J5507570N644975l660437n066147
43102G2025203m198453n875992m246386L881025P641267k149679j5157605j5719247
43094C6200133p657702o129618r660347k593234J4792932K2638567J3482128M546638
43086F5619497P636356Q871449n481153k1653661j7964387N84051R917696K708821
43078E0238669n399643l619998P79332R856j476788J782899N750863M782826M27475
43069E3275491l368578n709415n066605J301781R472430R047447k552005j3506743
$$ plain form
43126 94318303 98564157 101373414 98257934 92525886 89133113 88602102 89235202 89949064
43118 89949064 88327537 80585613 66889355 53853586 48791098 52484970 58552707 59072486
43110 59072486 51806346 43762118 45631791 59599242 75106812 80751787 77091350 72025203
43102 72025203 67826750 61950758 57704372 61585397 69226664 67076985 51919380 36200133
43094 36200133 28542431 22412813 12752466 10159232 24952164 47590731 61072859 65619497
43086 65619497 73255853 82127302 76646149 54992488 37028101 37612152 47529848 50238669
43078 50238669 44839026 41219028 41998360 42008216 40531428 42314327 48065190 52848016 53275491
43069 53275491 49906913 44197498 39130893 40432674 49905104 58952551 56400546 42893803
43061D2893803j2365026k913542L539731M916479P366021J0744386O961297n228616
43053E5914533j3828320p872264P712896J7853270J4797218L848101o188651j0864175
43045F1372608q092939L061446J6708804J9839421N840581j4315923k2438735
43038F1975263j4125541j736280L740413M487383O349956O865126K88772j0736848
43030E7108244j6658952j2772711m034417J294120m24281n368519n539540K621858
43022A6225802J2202347J3329917P599412O890656J4269036J6207823K124880
43015H8849873j7039069k1525347q814565N297865Q632594L180516m729751j1552577
43007D2299539j2629471l788131R454443J4582149Q091332J99453J04969M938715
$$ plain form
43061 42893803 30528777 27615235 31154966 36071445 43437466 54181852 61143149 55914533
43053 55914533 42086213 34213949 41926845 59780115 74577333 78425434 72236783 61372608
43045 61372608 53279669 56341115 73049919 92889340 98729921 84413998 61975263
43038 61975263 47849722 46113442 49853855 54341238 60691194 67556320 67845092 57108244
43030 57108244 40449292 27676581 23642164 24936284 24512003 19143484 13603944 16225802
43022 16225802 28428149 41758066 49357478 56248134 70517170 86724993 88849873
43015 88849873 71810804 50285457 41470892 46768757 55401351 58581867 53852116 42299539
43007 42299539 29670068 25881937 35336380 49918529 58009861 58209314 58314283 63252998
42999F3252998O894135L175086m780307j4022750j8441566j2427035k0919P315583
42991C0945225N388165J403692O53622m26577l425000j923929O404574J2559412
42983E1579184R871193M867346M956666N538423P16546l329813M05261M196835
42975G8801641k225097j0921279o090727Q584331J3380916L557017l736538K017741
42967H3368005Q774998K907439j0344715j7763609j6359145j0604566l193782
42960C6784625J719288k159503j0396227o971480J1152478K2070243Q659746j1675300
42952D9183870r552524J1339511J8731294J759891j2208278r96944J7721977J4435431
42944I0414228p364524j8488508p728498O527162Q256713M469075O374774Q361831
$$ plain form
42999 63252998 70147133 73322219 68541912 54519162 36077596 23650561 23629642 30945225
42991 30945225 36333390 37737082 38390704 37964127 34539127 32615198 39019772 51579184
42983 51579184 61450377 66317723 71274389 76812812 77529358 74199545 74604806 78801641
42975 78801641 76576544 65655265 59564538 68148869 81529785 85086802 81350264 83368005
42967 83368005 92143003 95050442 84705727 66942118 50582973 39978407 36784625
42960 36784625 38503913 36344410 25948183 18976703 30129181 52199424 60859170 49183870
42952 49183870 39631346 50970857 69702151 71462042 59253764 58256820 75978797 90414228
42944 90414228 83049704 64561196 56832698 63359860 71616573 76085648 82460422 90822253
42936I0822253m64434j4655178j8039219p409562L478105M662447K377150N473630
42928F6245192R421249L558575j0299865j7530205j0081963K672276O730514Q38217
42920E1553990m771265l112549K819337O788153O397930K550278l062443p682930
42912E1480501p867163k534837N213848R866292P116116j934828q789318m088822
42904D8461789R790973J7602902R608424l749193n763565K062339M251344j017958
42896H1247055J692363J4990555J6641456o762798l2107584k8635054l250454
42889D3815539R855461N39040n797262P592207K2069987J5088658m681016j3286395
42881G5196219o992880r37505j899982l018616j080413l07761j78822M260408
$$ plain form
42936 90822253 90357819 75702641 57663422 50253860 53731965 58394412 60771562 66245192
42928 66245192 75666441 79225016 68925151 51394946 41312983 43985259 50715773 51553990
42920 51553990 46782725 43670176 46489513 53277666 59675596 62225874 59163431 51480501
42912 51480501 43613338 41078501 46292349 56158641 63274757 61339929 52550611 48461789
42904 48461789 58252762 75855664 85464088 81714895 75951330 78013669 82265013 81247055
42896 81247055 82939418 97929973 114571429 107808631 75701047 47065993 43815539
42889 43815539 53671000 54210040 48412778 56004985 78074972 93163630 88482614 75196219
42881 75196219 68203339 67265834 65365852 62347236 61266823 60959062 60780240 65040648
42873F5040648J0112190R645235N660541Q220973J4452966Q604323j2165893k8256964
42865H1314019k3651982q248331j677857m774074k334207J0516966K0611240J6646833
42857H8402607L888289n874488r495257j0548793q572286M12160J3467597J9274279
42849I0954108J1125741l038875q837466k192863P268411R565314N238324N83951
42841A10666645j951619l202908j370363N694479J3376168J3170509M252818m268346
42833A36367383n469088l229175m423189p381416m957586K549182N269867k581181
42825A16144797j2548083j1519388L75244Q652930L158208r116289j5044266j2830478
42817F7272675r589812o102190K951610J3847486J4293674M088293n4590R954421
$$ plain form
42873 65040648 75152838 84798073 90458614 98679587 113132553 121736876 109570983 81314019
42865 81314019 57662037 49413706 47735849 42961775 40627568 51144534 71755774 88402607
42857 88402607 92290896 86416408 76921151 66372358 57800072 58212232 71679829 90954108
42849 90954108 102079849 99040974 90203508 88010645 95279056 104844370 110082694 110666645
42841 110666645 108715026 105512118 104141755 109836234 123212402 136382911 140635729 136367383
42833 136367383 130898295 127669120 123245931 115864515 110906929 113456111 118725978 116144797
42825 116144797 103596714 92077326 92452570 101105500 104263708 95147419 80103153 67272675
42817 67272675 57682863 51580673 54532283 68379769 82673443 86761736 86707146 96661567
42809I6661567J7889892P845483q081174p074196P264204R479682o870890j8569965
42801I8544603r870397L254012k52994j4038283j6500198l769446Q291911R578930
42793G5238138O206588O372161R346182J0256121O584684j354567r889624j2356147
42785I0403536n941986K889032N160362j20433o908600j0434024r209232k622206
42777F3216449O761886J1699504Q046846J414358l36836K140846L235275K450667
42769I8628995K550269J645207k929503n978304j033827O112504L094579r058344
42761I3031576j4477849m532614J0242597J5744340J1852868P502654O161245
42754A25524817M270063m21963n799259q445885n978970R34446O788018N736089
$$ plain form
42809 96661567 114551459 122396942 114315768 107241572 114505776 123985458 117114568 98544603
42801 98544603 88674206 91928218 91675224 77636941 61136743 57367297 65659208 75238138
42793 75238138 81444726 87816887 97163069 107419190 114003874 112649307 102759683 90403536
42785 90403536 84461550 87350582 92510944 92390511 85481911 75047887 65838655 63216449
42777 63216449 69978335 81677839 89724685 91139043 90802207 92943053 96178328 98628995
42769 98628995 101179264 102824471 99894968 93916664 92882837 98995341 102089920 93031576
42761 93031576 78553727 74021113 84263710 100008050 111860918 119363572 125524817
42754 125524817 129794880 129372917 123573658 115127773 109148803 110083249 116871267 122607356
42746A22607356o6057j832740L853010J0557039J2504755J2421977J4067192J3998171
42738A88110703P668287j784148q486161j3246087j9751150k4574669k0398838
42731A07537937q478298J168779L279771K943234N087284O058378P80887p095373
42723A11282599q773460j987328O579369J0262599Q848415N008979r40045r243256
42715A21037872j6349677j6974520j0450835j329953O678718J3090956J5828828
42708A11531389J0035703l422663j2998930p907567O727418J4347356P852724
42701A26165430j832851j607318O472510R720151K131600r622042j5553465j1845758
42693A04028257j875547P044997Q272078J970783l416579o52839N427065K833362
$$ plain form
42746 122607356 122541299 120708559 124561569 135118608 147623363 160045340 174112532 188110703
42738 188110703 195778990 193994842 185508681 172262594 152511444 127936775 107537937
42731 107537937 99059639 100228418 103508189 106451423 111538707 117597085 118377972 111282599
42723 111282599 102509139 100521811 107101180 117363779 126212194 131221173 130281128 121037872
42715 121037872 104688195 87713675 77262840 75932887 82611605 95702561 111531389
42708 111531389 121567092 118144429 105145499 97237932 103965350 118312706 126165430
42701 126165430 124332579 122725261 129197771 138917922 141049522 131427480 115874015 104028257
42693 104028257 102152710 109197707 117469785 119440568 116023989 115371150 120798215 123631577
42685A23631577r885717j8031034q742388J0209091J8215755P645552p135476
42678A15907360r592753j664471K464342k203452o364288k276090N104578O676695
42670A08051921J957401j982949l33632N020095P954905K481249j0927374k1013948
42662I1207668j4773860M196114J4491385K906222j5352456j5007234M705635
42655G2373474J8991949J1799665m402130r076468o93195O456413L944708l064024
42647I6330392o023765k493478L291881M450735j950376r655192q859117K69572
42639G5360652O136219J937954m379614k998136K827696M418628L846908R671290
42631I6821597J9179710J8842714M643023j0077898j2314309n769258k761921
$$ plain form
42685 123631577 113745860 95714826 86972438 97181529 115397284 123042836 115907360
42678 115907360 106314607 104650136 107114478 104911026 98546738 96270648 101375226 108051921
42670 108051921 110009322 108026373 107692741 112712836 120667741 123148990 112221616 91207668
42662 91207668 76433808 80629922 95121307 98027529 82675073 67667839 72373474
42655 72373474 91365423 103165088 98762958 89686490 88993295 95449708 99394416 96330392
42647 96330392 90306627 87813149 91105030 95555765 93605389 83950197 75091080 75360652
42639 75360652 81496871 83434825 79055211 76057075 78884771 83303399 87150307 96821597
42631 96821597 116001307 134844021 139487044 129409146 117094837 111325579 108563658
42624A08563658o236517p969085k232679O141471Q513699K762729n546473j0187860
42616I3808943r510030m891056K224090Q905117R484850J562014p421788o711545
42608H7450595L006442Q928967L794382l846951l161429K960392M533911J114984
42600A04781293N14607M142472N760942M315332N876184J0771543J0247262N94017
42592A47003652q840065p877453J041829P544847O332697J13299o317034r543767
42584A29458005p656112j616177M255449N853363L189196K60505J578014P405418
42576A42727661J1223249N618699o231184j0625449j057643J0603359J0351866
42569A62610558K880458J885199M554093m321994k2148194k5348958m859911J6098877
$$ plain form
42624 108563658 102327141 94358056 92125377 98266848 106780547 109543276 103996803 93808943
42616 93808943 84298913 79407857 81631947 90537064 100021914 101583928 94162140 87450595
42608 87450595 90457037 99386004 103180386 99333435 96172006 99132398 103666309 104781293
42600 104781293 105295900 109438372 115199314 119514646 125390830 136162373 146409635 147003652
42592 147003652 138163587 130286134 131327963 138872810 145205507 145318806 139001772 129458005
42584 129458005 121801893 120185716 124441165 130294528 133483724 133744229 135322243 142727661
42576 142727661 153950910 159569609 153338425 142712976 141655333 152258692 162610558
42569 162610558 165491016 167376215 171930308 167608314 145460120 120111162 115251251 131350128
42561A31350128J3628596m607439j5186787j2422042o972233k426476N148297
42554A08512044J0933617O088293m010303n670917N88618K074202k824851l089364
42546A12601339K772493L476857l142662n228841R41514L634351k479736o534238
42538A06041077k521310r77824q084728j1428250j102699J1271676J1153286M611208
42530A08962436N139540Q907697L379326p615486q330607L041104J1520673P136684
42522A32141367n513734j7451524k1439770j1810385P204902J7455997P368953
42515A07955806p987357n596345J0587365J5066745O06788j1286375m656291Q780530
42507A13470866J1241229L516671l214946m622506j395780O314739J3025546R750326
$$ plain form
42561 131350128 144978724 140371285 125184498 112762456 105790223 103363747 108512044
42554 108512044 119445661 125533954 121523651 115852734 116441352 118515554 115690703 112601339
42546 112601339 115373832 118850689 115708027 110479186 111420700 115055051 112575315 106041077
42538 106041077 103519767 102541943 94457215 83028965 81926266 93197942 104351228 108962436
42530 108962436 114101976 123009673 126388999 118773513 110442906 113484010 125004683 132141367
42522 132141367 126627633 109176109 87736339 75925954 83130856 100586853 107955806
42515 107955806 99968449 94372104 104959469 120026214 120633002 109346627 104690336 113470866
42507 113470866 124712095 128228766 125013820 120391314 118995534 125310273 138335819 148086145
42499A48086145L85662J483913J5871552K2762744P247209j5762348k2734307
42492A57340570j3268340l739585j310252k714178q248524j6632289j4671937
42485I6755465N584581K5312765J8649742p856096k0111048l651099J7497357
42478A32181667J6694562j041266j2306599p840735J330657J909115p796717j8106810
42470A05023874j7388346m882004O202560M936270j182533K556335J3913075J6529650
42462A25708881O635359j531231n41312n66342p837378j1512201l742990M189420
42454A10802206L16067p674666o370063J130851L888397L917728R720963J6112229
42446A31843712J0056086o047997j4612222o601563Q887001J8243528J4564105
$$ plain form
42499 148086145 148471807 149955720 165827272 188590016 195837225 180074877 157340570
42492 157340570 144072230 140332645 139022393 136308215 128059691 111427402 96755465
42485 96755465 102340046 127652811 146302553 138446457 118335409 114684310 132181667
42478 132181667 148876229 147834963 135528364 127687629 129018286 130927401 123130684 105023874
42470 105023874 87635528 82753524 88956084 93892354 92709821 95266156 109179231 125708881
42462 125708881 132344240 130813009 130271697 129705355 121867977 110355776 106612786 110802206
42454 110802206 111118273 103443607 97073544 98204395 102092792 106010520 115731483 131843712
42446 131843712 141899798 135851801 121239579 114638016 123525017 141768545 156332650
42439A56332650j772700k0533282k3640203n321623J3395755Q451665j1698858
42432A15213404j6262225J520238J4016791K853032j3481756j1389997J456014
42425I3925501L701092l012694j562549O820118N102533n993882n811524J0380199
42417A03548794J9914117P836138r285228r944619N32222L735767n30596R79419
42409A16786014P293839M480469p097231j0058213J451511J1159390O256835m508574
42401A25764040q289912p176008p213941l470736P893111J4730183M844200j1304249
42393A15776688j3501811k410979K957014m029372j0778556j0083809r193715
42386F8735460r481753K48723K0036323K8968925J3827078q860635j5879925r106949
$$ plain form
42439 156332650 154559950 134026668 110386465 105064842 118460597 126912262 115213404
42432 115213404 98951179 100471417 114488208 117341240 103859484 92469487 93925501
42425 93925501 97626593 94613899 93051350 99871468 104974001 98980119 93168595 103548794
42417 103548794 123462911 131299049 122013821 112069202 112601424 116337191 115806595 116786014
42409 116786014 124079853 128560322 121463091 111404878 112856389 124015779 130272614 125764040
42401 125764040 117474128 110298120 103084179 99613443 107506554 122236737 127080937 115776688
42393 115776688 102274877 99863898 102820912 98791540 88012984 77929175 68735460
42386 68735460 59253707 59502430 79538753 108507678 122334756 113474121 97594196 88487247
42378H8487247o032687q966012m755937Q873184J6969812R595555m448817j0323663
42370H9398682m088093N830410P946335j747694j4244653j5621320m876523L126823
42362F5723967j073791o976107j487167R139801J0155499L433630L007147R510660
42354I1433639R427690j30749o137836k404913J700012Q81781L464073J2835819
42346A11069516J6774271O698833o844349j0272627o320106m559135l505017L448816
42338A06490202J2184648J2608172M806010j920503k740667M78923O430846J3130693
42330A51468324J3518343L644249q027694j1014512r298321j4243741k2945564
42323A03101084j9499470p30803J4909270J2243058J068811J541771J5223436
$$ plain form
42378 88487247 82454560 73488548 68732611 77605795 94575607 104171162 99722345 89398682
42370 89398682 85310589 91140999 99087334 97339640 83094987 67473667 62597144 65723967
42362 65723967 64650176 57674069 56186902 65326703 75482202 78915832 81922979 91433639
42354 91433639 100861329 100730580 94592744 92187831 93887843 94769624 98233697 111069516
42346 111069516 127843787 134542620 127698271 117425644 111105538 106546403 103041386 106490202
42338 106490202 118674850 131283022 136089032 134168529 131427862 131906785 138337631 151468324
42330 151468324 164986667 168630916 160603222 149588710 140290389 126046648 103101084
42323 103101084 83601614 82870811 97780081 110023139 111091950 112633721 127857157
42316A27857157K3741301J4601262l659369j5074768j5608139j2443116r907502
42309A09506826n460052Q77617K398021m473055j2524264j2702757p227147n894638
42301F4500551j0292604j0527950m66207J1330210J2031788K172301m112286K763590
42293F7399393J4396596J3558765l353040j8301093j1753364J1226609K4373405
42286I7547271J2518755r741194j9017969j2785411n741332m086343l17015Q218503
42278F6595265J2929905R044976K366503k784969q621873j3197522r546549o15383
42270E6170353O91835o837402q028272K442764P830520k414420j0674008J873968
42262D1055338K1065939J8548133l315314j3974755k042438Q231041l577824k2125791
$$ plain form
42316 127857157 151598458 166199720 162540351 147465583 131857444 119414328 109506826
42309 109506826 104046774 104924391 107322412 102849357 90325093 77622336 70395189 64500551
42301 64500551 54207947 43679997 43213790 54544000 66575788 68748089 64635803 67399393
42293 67399393 81795989 95354754 92001714 73700621 61947257 73173866 97547271
42286 97547271 110066026 100324832 81306863 68521452 62780120 58693777 58376762 66595265
42278 66595265 79525170 88570146 90936649 88151680 79529807 66332285 56785736 56170353
42270 56170353 56862188 50024786 41996514 44439278 52269798 49855378 39181370 41055338
42262 41055338 62121277 80669410 77354096 63379341 61336903 69567944 65990120 43864329
42254D3864329j9888494K477504J7939812R935244q343745j3566195j220322J1329804
42246D2527937Q128808n880035j3172908p487553L69823J578042J797584P584231
42238C5445929J2151734O897405j713692j617480M456912M293559j715454j558547
42230E6640366N672954O418554m474203j4470111j3118936o110658j880978K180322
42222C0857310J0199833J5365043Q542239o585742j6265002j1590017M215865
42215C4739529J9386371K1624847Q224628r253864j6218986j1641437n864720
42208D0996368l023696K187918R426858R846146L141926J545196Q851368J1233909
42200H4205993k57813j3433310j4874632j1399738j4444151j6206037l054338
$$ plain form
42254 43864329 23975835 26453339 44393151 54328395 45984650 32418455 31198133 42527937
42246 42527937 50656745 44776710 31603802 24116249 24486072 26064114 27861698 35445929
42238 35445929 47597663 54495068 52781376 51163896 55620808 59914367 58198913 56640366
42230 56640366 62313320 68731874 64257671 49787560 36668624 30557966 28676988 30857310
42222 30857310 41057143 56422186 64964425 58378683 42113681 30523664 34739529
42215 34739529 54125900 75750747 83975375 74721511 58502525 46861088 40996368
42208 40996368 37972672 40160590 49587448 59433594 62575520 64120716 72972084 84205993
42200 84205993 83948180 70514870 55640238 44240500 29796349 13590312 10535974
42193A0535974J6069823J8899005M322711o189049k510698K017940k864105p881648
42185C2399953l433645L781424M826634L359202M336848K299720n728365q848139
42177C2993632R20781J1827261R222191o47458k533578P36280m192167j1834061
42169C6492881l241731J7562416K1507623r47664k0260914j0618982J0748735
42162E1242364J1315827o875493j4518188l095640O090549Q57358m182834L354233
42154D4188176J2601435R939551N99541l723050l070155k408084n17491K639748
42146F0249671J009201m159847r63914J1356382J4363603r86455j5702432j1377165
42138E3789044N55454J101411k423953O355200J6730320P019053j2439270j1460041
$$ plain form
42193 10535974 26605797 45504802 49827513 43638464 41127766 43145706 40281601 32399953
42185 32399953 28966308 32747732 37574366 40933568 45270416 47570136 41841771 32993632
42177 32993632 33914413 45741674 54963865 54316407 51782829 52519109 48326942 36492881
42169 36492881 33251150 50813566 72321189 71373525 51112611 40493629 51242364
42162 51242364 62558191 55682698 41164510 38068870 44159419 45016777 40833943 44188176
42154 44188176 56789611 66729162 67328703 63605653 60535498 58127414 57609923 60249671
42146 60249671 61258872 57099025 56135111 67491493 81855096 80868641 65166209 53789044
42138 53789044 54344498 55445909 53021956 59377156 76107476 83126529 70687259 59227218
42130E9227218P478708J0597209q821251j7026846J724561J6347120K279975j4897229
42122E6909465k175209K4640662K6199483J577065j5115422j0218666l939848
42115G7877530r349565j2789046k300416J1186182J1788742K74913j0901534j2620489
42107E3166317m521701N859410Q464210K277289k101119J156543K959399l005138
42099F4255210m234672J0658562K5906538J6338261j3063324l0395508k0332353
42092D9132714m63020R461769J0905187J1319880P266151m535050j4595602j1971856
42084E6520173P96414J2167265J3648451L908961j0056623j4721969m258523P318727
42076F5322876K446857j2395322j4062337P72388R051251j827095j3911818q397841
$$ plain form
42130 59227218 66705926 77303135 68481884 51455038 53179599 69526719 71806694 56909465
42122 56909465 54734256 79374918 105574401 107151466 92036044 81817378 77877530
42115 77877530 68527965 55738919 53438503 64624685 76413427 76688340 65786806 53166317
42107 53166317 48644616 54504026 62968236 65245525 63144406 64300949 67260348 64255210
42099 64255210 60020538 70679100 96585638 112923899 99860575 69465067 49132714
42092 49132714 48669694 58131463 69036650 80356530 87622681 83087631 68492029 56520173
42084 56520173 57316587 69483852 83132303 87041264 76984641 62262672 58004149 65322876
42076 65322876 67769733 55374411 41312074 42084462 51135713 49308618 35396800 26998959
42068B6998959N332108P812489M15823j517979M413751O981834J618275m822220
42060D7233040o222765k035507O061450J2762855J0134285j218257r174072o540866
42052E1000163j034417P7189K854420J1739777J5114155L135342j1129351r200618
42044F2556660J876191p24640j8075376k5977016j1733868P755971J2114319L510680
42036C1302921l314548l114290j046713l89538N70514L487858P727598J0564107
42028D5787909Q147938O43572m326850l72951O225940K779173j1309135k1753097
42020B5822499j7528776l412723Q215113J0377801L965225n195587r121663m174711
42012H947178L501227N244149K295284K960060Q132799J0017000N890973J735775
$$ plain form
42068 26998959 32331067 40143556 40559379 39041400 43455151 50436985 52055260 47233040
42060 47233040 41010275 38974768 45036218 57799073 67933358 66715101 57541029 51000163
42052 51000163 49965746 50042935 52897355 64637132 79751287 82886629 71757278 62556660
42044 62556660 64432851 63708211 45632835 19655819 7921951 15677922 27792241 31302921
42036 31302921 27988373 24874083 23827370 23437832 24008346 27496204 35223802 45787909
42028 45787909 53935847 54579419 50252569 49879618 56105558 58884731 47575596 25822499
42020 25822499 8293723 4881000 13096113 23473914 27439139 22243552 13121889 8947178
42012 8947178 12448405 17692554 19987838 22947898 31080697 41097697 46988670 48724445
42004D8724445J83712l093546p689304n832664L312659Q922009M667016j820497
41996D7373830k665559j314497k304192j353760M430820P713067L479981l44325
41988E5015365K709659L514309p366273j9914339j7872059m626546L076852K209214
41980A6746182L703679Q462426N945432j882552J099282J6409201K2910186Q146584
41972H1540420j2070557j8471140j4530395j2097809p799840N749199J7885421
41965D0205299J2685966k962934p813372k17138M30405j1729054j7260247k979023
41957A0359902J5521388J6505052K055980r712815j1439246r391270o517390L46667
41949G728268P734200N347295p774031j7572390j0862608Q933889K5779885K6951628
$$ plain form
42004 48724445 48908157 45814611 38125307 32292643 35605302 44527311 49194327 47373830
41996 47373830 44708271 43393774 41089582 39735822 44166642 51879709 55359690 55015365
41988 55015365 57725024 61239333 53873060 33958721 16086662 11460116 14536968 16746182
41980 16746182 20449861 28912287 34857719 32975167 34074449 50483650 73393836 81540420
41972 81540420 69469863 50998723 36468328 24370519 16570679 22319878 40205299
41965 40205299 52891265 49928331 42114959 41897821 42328226 30599172 13338925 10359902
41957 10359902 25881290 42386342 44442322 34729507 23290261 13898991 7381601 7728268
41949 7728268 15462468 20809763 13035732 -4536658 -15399266 -6465377 19314508 46266136
41941D6266136J2796002n472971j4759753r414482M786332J5379577J3479057
41934F3059898J314023r455940q627693J123467N753501l301794j6361468j6766169
41926A6737825l817996N817118K067720m919100k120396O201211O884628j090357
41918B5760653p020778n901983k315176J527541Q743734J7855731K1287537J6104122
41910G6041381P163232j622961j0024504j5046390j2346875n696638m095386p081877
41902B7289982m568160N004387Q957019n26705j2943142j4004733m826118K837968
41894G220498L833445K586678L060553L983137K194428l901069j1477626j2221180
41886d721136n13602J5177617J8154361M992031q646964r518273l521961k970710
$$ plain form
41941 46266136 59062138 53589167 38829414 29414932 34201264 49580841 63059898
41934 63059898 64373921 54917981 46290288 47413755 53167256 49865462 33503994 16737825
41926 16737825 12919829 18736947 20804667 15885567 13765171 19966382 26851010 25760653
41918 25760653 18739875 12837892 10522716 12050257 20793991 38649722 59937259 76041381
41910 76041381 83204613 81581652 71557148 56510758 44163883 38467245 34371859 27289982
41902 27289982 22721822 27726209 36683228 36156523 23213381 9208648 4382530 7220498
41894 7220498 11053943 13640621 16701174 20684311 22878739 18977670 7500044 -4721136
41886 -4721136 -5234738 9942879 28097240 33089271 24442307 14924034 11402073 8431363
41878H431363p708763r430327o021587l46909P511270J5163024J2730143l748624
41870A6579590j9469519j5774159M841408K1104218J8395097J433952j5114095
41863A1996492j8513934m905572J4772684K0591543O123813j1029822j2348818
41856F686386k954132J267971J25278K741374M215837o258983j9364474j5515719
41848b9056462P27514N622708k593969P5426J8826209K6216957Q025883j0025350
41840A7818916l882482R428703K484889j5527748j5405450L719472J6350381J2704090
41832B7690771O595331M511907k460732j4014657j5609005l882044N746216L318165
41824A1895952l321373o051813p616632q958519l350392R009428J6327125J3028729
$$ plain form
41878 8431363 722600 -8707727 -14729314 -15076223 -7564953 7598071 20328214 16579590
41870 16579590 -2889929 -18664088 -13822680 7281538 25676635 27110587 11996492
41863 11996492 -6517442 -11423014 3349670 23941213 30065026 19035204 6686386
41856 6686386 3732254 5000225 5125503 7866877 12082714 5823731 -13540743 -29056462
41848 -29056462 -28328948 -22706240 -25300209 -25224783 -6398574 19818383 27844266 17818916
41840 17818916 13936434 23365137 25850026 10322278 -5083172 -1363700 14986681 27690771
41832 27690771 34286102 38798009 36337277 22322620 6713615 2831571 8577787 11895952
41824 11895952 8574579 2522766 -5093866 -14052385 -17402777 -8393349 7933776 20962505
41816B0962505P887935P050432L757011o220434j3285770r308915k278052l607645
41808D957067j0123988j0704674l799970L032291N698355N209981J113504o574151
41800a1191585j1614590p067452M383323J2872990J3485051J0152064Q109906
41793A9129707P419233M202068m211918j4655591j8221782q631149Q339064J8754992
41785A2124624J5938258O525809j081523o913225j3279415j5885512r268290K870693
41777h968581J0692340R957097M613080p19093m779877o747494m753402J488343
41769G82413R141168J3667461J1438627L324476l695704k813543K880062K315891
41761C7040851q445253j8714491j6275076l436241O547707O143513J53956k455189
$$ plain form
41816 20962505 28850440 35900872 39657883 33437449 20151679 10842764 8564712 4957067
41808 4957067 -5166921 -15871595 -19671565 -16639274 -10940919 -5730938 -4617434 -11191585
41800 -11191585 -22806175 -29873627 -25490304 -12617314 867737 11019801 19129707
41793 19129707 26548940 30751008 26539090 11883499 -6338283 -14969432 -6630368 12124624
41785 12124624 28062882 34588691 33507168 26593943 13314528 -2570984 -11839274 -8968581
41777 -8968581 1723759 11680856 16293936 15574843 10794966 4047472 -705930 782413
41769 782413 9923581 23591042 35029669 38354145 34658441 31844898 34724960 37040851
41761 37040851 28595598 9881107 -6393969 -9830210 -3282503 2861010 3014966 559777
41753E59777K630791J3046427K0957185J7585967K247107j3811438j8026260j0637071
41745A4552485k964502j947768k701365J710697Q778713R598437J749929n583863
41737B3192763k235900Q510912J1398612j235641j6362370j5357471K9275R320689
41729A7260869L331282k478283O068162J6710663Q302330j4722288k5923082j4215235
41721e665582K173041M240007k808519l069805N055367J0556010Q617517M515631
41713B3613667J969211j022336n047193o941474n651038l893109l072747k085337
41705b130356j835157n109481j0141427r905791j478358Q101935J0229830O368406
41697e900399N052509P801812O066020l965713j1315769m061680J0898647J4123563
$$ plain form
41753 559777 3190568 16236995 37194180 54780147 57027254 43215816 25189556 14552485
41745 14552485 11587983 9640215 6938850 8649547 17428260 27026697 28776626 23192763
41737 23192763 20956863 29467775 40866387 39630746 23268376 7910905 7940180 17260869
41729 17260869 20592151 18113868 24182030 40892693 49195023 34472735 8549653 -5665582
41721 -5665582 -3492541 747466 -2061053 -5130858 -75491 10480519 19098036 23613667
41713 23613667 25582878 24560542 19513349 12571875 6920837 3027728 -45019 -2130356
41705 -2130356 -3965513 -9074994 -19216421 -29122212 -30600570 -22498635 -12268805 -5900399
41697 -5900399 -847890 6953922 13019942 9054229 -2261540 -6323220 4575427 18698990
41689A8698990M94230j2945524j1077942l35380M695897L121400L237556M627011
41681A0516238O60657n758109n813965k282709n817332j3341311r342775P165846
41673b4013460J6791053R248197k69685L421915J1132755P089410l229111l388852
41665A6782222N100733N830802m576834j2320621j0088150n735209m443150K90393
41657i159814J1690080J9836733J4632451p59226j5277286k1138239j6067419
41650a6242720k762579R985128J3247315Q371462M509515M289190R94475p585500
41642A4806286j2760827p355446L761087J0462273P880408k951444j6944019k4280734
41634b7382416j6877583K85361J2610205J3896081J1335624R819768M370113n666504
$$ plain form
41689 18698990 19193220 6247696 -4830246 -5165626 -469729 2651671 5889227 10516238
41681 10516238 11176895 5418786 -395179 -2677888 -8495220 -21836531 -31179306 -24013460
41673 -24013460 -7222407 2025790 1756105 5178020 16310775 23400185 20171074 16782222
41665 16782222 21882955 27713757 23136923 10816302 728152 -5007057 -9450207 -9159814
41657 -9159814 2530266 22366999 36999450 36240224 20962938 -175301 -16242720
41650 -16242720 -19005299 -9020171 4227144 12598606 17108121 21397311 22391786 14806286
41642 14806286 2045459 -5309987 -1548900 8913373 16793781 13842337 -3101682 -27382416
41634 -27382416 -44259999 -43974638 -31364433 -17468352 -6132728 3687040 8057153 2390649
41626B390649r048087J65507R689368N921488n561222r609761l847125K381436
41618g517747N060955O917850O104604j636382j1133587j1543165j985139P264448
41610h468163Q332031J394563r723388j7294315j0313858J1207610K7268028J9309617
41602B1712125k159459r367680L844105J4847511P108264q269972j3891178j0518157
41594C305559q332592p997317l640237M651981J2247563J6515726J4333470K193581
41586C3277734j3604261j7322396l677793J2129713J3738828L655015n496686
41579B2700154r366712j0120070o319951J728755M424342m966500j6415382j5168035
41571c3503399k656098P910482J1608969J3201762J3052205P216652o55792k297221
$$ plain form
41626 2390649 -6657438 -6491931 3197437 9118925 3557703 -6052058 -9899183 -7517747
41618 -7517747 -2456792 4461058 10565662 8929280 -2204307 -13747472 -15732611 -8468163
41610 -8468163 -136132 1258431 -8464957 -25759272 -36073130 -24865520 2402508 21712125
41602 21712125 19552666 10184986 14029091 28876602 35984866 27714894 13823716 3305559
41594 3305559 -5027033 -13024350 -16664587 -12012606 234957 16750683 31084153 33277734
41586 33277734 19673473 2351077 -1326716 10802997 24541825 28196840 22700154
41579 22700154 13333442 3213372 -3106579 -1377824 3046518 -1919982 -18335364 -33503399
41571 -33503399 -36159497 -28249015 -16640046 -3438284 9613921 16830573 16174781 13877560
41563A3877560J440363L015391K011423K790766J784394o782374j5140429j0164192
41555g167098L598183Q624020K774963J491315Q611787Q891913k551027p762357
41547A6511699L624221J3780501M566870j2606271j5750175o251866r90541j976228
41539I08210J133347N278236k568619j7304828j6942721L155503J9734611J4106400
41531G500139l085575j0330915m094781K950308K655975j511639k945906J149466
41523g712928Q059530J0167306K051436r765747j1069839J854125J5842671J7860848
41515B7287402J0425252L441295j000683o081518r018223m499636L058545K694126
41507B6306560o335783j1094572k243999J2492397J7389646P228081q037859j5412451
$$ plain form
41563 13877560 15317923 18333314 20344737 23135503 24919897 18137523 2997094 -7167098
41555 -7167098 -3568915 5055105 7830068 9321383 17933170 26825083 24274056 16511699
41547 16511699 20135920 33916421 38483291 25877020 10126845 3874979 2884438 908210
41539 908210 2041557 7319793 4751174 -12553654 -29496375 -26340872 -6606261 7500139
41531 7500139 4414564 -5916351 -10011132 -7060824 -4404849 -5916488 -8862394 -7712928
41523 -7712928 346602 10513908 12565344 2799597 -8270242 -6416117 9426554 27287402
41515 27287402 37712654 41153949 40153266 34071748 25053525 20553889 23612434 26306560
41507 26306560 19970777 8876205 6632206 19124603 36514249 43742330 35704471 20292020
41499B0292020j1805047m621070j825889l472004l809921j81582L627129L711936
41491A915572J759981J418212K198032J500755O12986L011694O942014N700834
41483B5060080k566821j0217238r051357j204342L145236j410211q433693p058319
41475a1736665M831511J7173329J8672541R660063R10441m66043P20441l376444
41467C6389174j1063169j3739794q921916k806791M91591L728386P566927N689813
41459A7334221m304611j1869830m996234J2103041K2240158J5927965N16634j1729569
41451C5221775j5988007j3390514o282835L85107M87387m506976m360856N683547
41443b751372J4989341J0167120n848577j6333737j1232683L129984J4533286
$$ plain form
41499 20292020 8486973 3865903 2040014 -1431990 -5241911 -5423493 -1796364 1915572
41491 1915572 3675553 5093765 7291797 8792552 9405538 12417232 19359246 25060080
41483 25060080 22493259 12276021 3224664 2020322 5165558 3755347 -4678346 -11736665
41475 -11736665 -6905154 10268175 28940716 38600779 39511220 39045177 39765618 36389174
41467 36389174 25326005 11586211 2664295 -142496 349095 4077481 11644408 17334221
41459 17334221 13029610 1159780 -3836454 8266587 30506745 46434710 46951344 35221775
41451 35221775 19233768 5843254 -439581 -54474 432913 -4074063 -8434919 -2751372
41443 -2751372 12237969 22405089 16556512 222775 -11009908 -7879924 6653362
41436F653362J6757072R950933k400050j3271415j5201911p855434J359870O326440
41428B318867P163887M870316j579504q772384p398814M924100J4858865P643371
41420B4028704j1358259k0095212p575244J0969384J3263988j475388j2736888
41413d978915o948954M810429L713158r300750j4956409m300452Q158727P412445
41405a6390721J430524O940123J9665071J9128794K752521p356223P83008R293201
41397C6246298O70843j1359924m108190J3756532J2672279j0465616k5112778
41390A2299444j2894595O724689R455170J237985R66679N965666q02374j7968302
$$ plain form
41436 6653362 23410434 33361367 30961317 17689902 2487991 -5367443 -4007573 2318867
41428 2318867 9482754 14353070 12773566 4001182 -3397632 1526468 16385333 24028704
41420 24028704 12670445 -7424767 -15000011 -4030627 9233361 7757973 -4978915
41413 -4978915 -11927869 -7117440 -3404282 -12705032 -27661441 -31961893 -23803166 -16390721
41405 -16390721 -14960197 -8020074 11644997 30773791 33526312 26170089 26953097 36246298
41397 36246298 36917141 25557217 21449027 35205559 47877838 37412222 12299444
41390 12299444 -595151 6129538 15584708 16822693 17789372 23755038 22952664 4984362
$$ [...]
##END NTUPLES=NMR SPECTRUM
##END=
