##TITLE=31Pdec_LR-684B-FK
 DMSO, 124 sc
 26.7.2019
##JCAMPDX= 6.0         $$ Bruker NMR JCAMP-DX V2.0
##DATA TYPE= NMR SPECTRUM
##DATA CLASS= NTUPLES
##ORIGIN= UXNMR, Bruker Analytische Messtechnik GmbH
##OWNER= root
$$ XWIN-NMR		Version 3.5
$$ Fri Jul 26 15:06:29 2019 Russian Standard Time (UT+4h)  she@DPX200
##.OBSERVE FREQUENCY= 81.013821
##.OBSERVE NUCLEUS= ^31P
##.ACQUISITION MODE= SIMULTANEOUS
##.ACQUISITION SCHEME= undefined
##.AVERAGES= 124
##.DIGITISER RES= 17
##SPECTROMETER/DATA SYSTEM= spect
##.PULSE SEQUENCE= zgpg30
##.SOLVENT NAME= CDCl3
##.SHIFT REFERENCE= (INTERNAL, CDCl3, 0, 182.463)
##AUDIT TRAIL= $$ (NUMBER, WHEN, WHO, WHERE, WHAT)
$$ ##TITLE= Audit trail, XWIN-NMR		Version 3.5
$$ ##JCAMPDX= 5.01
$$ ##ORIGIN= Bruker BioSpin GmbH
$$ ##OWNER= she
$$ F:/spectra/data/she/nmr/P31/1/pdata/1/auditp.txt
$$ ##AUDIT TRAIL=  $$ (NUMBER, WHEN, WHO, WHERE, WHAT)
(   1,<2019-07-26 15:05:15.64 +0400>,<she>,<DPX200>,
      <continue with go, POWCHK disabled, PULCHK disabled
       configuration hash MD5:
       00 E9 B6 7A A2 85 ED C7 34 08 36 98 17 FE 4E 26
       data hash MD5: 32K
       11 F1 93 3C 65 45 A9 8E 60 BC A3 C9 39 75 4D BA>)
(   2,<2019-07-26 15:05:55.60 +0400>,<she>,<DPX200>,
      <Start of raw data processing
       efp BC_mod = 2 LB = 1 FT_mod = 6 PKNL = 1 PHC0 = -372.7894 PHC1 = 51.39999 SI = 64K 
       data hash MD5: 64K
       C1 19 69 97 74 A7 2F 2A 31 34 47 7F 26 AA C1 3A>)
(   3,<2019-07-26 15:06:04.46 +0400>,<she>,<DPX200>,
      <abs ABSG = 5 
       data hash MD5: 64K
       DA A5 97 10 EC 45 08 96 4E E3 17 51 5C 14 74 5B>)
$$ ##END=
$$ 
$$ hash MD5
$$ 6B 46 C0 E7 1B B3 29 15 69 A5 18 EB 57 E4 29 34
##$RELAX= 
##$RELAX= 
##$RELAX= 
##$RELAX= 
##$RELAX= 
##$RELAX= 
##$RELAX= 
##$RELAX= 
$$ Bruker specific parameters
$$ --------------------------
##$DU= <F:/spectra>
##$EXPNO= 1
##$NAME= <P31>
##$PROCNO= 1
##$TYPE= <nmr>
##$USER= <she>
##$AMP= (0..31)
100 100 100 100 100 100 100 100 100 100 100 100 100 100 100 100 100 100 
100 100 100 100 100 100 100 100 100 100 100 100 100 100 
##$AQSEQ= 0
##$AQ_mod= 1
##$AUNM= <au_zg>
##$AUTOPOS= <>
##$BF1= 81.014009
##$BF2= 200.13
##$BF3= 200.13
##$BF4= 200.13
##$BF5= 200.13
##$BF6= 200.13
##$BF7= 200.13
##$BF8= 200.13
##$BYTORDA= 1
##$CFDGTYP= 0
##$CFRGTYP= 5
##$CHEMSTR= <none>
##$CNST= (0..31)
1 1 145 1 1 1 1 1 1 1 1 1 1 1 1 1 1 1 1 1 1 1 1 1 1 1 1 1 1 1 1 1 
##$CPDPRG= <waltz16>
##$CPDPRG1= <>
##$CPDPRG2= <waltz16>
##$CPDPRG3= <>
##$CPDPRG4= <mlev>
##$CPDPRG5= <mlev>
##$CPDPRG6= <mlev>
##$CPDPRG7= <mlev>
##$CPDPRG8= <mlev>
##$CPDPRGB= <>
##$CPDPRGT= <>
##$D= (0..31)
0 1 0 0 0 0 0 0 0 0 0 0.03 2e-05 3e-06 0 0 0 0 0 0 0 0 0 0 0 0 0 0 0 0 
0 0 
##$DATE= 1564138939
##$DBL= (0..7)
120 120 120 11 120 120 24 19 
##$DBP= (0..7)
150 150 150 150 150 150 150 150 
##$DBP07= 0
##$DBPNAM0= <>
##$DBPNAM1= <>
##$DBPNAM2= <>
##$DBPNAM3= <>
##$DBPNAM4= <>
##$DBPNAM5= <>
##$DBPNAM6= <>
##$DBPNAM7= <>
##$DBPOAL= (0..7)
0.5 0.5 0.5 0.5 0.5 0.5 0.5 0.5 
##$DBPOFFS= (0..7)
0 0 0 0 0 0 0 0 
##$DE= 6
$$ [...]
##$SUBNAM3= <"">
##$SUBNAM4= <"">
##$SUBNAM5= <"">
##$SUBNAM6= <"">
##$SUBNAM7= <"">
##$SUBNAM8= <"">
##$SUBNAM9= <"">
##$SW= 369.568048894756
##$SWIBOX= (0..15)
0 1 3 0 0 0 0 0 0 0 0 0 0 0 0 0 
##$SW_h= 29940.119760479
##$TD= 32768
##$TD0= 1
##$TE= 0
##$TE2= 300
##$TE3= 300
##$TEG= 300
##$TL= (0..7)
0 120 53 12 22 120 120 120 
##$TP= (0..7)
150 150 150 150 150 150 150 150 
##$TP07= 0
##$TPNAME0= <>
##$TPNAME1= <>
##$TPNAME2= <>
##$TPNAME3= <>
##$TPNAME4= <>
##$TPNAME5= <>
##$TPNAME6= <>
##$TPNAME7= <>
##$TPOAL= (0..7)
0.5 0.5 0.5 0.5 0.5 0.5 0.5 0.5 
##$TPOFFS= (0..7)
0 0 0 0 0 0 0 0 
##$TUNHIN= 0
##$TUNHOUT= 0
##$TUNXOUT= 0
##$USERA1= <user>
##$USERA2= <user>
##$USERA3= <user>
##$USERA4= <user>
##$USERA5= <user>
##$V9= 5
##$VALIST= <valist>
##$VCLIST= <CCCCCCCCCCCCCCC>
##$VD= 0
##$VDLIST= <DDDDDDDDDDDDDDD>
##$VPLIST= <PPPPPPPPPPPPPPP>
##$VTLIST= <TTTTTTTTTTTTTTT>
##$WBST= 1024
##$WBSW= 4
##$XGAIN= (0..3)
0 0 0 0 
##$XL= 0
##$YL= 0
##$YMAX_a= 9258
##$YMIN_a= -21669
##$ZGOPTNS= <>
##$ZL1= 120
##$ZL2= 120
##$ZL3= 120
##$ZL4= 120
##$ABSF1= 182.463
##$ABSF2= -187.1042
##$ABSG= 5
##$ABSL= 3
##$ALPHA= 0
##$AQORDER= 0
##$ASSFAC= 0
##$ASSFACI= 0
##$ASSFACX= 0
##$ASSWID= 0
##$AUNMP= <proc_1d>
##$AZFE= 0.1
##$AZFW= 0.5
##$BCFW= 0
##$BC_mod= 2
##$BYTORDP= 0
##$COROFFS= 0
##$CY= -3
##$DATMOD= 1
##$DC= 0
##$DFILT= <>
##$DTYPP= 0
##$F1P= 0
##$F2P= 0
##$FCOR= 1
##$FTSIZE= 65536
##$FT_mod= 6
##$GAMMA= 0
##$GB= 0
##$INTBC= 1
##$INTSCL= 5.30512e-09
##$ISEN= 30
##$LB= 1
##$LEV0= 0
##$LPBIN= 0
##$MAXI= 10000
##$MC2= 0
##$MEAN= 0
##$ME_mod= 0
##$MI= 50
##$NCOEF= 0
##$NC_proc= -10
##$NLEV= 6
##$NOISF1= 182.463
##$NOISF2= 159.3651
##$NSP= 0
##$NTH_PI= 0
##$NZP= 0
##$OFFSET= 182.463
##$PC= 4
##$PHC0= -372.7894
##$PHC1= 51.39999
##$PH_mod= 1
##$PKNL= yes
##$PPARMOD= 0
##$PSCAL= 0
##$PSIGN= 0
##$REVERSE= no
##$SF= 81.0140089999434
##$SI= 65536
##$SIGF1= 159.3651
##$SIGF2= -187.1042
##$SINO= 113.3802
##$SIOLD= 16384
##$SREGLST= <1H.CDCl3>
##$SSB= 0
##$STSI= 65536
##$STSR= 0
##$SW_p= 29940.119760479
##$SYMM= 0
##$S_DEV= 0
##$TDeff= 32768
##$TDoff= 0
##$TI= <>
##$TILT= no
##$TM1= 0
##$TM2= 0
##$TOPLEV= 0
##$USERP1= <user>
##$USERP2= <user>
##$USERP3= <user>
##$USERP4= <user>
##$USERP5= <user>
##$WDW= 1
##$XDIM= 65536
##$YMAX_p= 354180681
##$YMIN_p= -324527823
$$ End of Bruker specific parameters
$$ ---------------------------------
##NTUPLES= NMR SPECTRUM
##VAR_NAME=  FREQUENCY,     SPECTRUM/REAL,   SPECTRUM/IMAG
##SYMBOL=    X,             R,               I
##VAR_TYPE=  INDEPENDENT,   DEPENDENT,       DEPENDENT
##VAR_FORM=  AFFN,          ASDF,            ASDF
##VAR_DIM=   65536,         65536,           65536
##UNITS=     HZ,            ARBITRARY UNITS, ARBITRARY UNITS
##FACTOR=    0.456856943014862, 1,           1
##FIRST=     14782.0589164792, 0,            0
##LAST=      -15158.0608439998, 0,           0
##MIN=       -15158.0608439998, -324527823,  0
##MAX=       14782.0589164792, 354180681,    0
$$ Real data points
##PAGE= N=1
##DATA TABLE= (X++(R..R)), XYDATA
$$ [...]
27378A6583670l7421663q5348034k8991161N6231578P4447709L2972761m977875
27371B3496985j8423851k4197680k4535793j0460526J0853831K5237797K7250529
27364I221292J4079007q930528j5982794P891144K8341845M574367l5795038k9252590
27356b5853295J7170855K9803960r689189l2706084k746021K2842660j810332
27349b987446k7756247L4996M0735979K4300676l0965314n1132516k3905711j832924
27341g3508507o504769n774804J7233350L6981549L1493503O116070k9615722
27334b3579330o6499451p9471865m7001008J4189301O5483005Q9710996Q9266504
27327D2098152N9855343N695119l6028084l2164826n347174m087197l0067970
$$ plain form
27378 16583670 -20837993 -106186027 -135177188 -78945610 -4497901 28474860 23496985
27371 23496985 5073134 -19124546 -43660339 -54120865 -43267034 -18029237 9221292
27364 9221292 23300299 14369771 -1613023 6278121 34619966 39194333 3399295 -25853295
27356 -25853295 -8682440 21121520 11432331 -21273753 -24019774 -1177114 -2987446
27349 -2987446 -30743693 -30708697 10027282 34327958 3362644 -47769872 -71675583 -73508507
27341 -73508507 -80013276 -85788080 -68554730 -31573181 -79678 6036392 -23579330
27334 -23579330 -90078781 -169550646 -216551654 -202362353 -136879348 -47168352 42098152
27327 42098152 101953495 107648614 71620530 39455704 34108530 30021333 -46637
27320d6637m2279778k6877878j0827130n181493J0865387L7550709L7184014p376977
27312f989783n6055702o0318669k1284534K4454709N4058074O8007021O5483953
27305F7355069L7964943j0679138n3408616o0021563l0021534P48509j738129
27298d9800459k5654120k6271074J1504388M8064265M2139556N614543j7064011
27291a1466912n578427K3494284M3904561L7544423L264418l0444496k4398182
27284C6319669J5472200L0097707j3462211o7417197o9763410l2005347o118890
27277a06877479N087137L3540199O0731873L2298224l7364508o0317006k016012
27270g4917572O1245009N2504728l25347k0212273M382761J8980514o784530m0507908
$$ plain form
27320 -46637 -42326415 -69204293 -80031423 -85212916 -74347529 -36796820 387194 -6989783
27312 -6989783 -63045485 -123364154 -144648688 -120193979 -66135905 1871116 67355069
27305 67355069 105320012 94640874 41232258 -18789305 -48810839 -48062330 -49800459
27298 -49800459 -75454579 -101725653 -90221265 -42157000 -17444 5597099 -11466912
27291 -11466912 -17045339 6448945 50353506 87897929 91162347 60717851 36319669
27284 36319669 51791869 81889576 68427365 1010168 -68753242 -100758589 -106877479
27277 -106877479 -101790342 -68250143 -7518270 24779954 -12584554 -72901560 -74917572
27270 -74917572 -13672563 38832165 38506818 18294545 22677306 41657820 34873290 -5634618
27262e634618l4553307J8368683P5328263P8177002J3321933n8774199o2182174
27255B4051583r60564M2452464J8496492k7153070l0930360k939467M341893j8097585
27247I261386l5786474l4380209k8740750j9688365N948949L3769195K8594691
27240d1021577r225895l3204780r171375M2051948O9360397M1097988k8505870
27233C1380836q4080899p0184277O061522O5521585M5071664j6857854k9927895
27226e3015318J8364078M5744705M312020m2073729j6859726M7214449N6731047
27219F0417526Q18977l6801526j2497081J2976832j8800225o1151624l1768552
27212h6805673N2825575Q9708979L2968885m5342700n7251113n900817M1056151
$$ plain form
27262 -5634618 -40187925 -21819242 53509021 131686023 145007956 86233757 24051583
27255 24051583 23091019 65543483 84039975 56886905 25956545 23017078 27358971 9261386
27247 9261386 -26525088 -60905297 -89646047 -109334412 -103385463 -69616268 -41021577
27240 -41021577 -50247472 -83452252 -92623627 -50571679 18788718 59886706 31380836
27233 31380836 -52700063 -122884340 -116822818 -51301233 -6229569 -23087423 -53015318
27226 -53015318 -34651240 11093465 15405485 -26668244 -43527970 3686479 60417526
27219 60417526 61236503 24434977 11937896 24914728 6114503 -55037121 -86805673
27212 -86805673 -33980098 55728881 88697766 43355066 -13896047 -19796864 21259287
27205B1259287M1830368N868172l9423976o6416101n3340218j0506632J7942734
27198h2786366J2506401J2626300M9521652P5994108K9093237n4619274o8616013
27191b6279955J0532706Q1776259O1175955j0063534m5744713l7261508l2678756
27184A456454m0845654k8670263R531901M3811954N7301703N1902577K2248540
27177A16737212k4389396m3678525j1286612J4935279l4264401j14513195j04426730
27170b00886368J5456702J13778975Q4389134j1712555n0068951k0696370p879499
27163g7618932l1455917k1062317M5873657Q6820183M0003271l2558829l4859233
27156b4858117K1796528M4071403j793343n3021258n4679013k5609913q4871K6814297
$$ plain form
27205 21259287 63089655 68957827 29533851 -36882250 -90222468 -100729100 -82786366
27198 -82786366 -70279965 -57653665 -8132013 67862095 96955332 42336058 -26279955
27191 -26279955 -15747249 66029010 127204965 117141431 71396718 34135210 1456454
27184 1456454 -39389200 -68059463 -58527562 -14715608 42586095 94488672 116737212
27177 116737212 92347816 48669291 37382679 52317958 18053557 -96459638 -200886368
27170 -200886368 -185429666 -71650691 12738443 1025888 -49043063 -69739433 -77618932
27163 -77618932 -109074849 -130137166 -84263509 2556674 42559945 10001116 -24858117
27156 -24858117 -3061589 41009814 39216471 -13804787 -68483800 -94093713 -94178584 -67364287
27148f7364287N5930618M6138755k1550526q4099510o9411450l891620K6376585
27141a17871435P596497O564376M2569408M6421796j5638401o5457802k6936023
27134a22751584M9896220O1383105M554658l0422870l144340L1083811K2369268
27127A2968268o369233j3760992J845630K3406224M2700856M4572082J1772173
27120A17135008l3320321m0624054q211335P046718j6911293k3686186K5044580
27113B6473117O8012612L0350928m8573315o0116312J1912760O3149212K0161580
27106A11370582n8467861p4402479k3440708K0217766J7310000l231373j2380659
27099b3024732j9337475l0707838k4664125N928864K3966105M34455k9312984
$$ plain form
27148 -67364287 -11433669 34705086 13154560 -70944950 -140356400 -144248020 -117871435
27141 -117871435 -110274938 -103710562 -61141154 -14719358 -30357759 -95815561 -122751584
27134 -122751584 -72855364 -11472259 -6917601 -37340471 -40484811 -9401000 12968268
27127 12968268 6599035 -7161957 -5316327 18089897 60790753 105362835 117135008
27120 117135008 83814687 43190633 34979298 42026016 25114723 1428537 26473117
27113 26473117 94485729 124836657 76263342 16147030 28059790 91209002 111370582
27106 111370582 52902721 -21499758 -44940466 -24722700 -7412700 -10644073 -23024732
27099 -23024732 -42362207 -73070045 -97734170 -91805306 -67839201 -67404746 -96717730
27092i6717730p988312N5327762Q9354319N8178953M912797k1109877l1182974
27085E0774938n3708871o5492434k3934639N0691832Q5543636M9977073j0026013
27078H3825522l9917589l3237620r294904J9315799L7799458K9292730N878169
27071I3661565J426366J3870660O8462m5200499n9154154n631842N0844490L1170544
27063H1055592l4985535n1395201k514067L0208608M723331j8987709J4301415
27056B2406434O3054088N7272896L039835m1158598n4087115n6429374n1311462
27049e7213296k2982695J5309361K9344289J8765991J3885983J7699679K642861
27042A7452173k9293981l7640730j0720105J0569881J667781l044190K6649468
$$ plain form
27092 -96717730 -104706042 -49378280 39976039 98154992 103067789 81957912 50774938
27085 50774938 -2933933 -68426367 -92361006 -41669174 43874462 93851535 83825522
27078 83825522 43907933 10670313 1375409 20691208 58490666 87783396 93661565
27071 93661565 95087931 108958591 109027053 63826554 4672400 -959442 49885048 81055592
27063 81055592 46070057 -5325144 -7839211 22369397 27092728 8105019 22406434
27056 22406434 85460522 142733418 145773253 104614655 50527540 -5901834 -57213296
27049 -57213296 -80195991 -64886630 -35542341 -16776350 -2890367 14809312 17452173
27042 17452173 -11841808 -49482538 -60202643 -49632762 -47964981 -51009171 -24359703
27035b4359703N5467203L3934927j9776969m3968469k2057118O981724J8636194
27028D857789K8740677M6388526N1200485K9440620o916904m5325707p8348473
27021C0037013q1970040l7319358J8557508K1734763k0999593k8203188L1060189
27014f7102706P8350725M5018215j6974716j9516874K1056124K4530828o458217
27007E8903379O219526O5975694P6839906L07825o8303818l8501377M1257136
27000A42698271N8636534q309761q1115874q9844801l3169921M3410178Q0676446
26993A12981072M4131537k8269765m9175251O751271N7515215K9668957l2062364
26986A41540672m1369582q512141q367855m0903177l3642600J9709345L6872606
$$ plain form
27035 -24359703 31107500 65042427 45265458 1296989 -20760129 -13778405 4857789
27028 4857789 33598466 79986992 131187477 160628097 153711193 108385486 30037013
27021 30037013 -51933027 -89252385 -70694877 -48960114 -69959707 -98162895 -67102706
27014 -67102706 11248019 56266234 39291518 19774644 40830768 65361596 58903379
27007 58903379 65122905 131098599 207938505 208246330 139942512 101441135 142698271
27000 142698271 201334805 193025044 111909170 22064369 -11105552 32304626 112981072
26993 112981072 157112609 128842844 79667593 86418864 143934079 173603036 141540672
26986 141540672 100171090 91658949 83291094 42387917 8745317 28454662 65327268
26979F5327268j2061615m6930000p698404M8870050M4730055k332336k8079191
26972F1825827k7630245l3161325l1124232J2144062O5744711N9675727p251389
26965A00223136n7229685m0622380O200688K4763770O165770k0559152l2817597
26958a3875450k6113375p516942O883109N560602k110857m63768M757066k804806
26950c5684421j6034123j0959314J2517446K6420232J3843136j4637465m2834145
26943f7368654n7934772m1673710J0040558N8681852N6825003J5660886p173141
26936c2941978L419521j943316m6954104p6025656l5572723L7582558O6408602
26929h6027096M1803441J8477591J9237412R834509k7021972n3463378l4936926
$$ plain form
26979 65327268 53265653 6335653 -1362751 47507299 92237354 89905018 61825827
26972 61825827 34195582 1034257 -30089975 -17945913 47798798 107474525 100223136
26965 100223136 42993451 2371071 8571759 33335529 39501299 18942147 -13875450
26958 -13875450 -39988825 -47505767 -40622658 -35062056 -37172913 -37636681 -32879615 -35684421
26950 -35684421 -51718544 -62677858 -50160412 -23740180 -9897044 -24534509 -67368654
26943 -67368654 -125303426 -166977136 -156936578 -98254726 -41429723 -25768837 -32941978
26936 -32941978 -29522457 -31465773 -78419877 -154445533 -190018256 -152435698 -86027096
26929 -86027096 -44223655 -25746064 -6508652 3325857 -23696115 -77159493 -112096419
26922a12096419N755718K0754011j990811l3237633m1779925k1838220Q716758
26915a75716521K6424920K4612515J9522760K6046569L3897982K4875775O598998
26908a3737002M119268K0589511L4094924L3715013K7859301J4783995j7467157
26901A03957853n2342901m8406674k520369L1950537K0330274r19473J0308567
26894F2357814K2837979j7673832q2052622q0315802K076925O8762427M6187336
26887B2180225j4768626k4132885J4057056K7053395r0848j0917574J1160885
26880B4541628Q417230m4070688p7758504l4237271L4106556M3600866J4261172
26873c1139011L0003714Q4589927P9607292o617794o1955792r419441O4981119
$$ plain form
26922 -112096419 -106340701 -85586690 -87577501 -120815134 -162595059 -184433279 -175716521
26915 -175716521 -149291601 -124679086 -105156326 -79109757 -45211775 -20336000 -13737002
26908 -13737002 -9617734 10971777 45066701 78781714 106641015 121425010 103957853
26901 103957853 51614952 3208278 687909 32638446 52968720 52049247 62357814
26894 62357814 85195793 67521961 -14530661 -94846463 -92769538 -24007111 22180225
26887 22180225 7411599 -16721286 -2664230 24389165 24298317 13380743 24541628
26880 24541628 32958858 -11111830 -88870334 -123107605 -89001049 -45400183 -31139011
26873 -31139011 -1135297 83454630 163061922 156444128 94488336 85068895 150050014
26866A50050014M2176103m5562450p2054368j6675012J8654544j5793202n2139105
26859H656524l9270419k4468784m7017977n2726227Q304052P7979352P3609561
26852E066082J8520624l438640J5599211J2956959k4469046m3083916k3523821
26845d2372547p863532j4035289n807629K9859525N0593408L3491572J4670262
26838E8535770J8760216J2045559k9580444o1459036l4389609K0961540L1167545
26831A6041541j9987183p7114276q5331704l8212201L2374091P9020516O5610804
26824b7598412O657474l2070813n817519M8275719N7486683R217553m0191020
26817A5959665m7722839k9867656j7478996o244776K1797873N2602063M9931200
$$ plain form
26866 150050014 192226117 146663667 74609299 57934287 76588831 60795629 8656524
26859 8656524 -30613895 -55082679 -102100656 -154826883 -146522831 -68543479 5066082
26852 5066082 23586706 20148066 35747277 48704236 24235190 -18848726 -42372547
26845 -42372547 -50236079 -64271368 -70078997 -40219472 10373936 43865508 58535770
26838 58535770 77295986 89341545 59761101 -1697935 -36087544 -15126004 16041541
26831 16041541 -3945642 -81059918 -166391622 -204603823 -172229732 -93209216 -27598412
26824 -27598412 -20940938 -53011751 -58829270 -10553551 46933132 56150685 15959665
26817 15959665 -31763174 -61630830 -79109826 -85354602 -63556729 -10954666 38976534
26810C8976534R077571k5691641j2914809K8390469L7562214o078327m9228087
26803B0093924l6303572J1129429L0102508J4575261J5567710M0949026L1867993
26796A27982279k8638197n9932200n98630P7955168O0341634m3110440j08981294
26789B5018320p5150903r364581J0878317q09670M777917K8219044M1511273L9276124
26781F4355841K2289188k4519297q7971031j02780870l1130086O4148262Q9349336
26774f258657M3387115M742802N434334l965594m9644439p3689709k4406908M9243565
26766e5157491N8773029M363843k7234948P682148M8469812K5686751l3036010
26759B9547134m3058156J3547003O1352758L6982711k6280554n0413455k0768957
$$ plain form
26810 38976534 48054105 22362464 9447655 37838124 75400338 69322011 20093924
26803 20093924 -16209648 -5080219 25022289 39597550 55165260 96114286 127982279
26796 127982279 99344082 39411882 38813252 116768420 177110054 133999614 25018320
26789 25018320 -50132583 -59497164 -48618847 -49428517 -44650600 -16431556 25079717 64355841
26781 64355841 86645029 62125732 -25845299 -128626169 -159756255 -95607993 -6258657
26774 -6258657 37128458 41871260 47305594 43340000 -6304439 -79994148 -104401056 -55157491
26766 -55157491 3615538 7979381 -19255567 -11573419 36896393 62583144 29547134
26759 29547134 -13511022 35981 61388739 98371450 72090896 21677441 908484
26752I08484K418021k1458959n1936340k6957737M1258416P1577009J9297999
26745C5106893o0860104q3341599m0054518O59973k442011j2843952J0147188
26738a53628130L7377239J8707522k5858421l0167053J0476753K7193760j1394255
26731a27292585m5535658j9459303K9436903L1319762j0234784l7407984l3917529
26724b13091178l0841808k9942814L873324O5773391R5282987O1875040J1905162
26717c5165896n7634J8325788K9863864L2429465M6921869O3248359M4592713
26710B00158528j6003193p6085303q7559063m2873524K4483184P1185437P2778643
26703A46084709L4136253j7994833n3671757n9551955m7127513l7351907k9750157
$$ plain form
26752 908484 3326505 -18132454 -70068794 -97026531 -55768115 15808894 35106893
26745 35106893 -25753211 -109094810 -149149328 -148489355 -150931366 -163775318 -153628130
26738 -153628130 -116250891 -97543369 -123401790 -153568843 -143092090 -115898330 -127292585
26731 -127292585 -172828243 -192287546 -162850643 -131530881 -141765665 -179173649 -213091178
26724 -213091178 -243932986 -273875800 -270002476 -204229085 -108946098 -47071058 -35165896
26717 -35165896 -35223530 -16897742 12966122 45395587 92317456 155565815 200158528
26710 200158528 184155335 108070032 20510969 -22362555 2120629 73306066 146084709
26703 146084709 180220962 162226129 108554372 49002417 1874904 -35477003 -65227160
26696f5227160J939280O2304967R5902735M2962776o0267595r7336844k2222789
26689d1944630O4595625M9402305l5841170o9591044k2363532J8470291M0467
26682c7231688k5976985q849392K1546474K4343028J7571218K7250418L2545198
26675E1198271J3431936m896182m031726j0573234l3128260k4695393L2845722
26668B0151134P0381942K9434356l8711498n1344822k0119428j0903754k5058082
26661b6170152k0485420j3387374m6698506p9608022l0865941O9462856R7026585
26654e0725974K2270358l9531505q039229M7827607L7740408r617996j6531290
26647a6607621J1142462J3686860j0245410j0391917K2519759M6739615L9309450
$$ plain form
26696 -65227160 -63287880 -982913 94919822 137882598 77615003 -19721841 -41944630
26689 -41944630 22650995 72053300 36212130 -33378914 -55742446 -37272155 -37231688
26682 -37231688 -63208673 -72058065 -50511591 -26168563 -8597345 18653073 51198271
26675 51198271 64630207 59734025 55702299 45129065 12000805 -12694588 20151134
26668 20151134 90533076 119967432 81255934 29911112 9791684 -1112070 -26170152
26661 -26170152 -46655572 -60042946 -106741452 -186349474 -217215415 -147752559 -50725974
26654 -50725974 -28455616 -67987121 -76026350 -28198743 9541665 -76331 -16607621
26647 -16607621 -5465159 8221701 -2023709 -12415626 10104133 56843748 96153198
26640I6153198J7623091K609747N173498L0448094N4967704K9090180m9447427
26633A86618085r8589847n2336145K9178586K8989209n5762107r9226029k3155874
26626h4284122R0888001J12043309K8491837n3008699m9374252J4041971N8688714
26619A17486759M5924282j968357m4627142o0706919n0501186k5981570n128099
26612b5502232j485305r042489p534248P307311J2223601q180208k8730960j3873849
26604g4818379K6550838M5002476K1334028j3902667k8747012k7302621k3794586
26597g5677923j3754042O866162K2218777J9841016R544373j603224k5722962
26590e8287823o0529430o8061369k1787967M4323433O9567078L9326667m909848
$$ plain form
26640 96153198 113776289 116386036 121559534 152007628 206975332 236065512 186618085
26633 186618085 88028238 35692093 64870679 93859888 38097781 -61128248 -84284122
26626 -84284122 6603879 118647188 147139025 94130326 44756074 58798045 117486759
26619 117486759 163411041 161442684 116815542 56108623 5607437 -20374133 -25502232
26612 -25502232 -26987537 -36030026 -43564274 -36256963 -24033362 -32213570 -60944530 -74818379
26604 -74818379 -48267541 -3265065 18068963 4166296 -24580716 -51883337 -75677923
26597 -75677923 -89431965 -82565803 -60347026 -40506010 -30961637 -32564861 -58287823
26590 -58287823 -118817253 -186878622 -208666589 -164343156 -94776078 -55449411 -60359259
26583f0359259j9846644K07407L0301046M0540322K2220665K04881M331210K2565619
26575D0165247J3049477k5849039m1155280o250662L1747730K4535072n207053
26568C1035492j4411120j3942135k7405278k2300368L2722472P7105535K8680126
26561I1484724o8961750q3563941R160464Q1461539M3999986k9984904l5759403
26554G836715L148556l357325n5723614p1065656j7362651M6740514O1678066
26547b8105395L1618496j532725l446420K9234322N9290407M0297064j4768387
26540A12587362l2345560J4364037M4266636k0779924j24335456j40546702n1314697
26533a98104304L6116516N0232386L6245392M9740588O2125859K7992995k1341255
$$ plain form
26583 -60359259 -80205903 -79998496 -49697450 -9157128 13063537 13268418 17599628 40165247
26575 40165247 53214724 27365685 -13789595 -20040257 11707473 36242545 31035492
26568 31035492 16624372 2682237 -24723041 -47023409 -14300937 62804598 91484724
26561 91484724 22522974 -61040967 -51880503 29581036 73581022 43596118 7836715
26554 7836715 10985271 7627946 -48095668 -119161324 -136523975 -89783461 -28105395
26547 -28105395 3513101 1980376 -1466044 27768278 87058685 127355749 112587362
26540 112587362 80241802 94605839 138872475 118092551 -6242905 -146789607 -198104304
26533 -198104304 -161987788 -111755402 -75510010 -25769422 36356437 64349432 43008177
26526D3008177k1899558K1861460M4849106J5957228k7025955l5939498q968910
26519C1842050J5769602L014573m4493420q4832030p8144066l3145607L629104
26512a86359794Q582741N518524K0030154M0980630M7581942M5285738M6167142
26505B7787077L7534467M724350l0087360k9176118M576845K6445415R992563
26498E1797239j8012408j5056490K0437386M5916442K7596099j5588305l5463093
26491F1626870k1830832j9679756n8392711r2237504n7708680K4715158O8914474
26484i4592981M7070281K3383356L9751394M5858631m208483n6379200l6176584
26477c5293586K6055273M0757776P93944j9226995N741216K0424403k053846j9043332
$$ plain form
26526 43008177 21108619 42970079 87819185 103776413 76750458 40810960 31842050
26519 31842050 47611652 50626225 6132805 -78699225 -156843291 -189988898 -186359794
26512 -186359794 -177777053 -172258529 -152228375 -111247745 -63665803 -18380065 27787077
26505 27787077 65321544 70045894 39958534 10782416 15359261 41804676 51797239
26498 51797239 33784831 18728341 39165727 85082169 112678268 97089963 61626870
26491 61626870 39796038 20116282 -38276429 -130513933 -188222613 -163507455 -94592981
26484 -94592981 -47522700 -24139344 15612050 61470681 57262198 882998 -35293586
26477 -35293586 -9238313 31519463 32313407 13086412 18827628 39252031 37198185 18154853
26469A8154853j1579304k3633377o3969481n7560818L7220753J31269124J07604659
26462A37506409j5810005j04898244p7646893J1247574N4401100J2230393n9642050
26455d2611716p8055378k2157480M2703247M7188320J4299797K3757730P7829576
26448F2954096Q1400349p402414r1064236o9655915O227107J7308483l7602097
26441c7834627n1232548J4629538P8755609P6246614L6579862J532877l4128562
26434H4548763o2525389l8762262K9038633M9935879k2410303j01552229q3170767
26427a44897675N765915N5275769L2845686P452499K6323547N2472768L9020514
26420G4259023J118753j4560416N876531L5286665M2596075K2441701m027304
$$ plain form
26469 18154853 6575549 -17057828 -81027309 -138588127 -101367374 29901750 137506409
26462 137506409 121696404 16798160 -60848733 -49601159 4799941 17030334 -42611716
26455 -42611716 -120667094 -142824574 -100121327 -52933007 -38633210 -14875480 62954096
26448 62954096 144354445 136952031 45887795 -23768120 -17541013 -232530 -37834627
26441 -37834627 -89067175 -74437637 4317972 80564586 117144448 118677325 84548763
26434 84548763 22023374 -16738888 12299745 62235624 39825321 -61726908 -144897675
26427 -144897675 -139131760 -83855991 -51010305 -43557806 -17234259 35238509 74259023
26420 74259023 75377776 60817360 66693891 101980556 144576631 167018332 162991028
26413A62991028j2918701m598074k13313q690971j4145316m673895P188918O786759
26405A31726435n97969o204621j5260919k9589422l3059198j4150102J4419256
26398D7283460L4045803L7991692J9789256k5266207p0274388o6179080r796000
26391c2405464L2437627M995206o0580853q7356076m7050314K2892786P2459736
26384i4607352P4398392L1279705j7502424k1646217J4412008K6121520j4339027
26377a883395m2365894L697634P8043436R0493260L7539478j1692722l1830114
26370A22001683n0682600o0192640k2945088L0707309K0347251m8477286p1016265
26363h0257636l347138O5213791N3570654Q870641J2421022M4482884L2079978
$$ plain form
26413 162991028 150072327 145474253 145260940 136569969 122424653 117750758 124939676 131726435
26405 131726435 131128466 124923845 109662926 80073504 47014306 32864204 47283460
26398 47283460 81329263 119320955 139110211 113844004 43569616 -22609464 -32405464
26391 -32405464 32163 5027369 -55553484 -142909560 -189959874 -167067088 -94607352
26384 -94607352 -20208960 11070745 -6431679 -28077896 -13665888 12455632 -1883395
26377 -1883395 -44249289 -40551655 37491781 127985041 165524519 153831797 122001683
26370 122001683 71319083 11126443 -11818645 18888664 39235915 -9241371 -80257636
26363 -80257636 -83604774 -18390983 35179671 44050312 56471334 100954218 133034196
26356A33034196k2029777n1534433l9454100l2245784m8661202m8236353j15963
26349a09243416O7918065J02122356P6552068J3095249l4651248k8873528P341146
26342I4260692J5323491j6107631l1966768P78516L4802551J4860514l4097231
26335G7854134m6375060j2816548J8139915J5198771j3667661n4206133q6728950
26328a02601532p2357334K646971P9811958Q3840784K0047897l6549795m2352770
26321f7513821j9792211K786544K3629895L6093066K4083088j25987m885310O346737
26313F22001P42019j9394392j6716735P575524N936419k9852816m2889038m304130
26305i8281148L2017071J4594176k1246600j2607376K8342989L6361629m145860
$$ plain form
26356 133034196 111004419 59469986 20015886 -12229898 -60891100 -109127453 -109243416
26349 -109243416 -41325351 60797005 137349073 150444322 115793074 86919546 94260692
26342 94260692 109584183 93476552 61509784 62288300 97090851 111951365 77854134
26335 77854134 31479074 18662526 36802441 52001212 38333551 -15872582 -102601532
26328 -102601532 -174958866 -172311895 -92499937 -8659153 11388744 -25161051 -67513821
26321 -67513821 -87306032 -84519488 -60889593 -24796527 -713439 -839426 -5724736 622001
26313 622001 1364020 -18030372 -34747107 -27171583 -21235164 -51087980 -93977018 -98281148
26305 -98281148 -66264077 -51669901 -72916501 -85523877 -57180888 -20819259 -24965119
26298b4965119m1123175l4276119J06427K7298156L4523554K4408015N81537k8346727
26290d1793451m9670882n6724329m5882710j0563606M1619349P3929579N2523880
26283c6562170l795815l4011505o898634L8816859M3072122j050457m2723750
26276d3153350l9509590n539620J6154427J1934991N264441J0980324J2524511
26269c1343866j900178q609203J6881869N1984055N1584142J4719008j4242598
26262G9073229j4788067j5733485l4914060l9948892n033997K9941767Q921074
26255G517569m8929330o4455697q666964N5516139O1699642K4197701j050514
26248B5828546l638079j5802865l9028251l3545112R288903L8467298J5877341
$$ plain form
26298 -24965119 -66088294 -100364413 -100257986 -72959830 -38436276 -14028261 -13446724 -41793451
26290 -41793451 -91464333 -148188662 -194071372 -204634978 -163015629 -89086050 -36562170
26283 -36562170 -40357985 -74369490 -81268124 -42451265 620857 -429600 -43153350
26276 -43153350 -82662940 -88202560 -72048133 -60113142 -54848701 -43868377 -31343866
26269 -31343866 -33244044 -41853247 -24971378 27012677 78596819 93315827 79073229
26262 79073229 64285162 48551677 13637617 -26311275 -31345272 -1403505 7517569
26255 7517569 -41411761 -105867458 -114534422 -59018283 2681359 26879060 25828546
26248 25828546 22190467 6387602 -32640649 -66185761 -56896858 -18429560 -2552219
26241b552219k5212049l2269582q593135J0940266K7587221N9057225P3011353
26234A01969080K1012863n9837043o8763676Q474581O0866356J4633395n0952949
26227B7402607k8301738M8819904O2928957l669770n6721409m6349993k2461057
26220a8352499k4136468j9124823J5605326M2588852L3701017J7425380J6001699
26213F3708484K358318l8227346o5407434m7479002j3173877K410710J0119770
26206h5690377K3358645J8463613j4193652l3172901j1295840J2699238P61259
26199h9070015j7241487n34854K8835939L3143168L0983151N1124267O0772877
26192I8013046K0719719k7903037k2356954O623374k1490755r2502089j01861125
$$ plain form
26241 -2552219 -27764268 -60033850 -68626985 -57686719 -30099498 28957727 101969080
26234 101969080 122981943 63144900 -5618776 2855805 63722161 78355556 27402607
26227 27402607 -899131 47920773 110849730 107179960 50458551 4108558 -18352499
26220 -18352499 -42488967 -61613790 -46008464 -3419612 30281405 47706785 63708484
26213 63708484 66066802 27839456 -37567978 -85046980 -98220857 -95810147 -85690377
26206 -85690377 -62331732 -43868119 -58061771 -91234672 -102530512 -89831274 -89070015
26199 -89070015 -106311502 -106846356 -78010417 -44867249 -13884098 37240169 98013046
26192 98013046 118732765 90829728 68472774 75096148 53605393 -38896696 -140757821
26185a40757821j2913890Q4029758R5535168L1284809l8476009o5595215m1590671
26178h8483871Q056780K8681909j0347784n9016214m2869758K3738123N5932617
26171h4308198L3648197K4965538N3240701M7046719k6968473q2755519m3652614
26164g8783649L0785382L9404832l571858j0068477K6760597L0861911j9318496
26157A6070242n9603324n3683293m1440066m9985487m1415643J1498956O5696883
26150a52861732P1782701M7240279L6477288L6094093J3112168k6082198l9970412
26143a4207813j9189196r05722q381856j6421603M554415L9366831M8266755J9911586
26135E2993397j9965611m2527164l4929964M185061N6423291P5374901K8779516
$$ plain form
26185 -140757821 -153671711 -69641953 25893215 57178024 18702015 -46893200 -88483871
26178 -88483871 -80427091 -51745182 -62092966 -121109180 -163978938 -140240815 -84308198
26171 -84308198 -50660001 -25694463 27546238 74592957 47624484 -35131035 -78783649
26164 -78783649 -47998267 -8593435 -12165293 -22233770 4526827 35388738 16070242
26157 16070242 -43533082 -97216375 -138656441 -188641928 -230057571 -218558615 -152861732
26150 -152861732 -81079031 -33838752 2638536 38732629 51844797 25762599 -14207813
26143 -14207813 -33397009 -34302731 -42684587 -59106190 -54551775 -15184944 33081811 52993397
26135 52993397 33027786 -9499378 -44429342 -40244281 16179010 91553911 120333427
26128A20333427m2411588n5702625k303060K3965755l7119303r9361204l9032651
26121a31631249J08057418J67042717O1372815p5627049q5583210M679483M7561843
26114I5872768n042748n5282425k4015491M0974876N2076054L395547m1883891
26107F6094690m2158315r415031K6299717M4482258L4948946K252987k9430275
26100I3074977l4988619j4892291O637982Q369673j0879567l6662524m8657722
26093c7998091k9725295J7724926N9862455N3851361j863056n1017110l7252421
26086b6417231K3249985N4934543J7378477m3296553n8262781k3692072Q041803
26079d8063829N147228j5827223k9342313k6254906l013991L2618997M5580540
$$ plain form
26128 120333427 77921839 22219214 19916154 43881909 6762606 -92598598 -131631249
26121 -131631249 -23573831 143468886 204841701 129214652 43631442 48310925 95872768
26114 95872768 90830020 35547595 11532104 52506980 104583034 107978581 66094690
26107 66094690 23936375 14521344 40821061 85303319 120252265 122505252 93074977
26100 93074977 58086358 43194067 49832049 58201722 47322155 10659631 -37998091
26093 -37998091 -67723386 -49998460 9863995 63715356 61852300 10835190 -26417231
26086 -26417231 -3167246 51767297 69145774 25849221 -32413560 -56105632 -48063829
26079 -48063829 -42916601 -58743824 -88086137 -114341043 -117355034 -84736037 -39155497
26072c9155497R159376l9511626l1506927L3574476P4768737M1318471j8584718
26065C0062292l6821682j9428471j0344238o144971K5835850O8170597O3163073
26058A14492450K738532m9425051l9235030J4496228N1509754L6231261j7496738
26051A13311406o6077632p2989752l9081396L174384L0516573M7789464N5435509
26044G2078556K8651274l9498728r8105743q5669521j0551732N4190371N5879144
26037b3026379J0762018l0930588l7562349j1334487K2914146L8217546K9122402
26030a837691J3864699O713560L123448J40436L997554K748266l0187963p7945201
26022g9382892p1425300J4156741R4370799P1507981k9160499q8153151m6264707
$$ plain form
26072 -39155497 -29996121 -69507747 -101014674 -67440198 7328539 48647010 30062292
26065 30062292 -6759390 -26187861 -36532099 -42677070 -16841220 51329377 114492450
26058 114492450 117230982 67805931 28570901 43067129 94576883 130808144 113311406
26051 113311406 47233774 -25755978 -64837374 -61662990 -31146417 16643047 72078556
26044 72078556 100729830 61231102 -36874641 -122544162 -133095894 -78905523 -23026379
26037 -23026379 -12264361 -43194949 -80757298 -92091785 -69177639 -30960093 -1837691
26030 -1837691 12027008 18740568 21864016 22004452 26002006 28750272 -1437691 -79382892
26022 -79382892 -150808192 -136651451 -42280652 29227329 66830 -88086321 -134351028
26015a34351028L7125245P9619286O5278462K8336925J206021o129665j0192229
26008F0893017l8889668q3649027q7974644k6800040L4757123K5208396k1553256
26001a38008099j8781966L3876787O0633218M5057424M3978915O3549046M2564274
25994A32869599j8463326l6545635N034520J3309981n0264494q8878373l4591646
25987g7529374K8039755P217889l6817265m787729N9588953M5785469k8365311
25980f867613m9994982l000737K4785210J0604376K3036634P2018062P5272701
25973A45853651M550008n9059600n5495866k3131651o551110R348968K8447935
25966D3962335O903093n7124823q6811660l9845122K1265823L1478160J7722987
$$ plain form
26015 -134351028 -97225783 -17606497 47671965 76008890 77214911 71085246 60893017
26008 60893017 22003349 -61645678 -149620322 -176420362 -141663239 -116454843 -138008099
26001 -138008099 -156790065 -122913278 -62280060 -17222636 26756279 90305325 132869599
25994 132869599 114406273 77860638 82895158 96205139 45940645 -42937728 -77529374
25987 -77529374 -49489619 -42271730 -79088995 -83876724 -24287771 21497698 -6867613
25980 -6867613 -56862595 -59863332 -35078122 -24473746 -1437112 70580950 145853651
25973 145853651 150403659 91344059 35848193 12716542 6165432 15514400 43962335
25966 43962335 50865428 -6259395 -93071055 -132916177 -111650354 -80172194 -62449207
25959f2449207K5910619L0358816m891672l9692327k0520184K0945387K1474996
25952b8863572k733994O679572L3101966R473818n1426766o0263889Q05377L7251133
25944e5976355j0101346o6348922l6222430M8918140P9073060K7882963j7626340
25937c0401230R084600O4123596O6502512R491190m6959899o7065587o9068802
25930f4293620o7827692m2013480J7133260O4840492N3262637M252485j4867772
25923d9513690J3467541L2917171n07074m9839899m8023962P368041N0999662
25916d3132210L7343026m894650j8439835P122553K9059734J3062068k4213281
25909d092595m3576973l5126404j9722564q266747Q721986K6057325J4503071
$$ plain form
25959 -62449207 -36538588 -6179772 -11071444 -50763771 -71283955 -50338568 -28863572
25952 -28863572 -31597566 -24917994 8183972 17657790 -33768976 -94032865 -93227488 -55976355
25944 -55976355 -66077701 -132426623 -168649053 -119730913 -40657853 -12774890 -30401230
25937 -30401230 -21316630 42806966 109309478 118800668 71840769 4775182 -64293620
25930 -64293620 -132121312 -174134792 -157001532 -92161040 -38898403 -34645918 -49513690
25923 -49513690 -36046149 -3128978 -3636052 -53475951 -101499913 -94131872 -43132210
25916 -43132210 -5789184 -10683834 -29123669 -22001116 7058618 20120686 -4092595
25909 -4092595 -47669568 -82795972 -102518536 -110785283 -102063297 -76005972 -61502901
25902f1502901l0492967o0155620k9008264L5787514O2163494K6457115k0139349
25895g6890978k4288452N915807K5585115J4908986n079463p714317M888882N192572
25887e7481848k2922670n5276079n0530913n490224L7011188M7102381M2745025
25880f4843140M3660375L0790517p376991k7322701J0436905O3511685O1076738
25873A09933388J6782700M914495L0362314J9795843m1727159o9168835j6703111
25866E4189635L7243622J1721426m9608257n6144690j3579342M689662j1321691
25859b2809635n819180L0238738M1121494P769678j6430897O794911M4211068
25852H5076177M9953662K7349196J518583k6493464o2774949q6052798o6580865
$$ plain form
25902 -61502901 -91995868 -152151488 -181159752 -145372238 -83208744 -56751629 -76890978
25895 -76890978 -101179430 -95263623 -69678508 -54769522 -59848985 -67563302 -62674420 -57481848
25887 -57481848 -80404518 -135680597 -186211510 -191701734 -154690546 -107588165 -64843140
25880 -64843140 -21182765 9607752 2230761 -25091940 -14655035 48856650 109933388
25873 109933388 126716088 131630583 161992897 181788740 140061581 70892746 54189635
25866 54189635 91433257 103154683 53546426 -2598264 -16177606 -11487944 -22809635
25859 -22809635 -28628815 1609923 42731417 50501095 34070198 40865109 85076177
25852 85076177 135029839 162379035 163897618 137404154 74629205 -11423593 -78004458
25845g8004458j1032585L6200580L9348916R184042j0901848J892581J9248197
25838E935425J076368m0471492m9921473r429899L0737882K6988040N871130J3373010
25830a5841009L6853749K9977023p640528l1893041k3726336l872976J5286298
25823h56820L9390973N5016633L6205575n592496k5842401r548101J3743775K3190919
25815A25708057K8437024K9924255P865885l1691269m7012860k1517939N731495
25808I7444648k450167k8277127l3341916j7632249j1770299k8060737m7908809
25801g1996656m9290907k7305647O467843L3462320M2367458L7254232K5385628
25794c655729N806779j3534426l202602M9436347R8694712Q2073827O324200n4017684
$$ plain form
25845 -78004458 -89037043 -52836463 -13487547 -4303505 -15205353 -13312772 5935425
25838 5935425 7011793 -33459699 -83381172 -92811071 -62073189 -35085149 -29214019 -15841009
25830 -15841009 21012740 50989763 43349235 11456194 -12270142 -16143118 -856820
25823 -856820 38534153 93550786 129756361 124163865 98321464 88773363 102517138 125708057
25815 125708057 154145081 184069336 191935221 160243952 113231092 91713153 97444648
25808 97444648 94994481 66717354 33375438 15743189 3972890 -24087847 -71996656
25801 -71996656 -121287563 -148593210 -142125367 -108663047 -66295589 -29041357 -3655729
25794 -3655729 2151050 -11383376 -14585978 34850369 133545081 215618908 221943108 167925424
25786A67925424n4973149l2452831l3525324m6766481l5537549k421985K2099615
25779a5652280L1431828M1778701N2285873M3698072J2880488k0728402m2811569
25772A02882711n5839101o2643104n7169466l6128126r251667P003755M848433
25765a06296565n393698m587314J1816495K6351296K3456586R903947q35875q213407
25757e3798535r120086J5088297O2277318P9871587K0495341p8124817j20462334
25750h3773229o6768272K6133589Q3433938Q3229085M0451749k4534822p8459582
25743b0287544q2931922l6838864K1258612O3806597Q7925898P9130490K3197590
25736A35260857l7318464l4424164J5006846J5194646n4874330q9385782k0649333
$$ plain form
25786 167925424 112952275 80499444 46974120 207639 -35329910 -37751895 -15652280
25779 -15652280 15779548 57558249 109844122 153542194 166422682 145694280 102882711
25772 102882711 47043610 -15599494 -72768960 -108897086 -118148753 -111144998 -106296565
25765 -106296565 -111690263 -116277577 -104461082 -78109786 -54653200 -44749253 -45585128 -53798535
25757 -53798535 -62918621 -47830324 14446994 94318581 114813922 36689105 -83773229
25750 -83773229 -150541501 -124407912 -40973974 42255111 82706860 58172038 -20287544
25743 -20287544 -103219466 -140058330 -118799718 -54993121 32932777 112063267 135260857
25736 135260857 97942393 63518229 78525075 93719721 38845391 -50540391 -71189724
25729g1189724O0509732M3733808k4950133k7772241K4732226K1905355m5407367
25722a8438344o4730206L838115N9514585L2536130o917451J5914840M7148795
25715F8866464M418130o9824401o8562421P833922N1964287J4544638l0805642
25708b1565023r324079M8010907O1731195J6038609l6202345n3919431m3906337
25701c9136504k2569933J1632660N1372464O1081923J7761325m3879288o3912700
25694b7650053l4160392o401058j5283866l2035429j7444523J4828053K4679308
25687i3467960J1453913R718566K7825456L2739627K054445l9343936m6957105
25680i5976994p429131M4219672N6031100J5467194k6773330j1968874M4566620
$$ plain form
25729 -71189724 -10679992 33053816 8103683 -19668558 5063668 26969023 -18438344
25722 -18438344 -83168550 -79330435 -19815850 12720280 5802829 21717669 68866464
25715 68866464 73284594 3460193 -65102228 -57268306 -5304019 9240619 -21565023
25708 -21565023 -30889102 17121805 78853000 94891609 58689264 4769833 -39136504
25701 -39136504 -61706437 -50073777 1298687 62380610 80141935 36262647 -27650053
25694 -27650053 -61810445 -68211503 -83495369 -115530798 -132975321 -118147268 -93467960
25687 -93467960 -82014047 -72295481 -44470025 -11730398 -9675953 -49019889 -95976994
25680 -95976994 -103406125 -59186453 -3155353 12311841 -14461489 -26430363 18136257
25673A8136257O3361714Q208937n9500243o3761274r888770M1071025N4276370
25666E1904016L2933807j1433013m8111844k7308724M6858113Q3326543J7320356
25659A45489254q0192417r1950988k2041703K5680237J5282442Q866223L0131106
25652C1264154K2492689l0251093n8350490k4913034J3880342J5729097J8297012
25645a1851323M3365062L7668345k0298248n1501216J026447O6667874N7092315
25638A22169256M566536j0544232o23367k4515343n5315154k1271865N0671110
25631F5136941N8107988j5489197p5399571n9049343o234286K5673235K7928700
25624B0674467Q414048k5388502l8717475q20789M7460291L4971391k4579633
$$ plain form
25673 18136257 81497971 89706908 30206665 -33554609 -43443379 -2372354 51904016
25666 51904016 84837823 73404810 25292966 -2015758 44842355 128168898 145489254
25659 145489254 65296837 -26654151 -48695854 -23015617 -7733175 1133048 31264154
25652 31264154 53756843 23505750 -34844740 -59757774 -45877432 -30148335 -11851323
25645 -11851323 31513739 69182084 48883836 -2617380 -1590933 65076941 122169256
25638 122169256 126735792 116191560 115568193 91052850 35737696 14465831 65136941
25631 65136941 123244929 107755732 32356161 -26693182 -32927468 -7254233 20674467
25624 20674467 29088515 3700013 -35017462 -35838251 11622040 46593431 22013798
25617B2013798m4445985l405226K2891950m064959j9751296K5017751O9456457
25610F7712490L8214719l4467180n5175961n694133M6556671N0530402K0378926
25603A28055934q783676k2073448k0927963j3680370j2642135k0862236k6851090
25596B235016k4294011k1717332j9997243k548461L2551522N1655591K2770699
25589D0655781l7237262p5536213o0475625j1131177K9971828M4092162M8726025
25582b0934481N9019304N0747421o377851p7952135q1080763j627496O1798116
25575a6407885K8665265m0731596l6523405K7240247M0234947j8122506m7706909
25568f3351842k623855L1566868j0237852n8756875k8275546M3699079O6151440
$$ plain form
25617 22013798 -22432187 -25837413 -2945463 -7010422 -26761718 -1743967 67712490
25610 67712490 105927209 71460029 16284068 10589935 57146606 107677008 128055934
25603 128055934 119272258 97198810 76270847 62590477 49948342 29086106 2235016
25596 2235016 -22058995 -43776327 -63773570 -66322031 -33770509 17885082 40655781
25589 40655781 3418519 -72117694 -132593319 -143724496 -113752668 -69660506 -20934481
25582 -20934481 38084823 88832244 82454393 4502258 -76578505 -78206001 -16407885
25575 -16407885 12257380 -28474216 -64997621 -37757374 2477573 -15644933 -63351842
25568 -63351842 -65975697 -34408829 -44646681 -103403556 -131679102 -87980023 -21828583
25561b1828583L3161581K67489j9781040m3089434m3704544N691532N6226108
25554c3056891M1457774j1829823k4509223M887431Q601913k4367955l2575175
25547g1391949M044784L1518819J8817642L26731Q30925j112591j1148350K302702
25539b5811287L9141805M9637090J6830000j1045747l035105P430734m963204
25532F8184286o103771K8577609N5874067L3100348n550268l322023K5511302
25525A96271550K0596745k7127692o2714591m7187964n339598J0199688k1995695
25518F2702443o8190082o6175664Q055820R5689181J07691184L2465239m6420975
25511A25817146n5890158j3998670J8336502K0651617J3135153J0905468J4797933
$$ plain form
25561 -21828583 11332998 11600487 -8180553 -51269987 -94974531 -89282999 -33056891
25554 -33056891 8400883 -3428940 -27938163 -23050732 -14448819 -38816774 -71391949
25547 -71391949 -67347165 -35828346 -17010704 -16683973 -15853048 -16965639 -28113989 -25811287
25539 -25811287 13330518 62967608 79797608 68751861 65716756 73147490 68184286
25532 68184286 62080515 90658124 146532191 179632539 174082271 170760248 196271550
25525 196271550 216868295 189740603 127026012 79838048 74498450 84698138 62702443
25518 62702443 -5487639 -71663303 -63607483 32081698 139772882 172238121 125817146
25511 125817146 69926988 55928318 74264820 94916437 108051590 118957058 133754991
25504A33754991K0140830J0128797k5894930n2786601k2310370L3882113J9856263
25497A16771093p2921323j17429814l0846616Q0917328O8041278l7006970p3564583
25490f6039607j080096N6751851K2350481l0532546k5495292l401418k0201284
25483f7647911l3248663J7902020R2876067J06415712N4052811q13003k7927516
25476A41609517m1503524l9954531r461208K7817468L2859730O565643k2951274
25469I4981821n0459372p8813975p7959851k1378213N1172444P1463890L7204298
25462B6211042Q114642J1748154J6584773K566548o130046N257556J2377171j405521
25454G5324319j4810634q989381M81864n448201j8310251k1415916j3338149R92672
$$ plain form
25504 133754991 153895821 164024618 138129688 85343087 63032717 96914830 116771093
25497 116771093 43849770 -73580044 -104426660 -23509332 44531946 7524976 -66039607
25490 -66039607 -67119703 -10367852 11982629 -18549917 -44045209 -47446627 -67647911
25483 -67647911 -100896574 -82994554 9881513 116297225 170350036 169537033 141609517
25476 141609517 100105993 60151462 50690254 78507722 111367452 117933095 94981821
25469 94981821 44522449 -34291526 -112251377 -133629590 -82457146 -10993256 26211042
25462 26211042 34325684 46073838 62658611 65225159 59095113 64352669 76729840 75324319
25454 75324319 60513685 51524304 52006168 46557967 28247716 6831800 -6506349 -5513677
25446e513677J6586551J9120043o09750j9747114p182533K2264116K0342100k0580213
25438B4679523n3122162m6610967k3123117n754631J4494479L7441268L7910656
25431a4084951K2106522L6891586Q0039479O8958006l5896859j36054674j10518223
25424h8559114J0593785Q2465130M1132143l1489203m3472456m316455K6446108
25417g200062K9423224K4093951K3802055K5463262J7170674j4996479n8910556
25410C8846069o4099297n965034N1118512K6614143m5101100n0054563K3470438
25403b5170832M9971032l5405007j16778903o6870083N5414514R6642828L6554690
25396e641761j1161146M239825J5714949j4365439k9466485K113303K3075246
$$ plain form
25446 -5513677 11072874 30192917 29583167 9836053 2653520 24917636 45259736 24679523
25438 24679523 -28442639 -75053606 -98176723 -103931354 -89436875 -51995607 -14084951
25431 -14084951 8021571 44913157 124952636 193910642 158013783 21959109 -88559114
25424 -88559114 -77965329 4499801 45631944 14142741 -29329715 -33646170 -7200062
25417 -7200062 22223162 46317113 70119168 95582430 112753104 97756625 38846069
25410 38846069 -25253228 -31218262 19900250 46514393 1413293 -48641270 -25170832
25403 -25170832 24800200 -10604807 -127383710 -194253793 -138839279 -42196451 -5641761
25396 -5641761 -16802907 -12563082 3151867 -11213572 -40680057 -38566754 -15491508
25389a5491508l640598k4229893L358101K8352821K884238k4554247K472862L9980273
25381I132049K2937360r468839J6330988N9171763J8448050p8437472q9035594
25374e0921695K2798505J16827897Q0793747j7005886n4685771k9757375q371745
25367E9677677J0422720N9824553R1887402L1306692p7672995j06052074l0310030
25360C9083945K9708927o582364o7541591n2584200K0412446O2369984M5469216
25353G0336363J3026387m402336j2530889j4476765q178100r534844k8960997
25346E278819l8413643p774552L9976190N6310264L6197456J0913816j4319927
25339H8168423n6936844r4862986p3203698R570052P6965838O4817454k044493
$$ plain form
25389 -15491508 -19132106 -43361999 -40003898 -11651077 -8766839 -33321086 -30848224 9132049
25381 9132049 32069409 22600570 38931558 98103321 116551371 38113899 -50921695
25374 -50921695 -28123190 88704707 169498454 152492568 97806797 68049422 59677677
25367 59677677 70100397 129924950 221812352 253119044 175446049 69393975 39083945
25360 39083945 68792872 62210508 -5331083 -57915283 -37502837 24867147 70336363
25353 70336363 83362750 78960414 66429525 51952760 43774660 34239816 5278819
25346 5278819 -33134824 -40909376 -933186 55377078 91574534 102488350 88168423
25339 88168423 31231579 -63631407 -136835105 -127265053 -50299215 14518239 12473746
25332A2473746m9957836m2257885q7533L6241360M1065656J6126475j0894327
25325B709656j3182356J355905J401783j9112432l1955429k1470214o114764N61092
25317h5806759J2605629L3129272L1662659o600891m1539480k9419517R570699
25310g6398388J9557694q861387k9724792j2012586K1443940L1015717O620137
25303d8359665k8926106m2974507k0901694J2340611J1030726k7234499l6869172
25296a81894306L4274317J32125393J43102234M2215480o3532902o8575463L213070
25289D0927823M8546016K8117095k49365J4436144L9918693J6244266m7960323
25282A39980349p9411491m0000411J4364253J472942p4551116j15848398n0316767
$$ plain form
25332 12473746 -37484090 -79741975 -79829508 -43588148 -2522492 13603983 2709656
25325 2709656 -10472700 -9116795 -7715012 -26827444 -58782873 -80253087 -86367851 -85806759
25317 -85806759 -73201130 -40071858 -8409199 -15010090 -56549570 -85969087 -76398388
25310 -76398388 -56840694 -65702081 -95426873 -107439459 -85995519 -54979802 -48359665
25303 -48359665 -77285771 -120260278 -141161972 -128821361 -117790635 -145025134 -181894306
25296 -181894306 -147619989 -15494596 127607638 169823118 106290216 37714753 40927823
25289 40927823 89473839 117590934 117341569 131777713 171696406 187940672 139980349
25282 139980349 60568858 20568447 34932700 36405642 -38145474 -153993872 -204310639
25275b04310639P0150101J23644803O0743461m2945766q2517205l8943974K1335803
25268i2843416L8381396J8504041M413828J3263438K1717954O043391k1423734
25261a1943102k7732835m290123K2505092K9768980K6518527K9463765L0574021
25254I4864325J3557290j1590440k2059856k2442921l4607627m8289565k5918659
25247e6487453K9936307N8929393K3288658k9625170k7281341K7036321O0869200
25240H6665915L3573975j7683635m1364794l6252935k8726942j9842709P614130
25233a6016995M4409781N5579862K8117212j1321125l4410125m1938261m4102071
25226a9681722l4218070m622412K7437780L7209089K7998360K2173407K1285457
$$ plain form
25275 -204310639 -134160538 -10515735 50227726 7281960 -75235245 -114179219 -92843416
25268 -92843416 -54462020 -35957979 -31544151 -18280713 3437241 9480632 -11943102
25261 -11943102 -39675937 -43966060 -21460968 8308012 34826539 64290304 94864325
25254 94864325 108421615 96831175 74771319 52328398 17720771 -30568794 -56487453
25247 -56487453 -26551146 32378247 55666905 26041735 -1239606 25796715 86665915
25240 86665915 120239890 102556255 61191461 24938526 -3788416 -23631125 -16016995
25233 -16016995 28392786 83972648 112089860 100768735 66358610 24420349 -19681722
25226 -19681722 -53899792 -58522204 -31084424 6124665 34123025 56296432 77581889
25219G7581889O000797k3112885l7917630k3643500L821542K9485443N1899230
25212H4114886N4772479J4759724l9027902l0022816N5552630J16310293O0670712
25205C17130006n5980364j02573664n7314605k3666805o0083179r7891876o3386078
25198a43766565R195869M3511876L1675125J6175107J1974256R007381J3672026
25191h554925K8137457K0336868k6805709o3726418l2195400M5007476R1475575
25184E3674924P9781375M8537912K6829849K197365l3689110o0907319o3554832
25177E2870164m7351883j9469530J6123752M2769492M1963050J8548312r933639
25170I5519718l6915900n3782038l8254609O076894K7732363m673722m1250760
$$ plain form
25219 77581889 83582686 60469801 22552171 -1091329 2730213 32215656 84114886
25212 84114886 138887365 153647089 114619187 84596371 140149001 256459294 317130006
25205 317130006 261149642 158575978 101261373 77594568 17511389 -80380487 -143766565
25198 -143766565 -134570696 -91058820 -59383695 -43208588 -31234332 -22226951 -8554925
25191 -8554925 19582532 39919400 13113691 -50612727 -82808127 -37800651 53674924
25184 53674924 133456299 181994211 208824060 211021425 177332315 116424996 52870164
25177 52870164 5518281 -13951249 2172503 44941995 86905045 105453357 95519718
25170 95519718 58603818 4821780 -33432829 -27355935 376428 -4297294 -45548054
25163d5548054j9854562L0923654L4988138m731119j5545604J3792520J5404171
25156I429144k6823824l6434854K3023113P4602836M9669738l118210o164239
25149H4183704K1583454J3671568k3907565l3629135j1916467l970061j3674687
25142C2340811m226793J9327198R010429l8925699o5507043l3300923K3651671
25135e7630349M9311471K6712162j7302583l7618547n193866N4196488P0460829
25128H2935605J3903022n3379106n6349220j0375972J4219770O266419J4378592
25121A1599110M2876196L5674187k1195070o3698049m7265364r139785M123716
25114d7025059P211327K7816937M2133671J3776872l8077280o0743409l7810382
$$ plain form
25163 -45548054 -65402616 -34478962 509176 -4221943 -19767547 -5975027 9429144
25156 9429144 -17394680 -53829534 -30806421 43796415 93466153 90347943 84183704
25149 84183704 105767158 119438726 95531161 61902026 49985559 46015498 32340811
25142 32340811 28114018 47441216 56451645 17525946 -47981097 -81282020 -57630349
25135 -57630349 -8318878 18393284 1090701 -36527846 -41721712 12474776 82935605
25128 82935605 96838627 43459521 -12889699 -23265671 -9045901 -2779482 11599110
25121 11599110 54475306 90149493 68954423 5256374 -42008990 -51148775 -47025059
25114 -47025059 -39813732 -11996795 30136876 43913748 5836468 -54906941 -92717323
25107i2717323J627761K6195594K5252939O348612p862070O44069J4966930J369245
25099b4174243l1169970l1368582J4266605M9426533K8114808j8594462l5279495
25092d8778806j9147931O07345J9431671M0404356L7102880n046136l7912168
25085a3338789q006766N2253824N9481062l01986n3832670m7837205j0466080
25078b2048610Q381507J122273j4100537k5991131k2182346J1312106N8073960
25071e432778P1307368L0026668k9170114n5311448l7217072j178436K3659934
25064c315878K4047960M633820j7368414k9577887l5313015l5833654j8172086
25057a10899154J4266102K2113018j5338495m5930086o695531O7881252P5287764
$$ plain form
25107 -92717323 -91089562 -64893968 -39641029 -33292417 -41154487 -40510418 -25543488 -24174243
25099 -24174243 -55344213 -86712795 -72446190 -23019657 5095151 -13499311 -48778806
25092 -48778806 -67926737 -67319392 -47887721 -7483365 29619515 24573379 -13338789
25085 -13338789 -21345555 30908269 90389331 90087345 36254675 -11582530 -22048610
25078 -22048610 -13667103 -12544830 -26645367 -52636498 -74818844 -63506738 -5432778
25071 -5432778 65874590 95901258 66731144 11419696 -25797376 -26975812 -3315878
25064 -3315878 20732082 25365902 7997488 -21580399 -56893414 -92727068 -110899154
25057 -110899154 -96633052 -74520034 -89858529 -135788615 -142484146 -74602894 684870
25050F84870n174941p1502319m1194035L9734957P9071282O3564030L8568412
25043A03752256J7094297j5569186m2193002l4237441j0566471p539021j1993984
25036a252552N978509J7728755k1352309o9434180m0813049M2713121N6062304
25029a0369401l5945740j01934429l4272495P9757966Q4050013j2667024n8044177
25022h9425287R757618Q2894378O3720362L566050l189447K7599873J5133446
25015A10056993l9736791n5938023r188006K7045292j635327m9315885m6463376
25008f5175123k311502K1719747O590658j1765006q581791L524111J2866253K6841953
25000a6290700M3453833M2686245J8997753p872465k5252127m0918048n3908132
$$ plain form
25050 684870 -4490071 -75992390 -117186425 -77451468 1619814 65183844 103752256
25043 103752256 120846553 105277367 63084365 28846924 18280453 10741432 -1252552
25036 -1252552 4725957 22454712 1102403 -68331777 -109144826 -66431705 -10369401
25029 -10369401 -46315141 -148249570 -182522065 -102764099 -18714086 -31381110 -89425287
25022 -89425287 -79667669 3226709 66947071 70513121 67323674 94923547 110056993
25015 110056993 70320202 14382179 5194173 32239465 30604138 -18711747 -65175123
25008 -65175123 -67486625 -45766878 -39176220 -50941226 -59523017 -55998906 -43132653 -16290700
25000 -16290700 27163133 69849378 88847131 80974666 55722539 14804491 -39103641
24993c9103641m6068667j9347845o326763j8939058k0487657J7660618O1239629
24986g1373384N8571084K0769546N674939K7868250L7545379k69332n1306216
24979B7480266o0647566k4734847J1968362J4833626q981033k7198054j4743272
24972h2022518K5215697O2268821O5171706L2626688o771004k5111286j7422637
24965E3955467L639565K1186632K1937141N397476j2238518j4792101n724739
24958G3360923K96285j187456p438410k1585895l7649106k5698168K8694679P6286146
24950H5078998M8106089m1449865r1564506m4013063L6294959N2986801N879390
24943E1318803l0250301k2122075m178181j617508J044245Q362357l043493k9879292
$$ plain form
24993 -39103641 -85172308 -104520153 -110846916 -129785974 -150273631 -132613013 -71373384
24986 -71373384 -12802300 7967246 13642185 41510435 79055814 78786482 27480266
24979 27480266 -33167300 -57902147 -45933785 -31100159 -40081192 -67279246 -82022518
24972 -82022518 -56806821 5462000 70633706 103260394 96489390 71378104 53955467
24965 53955467 57595032 78781664 100718805 106116281 93877763 79085662 73360923
24958 73360923 73657208 72469752 65031342 43445447 5796341 -19901827 8792852 85078998
24950 85078998 133185087 91735222 170716 -43842347 -7547388 45439413 51318803
24943 51318803 21068502 -1053573 -5231754 -6849262 -5805017 2557340 -486153 -30365445
24935c0365445k8026868J7645982N7378470M4902933J678768k4100266k6698087
24928A2415487k8663710k7499482n035523K9187903N1143290O3727517P7043859
24921A72319341O3867688l708186p8186460p0889722J8191919P5816900K3445684
24914B00857164o8794059p7072149O272719P0851221M3981665k4062190m5754260
24907A06280111j0467977K0622535L089742m2123503o2876208l8545798j241211
24900b5262309O855089r928620r280090J8536927K6811872j1133545m1291944
24893d4692620j350080P1390268P8468136L559597o1814442n2207266q695811
24886a5342218Q215671Q575833K2181884K5978036o571329l4666395q465307L6114459
$$ plain form
24935 -30365445 -58392313 -40746331 16632139 61535072 63213840 39113574 12415487
24928 12415487 -16248223 -43747705 -48783228 -19595325 31547965 95275482 172319341
24921 172319341 236187029 232478843 154292383 83402661 101594580 177411480 200857164
24914 200857164 132063105 54990956 61263675 132114896 176096561 152034371 106280111
24907 106280111 95812134 116434669 119524411 77400908 14524700 -24021098 -25262309
24900 -25262309 -18407220 -28335840 -37615930 -19079003 7732869 -3400676 -44692620
24893 -44692620 -46042700 25347568 103815704 107375301 45560859 -6646407 -15342218
24886 -15342218 -7126547 1449286 23631170 49609206 43037877 8371482 -93825 36020634
24878C6020634K3643811l8725689o7643796k7749078K6948939M1686818K2053879
24871A6235518n168198l0293868m3828890l3564364j2289405l884704J312426
24864a11481485K8348512N8581947M9237345J0965560l569101P533323o824975
24857C2791126m7000153m5080193J8197287O6745093M4861193k425812j8893377
24850D9195164k6090282n5354031o6962591k0564721L5193422L3326629n71380
24843e1827790l06486K1362100O428033k7250121j0344226M3897731M3951231
24836B5910472k9138172p9696814l7395777M7943212R0181567P2941901L1132984
24829A21879373j0455123l4888478k0537770K1818473L6183408j0562777p3237111
$$ plain form
24878 36020634 59664445 20938756 -46705040 -74454118 -47505179 -5818361 16235518
24871 16235518 11067320 -19226548 -63055438 -96619802 -108909207 -112793911 -111481485
24864 -111481485 -83132973 -24551026 24686319 35651879 32082778 39616101 32791126
24857 32791126 -14209027 -59289220 -41091933 25653160 70514353 68088541 49195164
24850 49195164 23104882 -32249149 -99211740 -119776461 -84583039 -51256410 -51827790
24843 -51827790 -52134276 -30772176 -24344143 -51594264 -61938490 -18040759 25910472
24836 25910472 -3227700 -82924514 -120320291 -72377079 17804488 90746389 121879373
24829 121879373 111424250 76535772 55998002 77816475 113999883 103437106 30199995
24822C0199995p9351600k0220510L9342214L6317657k3448017p1919517m9811183
24815a38890961K5326789P2889602M2904931k4657751n6975312l8110771m894882
24808a22408355K0471778M2058595N0879220L1245735J091675o698902J639528
24801A8279274l416086j4115417J324662L2700233L8124393J5501484j419213
24794H6979330j1371237l6660771n3100964j5690872M4300172M4745040j2132279
24787D7068419l4149046O169402K4003428k5748918o3423280k0824009M1003003
24780b5901001L6459345r341418k3157050o682437q6274J0847337M8045617N9621981
24772H9806100l750943p5774966n4779493L1118522N6502018j4636551q6677519
$$ plain form
24822 30199995 -49151605 -69372115 -30029901 6287756 -17160261 -89079778 -138890961
24815 -138890961 -113564172 -40674570 2230361 -22427390 -79402702 -117513473 -122408355
24808 -122408355 -101936577 -59877982 -8998762 22246973 23338648 16639746 18279274
24801 18279274 14863188 747771 2072433 34772666 72897059 88398543 86979330
24794 86979330 75608093 38947322 -14153642 -29844514 14455658 59200698 47068419
24787 47068419 12919373 19088775 43092203 17343285 -46079995 -66904004 -25901001
24780 -25901001 10558344 1216926 -21940124 -28622561 -28708835 -17861498 30184119 89806100
24772 89806100 86055157 10280191 -44499302 -13380780 43121238 28484687 -58192832
24765e8192832q0555944k1823426L3176785O7166084P5571821M7770519O29966
24758F3742973k7101247k8151924k4903493j6867986J2078997M0783267L1342508
24751E0923095p41202m680030J9925105K5698936L873295o220599M343835K598246
24743I5720681j4126356j2296738L740998q202135m3065998m6279106j1584808
24736c6093462M945127j1268147o558157L4328078M8671667O136150l1203783
24729H957473j3691513J4293696R43378k1261396m214980K0797955j57705l9773883
24721c4106975k8420095K9446224N6178135J1089628n9152200q0433267k5788131
24714a31186681O2267312J03083743N2965309l5956787o6717152k0326788K4194757
$$ plain form
24765 -58192832 -138748776 -160572202 -127395417 -60229333 15342488 63113007 63742973
24758 63742973 36641726 8489802 -16413691 -33281677 -21202680 19580587 50923095
24751 50923095 50181893 45501863 65426968 91125904 94999199 88778600 93122435 95720681
24743 95720681 81594325 69297587 73038585 64836450 21770452 -24508654 -36093462
24736 -36093462 -31148335 -42416482 -48974639 -14646561 34025106 40161256 8957473
24729 8957473 -4734040 9559656 10503034 -10758362 -14973342 5824613 5666908 -34106975
24721 -34106975 -62527070 -33080846 23097289 34186917 -24965283 -105398550 -131186681
24714 -131186681 -68919369 34164374 87129683 51172896 -15544256 -35871044 -11676287
24707a1676287J2029828j4424198m651380J1800208r452279l7204898j9937256
24700g3516262J3756172k656015n6612804o7036563n267508O7611443Q7624879
24693c6096658N4205449N531589k5363139k5213147m812021J1400820J6854346
24686c492761K4332471K3931502j4881700p2626893p2096765R142933P9435354
24679b6255859N3850207k0846164m2800719p278144J3166163K854850R156506
24672a8153160L2931861K3164250j9233600l5551127j4941423p495642k1260947
24665f0539788p644735L1821027K8965495k8603053o0361098k2297514K2563947
24658i6095719J6007759n445212L447999Q671569k5306484m6010593M560254P4072200
$$ plain form
24707 -11676287 353541 -14070657 -18722037 -6921829 -16374108 -53579006 -73516262
24700 -73516262 -59760090 -62416105 -119028909 -186065472 -191332980 -123721537 -36096658
24693 -36096658 18108791 23640380 -1722759 -26935906 -31747927 -20347107 -3492761
24686 -3492761 20839710 44771212 29889512 -42737381 -114834146 -105691213 -26255859
24679 -26255859 27594348 6748184 -36052535 -43330679 -30164516 -27309666 -18153160
24672 -18153160 14778701 37942951 18709351 -16841776 -31783199 -39278841 -60539788
24665 -60539788 -68184523 -36363496 -7398001 -36001054 -96362152 -118659666 -96095719
24658 -96095719 -80087960 -85533172 -82085173 -73413604 -98720088 -144730681 -140170427 -66098227
24650f6098227O7017092o829482m9765906k4359784J1559758J6718265K0282599
24643c1475685M4076591N1501514J2465405l9136228n6120355m5279672m0783875
24636a04752305m0446663j6550880K4611659M4469155L6165355L8389642O5437714
24629D7323677O9144640J2769146n1178742m0735601K9389374N7292876L058518
24622A27063888n2061879l4538627J3195043J8620988J257253J8463172M5469859
24615A37469697K0330957k6781311j3812317L7754966K3632908n6667341p8774690
24608D3152869p31379N4229670k50766o2973212j0748316R1352277Q7267973k4926328
24600A76372788r3604964m2256099L5571851K7551630n4508800j17445162j02694797
$$ plain form
24650 -66098227 918865 -5910617 -55676523 -80036307 -68476549 -51758284 -31475685
24643 -31475685 12600906 64102420 76567825 37431597 -18688758 -63968430 -104752305
24636 -104752305 -145198968 -161749848 -137138189 -92669034 -56503679 -18114037 47323677
24629 47323677 116468317 129237463 78058721 37323120 66712494 124005370 127063888
24622 127063888 75002009 40463382 53658425 72279413 73536666 91999838 137469697
24615 137469697 157800654 131019343 117207026 154961992 178594900 121927559 43152869
24608 43152869 42421490 96651160 96400394 33427182 22678866 114031143 201299116 176372788
24600 176372788 82767824 40511725 76083576 103635206 49126406 -68318756 -171013553
24593a71013553k6194501N4488763Q9517193P4930601M5585147K1898245r608958
24586G9602937m5387620m3739541M440357L5486542K154555m4671085l4208863
24579d6322718Q322470Q839517k7455344l2267367R25438J1545067j0390329m240041
24571i1043307M7378476P8892385M5130598j4683640m6831891m8048315l2884198
24564f2089892j473400L1372330L3343628O376317j0869593o429299l927300k346685
24556a6043894K1930075M4920797J2454537n2554091n4437943K7537642R1050273
24549G4857396O1817356K71074r629576Q766015r878423m7776821m1284993L178978
24541D0321006K2967805l69945l3488734n6758127o5082393l3666749M1493489
$$ plain form
24593 -171013553 -197208054 -142719291 -53202098 21728503 67313650 89211895 79602937
24586 79602937 34215317 -9524224 -5083867 30402675 32557230 -12113855 -46322718
24579 -46322718 -38000248 -29160731 -56616075 -88883442 -87958004 -76412937 -86803266 -91043307
24571 -91043307 -43664831 35227554 80358152 65674512 18842621 -29205694 -62089892
24564 -62089892 -63563292 -32190962 1152666 7528983 -3340610 -9769909 -13697209 -16043894
24556 -16043894 5886181 50806978 63261515 10707424 -43730519 -16192877 74857396
24549 74857396 136674752 136945826 127316250 136082265 126203842 78427021 37142028 40321006
24541 40321006 63288811 62918866 29430132 -27327995 -92410388 -126077137 -84583648
24534h4583648R5588601O4725948j6530148o0523270m8067328k9356754k5243457
24527a03990056j1673206R651824J1266071P829784M0354885Q9827595Q9671171
24520A32938068L3765861r455127o054873L26602k3470378m6359046l7472199
24513D4218908j4657524L300311K6852431M5577833J6433474n5730025r0127955
24506b4132547l5119223N0603950P6735045L9090821K793214K54595L594474j6104836
24498I7715493m8499941o0384882k9239710L0166344O5681450M0750697r305837
24491H6883614j7655360J1012982R34815o8568910j12914085o7576438P858475
24484a60024907K3038186m162423Q442621O3504641Q5486862N2650522K6025139
$$ plain form
24534 -84583648 11004953 75730901 59200753 -1322517 -49389845 -78746599 -103990056
24527 -103990056 -115663262 -106011438 -94745367 -86915583 -46560698 43266897 132938068
24520 132938068 166703929 157248802 151193929 151520531 128050153 81691107 44218908
24513 44218908 29561384 32861695 59714126 105291959 121725433 65995408 -24132547
24506 -24132547 -59251770 -8647820 68087225 107178046 109971260 110225855 113820329 97715493
24498 97715493 49215552 -11169330 -40409040 -10242696 55438754 96189451 86883614
24491 86883614 69228254 80241236 81176051 12607141 -100306944 -167883382 -160024907
24484 -160024907 -136986721 -141149144 -132706523 -69201882 16284980 68935502 94960641
24477I4960641L4722400K6201571l3947876q9199133p1018668n23153M2197409
24470C393191K2477460k1468823m0919334k5547132Q655640M5791970O9547967
24463F1930939N6193435l783494p2577570q2531479j5713150N2407686L5485895
24456C1412262m2346639o9780706p370404N1727235K4488384l3059875j8040989
24449f2970732N2758845P0151225M249855n5390196l8168908K0907322N4902763
24442D6440174M7328254J3385259l3051430o3144856m2598657J2428871L8644512
24435A9432127P385143m4381319p5716677p6369196l3501350N8739730J37704257
24428f707285J09663246j1484982q9471442m2794252M6311396O3307905J7905476
$$ plain form
24477 94960641 129683041 155884612 121936736 32737603 -38281065 -38804218 3393191
24470 3393191 25870651 4401828 -36517506 -62064638 -53408998 -7617028 61930939
24463 61930939 118124374 114340880 41763310 -40768169 -56481319 -4073633 31412262
24456 31412262 -10934377 -80715083 -88085487 -36358252 -11869868 -44929743 -62970732
24449 -62970732 -10211887 59939338 64189193 8798997 -29369911 -8462589 46440174
24442 46440174 93768428 107153687 74102257 10957401 -31641256 -19212385 19432127
24435 19432127 26817270 -17564049 -93280726 -169649922 -203151272 -144411542 -6707285
24428 -6707285 102955961 91470979 1999537 -40794715 5516681 68824586 86730062
24421H6730062j2611058j9975458m2440815o1400358l1283503K0196845K7907948
24414c2876337M166957J4538613N3112177M8796894m857433l3401004r811381
24407C9668486K930081l2624853o2001715l0738170L0787324N9000032L6929036
24400D3950221j2624353o0782035p0430810j5626035O5657919R0775189L5782551
24393G6702647l0256225m2384992j6547375L034833J4243275K8582066K3021278
24386E6395507k2945121p3937654p4958173k4074978K9509653M5492686K3292366
24379d1225714r619340j9396919M121391K6338679N574755l8821629l7743840
24372a10772617L0189204R7482023R1614494K0971742n0133365p5296650n0313891
$$ plain form
24421 86730062 74119004 54143546 11702731 -49697627 -80981130 -60784285 -32876337
24414 -32876337 -28709380 -14170767 38941410 87738304 82880871 49479867 39668486
24407 39668486 42598567 9973714 -52028001 -82766171 -51978847 7021185 43950221
24400 43950221 31325868 -29456167 -99886977 -115513012 -49855093 40920096 76702647
24393 76702647 46446422 4061430 -12485945 -9451112 4792163 33374229 56395507
24386 56395507 33450386 -40487268 -115445441 -139520419 -110010766 -64518080 -41225714
24379 -41225714 -50845054 -70241973 -66120582 -39781903 -34207148 -73028777 -110772617
24372 -110772617 -80583413 16898610 108513104 129484846 79351481 4054831 -46259060
24365d6259060k244638K2086686m658018m4729595l4604323J7548418L6151729
24358e6708801j209008k6200679J874872K7877252P452696p563791L0395203O2166883
24350C8084627K0921553l6488362j6719091M3063187K9426516n3022514q3306187
24343e8040271k1885257L2518815J3425616j4874587J5525053N9052636M1030156
24336F6752161j9843085n1387783l8112438k0248500j6029704p643523J1490406
24329g5022466K3927377J8474056M994305K360317K2012134N1918233N6128459
24322A04792415J2223520n1369506q2629581o9123605m3720726l0781629k2676035
24315a83285147r530699M371805J6681849K8836534L4241553L0968217L2498222
$$ plain form
24365 -46259060 -48503698 -26417012 -31075030 -75804625 -110408948 -92860530 -56708801
24358 -56708801 -57917809 -84118488 -82243616 -54366364 -46913668 -54477459 -24082256 38084627
24350 38084627 59006180 22517818 5798727 48861914 78288430 25265916 -58040271
24343 -58040271 -79925528 -47406713 -33981097 -48855684 -33330631 25722005 66752161
24336 66752161 46909076 -4478707 -42591145 -62839645 -78869349 -86512872 -75022466
24329 -75022466 -51095089 -32621033 -27626728 -25266411 -3254277 48663956 104792415
24322 104792415 117015935 65646429 -16983152 -86106757 -129827483 -160609112 -183285147
24315 -183285147 -192815846 -188444041 -171762192 -142925658 -108684105 -77715888 -45217666
24308d5217666L7709873J8053687k7370118m4005107l753198L1973384N376656
24301b7232489l1255438j374971M8701147J7020492o5614309o5955812K9064857
24294i6646523Q0885927K4395649l5993567j5250116K2446150N641446j8018511
24287c2539545J850118J0227704l1185914m1359578L1816437Q2609767J5634911
24280C7053900o8395635k6846892P7727739P8164708j5062521m2326814K4054224
24273F4368709M4162857l1578612p6200067j0058232O9105934N6329770o047135
24266A10083224k5835204L709061M0492668O6208733N9461139r696302j02527804
24259A41895515j22607895n6106312l794840k1075619l3967652J9102820P3015761
$$ plain form
24308 -45217666 -7507793 10545894 -16824224 -60829331 -64582529 -32609145 -27232489
24301 -27232489 -58487927 -59862898 -11161751 5858741 -59755568 -125711380 -96646523
24294 -96646523 -15760596 8635053 -27358514 -42608630 -20162480 -14521034 -32539545
24287 -32539545 -30689427 -20461723 -51647637 -93007215 -61190778 21418989 37053900
24280 37053900 -31341735 -58188627 19539112 97703820 82641299 40314485 64368709
24273 64368709 108531566 76952954 752887 -9305345 59800589 116130359 110083224
24266 110083224 84248020 87957081 128449749 194658482 254119621 244423319 141895515
24259 141895515 19287620 -36818692 -40613532 -61689151 -95656803 -76553983 -3538222
24252c538222N2985095Q128138K2015402O5576349N2246279j1616988m1834989
24245A43961064j3304138J6374925Q098644j4888896k2161735j5065591j1036656
24238I1977617k5354379n6248034o9708719l4747398J1799159k224923o1383797
24231a45890474n5929816N1170386J40718275R9505351j5148005o9586048m1708466
24224c6868797l617208K2921086O3774413Q4337864K5476582o2801747o1817398
24217C1404795K9641777P9673227K1904854n3566983n3414408j1400910o01452
24210D3640900j1216022L617128K8796120J7240004k2104269l7952136j5141390
24203F880335J5370955K7336613J8348959l919523k0706275p212412L0604085
$$ plain form
24252 -3538222 49446873 57575011 79590413 145166762 197413041 185796053 143961064
24245 143961064 130656926 147031851 155130495 140241599 118079864 103014273 91977617
24238 91977617 66623238 10375204 -59333515 -94080913 -82281754 -84506677 -145890474
24231 -145890474 -201820290 -150649904 -9931629 89573722 74425717 4839669 -36868797
24224 -36868797 -40486005 -17564919 46209494 130547358 156023940 93222193 31404795
24217 31404795 61046572 140719799 162624653 109057670 55643262 44242352 43640900
24210 43640900 32424878 36042006 64838126 82078130 59973861 22021725 6880335
24203 6880335 22251290 49587903 67936862 64017339 43311064 36098652 66702737
24196F6702737M4459284p79348p5828296j16612529r2080549k4576699M0794249
24189a57921151O9704008N6623841K5185885L006147n079538o488256L217894
24182a1751170K4397485K7743964r716838n1049754l9149321Q835677J4201297
24175c6488660m1000359p6870670l3643574M1926958P3844157N8276155L3280279
24168A9324286N223535k8634402l3665093J0425103M9456740K6285169j8707179
24161B9708159p369121L8712298K5705467m7113360o5408051J9558497R5084983
24154H8878872M4793888p6029073j16664111m0222626M2273425M0025759p720884
24147b4664750j6705177J8925659L9956708K1431258J490598J4824406M1027379
$$ plain form
24196 66702737 111162021 110382673 34554377 -82058152 -174138701 -198715400 -157921151
24189 -157921151 -88217143 -31593302 -6407417 -3401270 -8480808 -14969064 -11751170
24182 -11751170 12646315 40390279 30673441 -20376313 -59525634 -50689957 -36488660
24175 -36488660 -77489019 -154359689 -188003263 -146076305 -72232148 -13955993 19324286
24168 19324286 24547821 -4086581 -37751674 -27326571 22130169 48415338 29708159
24161 29708159 22339038 61051336 86756803 39643443 -25764608 -6206111 88878872
24154 88878872 133672760 57643687 -59020424 -99243050 -56969625 -16943866 -24664750
24147 -24664750 -41369927 -22444268 17512440 38943698 40434296 55258702 96286081
24140I6286081L5927795p803538n1694935n7837214k9462981j495495K359781
24133a3720506n027667M339322L0684813L8342529J372513n2529849o6955537
24126f3494382k8084410J6133435K2512292R080094J4331176K5060918l587950
24119h048827n9920858o7450809J0895313J08365530J33430986Q0032557J4319681
24112B11623573k3893921n0824616p6316536p1207177j7727212M8016519P3211029
24105I2881659M7392145K731689k8388772l6153491k6811694j4621076j4423429
24098B2607031k5987529l0749363j7950100n849069j6971792l6763178k4641014
24091a36305014K4702727N7952988K6073525m4247124p5411622l5645763K3602917
$$ plain form
24140 96286081 132213876 124410338 72715403 14878189 -14584792 -16080287 -13720506
24133 -13720506 -18748173 -14408851 16275962 54618491 55991004 3461155 -63494382
24126 -63494382 -91578792 -75445357 -52933065 -43852971 -29521795 -4460877 -8048827
24119 -8048827 -67969685 -135420494 -124525181 -16159651 117271335 197303892 211623573
24112 211623573 187729652 136905036 60588500 -10618677 -28345889 19670630 92881659
24105 92881659 140273804 143005493 114616721 78463230 51651536 37030460 22607031
24098 22607031 -3380498 -34129861 -52079961 -57929030 -74900822 -111664000 -136305014
24091 -136305014 -111602287 -53649299 -27575774 -71822898 -147234520 -182880283 -159277366
24084a59277366M0918938K1840567J2739853K4699037K9451539K0554644K3560066
24077A4487278L5986238J4131327m8951786q2433690k7293976O4864512Q7218449
24070E8008352K2247499l6593882j8993620L1913814L7564382j769103k4814737
24063F7562705q549014J3836959K3478881L8180710N2838464K2214132n9015757
24056A50547080j10211059n9344771M1861064O7783864j3761747r3181081o5768332
24049h2074982L3277797Q9971934O3898392J3600283r131549j6627637l1405239
24042F1508999m2108527l8822612m0159109n3285167m9603200j4726868J5907534
24035a61288950J0799224l693897R473019K7568196M413270l9796924l3617254
$$ plain form
24084 -159277366 -118358428 -96517861 -83778008 -59078971 -29627432 -9072788 14487278
24077 14487278 50473516 64604843 15653057 -66780633 -94074609 -29210097 58008352
24070 58008352 80255851 43661969 24668349 56582163 94146545 92377442 67562705
24063 67562705 59013691 72850650 96329531 134510241 187348705 209562837 150547080
24056 150547080 40336021 -19008750 22852314 90636178 76874431 -16306650 -82074982
24049 -82074982 -48797185 41174749 105073141 118673424 109541875 92914238 61508999
24042 61508999 19400472 -19422140 -59581249 -112866416 -162469616 -177196484 -161288950
24035 -161288950 -150489726 -154183623 -144710604 -117142408 -112729138 -152526062 -186143316
24028a86143316L4920076Q7124954N9578257q591655l2970373L267215L7807487
24021e007355K0163571k6016757m2631933j5234234J2132332j48018l2150307
24014h8892701l3623783K749228L3559275L5359786L7357921N7143390N2312237
24007I5965353j0634730p5547203n9109433J9014109N0659473o032332o7744028
24000e3428791n2917402P970854L9730780L7278972M6229130P0094074O8801438
23993A63759055L1660793r826018l3477344m0048799k5546634J0022722L4844435
23986A31388210J7324374j8923119k2600634O378474J9148234j174967k0135565
23979A11405007k2467289l9314370q1278671j01540920o2315599N430890M6605275
$$ plain form
24028 -186143316 -151223240 -64098286 -4520029 -13111684 -46082057 -42814842 -5007355
24021 -5007355 15156216 -10860541 -53492474 -68726708 -56594376 -56742394 -88892701
24014 -88892701 -122516484 -119767256 -86207981 -50848195 -13490274 43653116 95965353
24007 95965353 85330623 9783420 -49326013 -30311904 20347569 14315237 -53428791
24000 -53428791 -106346193 -98375339 -58644559 -21365587 24863543 94957617 163759055
23993 163759055 195419848 185593830 152116486 112067687 86521053 96543775 131388210
23986 131388210 148712584 129789465 107188831 113567305 132715539 131540572 111405007
23979 111405007 88937718 49623348 -31655323 -133196243 -195511842 -190080952 -143475677
23972a43475677N1670804M5419858L7222956K1435096M428878m473049j0658236
23965A570630j4625875N55902L1953575L7559509n383150n1825279m7975185j3831227
23957f2001100o841548k0758469M735420O9825365Q9040259J2747456q8023344
23950a275961j07016086l4669566M3405987N7356140J8729809j5271938q091614
23943d6833229K6316394M2014800J2357708l3461576m3394765j4369251L760539
23936e3609380j2116342k2310649J822965J9720086q732039l8583573j78727P9143746
23928c4843913J00485024M0940167j2864952r86454K5899359L546020m0466884
23921H1708367m3836261j5883193r968391k4504319j2356032K5176785L2876390
$$ plain form
23972 -143475677 -91804873 -46385015 -9162059 12273037 16701915 12228866 1570630
23965 1570630 -13055245 -12499343 19454232 57013741 51630591 -194688 -48169873 -62001100
23957 -62001100 -68842648 -89601117 -84865697 -15040332 73999927 86747383 -1275961
23950 -1275961 -108292047 -142961613 -99555626 -42199486 -23469677 -38741615 -46833229
23943 -46833229 -20516835 21497965 33855673 394097 -43000668 -57369919 -53609380
23936 -53609380 -65725722 -88036371 -86213406 -66493320 -75225359 -113808932 -113987659 -34843913
23928 -34843913 65641111 106581278 93716326 92729872 118629231 122175251 81708367
23921 81708367 37872106 21988913 12020522 -12483797 -24839829 336956 33213346
23914C3213346m265644l0856513m940965M2969218O0095703L8427413O491588
23907A41134146j2331485j0272445Q552633K3045221J0649716j7986605k6814697
23900A15976484r122603j753961k7142827n5694091n0770464j9795762Q068575
23893d0234649K5724001L6656288K7433461p737540l5088314j8313293K3198841
23886A1638795L6062016P488131k4280895l3365301l5233480m3034742l7440805
23879a18166281j693487M3540985O5021337N8080916M2340197L0062823J8386206
23872A37572696N446745l707594q323398j8469916m3222800p0968012o9281805
23865g0954084k0550390M0978690N3251210L090168m7789562m1033644R0265J2222296
$$ plain form
23914 33213346 28947702 -1908811 -6849776 36119442 96215145 134642558 141134146
23907 141134146 128802661 118530216 127082849 150128070 160777786 142791181 115976484
23900 115976484 106853881 105099920 77957093 22263002 -28507462 -48303224 -40234649
23893 -40234649 -14510648 22145640 49579101 41841561 6753247 -11560046 11638795
23886 11638795 47700811 55188942 30908047 -2457254 -37690734 -80725476 -118166281
23879 -118166281 -119859768 -76318783 -11297446 46783470 89123667 119186490 137572696
23872 137572696 143019441 139311847 130988449 112518533 69295733 -1672279 -70954084
23865 -70954084 -91504474 -50525784 2725426 5815594 -41973968 -83007612 -82917347 -70695051
23857g0695051r506494j3108747J4777133K3765675j0605329l7027389q334786
23850a10734988L9956132M2832906K386992k4593349j4852403J165379m19717
23843f4259048p978733q265673n186788L434380L0066327O5638575P4033128L5183010
23835A22665178k4989635o0066950m7597107m369700L1872354L6048315J9293425
23828G2855880J2154414J8653015Q919276k6441380m6587150j9977154J6032320
23821C5609221O369565l2539558l9140202j1717936r297518l9942770l4938616
23814a25597814L1273826P8952619M0855385k6889839l0257631J6873917K5126407
23807A0336870j9140201l6580124O642212L8808825m159635p8386309r4739982
$$ plain form
23857 -70695051 -80201545 -93310292 -78533159 -54767484 -65372813 -102400202 -110734988
23850 -110734988 -70778856 -27945950 -25558958 -50152307 -65004710 -63839331 -64259048
23843 -64259048 -72237781 -80503454 -85690242 -82255862 -52189535 13449040 87482168 122665178
23835 122665178 97675543 37608593 -9988514 -14358214 17514140 53562455 72855880
23828 72855880 85010294 103663309 112582585 86141205 39554055 19576901 35609221
23821 35609221 41978786 9439228 -29700974 -41418910 -50716428 -90659198 -125597814
23814 -125597814 -94323988 -15371369 25484016 -1405823 -31663454 -14789537 10336870
23807 10336870 -8803331 -45383455 -38741243 67582 -4092053 -82478362 -177218344
23800a77218344l6115275L6639542O9550030O3419400M7632619L7821203K2119605
23793F3848780j8743969p4038647r5215223n0744924J8067944L6690871l126138
23786a23261306l1502639m034183L6146269L3185257M703147J291648J7190532
23779f6281275N818662l2455315m3973212o337195L6938283M0860185J4282231
23772e1147636o626908n331639J2346441L4052025M2512055K4095700r865735
23765D0034303k8697646j8405675N743645K5278302L3033379J9766017k1311488
23758E5440837o7111586p4979257l6268602R985445L2331182M2655411N6411670
23751A8465100N4175542J6643231l0210669m4110734k3605244j465211M183503
$$ plain form
23800 -177218344 -213333619 -176694077 -107144047 -43724647 3907972 41729175 63848780
23793 63848780 45104811 -28933836 -124149059 -174893983 -156826039 -120135168 -123261306
23786 -123261306 -154763945 -158798128 -122651859 -89466602 -84763455 -83471807 -66281275
23779 -66281275 -60462613 -92917928 -136891140 -143228335 -106290052 -65429867 -51147636
23772 -51147636 -57774544 -63106183 -50759742 -16707717 25804338 49900038 40034303
23765 40034303 11336657 -7069018 -1325373 23952929 56986308 76752325 55440837
23758 55440837 -11670749 -86650006 -122918608 -112933163 -80601981 -37946570 18465100
23751 18465100 72640642 89283873 59073204 14962470 -8642774 -10107985 -5924482
23744e924482j137900j2570488k2892263r131046L7025705P4722164N4118630
23737A14210320j0610161n2027351l7452269m753576j145588k4956079m2313578
23730e9048282k9869910J1359835N6275956O3089037J3265078m9748734n9766580
23723e4443600j4726697J8134172l041033m2251648m8332505k0595157J6414280
23716a48842188N3116338P3697398M6971621j4347968l6116857J6862119P1029838
23709F2370301M5984210j8366905k5958357J7841998K2121511k7645585m7008351
23702B9338822j0948875p076252p5320047j12501250k7527329R9240616J23131735
23695A8337420M2209492k0691906r341698J4439944M183683p041801J611982q863555
$$ plain form
23744 -5924482 -7062382 -19632870 -42525133 -51656179 -14630474 60091690 114210320
23737 114210320 103600159 51572808 14120539 9366963 8221375 -16734704 -59048282
23730 -59048282 -88918192 -77558357 -21282401 41806636 55071714 5322980 -54443600
23723 -54443600 -69170297 -51036125 -54077158 -96328806 -144661311 -165256468 -148842188
23716 -148842188 -95725850 -22028452 24943169 10595201 -25521656 -8659537 62370301
23709 62370301 108354511 89987606 64029249 81871247 103992758 76347173 29338822
23702 29338822 18389947 11313695 -64006352 -176507602 -204034931 -104794315 18337420
23695 18337420 60546912 39855006 30513308 44953252 49136935 42095134 43707116 34843561
23687C4843561m8871475n6187517k65338M4837080M707366p3654418q4841538
23680a79432279j5756984M8450911N3899358L2361909K1858275R475494j9940378
23673d9083694l8592206j9198464J5994701K9500726K4940546L1159310M9287374
23666D4008293N3979166L6896679J3464364p023655k2829501j7082102K3357930
23659A24771174O2758304L9884697m2367200r7453620o2400269J3804108L8182328
23652G7179522K98045l2339306k9243634k9368616m9618670m3547324R261015
23645i7378968M4421155O287761n2198483l9827166L4316835P5783311M6656082
23638A8060527P023007N598915J1292571j5974893n5455940o8478306n7278070
$$ plain form
23687 34843561 -14027914 -70215431 -70480769 -25643689 -20936323 -94590741 -179432279
23680 -179432279 -195189263 -146738352 -92838994 -60477085 -38618810 -29143316 -49083694
23673 -49083694 -87675900 -106874364 -90879663 -61378937 -36438391 -5279081 44008293
23666 44008293 97987459 134884138 148348502 141324847 118495346 101413244 124771174
23659 124771174 187529478 227414175 185046975 87593355 25193086 38997194 77179522
23652 77179522 77477567 45138261 15894627 -13473989 -63092659 -106639983 -97378968
23645 -97378968 -52957813 -46670052 -98868535 -138695701 -104378866 -28595555 18060527
23638 18060527 25083534 30682449 41975020 26000127 -29455813 -97934119 -155212189
23631a55212189l8152208l132981M6024196O8832179M1948312O914423Q299294
23624b4478974J9605871o369628m3853197k7630455L3632615O0398348K4582879
23617C5887459j0934616K691294K9650912K0994484p076836j5873461j5379261
23610C9959975l5809925o1299858m9894736k864772L5965594M1001056K3620161
23603i322505k26944k1104662k3164901q73903J6580681j813689l5115246l2858762
23595a07899931Q303399L7974225L0555343J9182543K8542602K3504347l1939599
23588H222929r6307962q5844315J4738636J20059962J36481557O1971412k2037195
23581A37285024m4582548j2265111J7783289J4378137P81487M934153R711794
$$ plain form
23631 -155212189 -193364397 -196497378 -150473182 -81641003 -39692691 -32778268 -24478974
23624 -24478974 -4873103 -11242731 -55095928 -82726383 -49093768 11304580 35887459
23617 35887459 24952843 27644137 57295049 78289533 71212697 55339236 39959975
23610 39959975 4150050 -57149808 -107044544 -109909316 -73943722 -32942666 -9322505
23603 -9322505 -9549449 -30654111 -53819012 -54692915 -38112234 -39925923 -75041169 -107899931
23595 -107899931 -99596532 -61622307 -31066964 -11884421 16658181 40162528 8222929
23588 8222929 -88085033 -173929348 -159190712 -39130750 97350807 159322219 137285024
23581 137285024 92702476 80437365 98220654 112598791 113380278 118314431 128026225
23574A28026225j7959048o2538090o8292796k0083720K7597395K7211956N931942
23567A9893864J6511174M7519000L8262420k0640860n9577947k4964175M1392288
23560E8395764N4986775k693012o8373158q2952701n3436987j9311795P548091
23553a05837023L9822095O9029068O2364013J3064448l6842628m4726940j8256046
23546b1383013N254758J1913588J1298094j813283l9241331p3286403n3125459
23539a60383049J3917561N0406623J3256918l7323953k3025720L7794889O4616553
23532d0740178L8374326J5303083K3557091K5194419l538470k7341109j8390414
23525A2418748m946144j3633257j7690652R803915L7705445K6790169J340694
$$ plain form
23574 128026225 110067177 47529087 -20763709 -40847429 -13250034 13961922 19893864
23567 19893864 36405038 83924038 122186458 101545598 41967651 17003476 58395764
23560 58395764 113382539 110689527 42316369 -40636332 -94073319 -113385114 -105837023
23553 -105837023 -66014928 3014140 65378153 78442601 41599973 -3126967 -21383013
23546 -21383013 -16128255 -4214667 7083427 5270144 -33971187 -107257590 -160383049
23539 -160383049 -146465488 -96058865 -82801947 -120125900 -143151620 -105356731 -40740178
23532 -40740178 -2365852 12937231 36494322 61688741 58150271 30809162 12418748
23525 12418748 7472604 -6160653 -23851305 -14047390 23658055 50448224 51788918
23518E1788918R720850L7973064K8153121k5252213n9503431l1703109K7123175
23511C8300375N9502938M4956351L013219l5635087m7141556k6756317N299240
23504D1539163K3389366K2788564J4929055O760075K409955R081732J6961748
23497A37859658n293602o0152515q9435056m2546068L8844220O3978048J6997758
23490F0252443k7053433j8080416N882552m389431l3676112m2888018l3279103
23483i3231518k5085533j2801611J2313358K7866855J3982062n028977L744790
23476g8240574K7049501K8865301R018563m130317l615613m415353o311239K943845
23468b8835886J5574785J2451302k359769q601683l156862M365354J6442508L3791471
$$ plain form
23518 51788918 61509768 99482832 127635953 102383740 42880309 11177200 38300375
23511 38300375 97803313 142759664 145772883 110137796 62996240 36239923 41539163
23504 41539163 64928529 87717093 102646148 109406223 111816178 120897910 137859658
23497 137859658 132566056 72413541 -17021515 -59567583 -20723363 43254685 60252443
23490 60252443 33199010 15118594 21001146 16611715 -17064397 -59952415 -93231518
23483 -93231518 -118317051 -131118662 -118805304 -90938449 -76956387 -81985364 -78240574
23476 -78240574 -51191073 -22325772 -13307209 -17437526 -21053139 -25468492 -31779731 -28835886
23468 -28835886 -13261101 -809799 -3169568 -11771251 -14928113 -10562759 5879749 39671220
23460C9671220L1590043q983864n5023191n2207774P28811M8295809N0026418
23453E4097472J9346211r887174k0462828j4020877o852082k0141308m6017498
23446d3938084l8755513K0453896P0372261L9803283m0206406o5738971o996569
23439f5006103N0501791L5291948j4093177k4712165L727739K3685602K3329320
23432C2724955K2761512J7979157r538992m2664157m2145015n457239K9176747
23425B836968L3273555J0433571k2236485m4702405l8929585j3498915o701778
23418g9525074l2670861m6587375n999591N4431022O4689792K4930805N749536
23411a4981746L8270106O9036774M6874662m292587l6044176m9236441o7604241
$$ plain form
23460 39671220 71261263 62277399 7254208 -44953566 -44224755 4071054 54097472
23453 54097472 73443683 63556509 43093681 29072804 22220722 2079414 -43938084
23446 -43938084 -82693597 -62239701 8132560 47935843 7729437 -58009534 -65006103
23439 -65006103 -14504312 20787636 6694459 -18017706 -14289967 9395635 32724955
23432 32724955 55486467 73465624 63926632 21262475 -20882540 -26339779 2836968
23425 2836968 36110523 46544094 24307609 -20394796 -59324381 -72823296 -79525074
23418 -79525074 -112195935 -158783310 -164782901 -110351879 -45662087 -20731282 -14981746
23411 -14981746 23288360 92325134 139199796 134907209 98863033 49626592 -17977649
23404a7977649p3608377l2249331L4467235N9604220K6325406m792981J1334453
23397C102976L2621595l169909p1447252q4828585k2009878L5136595K1759017
23390h8835441j2878149J3424326P7600523P7049613j0273397p8871204m2410485
23383f5194214M4632376P0164775J8894628k9042691k7159571j0053439j0672311
23376h430447o635572K2605112M4066319K1279525k0029334k4743947R279061
23369C7390717K7679117n28327l8746019l4971627P707442L8655628K8260773
23362F5447704Q69264p393760J129848n16777j4230379j3470642Q569198K0221737
23354F0626193k981814l8889817m7686683k3901085L141009R224866m932271k3166784
$$ plain form
23404 -17977649 -91586026 -123835357 -89368122 -29763902 -3438496 -8231477 3102976
23397 3102976 35724571 32554662 -38892590 -123721175 -145731053 -110594458 -88835441
23390 -88835441 -101713590 -88289264 -10688741 66360872 56087475 -22783729 -65194214
23383 -65194214 -20561838 49602937 68497565 39454874 12295303 2241864 -8430447
23376 -8430447 -15066019 7539093 51605412 72884937 52855603 28111656 37390717
23369 37390717 65069834 64541507 25795488 -9176139 -1468697 37186931 65447704
23362 65447704 66316968 58923208 60053056 59536279 45305900 31835258 40404456 60626193
23354 60626193 57644379 18754562 -28932121 -52833206 -49692197 -40467331 -45399602 -68566386
23346f8566386k4295280M304169M3882177N1352192J3506777k4489210j7150703
23339b1456264J3437405J1847830k0761011k7510020R079975L3665988M799382
23332C103285l8396788l7099764q4058K0489600J5222085K1913918M9824563N6945894
23324I1918735J9142519k3814485k3491464L900037K68215m4943616p0099509
23317d7119568k4636783N1690905O9977682Q697979n1490912l1051116M0589248
23310A6657435O1924418l889999p7102419o4826368K0350140Q1581958O0934900
23303I5630065n30305l0528462j5959430k47488j0569214k3729364r023461K3874929
23295B8917270M0085252K8016995Q790525P46475k497896j3994711l1750913m2551704
$$ plain form
23346 -68566386 -92861666 -88557497 -44675320 6676872 20183649 -4305561 -21456264
23339 -21456264 -8018859 3828971 -16932040 -44442060 -35362085 -1696097 3103285
23332 3103285 -35293503 -72393267 -72477325 -51987725 -36765640 -14851722 34972841 91918735
23324 91918735 111061254 87246769 63755305 67655342 67923557 22979941 -47119568
23317 -47119568 -71756351 -20065446 49912236 58610215 7119303 -23931813 16657435
23310 16657435 78581853 74691854 -2410565 -67236933 -46886793 34695165 95630065
23303 95630065 95099760 64571298 48611868 48364380 37795166 14065802 5042341 28917270
23295 28917270 69002522 97019517 105810042 106556517 104058621 90063910 58312997 15761293
23287A5761293l4751043m100206L8511005O4681813N4303466K5192021J1001340
23280A70599689P438735k2324816p7293383j00134558n8085614K023375K2484036
23273e5292536J7953454L3101294N1279639K1214650l9349583n1267118M009812
23266a8350388M9633474K9538204j1569513q189854K5485061L2018651O201931
23259A04767566q430731K396074P163541j4547777m4902244o0574886n7962018
23252g2090475m1114356j1403592K4712536N4869898O9852453O2959107K7487230
23245A15272801k9785851p8466252q4730936m3000739J8098382N7162487M8457527
23238C007419M768224k5474709m879074M3150413N6314412J3612674l7854565
$$ plain form
23287 15761293 -18989750 -23089956 15421049 80102862 134406328 159598349 170599689
23280 170599689 178038424 155713608 78420225 -21714333 -79799947 -77776572 -55292536
23273 -55292536 -37339082 -4237788 47041851 68256501 28906918 -22360200 -18350388
23266 -18350388 31283086 60821290 49251777 41061923 66546984 98565635 104767566
23259 104767566 96336835 98732909 105896450 91348673 46446429 -14128457 -72090475
23252 -72090475 -113204831 -124608423 -99895887 -45025989 24826464 87785571 115272801
23245 115272801 85486950 7020698 -77710238 -120710977 -102612595 -45450108 3007419
23238 3007419 7775643 -17699066 -22578140 20572273 76886685 90499359 52644794
23231E2644794n1940258m2145114m1796301m0811308q173748M2539280O1671166
23224b8011489L5249503L174150j174144R609528J1774934J0823999K2914240
23217F4360721L6544182K2113926k2223206n7111065m6342502m508671J7690704
23210A0524089k858520l4156034l8050778k2054824j3232646k455630L6626729
23203f5657614Q0140653O6500334q152621o5506145m7836086N396202K3954821
23196a1160456L745049j2854392j4093546j5412010n997264L4369207P6921922
23189E5518510O8221448J4040336k1176961p693851J2823199J113375k1276884
23182A01569172j6569240O386291J0979047q012874k0744663j1893424l635473
$$ plain form
23231 52644794 704536 -41440578 -83236879 -124048187 -132221935 -89682655 -28011489
23224 -28011489 7238014 10412164 9238020 18847548 30622482 41446481 64360721
23217 64360721 100904903 123018829 100795623 43684558 -2657944 -7166615 10524089
23210 10524089 7665569 -26490465 -64541243 -86596067 -99828713 -102284343 -65657614
23203 -65657614 14483039 80983373 72830752 7324607 -40511479 -35115277 -11160456
23196 -11160456 -7415407 -20269799 -34363345 -49775355 -55772619 -21403412 55518510
23189 55518510 123739958 137780294 116603333 108909482 121732681 122846056 101569172
23182 101569172 84999932 91386223 102365270 94352396 73607733 61714309 58078836
23175E8078836j9686617m4320153l8135645N568757M5169927M8221943L8076257
23168I2973305M6791369M6466766r132697q2960441q0737027r1975M0246745k6375271
23160B7180774j02383869p0189514K7535371N9937502P961101l0105891p619318
23153h7683844K1170847K0157185K1251934L8666370L9410616K1429557K2682717
23146I7085382L1839810p515554p8853937q9048778j9695051L1063877Q381035
23139b6743216j3112493K8909204P0362801L9135416j3338197o160843K8705871
23132A07758543J4907252k4519212j6010408K1032717Q301058m3275577m7479393
23125B0714980M949706K9991941o326166l9084994j8817002K1433815L8120361
$$ plain form
23175 58078836 38392219 -5927934 -44063579 -38494822 6675105 54897048 92973305
23168 92973305 139764674 186231440 177098743 94138302 13401275 13309300 53556045 27180774
23160 27180774 -75203095 -145392609 -117857238 -57919736 -49958635 -80064526 -87683844
23153 -87683844 -66512997 -46355812 -25103878 13562492 52973108 74402665 97085382
23146 97085382 128925192 121409638 42555701 -46493077 -66188128 -35124251 -26743216
23139 -26743216 -39855709 -10946505 59416296 98551712 85213515 79052672 107758543
23132 107758543 122665795 98146583 82136175 103168892 111469950 68194373 20714980
23125 20714980 25664686 55656627 49330461 10245467 -8571535 12862280 50982641
23118E0982641L3401787J6283206j6962915m3202820k5922121J3448925J1670714
23111C9699417k9881596l4335237K6951287Q0267286O1464631R289017o759535
23104A46695270Q030461J406166l4212767n8311222m7744162j7668933R151431
23097G346244J9904324J1614398k937099m458717L619189j395969j7968659j4017751
23089A705960J8998402M2422387K5049986j1650484k9327135k3568382j1852673
23082A1778061J126756J7195877K6770495K3368204J6469676J0461514n468015
23075A01702568k8524139l2631570r462145J0702735L797090j1917741j1157882
23068B2508916k992113o875857j6014125j7358837k0979207l4084248l1638425
$$ plain form
23118 50982641 84384428 100667634 83704719 40501899 14579778 28028703 39699417
23111 39699417 9817821 -24517416 2433871 82701157 144165788 153454805 146695270
23104 146695270 154725731 156131897 121919130 63607908 15863746 -1805187 7346244
23097 7346244 27250568 38864966 35927867 31469150 35088339 33692370 15723711 1705960
23089 1705960 20704362 63126749 88176735 76526251 47199116 23630734 11778061
23082 11778061 12904817 30100694 56871189 80239393 96709069 107170583 101702568
23075 101702568 73178429 40546859 31084714 41787449 45584539 33666798 22508916
23068 22508916 19516803 12640946 -3373179 -20732016 -41711223 -75795471 -107433896
23061a07433896O871646N1672567N5449390J8268268j8180908k8929783k2156762
23054d4439478j0136747j356436j0459731l7712450m8442725j3329079L8097249
23047a27779397M7086052O961568k7770656j7358012J7911790L6339036K3654055
23040d0955564o301225k9975318k6220196K916759K2165809M105590k3229753
23033i7493898j0763657L0041779L3825943j6174499n0922668j5102321M7943497
23026g8645824O1213977K5979400P871700L1264188N1786190L3665809l243833
$$ plain form
23061 -107433896 -100562250 -48889683 6559707 24827975 6647067 -22282716 -44439478
23054 -44439478 -54576225 -55932661 -66392392 -104104842 -152547567 -165876646 -127779397
23047 -127779397 -80693345 -73731777 -101502433 -118860445 -100948655 -64609619 -40955564
23040 -40955564 -47256789 -77232107 -103452303 -100535544 -78369735 -74264145 -97493898
23033 -97493898 -108257555 -78215776 -44389833 -60564332 -111487000 -126589321 -78645824
23026 -78645824 -17431847 8547553 16419253 47683441 99469631 133135440 129891607
$$ [...]
##END NTUPLES=NMR SPECTRUM
##END=
