##TITLE=31Pdec_LR-79_NaOH
 , 24 sc
 24.12.2024
##JCAMPDX= 6.0         $$ Bruker NMR JCAMP-DX V2.0
##DATA TYPE= NMR SPECTRUM
##DATA CLASS= NTUPLES
##ORIGIN= UXNMR, Bruker Analytische Messtechnik GmbH
##OWNER= root
$$ XWIN-NMR		Version 3.5
$$ Tue Dec 24 14:37:53 2024 Russian Standard Time (UT+4h)  she@DPX200
##.OBSERVE FREQUENCY= 81.013821
##.OBSERVE NUCLEUS= ^31P
##.ACQUISITION MODE= SIMULTANEOUS
##.ACQUISITION SCHEME= undefined
##.AVERAGES= 24
##.DIGITISER RES= 17
##SPECTROMETER/DATA SYSTEM= spect
##.PULSE SEQUENCE= zgpg30
##.SOLVENT NAME= CDCl3
##.SHIFT REFERENCE= (INTERNAL, CDCl3, 0, 198.062)
##AUDIT TRAIL= $$ (NUMBER, WHEN, WHO, WHERE, WHAT)
$$ ##TITLE= Audit trail, XWIN-NMR		Version 3.5
$$ ##JCAMPDX= 5.01
$$ ##ORIGIN= Bruker BioSpin GmbH
$$ ##OWNER= she
$$ F:/spectra/data/she/nmr/P31/2/pdata/1/auditp.txt
$$ ##AUDIT TRAIL=  $$ (NUMBER, WHEN, WHO, WHERE, WHAT)
(   1,<2024-12-24 14:37:01.59 +0400>,<she>,<DPX200>,
      <created by zg, POWCHK disabled, PULCHK disabled
       configuration hash MD5:
       00 E9 B6 7A A2 85 ED C7 34 08 36 98 17 FE 4E 26
       data hash MD5: 32K
       1F 64 CB 26 E3 6A 08 26 88 72 7C 56 77 8C 52 8C>)
(   2,<2024-12-24 14:37:04.00 +0400>,<she>,<DPX200>,
      <Start of raw data processing
       efp BC_mod = 2 LB = 1.5 FT_mod = 6 PKNL = 1 PHC0 = 2103.214 PHC1 = 137.486 SI = 64K 
       data hash MD5: 64K
       B0 F4 4D 00 8B 02 F1 9A 72 58 D5 54 2A 27 45 CA>)
(   3,<2024-12-24 14:37:17.29 +0400>,<she>,<DPX200>,
      <pk PHC0 = -31.8912 PHC1 = 0 
       data hash MD5: 64K
       C2 C5 36 D4 69 93 8A 60 5C 53 E1 95 49 8F ED 84>)
(   4,<2024-12-24 14:37:21.53 +0400>,<she>,<DPX200>,
      <abs ABSG = 5 
       data hash MD5: 64K
       39 31 6B 85 7F 88 EF 39 08 CE CB A1 CA 1A 4D D1>)
$$ ##END=
$$ 
$$ hash MD5
$$ CA EC 6D 5E 61 DB FE DF 9D 7B EA A8 15 7C 8A 5E
##$RELAX= 
##$RELAX= 
##$RELAX= 
##$RELAX= 
##$RELAX= 
##$RELAX= 
##$RELAX= 
##$RELAX= 
$$ Bruker specific parameters
$$ --------------------------
##$DU= <F:/spectra>
##$EXPNO= 2
##$NAME= <P31>
##$PROCNO= 1
##$TYPE= <nmr>
##$USER= <she>
##$AMP= (0..31)
100 100 100 100 100 100 100 100 100 100 100 100 100 100 100 100 100 100 
100 100 100 100 100 100 100 100 100 100 100 100 100 100 
##$AQSEQ= 0
##$AQ_mod= 1
##$AUNM= <au_zg>
##$AUTOPOS= <>
##$BF1= 81.014009
##$BF2= 200.13
##$BF3= 200.13
##$BF4= 200.13
##$BF5= 200.13
##$BF6= 200.13
##$BF7= 200.13
##$BF8= 200.13
##$BYTORDA= 1
##$CFDGTYP= 0
##$CFRGTYP= 5
##$CHEMSTR= <none>
##$CNST= (0..31)
1 1 145 1 1 1 1 1 1 1 1 1 1 1 1 1 1 1 1 1 1 1 1 1 1 1 1 1 1 1 1 1 
##$CPDPRG= <waltz16>
##$CPDPRG1= <>
##$CPDPRG2= <waltz16>
##$CPDPRG3= <>
##$CPDPRG4= <mlev>
##$CPDPRG5= <mlev>
##$CPDPRG6= <mlev>
##$CPDPRG7= <mlev>
##$CPDPRG8= <mlev>
##$CPDPRGB= <>
##$CPDPRGT= <>
##$D= (0..31)
0 1 0 0 0 0 0 0 0 0.06 0 0.03 2e-05 3e-06 0 0 0.0002 0 0 0 0 0 0 0 0 0 
0 0 0 0 0 0 
##$DATE= 1735036621
##$DBL= (0..7)
120 120 120 11 120 120 24 19 
##$DBP= (0..7)
150 150 150 150 150 150 150 150 
##$DBP07= 0
##$DBPNAM0= <>
##$DBPNAM1= <>
##$DBPNAM2= <>
$$ [...]
##$SUBNAM3= <"">
##$SUBNAM4= <"">
##$SUBNAM5= <"">
##$SUBNAM6= <"">
##$SUBNAM7= <"">
##$SUBNAM8= <"">
##$SUBNAM9= <"">
##$SW= 400.765351723535
##$SWIBOX= (0..15)
0 1 3 0 0 0 0 0 0 0 0 0 0 0 0 0 
##$SW_h= 32467.5324675325
##$TD= 32768
##$TD0= 1
##$TE= 0
##$TE2= 300
##$TE3= 300
##$TEG= 300
##$TL= (0..7)
0 120 53 12 22 120 120 120 
##$TP= (0..7)
150 150 150 150 150 150 150 150 
##$TP07= 0
##$TPNAME0= <>
##$TPNAME1= <>
##$TPNAME2= <>
##$TPNAME3= <>
##$TPNAME4= <>
##$TPNAME5= <>
##$TPNAME6= <>
##$TPNAME7= <>
##$TPOAL= (0..7)
0.5 0.5 0.5 0.5 0.5 0.5 0.5 0.5 
##$TPOFFS= (0..7)
0 0 0 0 0 0 0 0 
##$TUNHIN= 0
##$TUNHOUT= 0
##$TUNXOUT= 0
##$USERA1= <user>
##$USERA2= <user>
##$USERA3= <user>
##$USERA4= <user>
##$USERA5= <user>
##$V9= 5
##$VALIST= <valist>
##$VCLIST= <CCCCCCCCCCCCCCC>
##$VD= 0
##$VDLIST= <DDDDDDDDDDDDDDD>
##$VPLIST= <PPPPPPPPPPPPPPP>
##$VTLIST= <TTTTTTTTTTTTTTT>
##$WBST= 1024
##$WBSW= 4
##$XGAIN= (0..3)
0 0 0 0 
##$XL= 0
##$YL= 0
##$YMAX_a= 4255
##$YMIN_a= -4624
##$ZGOPTNS= <>
##$ZL1= 120
##$ZL2= 120
##$ZL3= 120
##$ZL4= 120
##$ABSF1= 198.0616
##$ABSF2= -202.7028
##$ABSG= 5
##$ABSL= 3
##$ALPHA= 0
##$AQORDER= 0
##$ASSFAC= 0
##$ASSFACI= 0
##$ASSFACX= 0
##$ASSWID= 0
##$AUNMP= <proc_1d>
##$AZFE= 0.1
##$AZFW= 0.5
##$BCFW= 0
##$BC_mod= 2
##$BYTORDP= 0
##$COROFFS= 0
##$CY= -3
##$DATMOD= 1
##$DC= 0
##$DFILT= <>
##$DTYPP= 0
##$F1P= 0
##$F2P= 0
##$FCOR= 1
##$FTSIZE= 65536
##$FT_mod= 6
##$GAMMA= 0
##$GB= 0
##$INTBC= 1
##$INTSCL= 9.790993e-09
##$ISEN= 30
##$LB= 1.5
##$LEV0= 0
##$LPBIN= 0
##$MAXI= 10000
##$MC2= 0
##$MEAN= 0
##$ME_mod= 0
##$MI= 50
##$NCOEF= 0
##$NC_proc= -9
##$NLEV= 6
##$NOISF1= 182.463
##$NOISF2= 159.3651
##$NSP= 0
##$NTH_PI= 0
##$NZP= 0
##$OFFSET= 198.0616
##$PC= 4
##$PHC0= 2071.323
##$PHC1= 137.486
##$PH_mod= 1
##$PKNL= yes
##$PPARMOD= 0
##$PSCAL= 0
##$PSIGN= 0
##$REVERSE= no
##$SF= 81.0140089999434
##$SI= 65536
##$SIGF1= 159.3651
##$SIGF2= -187.1042
##$SINO= 113.3802
##$SIOLD= 16384
##$SREGLST= <1H.CDCl3>
##$SSB= 0
##$STSI= 65536
##$STSR= 0
##$SW_p= 32467.5324675325
##$SYMM= 0
##$S_DEV= 0
##$TDeff= 32768
##$TDoff= 0
##$TI= <>
##$TILT= no
##$TM1= 0
##$TM2= 0
##$TOPLEV= 0
##$USERP1= <user>
##$USERP2= <user>
##$USERP3= <user>
##$USERP4= <user>
##$USERP5= <user>
##$WDW= 1
##$XDIM= 65536
##$YMAX_p= 542374956
##$YMIN_p= -161989546
$$ End of Bruker specific parameters
$$ ---------------------------------
##NTUPLES= NMR SPECTRUM
##VAR_NAME=  FREQUENCY,     SPECTRUM/REAL,   SPECTRUM/IMAG
##SYMBOL=    X,             R,               I
##VAR_TYPE=  INDEPENDENT,   DEPENDENT,       DEPENDENT
##VAR_FORM=  AFFN,          ASDF,            ASDF
##VAR_DIM=   65536,         65536,           65536
##UNITS=     HZ,            ARBITRARY UNITS, ARBITRARY UNITS
##FACTOR=    0.49542278885378, 1,            1
##FIRST=     16045.7642231865, 0,            0
##LAST=      -16421.768244346, 0,            0
##MIN=       -16421.768244346, -161989546,   0
##MAX=       16045.7642231865, 542374956,    0
$$ Real data points
##PAGE= N=1
##DATA TABLE= (X++(R..R)), XYDATA
$$ [...]
41564a1768794K586699P185969M616931j065780l282690p59626K010907J124997
41556F48613k266758m398203l762843j720427N26337K778028L754859J467911
41548b972483k946443m748223j417901L303820M153258J328863p11529j32394
41540d143032O99324J82439k77501K23173K48336p92945r62146Q00907K372801
41531a648644J632098l38193j281921j009539n93265j39179N67718P55185q186
41522b063926o21316m64632r74268l004174m224063j962297K316222M362402K749934
41513c886118L46543j25288O21205O44017K02117J103760L314356M045517J079859
41504G345968l646283n286508j732100L192814M026317N24018k396063j713721
$$ y = [-11768794, -9182095, -1996126, 2620805, 1555025, -1727665, -2487291, -476384, 648613, -1618145, -6016348, -9779191, -11499618, -10973281, -8195253, -4440394, -2972483, -5918926, -10667149, -12085050, -8781230, -4627972, -3299109, -4010638, -4143032, -3443708, -3261269, -3538770, -3315597, -3067261, -3860206, -4822352, -4021445, -1648644, -16546, -354739, -1636660, -2646199, -3239464, -3378643, -2810925, -2055740, -2063926, -2685242, -3149874, -4124142, -7128316, -11352379, -13314676, -10998454, -6636052, -3886118, -3539575, -3664863, -3043658, -2399641, -2197524, -1093764, 2220592, 6266109, 7345968, 3699685, -1586823, -3318923, -126109, 3900208, 4424226, 2028163, 314442]
41496C14442o335n40514j908537p06286K455616L469112Q43552k119934j904993
41487a03877R91188L360857L053080N21848k141064k897401j252527J365920L013761
41478E911785K975317J798832J80095j389859k347718k357918j634214m22620
41470B713700J182354K394355J909770r5524j492050j094265n72917j594634k575151
41461G75638j040599J753336K036423n31549j749856Q88636L915680K363791l243567
41452E167933p254491n914666j570581R10392J69646r29556j35334R26755k39140
41443h869042k268498j178931L399153O422526L855678j455272l255230j627L644385
41434B93142L214952o17212l992225m322492j896888J132869K401321J208929
$$ y = [314442, 308107, -232407, -2140944, -2847230, -391614, 3077498, 3921050, 1801116, -103877, 887311, 4248168, 7301248, 7823096, 5682032, 2784631, 1532104, 2898024, 5911785, 8887102, 10685934, 10866029, 9476170, 7128452, 4770534, 3136320, 2713700, 3896054, 6290409, 8200179, 8104655, 6612605, 5518340, 4945423, 3350789, 775638, -264961, 1488375, 3524798, 2993249, 1243393, 2132029, 6047709, 8411500, 5167933, -2086558, -8001224, -9571805, -8661413, -8491767, -9421323, -9556657, -8629902, -8869042, -11137540, -12316471, -8917318, -2494792, 1360886, -94386, -3349616, -3351243, 293142, 3508094, 2890882, -1101343, -5423835, -7320723, -6187854, -3786533, -2577604]
41426b577604o35759q40356M71709J262035Q88372R49780K335790L431095K422223
41417G707285m2375j833146k105696j820286j854714j690596l23235J883988K936013
41408B857238J489320r21138j374565M10701J414781l33901k867172l458096k476107
41399e258939j559106j74516K418899L581992L66825m481753m780072K35603M391959
41390e259108L434475L93147l99688J80581o37056j585706L84582M116112N278464
41381E905803K523950j353931l888580m910460m278922j354158K558739M221417
41373e76142K144478j593614l990297m085055k816530j402885m84347J49614J368533
41364a1286245L495505N312155N124135K767274k02056k138914k503577j888157
$$ y = [-2577604, -3213363, -4053719, -3582010, -2319975, -1431603, -481823, 1853967, 5285062, 7707285, 7664910, 5831764, 3726068, 1905782, 51068, -1639528, -1962763, -78775, 2857238, 4346558, 3425420, 2050855, 2461556, 3876337, 3542436, 675264, -2782832, -5258939, -6818045, -6992561, -4573662, -991670, -624845, -5106598, -9886670, -9651067, -5259108, -1824633, -1431486, -1831174, -1650593, -2287649, -3873355, -3488773, 627339, 5905803, 8429753, 7075822, 3187242, -1723218, -6002140, -7356298, -4797559, -576142, 1568336, -25278, -4015575, -8100630, -10917160, -12320045, -12804392, -12654778, -11286245, -7790740, -2478585, 2645550, 5412824, 5210768, 3071854, 568277, -1319880]
41356a319880j579056k491572l729490k948561Q49087N596233Q254861P847240
41348A0478862N365005J786794k139626m900495n020998k924642n81247P44803
41340B808456J301955J565732J305425N2039k137152m246126m467435j777703
41332e594809K144320L960054K597207O17134L86626P29606n47904k505403k370678
41323e83847j08150J493862J242364R95130K060494K858322J525094j005092k055120
41314F423057m71013K198156L430144K205551j34981j678068k473436m067099
41306E432311o128874n709483j566046K834365L396590J069629J74760J881763
41298A385015L011218J337828j566428l495420m293975m287902l044231j098856
$$ y = [-1319880, -2898936, -5390508, -9119998, -12068559, -11219472, -5623239, 2631622, 10478862, 15843867, 17630661, 15491035, 10590540, 5569542, 2644900, 2063653, 2808456, 4110411, 5676143, 6981568, 7033607, 4896455, 650329, -3817106, -5594809, -3450489, 509565, 3106772, 3723906, 4110532, 4840138, 4292234, 1786831, -583847, -691997, 801865, 2044229, 3039359, 5099853, 7958175, 9483269, 8478177, 6423057, 5952044, 8150200, 11580344, 13785895, 13650914, 11972846, 9499410, 5432311, -696563, -6406046, -7972092, -5137727, -1741137, -671508, -496748, 1385015, 4396233, 5734061, 4167633, 672213, -3621762, -7909664, -10953895, -12052751]
41290a2052751l28700j141369j496237P4037K634706M945222O809386P293358
41282F737652M632566l55179l647616k962530p56260r8091l10752N48673J571501
41273E359964Q93722l41250J77800J466145O43484j913234k903107j567732q25228
41264I90564k205434l302498j723074J348635L211290L012321J498270o02462
41256B227612k322983k305714o55637L77993p40630k415823k128303j73099Q27824
41247g308760j74354j291040o11866J238241K388994K355652K097445K102704
41239G97016J896825J380572J125307R22591l41148k387818k859703p53946J033900
41230H13596n28392l251214k018700L220768O133791K633053l167068m817340
$$ y = [-12052751, -12381451, -13522820, -15019057, -14945020, -12310314, -7365092, -555706, 6737652, 11370218, 11015039, 7367423, 4404893, 3648633, 3550542, 3239790, 3788463, 5359964, 6253686, 5912436, 6090236, 7556381, 8199865, 6286631, 3383524, 1815792, 990564, -1214870, -4517368, -6240442, -4891807, -1680517, 1331804, 2830074, 2227612, -95371, -2401085, -3056722, -2678729, -3419359, -5835182, -7963485, -8136584, -7308760, -7483114, -8774154, -9386020, -8147779, -5758785, -3403133, -1305688, 797016, 2693841, 4074413, 5199720, 6122311, 5781163, 3393345, 533642, -220304, 813596, 285204, -2966010, -4984710, -1763942, 4369849, 7002902, 3835834, -981506]
41222i81506k035871P65946J858666K970760L944993K209651j922821m311105
41214B498713k742836K38208J577642J164333j82846k315030l755963k121084
41206e638863J380757J968349j517307l685042m90890L992360L510248q96040
41198a376428l004034r57851J286075J202843N12728O47979Q57547J413627L500427
41189D082913N117621K555992k665400m069960K23501L896553J811351k358738
41181H593833k541327K10754M07731k620577m280176k252482R70646K720193K724575
41172C933170J264018j049768j769302J087857N163940N933181K762646q52706
41164A6473036k866573m332039n415825m365014j381577O80394O73027L82299
$$ y = [-981506, -3017377, -2251431, -392765, 2577995, 6522988, 8732639, 6809818, 2498713, -244123, -5915, 1571727, 2736060, 2553214, 238184, -3517779, -5638863, -4258106, -2289757, -3807064, -7492106, -7982996, -3990636, -480388, -1376428, -4380462, -5338313, -4052238, -2849395, -2336667, -1688688, -831141, 582486, 4082913, 9200534, 11756526, 9091126, 5021166, 5244667, 9141220, 10952571, 8593833, 6052506, 6263260, 6670991, 4050414, -229762, -2482244, -1511598, 1208595, 3933170, 5197188, 4147420, 2378118, 3465975, 8629915, 14563096, 17325742, 16473036, 13606463, 9274424, 3858599, -506415, -1887992, -1207598, -534571, -152272]
41156a52272N42653j38509j024779M74563L329015K582634k723032o567668m496365
41147h173760j84133R95205K95134J894812M690885M389318J477247L33392J402785
41138G120885P99577k315222m183464l126801k048385k683683k488932M89441
41130h436584L894017M697589L237613J411323k30864j546124j616535n11673
41122H98762K8942o18996o79570R54773K539064K028814J0482j343613p37148
41113C081510J613126L987943L466183j251341o770157p725948l474536J117806
41105e955414K603888K860240M224640M866249K284148j756358l591649k866781
41097B668963j841100j137803L43344K333281L123971K017666l36352k996383
$$ y = [-152272, 390381, 251872, -772907, -298344, 3030671, 5613305, 2890273, -3677395, -8173760, -8357893, -7362688, -7067554, -5172742, -481857, 3907461, 5384708, 5718100, 7120885, 7920462, 5605240, 1421776, -1705025, -3753410, -6437093, -8926025, -8436584, -4542567, 155022, 3392635, 4803958, 4573094, 3026970, 1410435, 898762, 927704, 308708, -370862, 583911, 3122975, 5151789, 5162271, 3818658, 3081510, 4694636, 8682579, 12148762, 10897421, 4127264, -3598684, -7073220, -5955414, -3351526, -491286, 3733354, 8599603, 10883751, 9127393, 5535744, 2668963, 827863, -309940, 33404, 2366685, 5490656, 7508322, 7171970, 4175587]
41089D175587m314288k396221J692602L437550N62111l059770k754663n3569K06826
41080b503835j908508j681055K089663M887638L650217J012420K04849J01208
41072E852597j617671l684482l169863l16726J701500R93962j398347l411671
41064e050701l612727j498703K036652M635370M284377J444804j342251k046251
41056a149430r23768K23510J90373m54327m91203r7766p77130k768260l793990
41047a0041991j777377J993528M148183L384124J616504R70980J324642J254007
41039B872600O8590j685958k881715k607421r29122J052122K258367K340470J050226
41030A538159j831216m952624n349019j865232K464325L665596J693567k24790
$$ y = [4175587, -138701, -2534922, -842320, 2595230, 3157341, 97571, -2657092, -2710661, -2503835, -4412343, -6093398, -4003735, 883903, 4534120, 5546540, 5751389, 5852597, 4234926, 550444, -2619419, -2936145, -1234645, -240683, -1639030, -5050701, -8663428, -10162131, -8125479, -3490109, 794268, 2239072, 896821, -1149430, -2073198, -1849688, -1659315, -2113642, -2604845, -2702611, -3479741, -6248001, -10041991, -11819368, -9825840, -5677657, -2293533, -677029, 293951, 1618593, 2872600, 2941190, 1255232, -1626483, -4233904, -5163026, -4110904, -1852537, 487933, 1538159, -293057, -5245681, -10594700, -12459932, -9995607, -6330011, -4636444, -4861234]
41022d861234l69114N2292r7240l60576l13256r204J391948M586867P340340N913222
41012A3274045L21734m778348n861272m457835l701868l705324k710740p51216
41004a2370824N18212M89306j69991j170270k490331l111282j677477J537096
40996a8445561M432234M948285K767336m48762k322465j930641p71184o89228
40988a2459986j052052N43515M650944Q653668R412139N937016m22182o652911
40980H610151r146368o549900j971186k9239j279740k002110J11939L008039L829024
40971e419390K421963J65393j761718j842998P66815L438087K047169k510408
40963b695087m070490l1252M163773L124465l99194o67385J578251J212804k008673
$$ y = [-4861234, -5230348, -5178056, -5275296, -5635872, -5949128, -5958332, -4566384, 20483, 7360823, 13274045, 13595779, 8817431, 2956159, -1501676, -5203544, -8908868, -11619608, -12370824, -11852612, -11363306, -11533297, -12703567, -15193898, -18305180, -19982657, -18445561, -14013327, -9065042, -6297706, -6746468, -9068933, -10999574, -11770758, -12459986, -13512038, -12968523, -8317579, 336089, 9748228, 15685244, 15263062, 8610151, -536217, -7086117, -9057303, -9086542, -10366282, -12368392, -12256453, -9248414, -5419390, -2997427, -2832034, -4593752, -6436750, -5669935, -2231848, -184679, -2695087, -6765577, -6796829, -2633056, 491409, 92215, -575170, 1003081, 2215885, 207212]
40954B07212l309773j416655l78614k016149k775350j39342L052537L387109J852098
40945a536927J163099J348160Q81081j51891o47508n93792n19081j85803N99674
40936C57012J149891J046226Q27480P50875M33404K78465J211592K313800J233884
40927I602629j845195l364709j442118P44807o85686m450153n835460l432264
40919a0708149p15519n55919j241224L72780L696387M838412J929907k213497
40911d596822l828152l033554k761556l394071j572221M245571R718694R096249
40903C874138K650081l388098m193434j015000J754013J648489n20091k419011
40895a608913k302435m99814Q50290M66443k43716M30868J298757O8544k288470
$$ y = [207212, -3102561, -4519216, -4897830, -6913979, -9689329, -9828671, -6776134, -3389025, -1536927, -373828, 974332, 1855413, 1703522, 1056014, 462222, -56859, -242662, 357012, 1506903, 2553129, 3380609, 4131484, 4564888, 4843353, 6054945, 8368745, 9602629, 7757434, 4392725, 2950607, 3695414, 3009728, -1440425, -7275885, -10708149, -11423668, -11979587, -13220811, -12848031, -9151644, -4313232, -2383325, -4596822, -8424974, -11458528, -14220084, -17614155, -19186376, -14940805, -5222111, 3874138, 6524219, 3136121, -1057313, -2072313, -318300, 1330189, 810098, -1608913, -3911348, -4411162, -3560872, -3094429, -3338145, -2907277, -1608520, -1539976, -3828446]
40886c828446k405979O1146J610991N13393n14379P76088K034419R6917l557259
40877e213109m617056k079517N65715K09527k113478k818104M0419M576194O927285
40868d522124N473245K673230J715164K301630J947097O92833J126463L422827
40860A4830365M165298J473837k159043l883322l941830l151979o83342K891931
40852I541915L983831R99400k151597j483232J001907J027622q42594r06482Q45984
40843A2016754J167156l29885j134888j310210l096284n061268l016301K088013
40835A323087L589408j103415n993595n198410j043551P85061j44088k94753J067683
40826g012573J884051K301069M154165N914211L437644l171021p766005n454416
$$ y = [-3828446, -6234425, -6173279, -4562288, -4048895, -4563274, -3787186, -1752767, -1655850, -5213109, -9830165, -11909682, -11343967, -11134440, -13247918, -16066022, -16025603, -11449409, -4522124, 951121, 3624351, 5339515, 7641145, 9588242, 10281075, 11407538, 14830365, 18995663, 20469500, 18310457, 14427135, 10485305, 7333326, 6649984, 9541915, 13525746, 14525146, 12373549, 10890317, 11892224, 12919846, 12077252, 11170770, 12016754, 13183910, 12854025, 11719137, 10408927, 7312643, 2251375, -764926, 1323087, 4912495, 3809080, -2184515, -7382925, -8426476, -7641415, -7785503, -8080256, -7012573, -5128522, -2827453, 1326712, 7240923, 10678567, 7507546, -258459, -5712875]
40818e712875J013647M553656K116839k390937l382673j67045K763496J726970
40810E21078j409348k049707L27952J141832k423864o492953n387197K52736M026014
40801a1493457K352713j256944j838622L41200J433266M07238K42345K676581
40793g135680M976756L674551l90584l157357k770957j348433r71696n58258J585900
40784f095758M044312L778589O75792k039850k157897q89456j90858J34984J198997
40775a541145K411979K020623j46287j956924j362462J069298K488466R63326
40767C946874j827697k283632J35089J435924j388398n075030l906514J703113
40759g260271M916389J938547k674656k898174L58442J717295l28412k180064
$$ y = [-5712875, -4699228, -145572, 1971267, -419670, -3802343, -3969388, -1205892, 521078, -888270, -2937977, -2610025, -1468193, -3892057, -10385010, -15772207, -15519471, -11493457, -9140744, -10397688, -12236310, -11895110, -10461844, -10054606, -9812261, -7135680, -2158924, 1515627, 1125043, -2032314, -4803271, -6151704, -7123400, -7681658, -6095758, -2051446, 1727143, 2402935, 363085, -1794812, -2684268, -2875126, -2740142, -1541145, 870834, 2891457, 2745170, 788246, -574216, 495082, 2983548, 3946874, 2119177, -164455, -29366, 1406558, 18160, -5056870, -8963384, -7260271, -2343882, -405335, -3079991, -5978165, -5619723, -3902428, -4230840, -6410904]
40751f410904j293835P45566J532533Q31013k77210o79007N09565K677679L093024
40742G28424K55063k690040j385558L004021M619804J229163k617769k507970
40734F35138k9450J061656P97414J343860K119862Q92770j657029k511065r08344
40725A744812J022138J786038J521325j5378k999316n199804l725378M07962K864604
40716b592997J894006K84904M64413J275096J236123J324749K056471J211241
40708G154006k204101m498721j833663L520125N622804K704551j407248l271541
40700E786212l149758k129133j32384J972071J927043m02889j951132p20538J383379
40691B582871J794350Q87660L12738R6986k01174M45953K599663M138316K807341
$$ y = [-6410904, -7704739, -6959173, -5426640, -4595627, -4872837, -5551844, -5042279, -2364600, 728424, 983487, -1706553, -3092111, -88090, 4531714, 5760877, 3143108, 635138, 605688, 1667344, 2464758, 3808618, 5928480, 6821250, 5164221, 2653156, 1744812, 2766950, 4552988, 6074313, 6058935, 3059619, -2140185, -5865563, -5457601, -2592997, -698991, -414087, 50326, 1325422, 2561545, 3886294, 5942765, 7154006, 4949905, 451184, -1382479, 2137646, 7760450, 10465001, 9057753, 5786212, 2636454, 507321, 374937, 2347008, 4274051, 3871162, 1920030, 1199492, 2582871, 4377221, 5264881, 5577619, 5674605, 5473431, 5919384, 8519047, 12657363, 15464704]
40682A5464704k32469k062244k019808j348845j88802J755473K514967k36125
40674A3646851m591275n606587j905851K258925K664380j54118l013845l953990
40666f55510k449542J384891N662667O993931M151202j5237k089576k006539j822774
40657I153513k274636k610018k607560k688463k665345j896731j62511K418392
40649c333359N282241O651365M607751j21026m275715n848243n582708m057815
40641f677509o85815K780704J952520l651691p511588m091051K965064N773351
40633i146015L121331O05090J260342K563819K700939L182834L941612K019428
40625A0249380k571429n135249l153835K5050J166989J888672L979095M795469
$$ y = [15464704, 15232235, 13169991, 11150183, 9801338, 9612536, 11368009, 13882976, 13646851, 9055576, 3448989, 1543138, 3802063, 6466443, 6312325, 3298480, -655510, -3105052, -1720161, 3942506, 10936437, 15087639, 15072402, 12982826, 10976287, 9153513, 6878877, 4268859, 1661299, -1027164, -3692509, -5589240, -5751751, -3333359, 1948882, 8600247, 13207998, 13086972, 8811257, 2963014, -2619694, -6677509, -7363324, -4582620, -2630100, -6281791, -13793379, -17884430, -14919366, -9146015, -6024684, -5419594, -4159252, -1595433, 1105506, 4288340, 8229952, 10249380, 7677951, 2542702, -611133, -586083, 580906, 2469578, 6448673, 11244142]
40617A1244142J815324k093568k817082j358004j156270j686137p8307K641503
40609F511601K483847r36186l704453l432955j490569N43072K487069L415918
40601E877344J900524j027618k583605k268357j953536j973775q92680O41264
40593b280439j4578k676975l657874j274645J676382K504762K135269K311170
40585a276928K731808K899186L469466L706979J102875l900987o310605l070356
40577f48562J744810K049184k082387n267513m309113r39003J970536L149390
40569d332658K265736m3722j504648m86906J248522R50850m66197K79515K884996
40560G95488K984726j034581m649553l318848P98770J713419k051903n503186
$$ y = [11244142, 13059466, 10965898, 8148816, 6790812, 5634542, 3948405, 3870098, 6511601, 8995448, 8059262, 4354809, 921854, -568715, -25643, 2461426, 5877344, 7777868, 6750250, 4166645, 1898288, -55248, -2029023, -2921703, -2280439, -2295017, -4971992, -8629866, -9904511, -8228129, -5723367, -3588098, -1276928, 1454880, 4354066, 7823532, 11530511, 12633386, 8732399, 2421794, -648562, 1096248, 3145432, 1063045, -4204468, -8513581, -9452584, -7482048, -4332658, -2066922, -2110644, -3615292, -4102198, -2853676, -1902826, -2369023, -2089508, 795488, 3780214, 2745633, -1903920, -5222768, -4423998, -2710579, -4762482, -10265668]
40552a0265668l925473J156421M310147L054827L80014M07615L285090N581704
40544C984677M836682J937617j005647l206810m677768m696708k433381J411844
40536c849494M811673O105703M977020K398961K00915j74283P84888J194281L90829
40527A6840493k77964n9163n22268l228109o995721r085178q099302m504464K86945
40518a5644731M015190M656048L204013L242595N505564N519900J33240o064905
40510D566914n741698R02307O185827N353528J605952l86611p58420j752623l022023
40501F953153k928709j790081r07411k72556N39094R63863O93533M78357L09932
40492D039175r72541k905413k876956j02486K589534K927636K377912K883688
$$ y = [-10265668, -14191141, -13034720, -8724573, -5669746, -5289732, -4882117, -1597027, 3984677, 8821359, 10758976, 9753329, 6546519, 1868751, -2827957, -5261338, -3849494, 962179, 7067882, 12044902, 14443863, 14644778, 14470495, 15255383, 16449664, 16840493, 16562529, 16503366, 15981098, 12752989, 5757268, -3327910, -11427212, -15931676, -15644731, -11629541, -6973493, -3769480, -526885, 4978679, 10498579, 10631819, 4566914, -1174784, -272477, 5913350, 11266878, 12872830, 12486219, 11727799, 9975176, 6953153, 4024444, 2234363, 1326952, 1054396, 1593490, 2557353, 3250886, 3729243, 4039175, 3066634, 161221, -2715735, -2818221, -228687, 2698949, 5076861, 7960549]
40484G960549L305694J961936J46513j01428L48553n05189k219743l233232l874815
40475C788838m726554l880923L13046N134889O103897K920746p97655k839158
40467F017126l695027l346315r77332K079356K940170J115405j224035k744406
40459A64942l476737k433955J260048M940236M467868L58196k312944j059832
40451A907822J041486P94819p37450j101694j62187R98326J863585J569632p30446
40442E443893l155095k150764K018630M359072J853137k311701l632833k151566
40434B72773o97783k86570k94583p43356j483634j208248K61382R80053L23145
40425b876821N40526K439634K936501J33380k594946j564446J278052J846501
$$ y = [7960549, 11266243, 13228179, 13374692, 13273264, 13621817, 13116628, 10896885, 7663653, 3788838, -937716, -4818639, -4505593, 629296, 6733193, 9653939, 8856284, 6017126, 2322099, -1024216, -2001548, 77808, 3017978, 4133383, 2909348, 164942, -3311795, -5745750, -4485702, 454534, 4922402, 5280598, 2967654, 1907822, 2949308, 3744127, 3006677, 1904983, 1742796, 2741122, 4604707, 6174339, 5443893, 2288798, 138034, 2156664, 6515736, 8368873, 6057172, 2424339, 272773, -425010, -711580, -1006163, -1749519, -3233153, -4441401, -4180019, -3199966, -2876821, -2336295, 103339, 3039840, 3173220, 578274, -986172, 291880, 2138381]
40417B138381N31238L40818Q74172l04726k099744j577364M4276o91201k363025
40408c107175l48057M120511L947856k737660q343376o198345L76023L636957
40400h653266J829772m81551L45868L589736O290461N823289J822341k467879
40392H098771k823759L45197J896696o35903l218680j831117J049209P72622j774858
40383A878178k043262M46595J796345O08052j61136J225762K588862K033350Q77217
40374I249963O27933K97556j189632k340436j013686K368051N055934M629434
40366A7685117Q96011l746365n799104m077053j494410j455272k850543j650886
40358b492505K335033M159226P98682m104936n287496k727190j29295J137943
$$ y = [2138381, 2669619, 3010437, 3884609, 3579883, 1480139, -97225, -52949, -744150, -3107175, -3455232, 665279, 4613135, 1875475, -6467901, -12666246, -12290223, -8653266, -6823494, -7305045, -6959177, -3369441, 2921020, 8744309, 10566650, 8098771, 5275012, 5620209, 7516905, 6881002, 3662322, 1831205, 2880414, 3653036, 1878178, -165084, 281511, 2077856, 2685908, 2524772, 3750534, 6339396, 8372746, 9249963, 9877896, 10175452, 8985820, 6645384, 5631698, 7999749, 13055683, 17685117, 18581128, 14834763, 9035659, 4958606, 3464196, 2008924, -841619, -2492505, -157472, 4001754, 4800436, 695500, -4591996, -7319186, -7448481, -6310538]
40350f310538K495500L750766K704597n55849k817428k279634q01970k73194L56520
40341c731230K458152M547479M292976K217428P56093L93627o17117k748207l961085
40332C608116k798758q01509n31573k294390m096874m260772k916728j170883
40324a5263371J37901P88153J169804K176426M346556O686702P041404M404925
40316A1488500M84513j986673k416878k707027m107272n057344l326326N86027
40308g042480L818797M605918L593798J677094j276719m622156o010307m177551
40300i433606j248835o1574j85148Q11543K687235K420547n34536k185796O37607
40291g092563N166850N893392J874785k241265k658292j013758j107944l137590
$$ y = [-6310538, -3815038, -64272, 2640325, 2084476, -732952, -3012586, -3814556, -4087750, -3731230, -1273078, 3274401, 7567377, 9784805, 10540898, 10934525, 10317408, 7569201, 3608116, 809358, 7849, -523724, -2818114, -6914988, -11175760, -14092488, -15263371, -15125470, -14337317, -13167513, -10991087, -6644531, 42171, 7083575, 11488500, 11973013, 9986340, 7569462, 4862435, 755163, -4302181, -7628507, -7042480, -3223683, 1382235, 4976033, 6653127, 5376408, 754252, -5256055, -9433606, -10682441, -10744015, -10929163, -10117620, -7430385, -5009838, -5544374, -7730170, -7092563, -1925713, 3967679, 5842464, 3601199, 942907, -70851, -1178795, -4316385]
40283d316385l695962j089024J893790J713457j012908k409659p08645J671821
40275g953515K119456J561412K306651L833122L441271N34284k418898l260000
40267A63783k142422j07016J815133J942928o03613l209438j906135K610138M810806
40258C374164K132047j086744n68869J055445q76383m520617m070619N31707L079923
40249i49946P61530k014397j412168p0378j811003m882972m756176r82264K727049
40240a3390725L738457K517922N70205p34922j83503J829178K671626P22608j654932
40231c914086j061081J696903K396812m50111l337254k794696k14425L54729k015135
40222i338344l792698j645240L099899N803501L912384k91406k727930j995341
$$ y = [-4316385, -8012347, -9101371, -7207581, -5494124, -6507032, -8916691, -9625336, -7953515, -5834059, -4272647, -1965996, 1867126, 5308397, 5842681, 3423783, 163783, -1978639, -2085655, -270522, 1672406, 1068793, -2140645, -4046780, -1436642, 3374164, 5506211, 4419467, 3850598, 4906043, 4029660, -490957, -4561576, -4029869, -949946, -188416, -2202813, -3614981, -3685359, -5496362, -10379334, -15135510, -16117774, -13390725, -9652268, -7134346, -6564141, -7299063, -7482566, -5653388, -2981762, -2259154, -3914086, -4975167, -3278264, -881452, -1331563, -4668817, -7463513, -7677938, -7323209, -9338344, -13131042, -14776282, -11676383, -5872882, -1960498, -2251904, -4979834, -6975175]
40214f975175K97326K403866L605032L178247Q42442j578434j553996M60187J377965
40205B057460L78427K80088K326066L030411o26528n501512n894877j562469K054757
40196c458177J405411j271387k280921j262073j53706J29933K00114P22593J697635
40187d270578K415992J712627o76158k897230k601537o3048J929112J735102O78807
40178b036911M71788O99102K70172j35091R04019K669904K597563o3352k513206
40169B863988j672079J522574K854664K73581l122181l060846J65808K371287
40161B196796J508248l8747j3884R7097j742167l880726l164135j4795J975942
40152c076371J097680q31910j876163k192977k304698j647052J09794J985946
$$ y = [-6975175, -6677849, -4273983, -668951, 2509296, 3351738, 1773304, 219308, 679495, 2057460, 2435887, 2715975, 5042041, 8072452, 7445924, 1944412, -3950465, -5512934, -3458177, -2052766, -3324153, -5605074, -6867147, -7020853, -6890920, -6690806, -5968213, -4270578, -1854586, -141959, -818117, -3715347, -6316884, -6379932, -4450820, -2715718, -2036911, -1565123, -866021, -595849, -730940, 173079, 2842983, 5440546, 5377194, 2863988, 1191909, 2714483, 5569147, 5842728, 2720547, -340299, -174491, 2196796, 3705044, 3666297, 3652413, 3749510, 2007343, -1873383, -5037518, -5052313, -3076371, -1978691, -2810601, -4686764, -6879741, -9184439, -10831491, -10721697, -8735751]
40144h735751K876363K737604K142603J562155J186215O72451n70197k025290
40136a53847j919811L34036K746960L420268L143055L239478K625989P803k668962
40127A0774969k816622j961376l267981n146666l066260J862525K625254l039225
40119d035382p892006n145044J953114N582972M391149L032232L264792K280365
40111C432192m95006j351787J296825L382223Q18294m441722o910338m535296
40103h804615n92332R45425j21337r66852K28049K350396L478568L337173K411705
40094B266180R6137l754353o163787l467812K951933O949511N308264J879599
40086F065672J732353M296846N494827M122314K240760P84080j220511l587922
$$ y = [-8735751, -5859388, -3121784, -979181, 582974, 1769189, 2441640, 1871443, -153847, -2073658, -1739622, 1007338, 4427606, 7570661, 10810139, 13436128, 13443931, 10774969, 7958347, 5996971, 2728990, -2417676, -5483936, -3621411, -996157, -4035382, -11927388, -17072432, -15119318, -9536346, -5145197, -2112965, 1151827, 3432192, 2937186, 1585399, 2882224, 6264447, 7082741, 2641019, -4269319, -8804615, -9396947, -8451522, -8572859, -9539711, -9311662, -6961266, -3482698, -145525, 2266180, 2362317, -1392036, -7555823, -11023635, -8071702, -1122191, 4186073, 6065672, 7798025, 12094871, 17589698, 21712012, 23952772, 24736852, 23516341, 19928419]
40078A9928419m625544l891817k643832j663846r37808j059484k578454m285552
40070a757918m265958k221010R29900M502986P075655N963741P46331m238111
40062F735616m453731j058264J358463J556455J816620K396686J095355j529436
40054G917764j843896P92427K438473O73144k058002k974385k698735k488634
40046b41844j697948j75711N39753N36669K145306N024202N028880R85152j944650
40037A0199809K36250L593465K135393k723901m495952j595705J172722P76462
40029I298543k66387N95568J595782J54669k542415l033415p1786M084890O105689
40020A5921138M508136P25564k503674m066125n115723o335170o152471l174161
$$ y = [19928419, 15302875, 11411058, 8767226, 7103380, 6165572, 5106088, 2527634, -1757918, -6023876, -8244886, -7314986, -2812000, 4263655, 10227396, 10973727, 6735616, 2281885, 1223621, 2582084, 4138539, 5955159, 8351845, 9447200, 7917764, 6073868, 6866295, 9304768, 9977912, 7919910, 4945525, 2246790, -241844, -1939792, -2115503, -1575750, -1039081, 1106225, 6130427, 11159307, 12144459, 10199809, 10436059, 14029524, 16164917, 13441016, 8945064, 7349359, 8522081, 9298543, 9032156, 9627724, 11223506, 11378175, 8835760, 5802345, 5730559, 9815449, 15921138, 20429274, 21154838, 18651164, 14585039, 9469316, 3134146, -3018325, -6192486]
40012f192486J055533L748491M254982L713643K430345L0250k500574l414170
40004C126014k576516j262603j28644O69446K69410j555090k647680q31683K429751
39995b507595L557199J833322K0525J7591Q25566J192533J440358J880849J801563
39986A0061911Q62523l84856j778339l469641m527219l799346k171076j508810
39978f714853j339785N38929L752622M814527K076946j469089j870227J239311
39970A028381M910311O050787L649482m59161k726868j630817r3843j733520n176190
39961C818562n631099k196267O84454J42175j137904O2805K498285L258667K288838
39952C788516J192693K55321n73727k04201J482961K383879J306646j94824j121994
$$ y = [-6192486, -5136953, -1388462, 2866520, 6580163, 9010508, 9040758, 6540184, 3126014, 549498, -713105, -841749, -172303, 97107, -1457983, -4105663, -4937346, -2507595, 1049604, 2882926, 2903451, 2921042, 3746608, 4939141, 6379499, 8260348, 10061911, 10924434, 10539578, 8761239, 5291598, 764379, -3034967, -5206043, -6714853, -8054638, -7515709, -3763087, 1051440, 3128386, 1659297, -210930, 1028381, 5938692, 11989479, 15638961, 15179800, 12452932, 10822115, 10728272, 8994752, 3818562, -1812537, -4008804, -3324350, -3182175, -4320079, -4257274, -1758989, 1499678, 3788516, 4981209, 5236530, 4662803, 4458602, 5941563, 8325442, 9632088, 9437264, 8315270]
39943H315270k878730n422444n453064j746795J591908J224478J06078K188282
39935b075017N317065N138611K897791K720194L443386M79145n242411p587800
39927E090964m575528n95380J150514J747504J522085j033406l979409k730217
39919c402873J830590L136642n93873l057296n56842J602244j460263n344818
39911g846489l591101J717601L851741J981741N77245J108877J390829J236938
39903D27382K079635K358915l10909l484397k756316M84048O69444k792318m602993
39894g927509k390392N5636j99944j063790m55196j08572j553346k731548j482777
39885a7857438J111396L177812M551689M932810L079997j07092j217406P44233
$$ y = [8315270, 5436540, 14096, -5438968, -7185763, -5593855, -4369377, -4263299, -2075017, 3242048, 8380659, 11278450, 13998644, 17442030, 17921175, 12678764, 5090964, 515436, -79944, 1070570, 2818074, 4340159, 3306753, -672656, -3402873, -1572283, 1564359, 970486, -2086810, -2643652, -1041408, -2501671, -7846489, -11437590, -9719989, -5868248, -3886507, -3309262, -2200385, -809556, 427382, 2507017, 4865932, 4555023, 1070626, -1685690, -1201642, -532198, -3324516, -7927509, -10317901, -10262265, -10462209, -11525999, -11981195, -12089767, -13643113, -16374661, -17857438, -16746042, -13568230, -9016541, -4083731, -1003734, -1110826, -2328232, -1583999]
39877a583999K434160J395443l02995j94811L68831o90247j949032r13907J611272
39868A74715K935248K397994R61062j135547l385747l746964j479763O90818M32302
39859b155882l10462J029527K266435m85405n536894o719614k142570K971582
39851a1083283L636885J234115J43944J423208K613820K079762Q55826N86182
39843A490459J414386K200128K057234J260118N76961M9103p74360j448608r27431
39834E897990K65700j6796k316175m209665l789617k467599k134210j621383R90315
39825i401440M191384M733877K515070J98415j224668k597532k964882l84633
39817d934409L430166M144828J557763M90685L092458N086070K560754j914758
$$ y = [-1583999, 850161, 2245604, 1942609, 1747798, 2116629, 1426382, -522650, -1436557, 174715, 3109963, 5507957, 6469019, 5333472, 1947725, -1799239, -3279002, -2588184, -2155882, -2466344, -1436817, 829618, 344213, -5192681, -11912295, -14054865, -11083283, -7446398, -6212283, -6068339, -4645131, -2031311, 48451, 904277, 1490459, 2904845, 5104973, 7162207, 8422325, 8999286, 9048389, 8274029, 6825421, 5897990, 6163690, 6146894, 3830719, -378946, -4168563, -6636162, -8770372, -10391755, -9401440, -5210056, -476179, 2038891, 2237306, 1012638, -1584894, -4549776, -4934409, -1504243, 2640585, 4198348, 4689033, 7781491, 12867561, 15428315, 13513557]
39809A3513557l767457l323363l732359m742925l582601o07954Q16286k70449
39801e697265j361420r00383p312M40322R07627J026969j55887j226230N73772
39792f399807M303462N151452J184696l258771l446547l83518K002144K909665
39784B062776L818722L663931K7004n080218n823729n93777M697941M007013j195978
39775E583685m754275m061686j804052n83471J90454J573732K629809K254991
39767A029187J267137R65613J026423M60475k77578J96569J859165K822067J539476
39758A0888534j140679k568104j151169J398775J498374j881237n198724m379983
39750b534213j63400K948189K886079K158982L105048M322245L699588K055131
$$ y = [13513557, 9746100, 6422737, 2690378, -2052547, -5635148, -6243102, -5426816, -5697265, -7058685, -7959068, -7966380, -7526058, -6618431, -5591462, -5747349, -6973579, -6399807, -2096345, 3055107, 4239803, 981032, -2465515, -2849033, -846889, 2062776, 5881498, 9545429, 9572433, 4492215, -1331514, -1925291, 2772650, 6779663, 5583685, 829410, -3232276, -5036328, -5619799, -5429345, -3855613, -1225804, 1029187, 2296324, 3261937, 4288360, 4748835, 4471257, 4667826, 6526991, 9349058, 10888534, 9747855, 7179751, 6028582, 7427357, 8925731, 7044494, 1845770, -2534213, -2697613, 250576, 3136655, 5295637, 8400685, 12722930, 16422518, 18477649]
39742A8477649J080632K4701k435050m796918m631023k662687j506432j231200
39734B319672Q9036J874467J213312j984938l944329k475787j88766m55151k723135
39725f275619l845018k368555K44583J726566J265167K05155N42377K021429J806234
39716d677681j245237l560174j246987L601330N145797K108463p93647l58831
39708a026967J074213P87123Q9130Q80747J875003J355467M01674M22459M87028
39699F345877k01175l05197N87051M17531j102129q15868J959694K499228j787811
39690G597201n529113l034766K301955L361840Q24841R90415L870903K815025
39682A3198301l457467p562852m783342K15716J655992P40055R87916J445563
$$ y = [18477649, 19558281, 19582982, 17147932, 12351014, 7719991, 5057304, 3550872, 2319672, 2408708, 4283175, 5496487, 3511549, -432780, -2908567, -3097333, -3552484, -6275619, -10120637, -12489192, -12244609, -10518043, -9252876, -9047721, -8505344, -6483915, -4677681, -5922918, -9483092, -10730079, -7128749, -1982952, 125511, -668136, -1026967, 47246, 834369, 923499, 1804246, 3679249, 5034716, 5436390, 5858849, 6345877, 6144702, 5839505, 6426556, 6844087, 5741958, 4926090, 6885784, 9385012, 7597201, 2068088, -966678, 1335277, 4697117, 5521958, 6512373, 10383276, 13198301, 9740834, 2177982, -2605360, -2389644, -733652, 6403, 994319, 2439882]
39674B439882j0566j109612J190319M433729L710495n89408l175456j473044J536313
39665F952652K287510Q29534p83234j639660k218149k822313k882658j723974
39657b000292K21824J458795J335298J274360K694356M312538L674970J084614
39649A4056463p12213r35540j735678l923730n019537l174295j42689J591332
39641D113K058951K130972J183036j018719k242948n12008K400502K811765k07122
39632F608542l930009n148302k984536N75793K097578q1976l462350l991332j421185
39623a1737777N57559O2465o80264j21549k98049k383803l371455p64536K882595
39614a5854814M059011L625775L622430K205895k455720n970607k508655N167831
$$ y = [2439882, 2429316, 1319704, 2510023, 6943752, 10654247, 10064839, 6889383, 5416339, 6952652, 9240162, 10069696, 9286462, 7646802, 5428653, 2606340, -276318, -2000292, -1778468, -319673, 1015625, 2289985, 4984341, 9296879, 12971849, 14056463, 13344250, 12408710, 10673032, 6749302, 1729765, -1444530, -1587219, 4113, 2063064, 4194036, 5377072, 4358353, 2115405, 1603397, 4003899, 6815664, 6608542, 2678533, -2469769, -5454305, -4878512, -2780934, -2862910, -6325260, -10316592, -11737777, -11180218, -11117753, -11798017, -11919566, -12217615, -14601418, -17972873, -18737409, -15854814, -11795803, -8170028, -4547598, -2341703, -4797423, -10768030, -13276685, -8108854]
39606h108854P843210K782363k467360j382127K791368L226602n38994l383013
39598G63195k241062J249191L998835L987450Q04648l502400n154841k681575
39590b776559O62891P79907j819458k850150j55597L633614M701812K416234p19024
39581C873670k203080j547220K58742K044265K918472K320003N05759j303882
39573F866729k173036k614349l412670l723567k246826j67536j56014j738754
39565i366023j044894K948443N474168K557676k508574l655945q06169R75652
39557e425666j68704j120753l90553o68964l378275n795459n642692m067994j971523
39548b8630583K011194P080475Q377225L448399k848405m091191l71674L346649
$$ y = [-8108854, -265644, 2516719, 49359, -1332768, 1458600, 4685202, 4146208, 763195, -1477867, -228676, 3770159, 7757609, 8562257, 5059857, -94984, -2776559, -2113668, -1333761, -3153219, -6003369, -6158966, -2525352, 2176460, 4592694, 3873670, 1670590, 123370, 382112, 2426377, 5344849, 7664852, 8170611, 6866729, 4693693, 2079344, -1333326, -5056893, -7303719, -7471255, -7627269, -9366023, -10410917, -7462474, -1988306, 569370, -1939204, -5595149, -6401318, -5425666, -5594370, -6715123, -7105676, -7774640, -11152915, -16948374, -22591066, -26659060, -28630583, -26619389, -19538914, -11161689, -7713290, -10561695, -14652886, -15024560, -11677911]
39540a1677911M546384M417619L599498J547620m05200J22204K372966K937605
39532G460785J008668l91619N64476J551445j07962l198383m381910k823927r42917
39523a261344r33089k197197k669472j764769r79746j397677j679188J79720L573159
39514i129603N641315N101711L658097K904014K133935N62594o22000m08759n1736
39505I789568o02402l68092K154479M552684L442809N8957j334830l15223q89717
39496A6488233m368981o464726l877772L01508J256916m57778n99162J711058
39488C989296K975733J019184k266957m415853n128374m428878j441620K912562
39480f784907M749218J712349k981714m119002j283690J156434O77485l82387
$$ y = [-11677911, -7131527, -2713908, 885590, 2433210, 2028010, 2150214, 4523180, 7460785, 8469453, 8077834, 8642310, 10193755, 10085793, 6887410, 2505500, -318427, -1261344, -2194433, -4391630, -7061102, -8825871, -9805617, -11203294, -12882482, -12702762, -9129603, -3488288, 1613423, 5271520, 8175534, 10309469, 10872063, 10250063, 9841304, 9789568, 9187166, 8819074, 10973553, 15526237, 18969046, 19028003, 17693173, 17377950, 16488233, 12119252, 5654526, 1776754, 2078262, 3335178, 2877400, 2278238, 3989296, 6965029, 7984213, 5717256, 1301403, -3826971, -8255849, -9697469, -6784907, -2035689, -323340, -3305054, -7424056, -8707746, -7551312, -6873827, -7256214]
39472g256214N88435K308146K264858J019031R71757K282302K842958J614425
39464F635698m67833k378643l513289k919112m71324J679474J426739j2229k6173
39455d6692P57101m43904k791817j802358L298348O694906L634299k399178m125580
39446B775125k14161L351704J190957n295731j0030502q715112k803774K316597
39438a7424897L247110K197737L142734N281818M086619p03088l113853M61820
39430b824000N405325N700570K588868J149318J463679l01567l638021l580545
39422E963627Q05899M195545K844092o31305k278182j990970j426190p72111j7117
39413F693288o2746m36842Q22584L018098K207703k591588o195240l798553J993708
$$ y = [-7256214, -6667779, -4359633, -2094775, -1075744, -103987, 2178315, 5021273, 6635698, 6167865, 3789222, 275933, -2643179, -3114503, -1435029, -8290, -20519, -46692, 710409, 266505, -2525312, -4327670, -1029322, 5665584, 9299883, 6900705, 2775125, 2560964, 5912668, 7103625, 1807894, -8222608, -16937720, -19741494, -17424897, -14177787, -11980050, -8837316, -3555498, 531121, -171967, -3285820, -2824000, 2581325, 8281895, 10870763, 12020081, 13483760, 13182193, 9544172, 5963627, 6769526, 10965071, 13809163, 13177858, 10899676, 8908706, 7482516, 6710405, 6693288, 6630542, 6193700, 7016284, 10034382, 12242085, 9650497, 3455257, -343296, 1650412]
39404A650412M642857K447874k00173K52221K042807J333915k319927n018297
39396D831689k786506L322909P147714M053093k779338n578181j935340K199421
39388H475461J248902k293962k454909J087221L307488J829543l85234m20876
39380A0393634R12637J800549K235294K611867K335150J454175J396399K411725
39372B5551430K291301m23400l489937l441747k44407K637336K679514R09033
39364B6469123l27967n65000j071776k400022l455487l023534j192475J100766
39356A5533628L188430M791761N558071N152994L641959J417797r79137k819142
39348C5486361l626282l942944m702004n392045m209968r67355J732323J756912
$$ y = [1650412, 6293269, 8741143, 8540970, 8793191, 10835998, 12169913, 9849986, 4831689, 2045183, 5368092, 12515806, 16568899, 13789561, 8211380, 6276040, 8475461, 9724363, 7430401, 4975492, 6062713, 9370201, 11199744, 10814510, 10393634, 11306271, 13106820, 15342114, 17953981, 20289131, 21743306, 23139705, 25551430, 27842731, 27419331, 23929394, 20487647, 20243240, 22880576, 25560090, 26469123, 26141156, 25576156, 24504380, 22104358, 18648871, 15625337, 14432862, 15533628, 18722058, 23513819, 29071890, 34224884, 37866843, 39284640, 38305503, 35486361, 31860079, 27917135, 23215131, 17823086, 13613118, 12645763, 14378086, 16134998]
39340A6134998L79166m1729K04498n73975j717581j015421J307820K853693L114371
39331B0645840L702020M523324L704757J721925J231044J930554M68995k957109
39323C4971350l387392O32677L086512p46340o329764o328418j403534J749287
39315B2244378O66784j250531j962264k692785k779034M38575N352554O113821
39307B6131498J259728l180482k177607J393254J806356j416671m348894m823192
39299A4643990l901630k967196k738027l915258n857450n742387j974141K439335
39291a0012764K991939p8993j714189J180344N533000O231115K668254j009283
39283E789423j671414q22705j436026l043003k471797R27774L796503L602421
$$ y = [16134998, 16514164, 16472435, 16676933, 16102958, 14385377, 13369956, 14677776, 17531469, 20645840, 24347860, 28871184, 32575941, 34297866, 35528910, 37459464, 37928459, 34971350, 31583958, 32216635, 35303147, 34556807, 28227043, 21898625, 20495091, 22244378, 22911162, 21660631, 19698367, 17005582, 14226548, 14665123, 20017677, 26131498, 27391226, 24210744, 22033137, 23426391, 25232747, 23816076, 19467182, 14643990, 10742360, 7775164, 5037137, 1121879, -4735571, -10477958, -12452099, -10012764, -7020825, -7099818, -8814007, -7633663, -2100663, 4130452, 6798706, 5789423, 4118009, 3295304, 1859278, -1183725, -3655522, -2727748, 1068755, 4671176]
39275D671176K239211K617289L892810L152883M46296j369694j265033r94736
39267A3390202j306784o33394J638956L583521L542877K175273Q79349M04886
39259B3674886J495301M319728O710989N816521K264040k99938o51668j523058
39251D1806801m353569o279496m722994j727888q19290k050881l013163k660340
39243A6179180j500961N999P95792p97279l783566l865716O80894M935720L174264
39234A5824327k996705o694468m873154r49164J245674J628780J468658Q16298
39226E470246l77555j359931j732721j447443L02806L616258N629529L088376
39218A3189565k550913o055582n158017k866033j986431j177133J386157L788412
$$ y = [4671176, 6910387, 9527676, 13420486, 16573369, 17019665, 15649971, 14384938, 13390202, 12083418, 11450024, 13088980, 16672501, 20215378, 22390651, 23270000, 23674886, 25170187, 29489915, 36200904, 42017425, 44281465, 43981527, 43329859, 41806801, 37453232, 31173736, 26450742, 24722854, 23903564, 21852683, 18839520, 16179180, 14678219, 14684218, 15480010, 14682731, 10899165, 7033449, 7714343, 12650063, 15824327, 12827622, 6133154, 1260000, 310836, 1556510, 3185290, 4653948, 5470246, 5092691, 3732760, 2000039, 552596, 855402, 4471660, 10101189, 13189565, 10638652, 4583070, -574947, -3440980, -5427411, -6604544, -5218387, -1429975]
39210a429975L057129J08807j246076M09057K372288J532148j766437l995496
39202i58555k188692K539138N579234L862045j95500j512525J127214L777254
39194A2029613K954871j42791k246473k318152j435349l97331M86169O61954K18518
39185I811029K04795N76371l54526k529238k455542K009491O854404N942129m44252
39176A9614661n204415l558241J103524K548870r5699k534707k004363j91737
39168I677893N91071R42917K431532L989064K692303j948141o464851p215822
39160D695966m594078k072428j499848j083509J429738N074975O594118M529736
39152A3074670J027845o37338N54689K824848L843864L002706J513469N85899
$$ y = [-1429975, 1627154, 1735961, 489885, 898942, 3271230, 4803378, 3036941, -958555, -3147247, -608109, 4971125, 8833170, 8637670, 7125145, 8252359, 12029613, 14984484, 14841693, 12595220, 10277068, 8841719, 8444388, 8930557, 9592511, 9811029, 10015824, 10592195, 10237669, 7708431, 5252889, 7262380, 14116784, 20058913, 19614661, 14410246, 10852005, 11955529, 14504399, 14408700, 11873993, 9869630, 9677893, 10268964, 11211881, 13643413, 17632477, 20324780, 18376639, 11911788, 4695966, 101888, -1970540, -3470388, -4553897, -3124159, 1950816, 8544934, 13074670, 14102515, 13465177, 14019866, 16844714, 20688578, 23691284, 25204753, 25790652]
39144B5790652p6900j556322l685074m693857l444833j198444q6298k84781j10525
39135A0653618J065701J681630N60329q67458m94512J143664J441825m39934k276651
39126A2468212j899138J53351K104380L393451M137612L584535J187695j644663
39118B3485435l048214l299629l587079k938121M24586M787389N915151L308399
39110B5047917J421511K610902L074610p05485n247209m852884p15965P57241
39102B1390638j871301k798202J719428P268832P532130K839943j066369o75536
39094C4339563K080026L305020J470994j528402k555072q20032P19581j031818
39086C5979860m472115m530090P10815P251818J0059048Q081106L244229k455841
$$ y = [25790652, 25713752, 24157430, 20472356, 15778499, 12333666, 11135222, 11048924, 10764143, 10653618, 11719319, 13400949, 13961278, 13093820, 12599308, 13742972, 15184797, 14744863, 12468212, 10569074, 10722425, 12826805, 16220256, 20357868, 23942403, 25130098, 23485435, 20437221, 17137592, 13550513, 10612392, 11036978, 15824367, 21739518, 25047917, 26469428, 29080330, 32154940, 31449455, 26202246, 21349362, 20633397, 21390638, 19519337, 16721135, 18440563, 25709395, 33241525, 36081468, 35015099, 34339563, 36419589, 39724609, 41195603, 39667201, 37112129, 36292097, 37011678, 35979860, 31507745, 26977655, 27688470, 34940288, 44999336, 53080442, 56324671, 53868830]
39078E3868830o813135p224884l496771R36424K889758K771677K158958O23386
39070D5714243k182687l686392j353752K919482M903878L533097J081997r83904
39062D9945962k739383l303334j617807N26963J62181j995711k168926M92011
39054C9301956K374395R29653j801917k715443j644615r6837J492994L427072
39046D1267258N464312P146233P867554O260151J860725k220761j461458M041521
39038G0225535Q862652R332519Q220463R912909J3786350J5820061J5194004J5691494
39030A67045987K0610132K8790807L6354784M1386234M6265781N4175603O1689983
39023D56319311N6729533K9326112j3843807n0924766o5112642o0036861n0911998
$$ y = [53868830, 47055695, 39830811, 36334040, 37270464, 40160222, 42931899, 45090857, 45714243, 43531556, 39845164, 38491412, 41410894, 46314772, 49847869, 50929866, 49945962, 47206579, 43903245, 42285438, 42812401, 42974582, 40978871, 38809945, 39301956, 41676351, 42606004, 40804087, 38088644, 36444029, 36347192, 37840186, 41267258, 46731570, 53877803, 61745357, 68005508, 69866233, 67645472, 66184014, 70225535, 79088187, 88420706, 96641169, 106554078, 120340428, 136160489, 151354493, 167045987, 187656119, 216446926, 252801710, 294187944, 340453725, 394629328, 456319311, 513048844, 542374956, 528531149, 477606383, 412493741, 352456880, 301544882]
39016C01544882m4844838l7270390k5525494j5747150j3104342j3109810q673005
39009A43269853j081087K683413J225767N65444M758522J0887547J5154076J8594891
39001A96058426K3353618K7535409K8739095L0050921L5963877M2042355L5462157
38994D19205858R929489k3877950m7645605n3413602m7935205m0804583l4405030
38987A81053372k6784523j8595764j2823465j0161857q627364p053763o201219
38980I0805417o629986p527129p715521o616555m415098k081962p40237m20955
38972E4657974j82478K55829L06303K36627J150284K485843J846992j250737l713503
38963E5793134k845899P301J854089K089277J765422Q05479j167027k743866k492236
$$ y = [301544882, 256700044, 219429654, 193904160, 178157010, 165052668, 151942858, 143269853, 142188766, 144872179, 146097946, 146663390, 151421912, 162309459, 177463535, 196058426, 219412044, 246947453, 275686548, 305737469, 341701346, 383743701, 419205858, 429135347, 405257397, 357611792, 304198190, 256262985, 215458402, 181053372, 154268849, 135673085, 122849620, 112687763, 104060399, 97006636, 90805417, 84175431, 76648302, 68932781, 62316226, 57901128, 55819166, 55078929, 54657974, 54475496, 54731325, 55037628, 55274255, 56424539, 58910382, 60757374, 59506637, 55793134, 52947235, 52954536, 54808625, 56897902, 58663324, 59468803, 58301776, 55557910, 53065674]
38954E3065674j598132j848148k301575j241475j77771j968894n479926o205278
38946C2244475k561073K007418L776279K453776l25968l082104m405017l683040
38938B6424746k554405l048332m086591k719050J090229M154878M650475L470047
38930B7381997R82191l220238o715341n300600O09001N150730M738460K266827
38922B5893027J242719N05204j716975k921570j41213M484882O542746N448233
38914C9337053L565651J551925r35372j846663R76291N056819N477055J627653
38906E4810412k199693k942643j950359j911341l648178o098134p076356m535671
38898B4448037N45350L526980J177974l594482n081689j930599K031840L095865
$$ y = [53065674, 51467542, 49619394, 47317819, 46076344, 45898573, 43929679, 38449753, 32244475, 29683402, 31690820, 35467099, 37920875, 37594907, 34512803, 30107786, 26424746, 23870341, 20822009, 16735418, 14016368, 15106597, 19261475, 23911950, 27381997, 28364188, 25143950, 18428609, 13128009, 13737010, 18887740, 23626200, 25893027, 27135746, 27640950, 25923975, 23002405, 22861192, 27346074, 33888820, 39337053, 42902704, 44454629, 43519257, 41672594, 42648885, 47705704, 53182759, 54810412, 52610719, 49668076, 47717717, 45806376, 42158198, 36060064, 28983708, 24448037, 24993387, 28520367, 29698341, 26103859, 21022170, 19091571, 21123411, 24219276]
38890B4219276P17719l442624o173040l910347K837136P768766N785025Q5521
38882B7887432k645772k239732l712572p023126o272757l44087L802739J763859
38874A1215984j513649j40169L522241L639353L79469j364190P1182J920983K144678
38865A9875882J216250j53922j429456j407040J17467J183640O37719L42772J862821
38856B2246133L273517K235948q4121j321840j765657k577549k675606j096293
38848A8234532P9753o85057m52562L637998Q127642P298552K215185l08638K502535
38839D0649940O526710Q127302Q553093R425835Q979061N206310q38661o692820
38831G9936770j0526591j0826928p560081m273202n056385q551300r193671n396704
$$ y = [24219276, 24936995, 21494371, 15321331, 11410984, 14248120, 22016886, 27801911, 27887432, 25241660, 23001928, 19289356, 12266230, 5993473, 5649386, 9452125, 11215984, 9702335, 9562166, 13084407, 16723760, 17103229, 15739039, 15810221, 17731204, 19875882, 21092132, 20938210, 19508754, 18101714, 18219181, 19402821, 20040540, 20383312, 22246133, 25519650, 27755598, 27671477, 26349637, 24583980, 22006431, 19330825, 18234532, 18314285, 17629228, 17176666, 20814664, 28942306, 36240858, 38456043, 38147405, 40649940, 47176650, 55303952, 63857045, 73282880, 82261941, 87468251, 86629590, 79936770, 69410179, 58583251, 51023170, 46749968, 41693583, 33142283, 23948612, 18551908]
38823A8551908j727448j339434j438630R37565L506822K948123O50124P5745J249010
38814B3413785J776401R98119l99945k505798m423409l054661K279452O375227
38806B4459171L976692k552657o143491m491916j717535j133866j563224j331120
38798I502054j011104p84911P71018L479576M605943K888174M53215r51925k445413
38789A6506627m676820n246096k411436J123978J543460o15835j816354j225035
38781C182489j174449k125375j444127J408292K335819j705135o967048o848341
38773a3337875q08477M792851N456873L937176M419513N124444J506413m883571
38765F207347o713720j260947M726186L773287k385397n785585k971031J824309
$$ y = [18551908, 16824460, 15485026, 14046396, 14983961, 18490783, 21438906, 22089030, 22164775, 23413785, 25190186, 26188305, 25788360, 23282562, 18859153, 15804492, 18083944, 24459171, 28435863, 25883206, 19739715, 15247799, 13530264, 12396398, 10833174, 9502054, 8490950, 7706039, 8477057, 11956633, 16562576, 19450750, 19903965, 18952040, 16506627, 11829807, 6583711, 4172275, 5296253, 6839713, 6223878, 4407524, 3182489, 2008040, -117335, -1561462, -153170, 2182649, 477514, -6489534, -13337875, -14146352, -9353501, -3896628, 40548, 4460061, 9584505, 11090918, 6207347, -506373, -1767320, 2958866, 6732153, 4346756, -1438829, -4409860, -2585551]
38757b585551L590908K237582N72671R0798M19657Q07982O95428O7896n2323J246378
38747G091426K875968K685653N87921j182485j370199j026534p85255N46041L030488
38738A2453024L748976N93527l674066m312372j068843J321456m14600l876230
38730D770872m616096j983568O68511O47766j342258l118200l730351l406537
38722a2109861k181882l7501K168736L345722L601764L727377L418104J759017
38714C691476l28979l72454J877570L200007J296272j538412j667792N29842J720944
38705H408474J050999Q08210J757872J734484k49075k163390k673148l194177
38697E480249m344292l873591q47357J403886J36623j690335M18069M926673N848259
$$ y = [-2585551, 1005357, 3242939, 3815610, 3906408, 4326065, 5134047, 5829475, 5897371, 5845048, 7091426, 9967394, 12653047, 13240968, 12058483, 10688284, 9661750, 8876495, 9422536, 12453024, 16202000, 16795527, 13121461, 8809089, 7740246, 9061702, 8647102, 4770872, 154776, -1828792, -1160281, -512515, -1854773, -4972973, -8703324, -12109861, -14291743, -14329244, -12160508, -8814786, -5213022, -1485645, 1932459, 3691476, 3362497, 2990043, 4867613, 8067620, 9363892, 7825480, 6157688, 6687530, 8408474, 9459473, 10267683, 12025555, 13760039, 13510964, 11347574, 8674426, 5480249, 1135957, -2737634, -3584991, -2181105, -2044482, -3734817, -3316748, 1609925, 7458184]
38688G458184J518124l060887l416483q28461J146632J555918J265130L47948
38680E986105j136124j835181r59613R6026k9743l63062N23923J876938K208177
38671F367446K043090K797004L867153L304846Q14936k126446m519810n945159
38663F603060n195435j616703K494773L794152K272227Q03412K39399j451329
38655G943556m390192n230874k414514P64713J182225N51934J478157K062383
38647A947388o30540l949631k537549K673120M669534Q16424k902478r57830L612415
38638B740853M415595J187814j037198q6192J208713M56865j202585j873059j236910
38629D573896M86350K974923M590465L395102R2409k361265k624723k166849k187917
$$ y = [7458184, 8976308, 5915421, 2498938, 1670477, 2817109, 4373027, 5638157, 5986105, 4849981, 3014800, 2055187, 2151213, 2121470, 1758408, 2282331, 4159269, 6367446, 8410536, 11207540, 15074693, 18379539, 19194475, 17068029, 12548219, 6603060, 1407625, -209078, 2285695, 6079847, 8352074, 9155486, 9394885, 7943556, 3553364, -1677510, -4092024, -3327311, -2145086, -1593152, -114995, 1947388, 1316848, -2632783, -5170332, -2497212, 2172322, 2988746, 86268, -871562, 2740853, 7156448, 8344262, 7307064, 7220872, 8429585, 8886450, 7683865, 5810806, 4573896, 5060246, 8035169, 12625634, 16020736, 16113145, 13751880, 11127157, 8960308, 6772391]
38620F772391j952322r68429k13026m2915O61436J975172K060137M86713n3061
38611H726096K372241N395224N378786K486260j64506j404278k832434m842612
38603A5114777n103167k209735J464441K447867O80393m62587J238724L566604
38595A6737317K357373k864053p317953o373685j470908J743761J078355M79997
38587D370204L727703Q525995R841773P155584M561136M128314L160877p50421
38579D4721165n176413n892155k953823r67586l049193o521402o142430j035567
38571A2982596L574360K591503k467338n434118l345346N97454K378865K123623
38563A3001599J920246J836206J050916N55864J167227O31234l204287p424870
$$ y = [6772391, 4820069, 3851640, 3638614, 3595699, 4257135, 6232307, 8292444, 8779157, 8726096, 11098337, 16493561, 21872347, 24358607, 24194101, 22789823, 19957389, 15114777, 10011610, 7801875, 9266316, 11714183, 12394576, 11931989, 13170713, 16737317, 19094690, 16230637, 8912684, 2538999, 1068091, 2811852, 3890207, 4370204, 8097907, 16623902, 26465675, 33621259, 38182395, 42310709, 45471586, 44721165, 39544752, 33652597, 30698774, 29731188, 26681995, 20160593, 14018163, 12982596, 16556956, 19148459, 16681121, 11247003, 7901657, 8499111, 10877976, 13001599, 14921845, 16758051, 17808967, 18364831, 19532058, 20163292, 16959005, 9534135]
38555I534135o832647j622790K304481J495877r89600j146126N98964J897185
38547E239479K568577L063449J866571j876272n097734l964923N29751L433040
38539E761938K177690n84091p84905K383660O071108O832404L748328r83104m509668
38530B0113360o045791o204697m399399M01422N973158P337012K915742k627910
38522A7462897m161621k214752o24504o13556p55394p85315j324319j106346J291401
38513G168491L774314L091613L49715l98714J102420J044657j450100k606947
38505A2075449r57585m23659l384003n775889l475758N66892R19833j476004j124137
38496c054861K547222L885762J35597l731797k152485K819473M208437m43087
$$ y = [9534135, 2701488, 1078698, 3383179, 4879056, 3889456, 2743330, 3342294, 5239479, 7808056, 10871505, 12738076, 10861804, 5764070, 1799147, 2328898, 5761938, 7939628, 7355537, 6570632, 8954292, 15025400, 21857804, 25606132, 24623028, 20113360, 14067569, 7862872, 3463473, 3864895, 9838053, 17175065, 20090807, 17462897, 13301276, 11086524, 10462020, 9848464, 9093070, 8307755, 6983436, 5877090, 7168491, 10942805, 14034418, 14384133, 13985419, 15087839, 16132496, 14682396, 12075449, 11117864, 10694205, 7310202, 1534313, -1941445, -1374553, -454720, -1930724, -3054861, -507639, 3378123, 3513720, -218077, -2370562, 448911, 4657348, 4214261]
38488D214261n764774n211294R63701N872306L944584k619017o614367m527241
38480i741841j73102J191931k47652n14144J416162K493159J264246N38367K476641
38471a296233M252390J853314l424840n927731l054575J546282L303837K458179
38463b89377K214437L089018K454054n12446k895707k411613q55524q22771j184415
38454a214344Q32104M242090M997651K233247k60292j25283k0405k470088m565860
38445C648820j938638L774224O022721J965077l853880n524660k533721J096171
38437B656114K324897J701059J220746J300423M58219k160537m517433l240931
38429b57443J832379O087902M872490q83425n634377n446799j468609K436698
$$ y = [4214261, -1550513, -6761807, -5798106, 74200, 4018784, 1399767, -5214600, -9741841, -9914943, -8723012, -8970664, -9484808, -8068646, -5575487, -4311241, -3772874, -1296233, 2956157, 4809471, 1384631, -4543100, -7597675, -6051393, -2747556, -289377, 1925060, 5014078, 7468132, 6955686, 4059979, 1648366, 792842, -29929, -1214344, -382240, 3859850, 8857501, 11090748, 10830456, 10705173, 10684768, 8214680, 3648820, 1710182, 5484406, 11507127, 13472204, 9618324, 4093664, 1559943, 2656114, 4981011, 6682070, 7902816, 9203239, 9661458, 7500921, 2983488, -257443, 1574936, 7662838, 12535328, 11651903, 6017526, 570727, -897882, 1538816]
38421A538816L426092J132930k348275l516883m98302M378402O657429M747193
38413A5517402J176595j172455j840536j372683K97666K740321M253580L657262
38405B3257152J585838q73020l361316n364110n895935m995646l904280k998927
38397b550244j366047Q89888K114413J795836J424094J599753R38019q19009j618461
38388B408242q74063j162317l563090m601045j351822L230595M270694K080521
38380D37715P90614J521110J852368J191669J461044K415013J348861j688460
38372I329934l043409j159800J057875J189457P07898J485399K383676J619073
38364A3570103k36217j663188k243218j782526M51J510373J479l958819n802295
$$ y = [1538816, 4964908, 6097838, 3749563, 232680, -265622, 4112780, 10770209, 15517402, 16693997, 15521542, 13681006, 12308323, 12605989, 15346310, 19599890, 23257152, 24842990, 23969970, 20608654, 15244544, 9348609, 4352963, 448683, -2550244, -3916291, -3026403, -911990, 883846, 2307940, 3907693, 4845712, 4026703, 2408242, 1534179, 371862, -3191228, -7792273, -9144095, -5913500, -1642806, 437715, 1228329, 2749439, 4601807, 5793476, 7254520, 9669533, 11018394, 9329934, 6286525, 5126725, 6184600, 7374057, 8081955, 9567354, 11951030, 13570103, 13333886, 11670698, 9427480, 7644954, 7645405, 9155778, 9157257, 5198438, -603857]
38355f03857k890766J727011L793341L221143K375335J773774P08196k2939O59569
38346A0740807J627287J129943m69926j886651l024799l509833j451482L232800
38338F388146O518797M975932R04541j098684q82158j539943k964075k042653
38330A0259903R25648J644696j164245l187511j123302K295275K684847K94553
38322A2629864j247772n73598J23688j073789k907780k451502J126795M869213
38314A0495119M828387P08616l733583n638795o146012o864283o119003k034123
38306a4503677L015538N304687N294442N435633M230305j199621p360507o791563
38298f574763M85049N460428K911338j554953j336876J267019Q25886j477846
$$ y = [-603857, -3494623, -1767612, 2025729, 5246872, 7622207, 9395981, 10104177, 10081238, 10740807, 12368094, 13498037, 13028111, 11141460, 8116661, 4606828, 3155346, 6388146, 12906943, 17882875, 18787416, 17688732, 16806574, 15266631, 12302556, 10259903, 11185551, 12830247, 11666002, 8478491, 7355189, 9650464, 12335311, 12629864, 11382092, 10808494, 10932182, 9858393, 6950613, 4499111, 5625906, 10495119, 15323506, 16032122, 12298539, 6659744, 513732, -6350551, -12469554, -14503677, -11488139, -6183452, -889010, 4546623, 8776928, 7577307, 216800, -6574763, -6089714, -629286, 2282052, 727099, -609777, 657242, 1483128, 5282]
38290E282j081129J151932R90792r47105o06793J476325J115670j190499n27036
38281C87439L235600M054188m02169m312524k461810K226040L923481K142729
38273H792974K78690p00427k251141l825913l088808j78359J901630J544816N41698
38264C015160J095965K691561K960764Q44271k017777l148219k121568r40771
38256B379386j265132k198034j788260J22163J949232K574029J883872j59500
38248C497756k926028m139890k011286J697480L279977J972417O13137R99108
38240B982671J477911K26429j774506k604079k060197q48094J019668L337009
38232A756812M659298L685246Q02105k460535m377748l353462O60644M718801
$$ y = [5282, -1075847, 76085, 1066877, 119772, -487021, 989304, 2104974, 914475, 387439, 3623039, 7677227, 7275058, 2962534, 500724, 2726764, 6650245, 8792974, 9071664, 8371237, 6120096, 2294183, -794625, -972984, 928646, 2473462, 3015160, 4111125, 6802686, 9763450, 10607721, 8589944, 5441725, 3320157, 2379386, 1114254, -1083780, -2872040, -2749877, -800645, 1773384, 3657256, 3497756, 571728, -3568162, -5579448, -3881968, -601991, 1370426, 1983563, 2982671, 4460582, 4687011, 2912505, 308426, -1751771, -2599865, -1580197, 1756812, 6416110, 10101356, 10903461, 8442926, 4065178, 711716, 1372360, 6091161]
38224F091161N257449K472640k73830j729402l769365o228098n487436q94171
38216d561052K117801l59604l837977j714258M254478O249501K165869j736072
38208B578686q57606J474613N16159k292233k333194P07458K606921O19542l503809
38199d83463o072087m834112l12231M358961N377201J821371k918821m613556
38191g676737k690040J81958K340200M539921O731290O262779J610950l690480
38183G609841m202102J29039L158331P07042l467932l061085J540901L954899
38175F368934J253064k420000l011388k317781l470818m819669k848870J315049
38167i951479L143156J319845j252396k465994k790110k201700L42412L743019
$$ y = [6091161, 11348610, 13821250, 13547420, 11818018, 8048653, 1820555, -3666881, -4561052, -2443251, -2802855, -6640832, -8355090, -4100612, 2148889, 4314758, 2578686, 1721080, 3195693, 3711852, 1419619, -913575, -206117, 2400804, 3020346, -483463, -6555550, -11389662, -11701893, -7342932, -1965731, -144360, -3063181, -7676737, -10366777, -10184819, -7844619, -3304698, 3426592, 9689371, 11300321, 7609841, 3407739, 3536778, 6695109, 7402151, 3934219, 873134, 2414035, 6368934, 7621998, 5201998, 2190610, -127171, -3597989, -8417658, -11266528, -9951479, -6808323, -5488478, -6740874, -9206868, -11996978, -14198678, -13856266, -10113247]
38159a0113247M984405L547369K106510J816361N96025k330253l902197j779333
38151e074360J474666J791940o39218j924794J21680L511188M798913K732318
38143F792333p87998k744188k212572j268105j710645j827256J098589N460829
38135B800987O149331J716280k845477k592517J035917K944666J112977k146496
38127H175668l881350k796689P09892M313180M791274J600502j751297j987594
38119I173586k71713J29822j217131k100129j608407j011131j318786k347388
38111e71277l500589l517899q20699L623538N640754L025986n49331n17707J545960
38102D358736O23532l176897m493549j488392J074050o23013l910597m433114
$$ y = [-10113247, -5128842, -1581473, 525037, 2341398, 2937423, 607170, -3295027, -5074360, -3599694, -1807754, -2446972, -4371766, -4250086, -738898, 4060015, 6792333, 6004335, 3260147, 1047575, -220530, -1931175, -3758431, -2659842, 2800987, 8950318, 10666598, 7821121, 5228604, 6264521, 9209187, 10322164, 8175668, 4294318, 1497629, 2207521, 6520701, 11311975, 12912477, 11161180, 9173586, 8901873, 9031695, 7814564, 5714435, 4106028, 3094897, 1776111, -571277, -4071866, -7589765, -8410464, -4786926, 853828, 3879814, 3330483, 2812776, 4358736, 4982268, 1805371, -2688178, -4176570, -3102520, -3725533, -7636130, -12069244]
38094a2069244k357060n50961K63832J220112K418061L258460L928294M268775
38086C80269L066496N66828n49060R53210K397612J406122J47883J822056M808760
38077A5000176M562859M93260l275046m013904l254402k813672j761954Q77294
38069E814611L273930K965346L16973k116923k731397j813664p4358K108500L906884
38060A1649902L749951P46023l553015n554088k934590K169568M539639J497022
38052A2310412l758526n814510l350859r671P36589o00436j485005j198177j104266
38043d274449j874826k177235o04255J963912K929973J110232j507571k023845
38035f458064j83295J716800K344119K690244L218560K152311j313317m073825
$$ y = [-12069244, -14426304, -14977265, -14713433, -13493321, -11075260, -7816800, -3888506, 380269, 3446765, 4013593, 3464533, 4417743, 6815355, 8221477, 8369360, 10191416, 15000176, 19563035, 20056295, 16781249, 12767345, 9512943, 6699271, 4937317, 5814611, 9088541, 12053887, 12370860, 10253937, 7522540, 5708876, 5634518, 7743018, 11649902, 15399853, 16145876, 12592861, 7038773, 4104183, 6273751, 10813390, 12310412, 8551886, 2737376, -613483, -623154, 113435, -487001, -1972006, -3170183, -4274449, -6149275, -8326510, -8930765, -6966853, -4036880, -2926648, -4434219, -6458064, -6641359, -4924559, -2580440, 109804, 3328364, 5480675, 4167358, 93533]
38027I3533k536165J831132L764826J276760j759374j192672K057931M084365
38019G620336L286231J274278l08990j494609k687797l412263k757775m09931
38011A109480K704416M506099L245296l55054l130048k636487J31285K078626
38003G653613J665530K42391q6612J020142J961056J093054j273315k857932j958014
37994G459913L8684L085k466756l634249m02125M792533O465756L112561j200447
37985A4168955k813782k798271l407225l296683o0487L985850L395837k225312
37977F948882o128627l268074K169791K318740l051290n969637j560460N058215
37969c482460N909530O43716m106709m096100j771083j084967j968392j740760
$$ y = [93533, -2442632, -611500, 3153326, 4430086, 2670712, 1478040, 3535971, 7620336, 10906567, 12180845, 11871855, 10377246, 7689449, 4277186, 1519411, 1109480, 3813896, 8319995, 11565291, 11210237, 8080189, 5443702, 5574987, 7653613, 9319143, 9561534, 9474922, 10495064, 12456120, 13549174, 12275859, 9417927, 7459913, 7498597, 7501682, 5034926, 1400677, 998552, 5791085, 12256841, 15369402, 14168955, 11355173, 8556902, 5149677, 1852994, 1792507, 5778357, 9174194, 6948882, 820255, -2447819, -278028, 2040712, -1010578, -6980215, -8540675, -3482460, 2427070, 3070786, -1035923, -5132023, -6903106, -7988073, -9956465, -11697225]
37961a1697225M99793L208932M972063N695658N459283L761662M31079l286672
37953I044573n021061l016538J896452O128039O082488J720737l157697m822728
37945H854265l364366j787396j772687j728964L23119L139991L352625K88915
37937G305502k377518j411226J015979o9499n092679q525835o116113m22813L299014
37928a2395188M091085M597399N196494L516083k46876k191199m27774J827710
37920C967734J111633j302930j904937j81572J518835J895729J624519J130519
37912G859530L1417j300842j627325n10338J088479J797662P71965j590876l156872
37903C362800j630923K175770M191898J921508k029653l410674j974855r99381
$$ y = [-11697225, -11197432, -7988500, -3016437, 2679221, 8138504, 11900166, 12331245, 9044573, 4023512, 1006974, 2903426, 9031465, 15113953, 16834690, 13676993, 8854265, 5489899, 3702503, 1929816, 200852, 523971, 3663962, 7016587, 7305502, 4927984, 3516758, 4532737, 4463238, -629441, -9155276, -15271389, -15694202, -12395188, -8304103, -3706704, 1489790, 5005873, 4758997, 2567798, 2140024, 3967734, 5079367, 3776437, 1871500, 1689928, 3208763, 5104492, 6729011, 7859530, 7890947, 6590105, 4962780, 4452442, 5540921, 7338583, 8110548, 6519672, 3362800, 1731877, 3907647, 8099545, 10021053, 7991400, 4580726, 2605871, 1606490]
37895A606490k094291l641704m232131m391373m220986k304778J613266N113466
37887a2552041N905535M570503L023565J640331l39777k417039k799291r44877
37879c913091J171039J100357j100699k656751j270111J859774L237796J471483
37871a00203q62206o49150J651661K796731J001008k093431l436754j454718K716220
37862d30842N963038N773668K864414K54681q55117k254906m543075m742737r83746
37853A045378L140591L104581M13076n009J843081J309334k117508k981648J217118
37844F968994N452681M801338J271878r50430k196036m431286n863103m036335
37836A017701j262788j149610k003107K73864M319351M758413R10377k343360
$$ y = [1606490, -487801, -4129505, -8361636, -12753009, -16973995, -19278773, -17665507, -12552041, -6646506, -2076003, 947562, 2587893, 2248116, -168923, -2968214, -3913091, -2742052, -1641695, -2742394, -5399145, -6669256, -4809482, -1571686, -100203, -962409, -1611559, 40102, 2836833, 3837841, 1744410, -1692344, -3147062, -430842, 5532196, 11305864, 14170278, 14424959, 13569842, 11314936, 6771861, 2029124, 1045378, 4185969, 7290550, 7703626, 7698617, 9541698, 10851032, 8733524, 5751876, 6968994, 12421675, 17223013, 18494891, 17544461, 15348425, 10917139, 5054036, 1017701, -245087, -1394697, -3397804, -3123940, 1195411, 5953824, 6864201, 4520841]
37828D520841k621517k581641l381019k185277J448222K952172K08238j790985
37820c430966J464324O054449N045269q59739m287228j935924J586022J458637
37812E094844r45016j533812M06576K523810L504753L848983L584660J946295
37804A8431093p35489k946335m101769m936659n248724l278433J153601M528445
37796B865730L197732j365651l637929r63972L163155M065104J677438q13308
37788H188299k107326l410221m832972m641929k499733o06506o19914j563208
37780a2093510j775870j096521p7814J283015K813153L499606K772020J483169
37772c192752O58149J82954m53740j090930j406986j558880j445818k55932K221104
$$ y = [4520841, 1899324, -682317, -4063336, -6248613, -4800391, -1848219, -1639981, -3430966, -1966642, 4087807, 9133076, 8273337, 3986109, 2050185, 3636207, 5094844, 4149828, 2616016, 3022592, 5546402, 9051155, 12900138, 16484798, 18431093, 17695604, 14749269, 10647500, 5710841, 462117, -2816316, -1662715, 2865730, 6063462, 4697811, 1059882, 95910, 3259065, 7324169, 9001607, 8188299, 6080973, 2670752, -2162220, -6804149, -9303882, -9910388, -10530302, -12093510, -13869380, -14965901, -15043715, -13760700, -10947547, -7447941, -4675921, -3192752, -2534603, -2351649, -2805389, -3896319, -5303305, -6862185, -8308003, -8563935, -6342831]
37763f342831M488057M600478K313366o45057k219900j635285K31284J696457
37755B486569J663452K71457j749377l644148m191302k030254K202510N213035
37747B21942M554946K064705J468335L077520L664205J543657j377675l165583
37739A2052052m178217m678607l442950o38760R10780j98144j128012J097494
37731b04364M614016M942182J040523l699234n806281m632639j514311J599042
37723c661066K929509K243726J329758J781660K890661K953236J676287q8832
37715A2054939j763944k626472j431446J580098L605485K336091j008813l551034
37707I194904m151410k981253J22066L953068M697187K58518n519628p001582
$$ y = [-6342831, -1854774, 2745704, 5059070, 4414013, 2194113, 558828, 790112, 2486569, 4150021, 4421478, 2672101, -972047, -5163349, -7193603, -4991093, 221942, 4776888, 6841593, 8309928, 11387448, 15051653, 16595310, 15217635, 12052052, 7873835, 3195228, -247722, -886482, 24298, -173846, -1301858, -204364, 4409652, 9351834, 10392357, 6693123, 886842, -3745797, -5260108, -3661066, -731557, 1512169, 2841927, 4623587, 7514248, 10467484, 12143771, 12054939, 10290995, 7664523, 6233077, 7813175, 11418660, 13754751, 12745938, 9194904, 5043494, 2062241, 2184307, 6137375, 10834562, 11093080, 5573452, -1428130]
37699a428130m108132j277489j48000J451133L431290K517683j144713k402987
37691c109345J007269M225254K796261j24295R06731M473883M406981m87751m764571
37682I330417m689533k940267l210321m390811l113793N27004L196247L279322
37674b011735K519798K496757K241205P71133j33521J707872M594593M194100
37666A6380202l42835m578151m734089k577902j758122j929679m71152J693810
37658A682082J007010k156927l019018J66981K942764J412216j799875j770419
37650a535186J366477L094201J074971k378740l885949k464610M02888K330327
37642a995621J827188k85492j698080j431230o66510k56043O16889K185513K729953
$$ y = [-1428130, -5536262, -6813751, -6961751, -5510618, -2079328, 438355, -706358, -3109345, -2102076, 2123178, 4919439, 4795144, 5701875, 10175758, 14582739, 14094988, 9330417, 4640884, 1700617, -1509704, -5900515, -9014308, -8487304, -5291057, -2011735, 508063, 3004820, 5246025, 6017158, 5883637, 7591509, 12186102, 16380202, 16037367, 11459216, 6725127, 4147225, 2389103, 459424, -11728, 1682082, 2689092, 532165, -2486853, -2319872, 622892, 2035108, 235233, -1535186, -168709, 2925492, 4000463, 1621723, -2264226, -4728836, -4325948, -1995621, -168433, -453925, -2152005, -3583235, -4249745, -4505788, -3888899, -1703386, 1026567]
37633A026567J214178o48899r00092q7985M76898J271531K921469L744976J774037
37624A0792680j869873m189329l978970k084621O55014L193022L435949P05092
37616F658964j939716j030494K272930L644112J665155q36511j439721p68065
37608H226654l6149Q79453J879682J651596n03687l371011m985163m027633m30388
37599g16646L878716N621079L654586R53132O06739R55001j823961o891544q806913
37590b569811n049237N58687L354919L144473K104702O91214j645878l787991
37582c198922l693389r52189K936224N955394O425846L847773k02892l217971
37574G899874m313286m396478l885736k272835l4696J396461J895350K451753
$$ y = [1026567, 2240745, 1591846, 691754, 603769, 1080667, 2352198, 5273667, 9018643, 10792680, 8922807, 4733478, 754508, -1330113, -675099, 2517923, 5953872, 6658964, 4719248, 3688754, 5961684, 9605796, 11270951, 10434440, 8994719, 8226654, 8190505, 9069958, 10949640, 12601236, 12097549, 8726538, 3741375, -286258, -716646, 3162070, 8783149, 12437735, 13390867, 13997606, 14952607, 13128646, 6237102, -2569811, -7619048, -7060361, -3705442, -560969, 1543733, 2234947, 589069, -3198922, -6892311, -7844500, -4908276, 1047118, 7472964, 11320737, 11117845, 7899874, 3586588, -809890, -4695626, -6968461, -7003157, -5606696, -3711346, -1259593]
37566a259593K528270N15863k713945l936861k136431K33395J402169K150439
37558c216694K485363O53829k609791l135663N73354M123462L313867r2873k080241
37549A4613k298633k334164j481848J046042K504034L60243k453539j344377K451356
37540c536273L618107R80494j553588j800317j499693j605803q31032M97121L63234
37531e367750l49430J418921M450509L409799k261829n471253j259400N411582
37523a8851O367723J199928l510528l731154j684159p82368j326175j785466j308199
37514f579249q0007J151584J593180J379890J568967K346701K346851Q64752o37770
37505C954899p18455k27805n78246j044094j2039J877212K121703k77776l590675
$$ y = [-1259593, 1268677, 1784540, -929405, -4866266, -7002697, -6769302, -5367133, -3216694, -731331, -77502, -2687293, -5822956, -5249602, -1126140, 2187727, 2094854, 14613, -2284020, -4618184, -6100032, -5053990, -2549956, -2189713, -4643252, -5987629, -3536273, 81834, 1062328, -491260, -2291577, -3791270, -5397073, -6228105, -5730984, -5367750, -5717180, -4298259, 152250, 3562049, 1300220, -4171033, -5430433, -18851, 6348872, 7548800, 4038272, 307118, -1377041, -2159409, -3485584, -5271050, -6579249, -6659256, -5507672, -3914492, -2534602, -965635, 1381066, 3727917, 4592669, 3954899, 3236444, 3008639, 2430393, 1386299, 1374260, 3251472, 5373175, 5095399, 1504724]
37496A504724n389026m516234j443789K035236L912847L898476L583261L712061
37488G297556K682842n50995l647517l669507j810583j951365m311324m149666
37480a0110559J454966Q282360R314348L400590l168324m148912m00478J909878
37472F533869p33368m980412n190397q88630K508634P25506l799249n124108j328687
37463a2276842L625668N448755M365361L265155L035283J993661o34459l026900
37455E795682l268484j936651r17025o32203o8268Q73376R72670r6203j066350
37446c43456j354560k043184l276698k840519L91173L442767K829789q635o13310
37437c816633J604653K651383O53064j308411p86525L2410j229009k633144j651589
$$ y = [1504724, -3884302, -8400536, -9844325, -7809089, -3896242, 2234, 3585495, 7297556, 9980398, 9429403, 5781886, 2112379, 301796, -1649569, -5960893, -10110559, -8655593, -373233, 8941115, 12341705, 9173381, 5024469, 4623991, 6533869, 5800501, 820089, -4370308, -5258938, -2750304, -2024798, -5824047, -10948155, -12276842, -8651174, -3202419, 1162942, 4428097, 7463380, 9457041, 8822582, 5795682, 2527198, 590547, -326478, -958681, -1026949, -153573, 819097, 722894, -343456, -1698016, -3741200, -7017898, -9858417, -9467244, -6024477, -3194688, -3203323, -3816633, -2211980, 439403, 1092467, -215944, -1002469, -970059, -2199068, -4832212, -6483801]
37428f483801k04807j475933l939661l468048j21371K130943J992946K155734
37420i413998L702496M124234K219188N51040J032652J784435O73012j198591
37412C474468j947284k046550k428081j931336M78509K890113K824326J066536
37404B380701K75993P82499O11541q42216j909316j460227l58857K64522N01111
37395B45751J012081K019034L121828L419105K167959P2428q14696M96808K404925
37386A4145223K755820J542833K00880r02008k556173m795371o442498o244997
37378b296291l460851J601482O254455O335399R78668m686529m699390L98632
37370D25575M579655M344299J932428J66450j497542l843639m761138k485373
$$ y = [-6483801, -6688608, -8164541, -12104202, -15572250, -15693621, -13562678, -11569732, -9413998, -5711502, -1587268, 631920, 1182960, 2215612, 4000047, 4673059, 3474468, 1527184, -519366, -2947447, -4878783, -4400274, -1510161, 1314165, 2380701, 2656694, 3439193, 4050734, 3208518, 1299202, -161025, -519882, -255360, 245751, 1257832, 3276866, 6398694, 9817799, 11985758, 12058186, 11243490, 11740298, 14145223, 16901043, 18443876, 18644756, 17742748, 15186575, 10391204, 3948706, -2296291, -5757142, -4155660, 2098795, 8434194, 9412862, 4726333, 26943, 425575, 5005230, 9349529, 11281957, 11448407, 9950865, 6107226, 1346088, -1139285]
37362a139285N65585O48512k025509l962953l453270k060314j402307j055362
37354a3884903N7327J939235L415305K899908l8330l067543k702445R59223L253608
37345g168615J159966j847051q46581K700805L352626R07479P53474M068032M677381
37336G757516r18250o696425n707209o62743Q27632j643943j846883J550793K489341
37327d850171j805658n302497k187312M403073P495828N906034L474058J617908
37319H751263j527958n587518p005646m303804l02962J930677K449039K890790
37311b706119L992590N346588N737852L553729j133471n132444n349370l232795
37303A076560k789561m017765k429917L423744Q189210O523917M96474l614194
$$ y = [-1139285, -573700, 74812, -1950697, -5913650, -9366920, -11427234, -12829541, -13884903, -13827576, -11888341, -8473036, -5573128, -5611458, -8679001, -11381446, -10422223, -7168615, -6008649, -7855700, -8702281, -6001476, -2648850, -1741371, -987897, 3080135, 7757516, 6839266, 142841, -5564368, -6227111, -5399479, -7043422, -8890305, -7339512, -4850171, -6655829, -11958326, -14145638, -9742565, -2246737, 3659297, 7133355, 8751263, 7223305, 1635787, -5369859, -9673663, -9976625, -8045948, -5596909, -2706119, 1286471, 6633059, 12370911, 15924640, 14791169, 9658725, 4309355, 1076560, -1713001, -5730766, -8160683, -4736939, 3452271, 9976188, 10472662, 6858468]
37295F858468l768507l182260l891409l764474o52516L857321O305173N057784
37287F819580J247578k446117l449381j301465J464245J783302l41958k078246
37279A697538j570891K21004J532691J557036p7989l234932n980482n829374l319444
37270a5004843j771098k102966r55133L539355P175247M950405r32541l366152
37262h467726m48101K006427l09437l450546j459525M054829N728705Q89273m852902
37253f309003n545372k242920J53251L88560J359079M216703O047703M356026
37245B424027P49939j709979k605301l225829l161022r14927K532228L959630
37237a951234K330966K60777o0762J33056j007996k389202j703609O48689K032084
$$ y = [6858468, 3089961, -92299, -3983708, -7748182, -8400698, -4543377, 1761796, 6819580, 8067158, 5621041, 2171660, 870195, 2334440, 4117742, 3775784, 1697538, 126647, 347651, 1880342, 3437378, 3359389, 124457, -5856025, -11685399, -15004843, -16775941, -18878907, -19834040, -16294685, -9119438, -4169033, -5101574, -8467726, -8915827, -6909400, -7218837, -10669383, -12128908, -8074079, -2345374, -1456101, -6309003, -11854375, -14097295, -13944044, -13555484, -12196405, -7979702, -1931999, 2424027, 3173966, 1463987, -1141314, -4367143, -7528165, -8443092, -5910864, -1951234, 379732, 640509, 579747, 712803, -295193, -2684395, -4388004, -3739315, -1707231]
37228a707231J424719M50639O57478J698063K314703J696283K4177j168851R070
37219E399050K945605L945006Q61517k958378k659815R40659K248266q42636m127487
37210E751787l955456k381843k726740l873006k756754J75874K028511K242963
37202e494664K504181L025333K571924J442903J026971R73571N9497q12055k8167
37193E269494Q96897r80889m425203m575837k57549L463651K106710k301969m669690
37184e474385l448210r35423J104822L035207N172284O393599N247592J639747
37176A2735233k502658m355349k937149m62066M69666M00780J427223K754451
37168G530131J450576k052974l429854r55525J592270R28687q40216o37126l7080
$$ y = [-1707231, -282512, 168127, 825605, 2523668, 4838371, 6534654, 6558831, 5389980, 5399050, 8344655, 12289661, 13151178, 10192800, 7532985, 8473644, 10721910, 9879274, 5751787, 1796331, -585512, -3312252, -7185258, -9942012, -9766138, -7737627, -5494664, -2990483, 34850, 2606774, 4049677, 5076648, 6050219, 6109716, 5297661, 5269494, 6166391, 5185502, 760299, -3815538, -4073087, -609436, 1497274, -804695, -5474385, -8922595, -9858018, -8753196, -5717989, -545705, 5847894, 11095486, 12735233, 10232575, 5877226, 2940077, 2478011, 2947677, 3348457, 4775680, 7530131, 8980707, 6927733, 3497879, 2542354, 4134624, 5063311, 4223095, 3585969, 3548889]
37159C548889j990063m578949l262112J710389M974131L197131j379341m826908
37151b606833n545836l976915j321759P77466J464219J743740K599777K889880
37143c976261J460392J09285J209833L324042K946098J53202j485837n78247O81825
37134C844332J012911J476364J654734p49626m764648n336790m85583M674376
37126A326070M412162j78839l621357l436343j506356J86833J548588K669793
37118A400551K893912J653828r76191l882422m585944j271188L922425O139108
37110E294079L817879P77715M70432J287160L56280j078522p6395K231260J776191
37101A4856079k124623n486710m960770j508677J555592K022063J12939k110669
$$ y = [3548889, 1558826, -3020123, -6282235, -4571846, 402285, 3599416, 2220075, -2606833, -8152669, -12129584, -13451343, -12673877, -11209658, -9465918, -6866141, -3976261, -2515869, -2406584, -1196751, 2127291, 5073389, 5226591, 3740754, 3162507, 3844332, 4857243, 6333607, 7988341, 7238715, 2474067, -2862723, -3348306, 1326070, 5738232, 5559393, 1938036, -1498307, -3004663, -2817830, -1269242, 1400551, 4294463, 5948291, 4972100, 1089678, -3496266, -4767454, -845029, 5294079, 9111958, 9889673, 10360105, 11647265, 12003545, 10925023, 10848628, 13079888, 14856079, 12731456, 7244746, 2283976, 775299, 2330891, 4352954, 4465893, 2355224]
37093B355224k871128k943957m354790o026701l799483K845678P523083M601733
37085b670341k341669m831631q96784L357835L316578J218495P25748J351675
37077g70094R00076l02218n97990k33748r24678l134657n046808l867231J372970
37068a2604378P259742P965897K344330k891496j042335N166821P301062L339340
37060A6838983n79699r84366j897564n953254q179996m008639K271909L588510
37052A095884O87189k00270K143832K855263k20027l252087k886033o50763P22417
37043B95405J183966J633119J556051N01936l19726J72120R76440L99254j407547
37034D991018k451615j262582J268868K673564J819820N81852J338462L157686
$$ y = [2355224, -515904, -3459861, -7814651, -13841352, -17640835, -14795157, -7272074, -2670341, -5012010, -9843641, -10740425, -7382590, -4066012, -2847517, -2121769, -770094, 129982, -172236, -770226, -1003974, -1928652, -5063309, -10110117, -13977348, -12604378, -5344636, 2621261, 4965591, 2074095, 1031760, 6198581, 13499643, 16838983, 16259284, 15274918, 13377354, 7424100, -755896, -4764535, -2492626, 1095884, 1783073, 1582803, 3726635, 6581898, 6361871, 3109784, 223751, -427012, 295405, 1479371, 3112490, 4668541, 5170477, 4850751, 5022871, 5999311, 6398565, 4991018, 2539403, 1276821, 2545689, 5219253, 7039073, 7620925, 8959387, 12117073]
37026A2117073K822902j3625j879391j057027m95108k458404l841926j032815
37018D161679L218521L040001j673152n017813l707215p60020L22357J82091N34047
37009C00496O24575o35285j985495j825378p77471j11514N68307K093967L714510
37000A966712M156224L569048K840893J851304k03839l191775n649840n933764
36992e95037l750935q22680O53615P59302J649094L551264L433987R2409k323402
36983B647617j07160L142308J423282l331298l441844J521583K747021l485383
36975A116126q183704k771480P122287R487007L065408k693199k679593j394148
36967C068704k684655l392394l84088L184838K973534O248j931847j916392j335215
$$ y = [12117073, 14939975, 14926350, 13046959, 11989932, 11494824, 9036420, 5194494, 4161679, 7380200, 10420201, 8747049, 3729236, 22021, -737999, -415642, -233551, 300496, 925071, 289786, -1695709, -3521087, -4298558, -4410072, -3841765, -1747798, 1966712, 6122936, 9691984, 12532877, 14384181, 14180342, 10988567, 5338727, -595037, -4345972, -5168652, -4515037, -3755735, -2106641, 1444623, 4878610, 4971019, 2647617, 2540457, 5682765, 7106047, 3774749, 332905, 1854488, 4601509, 1116126, -7067578, -9839058, -2716771, 6770236, 9835644, 7142445, 4462852, 3068704, 384049, -3008345, -3392433, -207595, 2765939, 2772187, 840340, -1076052, -2411267]
36958b411267o23983J38128k44934j997059k985644k086219j464508k529242k352294
36949a6557022J799501O491635N803799L42260k768117K03379M659491M856781
36941D831707J663812l82473n19284j598505l959036m418974j815199P34412P08346
36932d755194j09047R64932L152237M000115L407747K800464J908946j91169j994314
36923I184717j432074k36576j995571n616769n693178q76073L155414J934881
36915a575229j227159r85958J705106K272992P20980R75124L189227L019781r04432
36906G190432m475032m617582l385022l339539l131486n80329L088087N133215
36898d117256N154822M384983K967879M63063k205656l367400k368409K87240
$$ y = [-2411267, -3035250, -2897122, -3142056, -5139115, -8124759, -10210978, -11675486, -14204728, -16557022, -14757521, -8265886, -2462087, -2119827, -4887944, -4684565, -25074, 4831707, 6495519, 6113046, 5593762, 3995257, 36221, -4382753, -6197952, -5463540, -4755194, -4864241, -3899309, -747072, 3253043, 6660790, 9461254, 11370200, 11179031, 9184717, 7752643, 7516067, 5520496, -96273, -5789451, -6665524, -3510110, -1575229, -2802388, -3788346, -2083240, 189752, 910732, 1885856, 5075083, 8094864, 7190432, 2715400, -1902182, -5287204, -8626743, -11758229, -12338558, -9250471, -4117256, 1037566, 5422549, 8390428, 8853491, 6647835, 3280435, 912026, 1199266]
36890A199266L174673L793051N80664l905044m715023j040101K088150Q76076
36882B051712j747636r89120K401675L827603K027471j7901m33587k42265m2196
36873F835756Q30739J489881q4194k963780l442210o76644J315458o99587m330939
36864a725520m770865j059345L079040L771662Q56387k298655k165112J156311
36856c156097L621960J936116j916723k958642J08761L271541K814272k59009
36848C462179k566106k496189n73897J873049K778463M74785l346778m167353
36840d561847l58955L829462L554295l59604l309147l249765j773456k18113J392568
36831e054562J942598k64364l896243m825773j301493L494328N303803L382482
$$ y = [1199266, 4373939, 8166990, 8747654, 4842610, 127587, -912514, 1175636, 2051712, 304076, -685044, 1716631, 5544234, 7571705, 7553804, 7120217, 6877952, 6835756, 7666495, 9156376, 9072182, 6108402, 2666192, 1989548, 3305006, 2605419, -1725520, -6496385, -7555730, -4476690, -705028, 151359, -2147296, -4312408, -3156097, 465863, 2401979, 485256, -2473386, -2364625, 906916, 3721188, 3462179, 896073, -1600116, -2174013, -300964, 2477499, 2952284, -394494, -4561847, -4920802, -1091340, 2462955, 2103351, -1205796, -4455561, -6229017, -6447130, -5054562, -3111964, -3376328, -7272571, -12098344, -13399837, -9905509, -4601706, -1219224]
36823a219224K43518j515901j106864M42494J301561P02705n538P90294K341076
36814A974121K449835Q66111m18690n61473j124777l032473m565442l859247j567361
36805i839396O09792K551454N015030P278340P353036M366153l53262m318614
36797A2662533n478849l546466m95367R42725o7261j871983k544633j630018L89162
36788a640157K687790L718790K233609m21807j093685R09711K553097J594105
36780A0541453j98285o28607j185434m049281o974551n642150n33713L049173
36772e621395K341652L36706M27121J738375J936554J423388J851763K619575
36764G053739J808863n52829k698507l837716m446143m351698k691562J72034
$$ y = [-1219224, -975706, -2491607, -3598471, -3155977, -1854416, -1151711, -1157249, -366955, 1974121, 4423956, 5290067, 4871377, 4309904, 3185127, 152654, -4412788, -8272035, -9839396, -9229604, -6678150, -1663120, 5615220, 12968256, 17334409, 16981147, 12662533, 7183684, 3637218, 3141851, 4084576, 4017315, 2145332, -399301, -2029319, -1640157, 1047633, 4766423, 7000032, 6578225, 5484540, 6394251, 8947348, 10541453, 10343168, 9714561, 8529127, 4479846, -2494705, -8136855, -8670568, -5621395, -3279743, -2943037, -2515916, -777541, 1159013, 2582401, 4434164, 7053739, 8862602, 8309773, 5611266, 1773550, -2672593, -7024291, -9715853, -9543819]
36756i543819K356528K411216O73477j217802j448396P73868M104023N646777
36748C755872L865213N58032j285340j246630j541032l251916m274566k096111
36740e516478K326766M923047K978101j553084l899502j544471L209062N955703
36732F879144M674570Q30513l073333n487028n702318l789659j269563j93711
36724g131385o55610o33588P95239J768659N91257j221367r12089J525103L586578
36715b287203L959448L606318L186995J887072l71591j622115l05207J996653
36707A0050370J846774j998814o711466q099157n185788j450130o25867j766728
36699a3940806n90898L720718O074550K436321l143324k927627L578490Q074306
$$ y = [-9543819, -7187291, -4776075, -4102598, -5320400, -6768796, -5994928, -1890905, 3755872, 7621085, 8179117, 6893777, 5647147, 4106115, 854199, -3420367, -5516478, -3189712, 1733335, 4711436, 3158352, -741150, -2285621, 923441, 6879144, 11553714, 12384227, 9310894, 3823866, -1878452, -5668111, -6937674, -7131385, -7786995, -8420583, -7625344, -5856685, -5265428, -6486795, -7398884, -5873781, -2287203, 1672245, 5278563, 8465558, 10352630, 9981039, 8358924, 8053717, 10050370, 11897144, 9898330, 3186864, -4912293, -10098081, -11548211, -12174078, -13940806, -14531704, -10810986, -4736436, -2300115, -5443439, -8371066, -4792576, 3281730]
36691C281730M347829l702074p851584n807348j656541J422115L742581N065161
36683a158131L451029k81856j536944J571951M047889M52266o335393p731731
36675g520920j054613O257574O241281L97747l652223l021516j979738l770232
36667h102640n417901l142762J058048K231129j07502j539043O37544M050454
36659a0332673N217113L909107K256402J572151J497508J070172l23017k151955
36651B714808k610080n78664K169788K576430M78276j013511j42245R36389j78906
36642D352285k133987j826123R95369L534416L607584J471674j390467l439722
36634E171029l578576k237416j438996k202563k790120j476460O4973j036075
$$ y = [3281730, 7629559, 3927485, -3924099, -9731447, -11387988, -9965873, -6223292, -1158131, 2292898, 2011042, 474098, 2046049, 6093938, 6546204, 210811, -7520920, -8575533, -2317959, 3923322, 4321069, 668846, -2352670, -4332408, -8102640, -13520541, -16663303, -15605255, -13374126, -13481628, -15020671, -14383127, -10332673, -5115560, -1206453, 1049949, 2622100, 4119608, 5189780, 4866763, 2714808, 104728, -473936, 1695852, 4272282, 4750558, 3737047, 3594802, 4531191, 4352285, 2218298, 392175, 1387544, 4921960, 8529544, 10001218, 8610751, 5171029, 1592453, -644963, -2083959, -4286522, -7076642, -8553102, -8488129, -9524204]
36626i524204l788543l831045M74281N514346P210026N675428L476989J612132
36618F819410n00454k560561l386341k871543k137699j958880k224547k476497
36610a1297112j945818J10986K856292L683439J352922j550531j581903N80054
36602g791671Q95456j927193m142793k360171J448176K990975J976300K001200
36594f909721M544406O547813M955493Q96157k293215l160455k431476r56109
36586A192893M33248L01080j671255l150032j919299L56262R1599k540640l244164
36577a0150308K19817M742938O400169N296606L633005J663818j270679l574362
36569F961004k886657l0071J717191J008928p12343k341533l936985m426101j981378
$$ y = [-9524204, -13312747, -17143792, -16669511, -11155165, -3945139, 1730289, 5207278, 6819410, 6318956, 3758395, 372054, -2499489, -4637188, -6596068, -8820615, -11297112, -13242930, -13131944, -10275652, -6592213, -5239291, -6789822, -8371725, -7791671, -6896215, -8823408, -12966201, -15326372, -13878196, -10887221, -8910921, -6909721, -2365315, 4182498, 9137991, 10034148, 7740933, 4580478, 2149002, 1192893, 1626141, 1927221, 255966, -2894066, -4813365, -4457103, -4365504, -6906144, -10150308, -9930491, -5187553, 1212616, 6509222, 10142227, 11806045, 10535366, 6961004, 4074347, 4044276, 5761467, 6770395, 6058052, 3716519, -220466, -4646567, -6627945]
36560f627945K388337M746749L213599M73383k74405N57569Q11780L66146M74516
36551F129729P87173j08457j635247j368465J287847L496953K133450k293018
36543H429965n772457m870658l59236L502336L386810J33316k826484l444002
36535a820410k281388m32724J826811M089675N280226M725860K605524o99037
36527A3294537m103789m948746j317069M167987N829817J725829l694377n500905
36519E453284m083677k661399j895408n70888M70989n47399k178227j103769K237590
36510d878904L518270R19018k064511j786153P02303J986835J029741p16130k239608
$$ y = [-6627945, -4239608, 507141, 3720740, 4194123, 3919718, 4477287, 5289067, 5655213, 6129729, 6916902, 6808445, 5173198, 3804733, 5092580, 8589533, 10722983, 8429965, 2657508, -2213150, -2572386, 929950, 4316760, 4450076, 1623592, -1820410, -4101798, -4534522, -2707711, 1381964, 6662190, 11388050, 13993574, 13294537, 9190748, 4242002, 2924933, 7092920, 12922737, 14648566, 10954189, 5453284, 1369607, -1291792, -3187200, -3758088, -3287099, -3834498, -6012725, -7116494, -4878904, -1360634, -441616, -2506127, -4292280, -3589977, -1603142, -573401, -1289531, -3529139]
$$ [...]
##END NTUPLES=NMR SPECTRUM
##END=
