##TITLE=31Pdec_LR-798-RM2
 CDCl3, 24 sc
 11.3.2025
##JCAMPDX= 6.0         $$ Bruker NMR JCAMP-DX V2.0
##DATA TYPE= NMR SPECTRUM
##DATA CLASS= NTUPLES
##ORIGIN= UXNMR, Bruker Analytische Messtechnik GmbH
##OWNER= root
$$ XWIN-NMR		Version 3.5
$$ Tue Mar 11 14:52:12 2025 Russian Standard Time (UT+4h)  she@DPX200
##.OBSERVE FREQUENCY= 81.013821
##.OBSERVE NUCLEUS= ^31P
##.ACQUISITION MODE= SIMULTANEOUS
##.ACQUISITION SCHEME= undefined
##.AVERAGES= 24
##.DIGITISER RES= 17
##SPECTROMETER/DATA SYSTEM= spect
##.PULSE SEQUENCE= zgpg30
##.SOLVENT NAME= D2O
##.SHIFT REFERENCE= (INTERNAL, D2O, 0, 198.062)
##AUDIT TRAIL= $$ (NUMBER, WHEN, WHO, WHERE, WHAT)
$$ ##TITLE= Audit trail, XWIN-NMR		Version 3.5
$$ ##JCAMPDX= 5.01
$$ ##ORIGIN= Bruker BioSpin GmbH
$$ ##OWNER= she
$$ F:/spectra/data/she/nmr/P31/2/pdata/1/auditp.txt
$$ ##AUDIT TRAIL=  $$ (NUMBER, WHEN, WHO, WHERE, WHAT)
(   1,<2025-03-11 14:49:09.82 +0400>,<she>,<DPX200>,
      <created by zg, POWCHK disabled, PULCHK disabled
       configuration hash MD5:
       00 E9 B6 7A A2 85 ED C7 34 08 36 98 17 FE 4E 26
       data hash MD5: 32K
       85 1E EE 2B 1F 66 6F 2D 90 43 79 F3 36 5C 24 BF>)
(   2,<2025-03-11 14:50:34.46 +0400>,<she>,<DPX200>,
      <Start of raw data processing
       efp BC_mod = 2 LB = 1.5 FT_mod = 6 PKNL = 1 PHC0 = 1755.893 PHC1 = 55.2944 SI = 64K 
       data hash MD5: 64K
       86 61 81 BE FD 70 65 F3 FC 9D FE AF B7 E8 4A BF>)
(   3,<2025-03-11 14:51:10.62 +0400>,<she>,<DPX200>,
      <pk PHC0 = 60.84944 PHC1 = -80.8 
       data hash MD5: 64K
       FF 5A 62 12 BD 30 8F E5 E9 77 5C FC D7 74 1E FF>)
(   4,<2025-03-11 14:51:15.12 +0400>,<she>,<DPX200>,
      <abs ABSG = 5 
       data hash MD5: 64K
       4E 37 49 45 B5 36 4A DC 9B 19 F8 C9 8E 96 4C 5E>)
(   5,<2025-03-11 14:51:39.93 +0400>,<she>,<DPX200>,
      <pk PHC0 = -3.780451 PHC1 = 0 
       data hash MD5: 64K
       78 7B CB 80 A4 F9 8E 73 19 94 41 FE 0B 55 65 25>)
$$ ##END=
$$ 
$$ hash MD5
$$ 35 B8 37 97 32 B2 21 39 53 0E EF BB 16 14 AC 55
##$RELAX= 
##$RELAX= 
##$RELAX= 
##$RELAX= 
##$RELAX= 
##$RELAX= 
##$RELAX= 
##$RELAX= 
$$ Bruker specific parameters
$$ --------------------------
##$DU= <F:/spectra>
##$EXPNO= 2
##$NAME= <P31>
##$PROCNO= 1
##$TYPE= <nmr>
##$USER= <she>
##$AMP= (0..31)
100 100 100 100 100 100 100 100 100 100 100 100 100 100 100 100 100 100 
100 100 100 100 100 100 100 100 100 100 100 100 100 100 
##$AQSEQ= 0
##$AQ_mod= 1
##$AUNM= <au_zg>
##$AUTOPOS= <>
##$BF1= 81.014009
##$BF2= 200.13
##$BF3= 200.13
##$BF4= 200.13
##$BF5= 200.13
##$BF6= 200.13
##$BF7= 200.13
##$BF8= 200.13
##$BYTORDA= 1
##$CFDGTYP= 0
##$CFRGTYP= 5
##$CHEMSTR= <none>
##$CNST= (0..31)
1 1 145 1 1 1 1 1 1 1 1 1 1 1 1 1 1 1 1 1 1 1 1 1 1 1 1 1 1 1 1 1 
##$CPDPRG= <waltz16>
##$CPDPRG1= <>
##$CPDPRG2= <waltz16>
##$CPDPRG3= <>
##$CPDPRG4= <mlev>
##$CPDPRG5= <mlev>
##$CPDPRG6= <mlev>
##$CPDPRG7= <mlev>
##$CPDPRG8= <mlev>
##$CPDPRGB= <>
##$CPDPRGT= <>
##$D= (0..31)
0 1 0 0 0 0 0 0 0 0.06 0 0.03 2e-05 3e-06 0 0 0.0002 0 0 0 0 0 0 0 0 0 
$$ [...]
##$SUBNAM3= <"">
##$SUBNAM4= <"">
##$SUBNAM5= <"">
##$SUBNAM6= <"">
##$SUBNAM7= <"">
##$SUBNAM8= <"">
##$SUBNAM9= <"">
##$SW= 400.765351723535
##$SWIBOX= (0..15)
0 1 3 0 0 0 0 0 0 0 0 0 0 0 0 0 
##$SW_h= 32467.5324675325
##$TD= 32768
##$TD0= 1
##$TE= 0
##$TE2= 300
##$TE3= 300
##$TEG= 300
##$TL= (0..7)
0 120 53 12 22 120 120 120 
##$TP= (0..7)
150 150 150 150 150 150 150 150 
##$TP07= 0
##$TPNAME0= <>
##$TPNAME1= <>
##$TPNAME2= <>
##$TPNAME3= <>
##$TPNAME4= <>
##$TPNAME5= <>
##$TPNAME6= <>
##$TPNAME7= <>
##$TPOAL= (0..7)
0.5 0.5 0.5 0.5 0.5 0.5 0.5 0.5 
##$TPOFFS= (0..7)
0 0 0 0 0 0 0 0 
##$TUNHIN= 0
##$TUNHOUT= 0
##$TUNXOUT= 0
##$USERA1= <user>
##$USERA2= <user>
##$USERA3= <user>
##$USERA4= <user>
##$USERA5= <user>
##$V9= 5
##$VALIST= <valist>
##$VCLIST= <CCCCCCCCCCCCCCC>
##$VD= 0
##$VDLIST= <DDDDDDDDDDDDDDD>
##$VPLIST= <PPPPPPPPPPPPPPP>
##$VTLIST= <TTTTTTTTTTTTTTT>
##$WBST= 1024
##$WBSW= 4
##$XGAIN= (0..3)
0 0 0 0 
##$XL= 0
##$YL= 0
##$YMAX_a= 6940
##$YMIN_a= -3554
##$ZGOPTNS= <>
##$ZL1= 120
##$ZL2= 120
##$ZL3= 120
##$ZL4= 120
##$ABSF1= 198.0616
##$ABSF2= -202.7028
##$ABSG= 5
##$ABSL= 3
##$ALPHA= 0
##$AQORDER= 0
##$ASSFAC= 0
##$ASSFACI= 0
##$ASSFACX= 0
##$ASSWID= 0
##$AUNMP= <proc_1d>
##$AZFE= 0.1
##$AZFW= 0.5
##$BCFW= 0
##$BC_mod= 2
##$BYTORDP= 0
##$COROFFS= 0
##$CY= -3
##$DATMOD= 1
##$DC= 0
##$DFILT= <>
##$DTYPP= 0
##$F1P= 0
##$F2P= 0
##$FCOR= 1
##$FTSIZE= 65536
##$FT_mod= 6
##$GAMMA= 0
##$GB= 0
##$INTBC= 1
##$INTSCL= 9.790993e-09
##$ISEN= 30
##$LB= 1.5
##$LEV0= 0
##$LPBIN= 0
##$MAXI= 10000
##$MC2= 0
##$MEAN= 0
##$ME_mod= 0
##$MI= 50
##$NCOEF= 0
##$NC_proc= -7
##$NLEV= 6
##$NOISF1= 182.463
##$NOISF2= 159.3651
##$NSP= 0
##$NTH_PI= 0
##$NZP= 0
##$OFFSET= 198.0616
##$PC= 4
##$PHC0= 1812.962
##$PHC1= -25.5056
##$PH_mod= 1
##$PKNL= yes
##$PPARMOD= 0
##$PSCAL= 0
##$PSIGN= 0
##$REVERSE= no
##$SF= 81.0140089999434
##$SI= 65536
##$SIGF1= 159.3651
##$SIGF2= -187.1042
##$SINO= 113.3802
##$SIOLD= 16384
##$SREGLST= <1H.CDCl3>
##$SSB= 0
##$STSI= 65536
##$STSR= 0
##$SW_p= 32467.5324675325
##$SYMM= 0
##$S_DEV= 0
##$TDeff= 32768
##$TDoff= 0
##$TI= <>
##$TILT= no
##$TM1= 0
##$TM2= 0
##$TOPLEV= 0
##$USERP1= <user>
##$USERP2= <user>
##$USERP3= <user>
##$USERP4= <user>
##$USERP5= <user>
##$WDW= 1
##$XDIM= 65536
##$YMAX_p= 372728939
##$YMIN_p= -6846033
$$ End of Bruker specific parameters
$$ ---------------------------------
##NTUPLES= NMR SPECTRUM
##VAR_NAME=  FREQUENCY,     SPECTRUM/REAL,   SPECTRUM/IMAG
##SYMBOL=    X,             R,               I
##VAR_TYPE=  INDEPENDENT,   DEPENDENT,       DEPENDENT
##VAR_FORM=  AFFN,          ASDF,            ASDF
##VAR_DIM=   65536,         65536,           65536
##UNITS=     HZ,            ARBITRARY UNITS, ARBITRARY UNITS
##FACTOR=    0.49542278885378, 1,            1
##FIRST=     16045.7642231865, 0,            0
##LAST=      -16421.768244346, 0,            0
##MIN=       -16421.768244346, -6846033,     0
##MAX=       16045.7642231865, 372728939,    0
$$ Real data points
##PAGE= N=1
##DATA TABLE= (X++(R..R)), XYDATA
$$ [...]
43005b699667j53371j54273N8984P65585J200119N91602l76933m54397J68310
42996a054041K16154m23850m78030M39469J005596L09699o84582p48466k33105
42987a651156j64232m38406k08824N07515Q72792O18953K77793R9826k39342p43408
42977a068489q00848j12413P18553R24717N30200J91921K63357L65053m1586q42818
42967A27647j285430q79942m3597M29627L35604O7771j80485n73123r55777p91641
42957c749346q1173L77878J45730j03595L50331J030490R71739K94630J8544L83291
42947c61481M74157j90870p32149k41871O75605O20866o00437j596351j163597
42938c116128K29388J124528Q31710L780l95571j55530K82942N30678M86737J49691
$$ y = [-2699667, -2853038, -3007311, -2948327, -2182742, -982623, -391021, -767954, -1222351, -1054041, -837887, -1261737, -1739767, -1300298, -294702, 14997, -669585, -1418051, -1651156, -1815388, -2253794, -2462618, -1955103, -1082311, -463358, -185565, -85739, -325081, -1068489, -1869337, -1981750, -1263197, -338480, 191720, 383641, 646998, 1012051, 970465, 127647, -1157783, -2037725, -2081322, -1651695, -1316091, -1248320, -1428805, -2001928, -2957705, -3749346, -3830519, -3452641, -3306911, -3410506, -3060175, -2029685, -1057946, -763316, -744772, -361481, 112676, -78194, -810343, -1052214, -376609, 244257, -356180, -1952531, -3116128, -2886740, -1762212, -930502, -926722, -1322293, -1477823, -1194881, -664203, -177466, -27775]
42928b7775l24156m66570O9993Q50485R60604J99468n40978m54420J07419K74942
42918F49012m7417k70660k51882m12858o89675l55738P09628J456088J050540
42909A837038J72977P1770P50487J060577M31772m86102r82161j118915j114785
42900F22658p79936o7803N23213O56238O52348P28180M15102n27012j265577r32927
42890B4484k9958L02384P2533K44946R06814J052688L83148j20735R2782K30868
42880C159954l12095p84096m23664J40720K3907l23945j2832N37792K54593o47483
42870A612851r45925m43072j76798n71805q76749o75015n26478o79404m66823
42861c749218M06645J113463R28510K71283j17685j85134j38777J38545N85265
$$ y = [-27775, -351931, -818501, -748508, 101977, 1062581, 1262049, 721071, 266651, 374070, 649012, 601595, 330935, 79053, -333805, -1023480, -1379218, -669590, 786498, 1837038, 2010015, 2081785, 2832272, 3892849, 4324621, 3838519, 2856358, 1737443, 622658, -157278, -225081, 298132, 954370, 1606718, 2334898, 2750000, 2222988, 957411, 24484, -5474, 296910, 369443, 614389, 1521203, 2573891, 2957039, 2836304, 2929086, 3159954, 2847859, 2063763, 1640099, 1780819, 1804726, 1480781, 1467949, 2005741, 2260334, 1612851, 666926, 223854, 47056, -524749, -1401498, -2076513, -2602991, -3282395, -3749218, -3342573, -2229110, -1300600, -1029317, -1147002, -1332136, -1470913, -1332368, -747103]
42852g47103O50235J62121j97393P8880N37312O12140M79458M12538J45280l52247
42842A781221l75086L00688O19278j87943j095190p35766L40682M95244l54732
42833G88396p21855j00343L33428j01388m91046j17309K19301k94158q81312l34504
42823a700790J005942J671151J069631J6441n58841n41465l04310j69924k74336
42814B13499m86421m32715O2667O43032Q38811O81209N52631N73927N34158L43903
42804C524701J56028K8287j86842n35855p99846p50715m38480j31898j3384R751
42794H61747J31497K78642J04112m54613q13779l71380N42706Q82887K25179o28150
42784G58848p18782j65591J58154j05022m17562j81421N32638J178741J326492
$$ y = [-747103, -96868, 65253, -132140, -53260, 484052, 1096192, 1575650, 1988188, 2133468, 1781221, 1406135, 1706823, 2326101, 2138158, 1042968, 307202, 647884, 1143128, 788396, 66541, -33802, 299626, 198238, -292808, -410117, -190816, -484974, -1366286, -1700790, -694848, 976303, 2045934, 2062375, 1503534, 962069, 657759, 487835, 213499, -272922, -705637, -642970, 62, 838873, 1520082, 2072713, 2646640, 3180798, 3524701, 3680729, 3709016, 3522174, 2986319, 2186473, 1435758, 997278, 865380, 851996, 861747, 993244, 1271886, 1375998, 921385, 107606, -263774, 278932, 1161819, 1386998, 758848, 40066, -125525, 32629, -72393, -489955, -671376, -138738, 1040003, 2366495]
42775B366495R43181L03470k69516o56058r38984j116483r74549m23261J81841
42766e83864L34188k5129m34768m61644j42334J42704Q3802k80834n78091m15378
42756b361348J79449O87193O48830K32907K930J35609K12554q1135l96034j71872
42746i10917N35481J047076Q51609J02978o66529j018703p71004o2282N98508
42737b93783O96084L13031K3106l213k63180r00771j062015p2288J203091J278280
42727I18342J85461n38938j55109L30196J5951m55929k49401P9887l48468r73710
42717a191718o20563M29072P73190R1924n17789m02823o0023J53619N17180Q38857
42707A0926L45917p99274j280043n66017K73849M06241M49302R18217R31313j98898
$$ y = [2366495, 3309676, 3613146, 3343630, 2687572, 1748588, 632105, -342444, -765705, -583864, -249676, -274805, -709573, -1171217, -1313551, -1170847, -1087045, -1367879, -1945970, -2361348, -2181899, -1494706, -845876, -612969, -610039, -474430, -261876, -343011, -739045, -910917, -375436, 671640, 1523249, 1626227, 959698, -59005, -830009, -892291, -293783, 402301, 715332, 738438, 735225, 472045, -428726, -1490741, -1563029, -359938, 918342, 1103803, 564865, 409756, 739952, 755903, 299974, 50573, 130460, -218008, -1191718, -1812281, -1383209, -610019, -518095, -1035884, -1438707, -1498730, -1345111, -827931, 10926, 356843, -442431, -1722474, -2288491, -2014642, -1608401, -1159099, -240882, 690431, 491533]
42697D91533j342337j128719k00509j45060q42065p45858M85840J503205J449999
42688d73971R29868N32940K926o41625o21670K33271Q08798K25868q50636j199646
42678a053877o19444K11802Q19174J097008Q38356r1143j212974j643647r55338
42669b610083L31533J128428P56511k74178o92212O583Q61353Q57246M82919Q09296
42659A657396J400345O97840j338641k616857j670804L31668J337179J041505
42651H39631N98896N71922N17254J49855l13076p60151j142189j034504j71194
42642g43556P77547Q64209J56956m53448n49478m25647k30260J57097M65739K43559
42632B62718k32301k12925K57035L16162k66559o36065k49006K07651q8851p93567
$$ y = [491533, -850804, -1979523, -2180032, -2325092, -3167157, -3913015, -3427175, -1923970, -473971, 455897, 988837, 991763, 350138, -271532, -38261, 770537, 996405, 145769, -1053877, -1673321, -1461519, -642345, 454663, 1293019, 1201876, -11098, -1654745, -2610083, -2278550, -1150122, -393611, -667789, -1360001, -1353418, -492065, 365181, 848100, 1657396, 3057741, 3755581, 2416940, -199917, -1870721, -1539053, -201874, 839631, 1438527, 2010449, 2527703, 2677558, 2364482, 1604331, 462142, -572362, -743556, 33991, 898200, 1055156, 601708, 52230, -373417, -603677, -446580, 19159, 262718, 30417, -182508, 74527, 390689, 124130, -511935, -760941, -553290, -642141, -1435708]
42622a435708q85198k9834J145967J864135J803382J125106K97292k36770m53049
42613C195323o55455r05289q78837m44615K0405J45320L9056k5926o1036j75837
42603B53109k49399j44363j7080n4146p1159K52925Q05843J040409O09884j71442
42593B254581n96395k87852L58944N49180k606o69533o23375J59794Q70082P71380
42583B784200j17615j145206j542166r74151M5964M60946j72666j010733r36146
42574b607573l3762O38071N67081K01327q4410l79647m63654J79481J159779J186723
42564C63416l2667j010322n20848N60973O35823j99890n11409J38507O86459L67893
42554D77935k97030n53396l82392q2537K67262N46116M41718p5842n64398o07883
$$ y = [-1435708, -2320906, -2350740, -1204773, 659362, 2462744, 3587850, 3885142, 3648372, 3195323, 2539868, 1634579, 755742, 311127, 331532, 476852, 515908, 489982, 428946, 253109, 3710, -140653, -157733, -211879, -283038, -30113, 775730, 1816139, 2426023, 2254581, 1658186, 1370334, 1729278, 2278458, 2275852, 1606319, 982944, 1142738, 2012820, 2784200, 2666585, 1521379, -20787, -994938, -948974, -488028, -660694, -1671427, -2607573, -2641335, -2003264, -1436183, -1234856, -1319266, -1698913, -2162567, -1983086, -823307, 363416, 330749, -679573, -1200421, -639448, -3625, -203515, -714924, -576417, 110042, 477935, 180905, -372491, -754883, -837420, -570158, -24042, 417676, 341834, -222564, -830447]
42544h30447j86623M50348R17354Q21544K15466k48932j07455K38160J96617m8071
42534A417961k1913P423m80177j039227p72992L8710J97596m04942m91903M71919
42524a077545J269558P58686m86675j182250r85931l37418M43377J067661J084827
42515E54290N49702J49878P5319k95673r78667r13135J56248P06953k78993j330509
42505a604587n73072J185051J563207K56328o83641j37065P52390Q98978Q10694
42496B468283J002816P00193p09545k229364k458836j413064j93510M71003N74140
42487a787884L50654J52479L17509O74842O94724M04665M16528P64722O55069
42478B643308k00223r80326j017794o59434k87139L95553J334364J565598P08213
$$ y = [-830447, -1017070, -566722, 350632, 1172176, 1387642, 1138710, 1031255, 1269415, 1466032, 1417961, 1396048, 1403471, 923294, -115933, -888925, -850215, -652619, -1057561, -1549464, -1077545, 192013, 950699, 464024, -718226, -1704157, -2041575, -1598198, -530537, 554290, 1103992, 1253870, 1329189, 1033516, 54849, -858286, -702038, 4915, -274078, -1604587, -2177659, -992608, 570599, 826927, 143286, 6221, 758611, 1657589, 2468283, 3471099, 4171292, 3461747, 1232383, -1226453, -2639517, -2833027, -2362024, -1787884, -1437230, -1284751, -967242, -292400, 402324, 806989, 1223517, 1988239, 2643308, 2443085, 1462759, 444965, -214469, -501608, -106055, 1228309, 2793907, 3502120]
42469C502120r5379O0780K17165q26162k171318j940152k32674R52241O71396
42460A38017O8963K10285O01812M45795n6755l85231n68711o90304m70078K6388
42450f79819J39429l13728n73400j83953J57569k17238o95245k66059Q77074J605463
42440a49907J420263Q31146L19467j89272p35128r39759n03874K96015Q27004
42431A175955O68969l0202o19036m86425K43207P07218K70473o29077r27279k12216
42421A61587P34456P88826k43083j336638j320328k20783P09071N00602l13459
42412e39749m87983J51157N04828j01960q67369o45292M91500J444348J457330
42403A406810P04591k15074q09690q88648o92837o95201r44169q88140k16335
$$ y = [3502120, 3406741, 3467521, 3684686, 2858524, 687206, -1252946, -1485620, -533379, 138017, 206980, 417265, 1019077, 1464872, 1408117, 1022886, 454175, -236129, -706207, -679819, -540390, -854118, -1427518, -1611471, -1453902, -1671140, -2366385, -2632444, -1755370, -149907, 1270356, 2101502, 2420969, 2231697, 1496569, 556810, 52936, 348951, 1175955, 1844924, 1814722, 1195686, 709261, 952468, 1659686, 1930159, 1301082, 373803, 161587, 896043, 1684869, 1441786, 105148, -1215180, -1435963, -726892, -226290, -539749, -1027732, -876575, -371747, -473707, -1341076, -1986368, -1494868, -50520, 1406810, 2111401, 1896327, 1086637, 197989, -494848, -1190049, -2134218, -3022358, -3238693]
42394c238693N36392P45679O26748P08010P60268J73505p72331j051351m15488
42385a927261K05363J23877j88048n6447L43899N21778N76238Q04998Q82246K84651
42375A571294o67826j011911m12145M17468O82649L66517o2144l48214n65897
42366c0209p77804q48831n79775J1622N09253L61608m24243r89588m61389Q60609
42356b368747J611622R15236n12041j172137m98984O47501J137687P87005K77241
42347H24383K05200N17091P75067O81059K62501k67593o76131q05170o63386m40289
42337D12732l08038j86870J30039N43078N73648j7825p11924p45061j35648K97957
42327a47912J07228j62834N2813K77672l11635j378996j600753n08791P63162
$$ y = [-3238693, -2702301, -1956622, -1329874, -621864, 138404, 311909, -460422, -1511773, -1927261, -1721898, -1598021, -1786069, -1842516, -1498617, -976839, -400601, 404397, 1286643, 1571294, 903468, -108443, -520588, -103120, 579529, 946046, 883902, 535688, -30209, -808013, -1656844, -2236619, -2224997, -1715744, -1354136, -1778379, -2767967, -3229356, -2368747, -757125, 158111, -353930, -1526067, -2025051, -1377550, -239863, 547142, 824383, 1029583, 1546674, 2321741, 3002800, 3265301, 2997708, 2321577, 1516407, 853021, 412732, 104694, -82176, 47863, 590941, 1164589, 1146764, 434840, -310221, -445869, -147912, -40684, -203518, -150705, 126967, -184668, -1563664, -3164417, -3673208, -2910046]
42318b910046J039074O02392M30025N74379K93593n05904j018209p85637k64442
42309b544775R3515M69297R69697J056117L34123n83399p23286l7652N86491N16531
42299A36659J9608l00507k26242N7603L23826M66979M63434L31818J26022p0348
42289A328852j86964k76701n19190r32093j139485p50280R618M56518L65525K46111
42279a398089M55870O02296L03425J5855L69057R94440Q89059j02148j019209
42270A110556j152908q79426p90815p03676j11950Q01191J234292P49116k33244
42261B3136q99353p77559p7358N34129N72845K31840Q1363K66468L37645Q174
42251C01330l31117j69162L73005P37803O55192K73639k30967p00202p64779j34596
$$ y = [-2910046, -1870972, -1268580, -838555, -264176, 29417, -476487, -1494696, -2280333, -2544775, -2451260, -1981963, -1012266, 43851, 377974, -205425, -928711, -966363, -379872, 136659, 156267, -144240, -370482, -312879, 10947, 477926, 941360, 1273178, 1399200, 1328852, 1141888, 865187, 345997, -586096, -1725581, -2475861, -2466243, -2009725, -1644200, -1398089, -942219, -339923, -36498, -20643, 348414, 1342854, 2231913, 2129765, 1110556, -42352, -921778, -1712593, -2416269, -2528219, -1727028, -492736, 256380, 23136, -876217, -1653776, -1731134, -1197005, -624160, -392320, -310957, -44489, 293156, 301330, -29787, -198949, 174056, 911859, 1567051, 1840690, 1609723, 909521, 144742, 10146]
42241A0146Q07666J206697P28369n0250m76706o45188j004288j449236j354311
42232b227101m98838N09846R15948O29609J80587P6731M08696R20057J219175
42223B134710R94813K62811n73922j041084r67667n00340R4519M84777L54844
42214A243461k16312n92635k49958M14124M65057k64629q38011m84287L37937
42205a85253O38971K47090j51312r1536J81148K56649N6880k45034l88828j34332
42195A84443L90525N37351j51440j104662j195318j80984Q94580R89194K68026
42186F31715l10094k32383J52908K79764M4710k05127k03052j24897k64467m19931
42176f50854o6052O51380P27362k73985j181561o23728Q50514J332008K55167
$$ y = [10146, 817812, 2024509, 2752878, 2702628, 2225922, 1580734, 576446, -872790, -2227101, -2725939, -2216093, -1300145, -670536, -489949, -413218, -4522, 915535, 2134710, 3129523, 3392334, 2818412, 1777328, 809661, 309321, 403840, 888617, 1243461, 1027149, 434514, 184556, 598680, 1063737, 799108, -38903, -523190, -185253, 453718, 700808, 549496, 457960, 639108, 895757, 952637, 707603, 318775, 184443, 574968, 1112319, 960879, -143783, -1339101, -1520085, -625505, 363689, 631715, 321621, 89238, 242146, 521910, 566620, 361493, 158441, 33544, -230923, -650854, -716906, -65526, 661836, 387851, -793710, -1417438, -566924, 765084, 1020251]
42167A020251q56214p39637p7080k8411l53501j72551L39236L75504M0857J12180
42157c39366N59194N86034M2762l80520l67897l02272l41633k25511p2220l00442
42147a141871o43502l67035L45524M61543j01920j15009Q54819J343027J24395
42138G59971j652477j922473o23870M20431K86989j3888M69134J096129Q51516
42129c28538K9685l05078J7007J61998k98198p56173n38788J32608N21470L52188
42119a011819J1381o3465J63370M50372N46560K90295k91712q73723j017509n90696
42109b386946J23573P53357J081716J000807N80432K35489L71817P05300M65525
42100B931070m36735j066561p76844k11430k53401n67977k32840N66825P28769
$$ y = [1020251, 164037, -575600, -652680, -681091, -1034592, -1207143, -867907, -492403, -451546, -339366, 219828, 805862, 848624, 468104, 100207, -202065, -543698, -769209, -841429, -1141871, -1785373, -2152408, -1806884, -1345341, -1447261, -1562270, -707451, 635576, 759971, -892506, -2814979, -3438849, -3018418, -2731429, -2745317, -2276183, -1180054, -328538, -298853, -603931, -586924, -424926, -723124, -1479297, -2018085, -1885477, -1364007, -1011819, -1000438, -1063903, -900533, -450161, 96399, 386694, 94982, -778741, -1796250, -2386946, -2263373, -1510016, -428300, 572507, 1152939, 1388428, 1760245, 2465545, 2931070, 2494335, 1427774, 650930, 439500, 186099, -381878, -614718, -47893, 680876]
42091F80876M9704m46645j97864J50161R5944J33136N94020P97364K31410l88656
42081A699450k49637J92021N5208m50622n42237l47453n88813j121060j085095
42072b438238l84258K21179M36292O33084P43692K73095m15203k04643R50258
42063a84742J605757Q83256k33227m73406j06151j59802o22925o03903J28464
42054B33321Q29403Q55199K63377n15845r69064p03584O989J89854o15384j444136
42044a869870j041352L35716J189781P70422j77049o94466o46959k54723M26410
42035a962090J102471J146794M86052n7148J23907N37735M31597k6419j43830
42026A639069J08357J42763j67871k76239J12689N65692N44505K5918o22632r73602
$$ y = [680876, 730580, 283935, 86071, 236232, 332176, 465312, 1059332, 1856696, 2088106, 1699450, 1449813, 1641834, 1697042, 1246420, 704183, 356730, -232083, -1353143, -2438238, -2822496, -2601317, -2165025, -1531941, -788249, -515154, -930357, -1135000, -184742, 1421015, 2304271, 2071044, 1597638, 1491487, 1331685, 708760, 104857, 233321, 1062724, 1917923, 2181300, 1665455, 696391, -7193, -204, 189650, -425734, -1869870, -2911222, -2575506, -1385725, -615303, -792352, -1486818, -2133777, -2388500, -1962090, -859619, 287175, 773227, 716079, 839986, 1377721, 1809318, 1782899, 1639069, 1747426, 1890189, 1722318, 1446079, 1558768, 2124460, 2668965, 2694883, 2072251, 1098649]
42016A098649p00489J13582P54225M96887l92890q40587l94102J35555r4531o68505
42006d92206n63631K50759P26286K55422n09164o38768j40120K57986J80875j4279
41996f86840J42031N96282Q49005N36919j34136n72521m56513j00694l394j68581
41986A558k25994j63353m01042r51099j070481k36869R17844J287872P44587K25040
41976A28063L31526N51498J94435m82059o60037j82353K62340J86428m3953J34500
41966D20388N87755O91020K60722k20258l72503m25922o63638p78841l35840L21419
41956e15698L19082m77985j119659q43333j10498J71651l041Q1898N76668Q15188
41946a105727M35107k9105K4938M52331P54043P87585O44478K36799m45452r18310
$$ y = [1098649, 398160, 511742, 1265967, 1762854, 1369964, 529377, 135275, 270830, 176299, -492206, -1055837, -805078, -78792, 176630, -332534, -971302, -1111422, -853436, -672561, -686840, -544809, 51473, 900478, 1437397, 1303261, 730740, 274227, 173533, 170139, 1558, -224436, -387789, -788831, -1739930, -2810411, -3047280, -2129436, -841564, -96977, 128063, 459589, 1011087, 1205522, 723463, 63426, -118927, 143413, 329841, 285888, 420388, 1008143, 1699163, 1959885, 1739627, 1367124, 941202, 277564, -501277, -837117, -515698, -196616, -674601, -1794260, -2637593, -2748091, -2576440, -2579481, -2497583, -1920915, -1105727, -670620, -699725, -674787, -222456, 531587, 1319172, 1963650, 2200449, 1754997, 836687]
41936H36687o40094J68654O36385K71727m62844p38147k84489L99988O38153K74412
41926A100432j94172k06448J67909L21451j8899l29064j4133O49945Q11900K44578
41916B533499l20234k51245J10043N7660l71862n14822j92497m068k82229m10708
41906C53537K19364R78478O17293q31389j706354q15607Q39183J321525L50665
41897A326695m80739j07969N87841L14308o88655j208556r45694o72839p06631
41888b582239m26939M36976J097219Q66532K62159K08651O26498O34277n3865
41879A069269p34908p55471k58973K67653N82833N52371j360q51944j208270n98046
41869a936846L34367N52833L7994k43038J79028O46317N69109M19781Q04961J166085
$$ y = [836687, 196593, 365247, 1001632, 1273359, 810515, 72368, -212121, 187867, 826020, 1100432, 906260, 699812, 867721, 1189172, 1170273, 841209, 827076, 1477021, 2288921, 2533499, 2213265, 1962020, 2072063, 2129723, 1757861, 1243039, 1050542, 1046474, 764245, 353537, 572901, 1551379, 2168672, 1337283, -369071, -1184678, -345495, 976030, 1326695, 845956, 737987, 1325828, 1640136, 951481, -257075, -1202769, -1875608, -2582239, -3009178, -2572202, -1474983, -608451, -346292, -137641, 488857, 1123134, 1069269, 334361, -421110, -680083, -412430, 170403, 722774, 721414, -130530, -1338800, -1936846, -1602479, -1049646, -1011652, -1254690, -1075662, -429345, 139764, 559545, 1364506, 2530591]
41859B530591M68550r92087j605744n50424J044280J559849Q21182p5183l55147
41850B845867k23181j49499k38252l61605m23238l89010l52580n31026q93887
41841g16411r27582k02123Q73598J342151Q33875R426k73160J09825O18997P54894
41831B423490M54116l7721m49610o60847p03145o27979m29049j37217J08812J76681
41821A17531K9725l38015q47025j139072p82908J01570P81624P97302N31259M70193
41811b77816L41263l35765j150023j126741j28941Q76798J078112O39365J29422
41802D5674j86194k90660k79744m46021q97182j043030k43601R44160J146226
41793a250372Q4970r21147q23594j29380L04083N99997J055142J102731L44235
$$ y = [2530591, 2999141, 2007054, 401310, -149114, 895166, 2455015, 3276197, 3201014, 2845867, 2622686, 2473187, 2234935, 1873330, 1450092, 1061082, 708502, 177476, -716411, -1643993, -1846116, -972518, 369633, 1203508, 1212934, 939774, 1049599, 1668596, 2423490, 2877606, 2839885, 2390275, 1729428, 1026283, 398304, -30745, -167962, -59150, 117531, 147256, -190759, -1037784, -2176856, -2959764, -2858194, -2076570, -1279268, -748009, -277816, 63447, -272318, -1422341, -2549082, -2678023, -1801225, -723113, -83748, 45674, -140520, -431180, -710924, -1156945, -2054127, -3097157, -3340758, -2396598, -1250372, -1165402, -2086549, -2910143, -3039523, -2735440, -2135443, -1080301, 22430, 366665]
41784C66665k59412K91371J134465N96706j152285k179607j549522l82389J23738
41775c010270J74738L39644M39016K66132K87407P58869J036574N85049j05343
41766G71816l74494l90050m77638k47330N98912J217915N51817j000196j907342
41757a256590j395590j24428Q98434J200573P31832j98951p93285m19433M26737
41748i30701N72451k30308r13856o03431K10174M75502M677m51454k25914O28169
41738a464691J515440J762285J094413n1249q66362j044653j055945j298108j362623
41729b771493o56359M95141J067577P18741K64932M44742P85426L21621q57039
41720a86711j556216j056485l9186M22880K42659J32338M10088O90754O57480
$$ y = [366665, 107253, 398624, 1533089, 2129795, 977510, -1202097, -2751619, -3134008, -3010270, -2835532, -2495888, -2056872, -1790740, -1503333, -744464, 292110, 877159, 771816, 397322, 7272, -470366, -717696, -118784, 1099131, 1650948, 650752, -1256590, -2652180, -2776608, -1878174, -677601, 54231, -144720, -938005, -1357438, -930701, -358250, -588558, -1502414, -2105845, -1895671, -1420169, -1415492, -1866946, -2092860, -1464691, 50749, 1813034, 2907447, 2856198, 1989836, 945183, -110762, -1408870, -2771493, -3427852, -2932711, -1865134, -1146393, -881461, -436719, 348707, 670328, -186711, -1742927, -2799412, -2838598, -2415718, -2173059, -2040721, -1630633, -939879, -282399]
41711b82399M53630K33439m7882k28111N3650O44354P55481p073r54739j147200
41701e26850n41231J83645N90204P00371N45252J74388l0037K72727P12886N52637
41691B633992k42631q80626q17289l72314n6046J63380N56630R89346J000964
41682B975406L76727o05142j379879j440944o97611L53014R90453R53357O22859
41673B148240M50492L97437Q5133o06499j231665j136134k21055O92146O05006
41664A183101l87796j030904n16182L46920K96103m43620m56161O56625J553205
41655A201291J055084k48854r74762p44081k42822n8558k55795p13015j131702
41646b113214r98821k07578N66521P25984O09702P70884Q36067Q8859j039083
$$ y = [-282399, 171231, 404670, 356788, 128677, 182327, 826681, 1582162, 1575089, 620350, -526850, -1068081, -884436, -294232, 406139, 951391, 1125779, 1095742, 1368469, 2081355, 2633992, 2391361, 1510735, 693446, 321132, 265086, 428466, 985096, 1974442, 2975406, 3352133, 2746991, 1367112, -73832, -771443, -418429, 572024, 1525381, 2148240, 2598732, 2996169, 3081302, 2474803, 1243138, 107004, -114051, 578095, 1183101, 795305, -235599, -751781, -404861, -108758, -552378, -1008539, -351914, 1201291, 2256375, 2007521, 1032759, 288678, 45856, -12702, -268497, -981512, -2113214, -3112035, -3319613, -2753092, -2027108, -1417406, -646522, 189545, 278404, -760679]
41637g60679j234145j81926R00958R63836L95534J00886J52377P3967j16258N5117
41627C49667O69194J215965J170910M29789o54307j397379j238572m03888J67563
41618C08942r3233o81493p70851l04059J68444L97012N25640M97355J28258k55107
41608g9092l3289O87103R89980L99926m03421n37922o2744L36039L83579L36164
41598B016323L12923J39372j93393m42357n08046m80780k96086J79299O59340
41589A386595N56969j95437q79992q46088k94179J18669J76359J96921L58160
41580E77977L57847j47469r80836j474293j092154n3274P47242O18018j49619
41571a596561o16153k93288M05071Q19415P27600K76939k65273m89272j06585
$$ y = [-760679, -1994824, -2176750, -1275792, -311956, 83578, 184464, 336841, 410808, 294550, 349667, 1018861, 2234826, 3405736, 3835525, 3181218, 1783839, 545267, 141379, 308942, 215709, -465784, -1236635, -1540694, -1372250, -975238, -449598, 47757, 176015, -79092, -112381, 574722, 1564702, 1964628, 1561207, 1023285, 960541, 1296580, 1680159, 2016323, 2329246, 2468618, 2275225, 1832868, 1324822, 844042, 547956, 727255, 1386595, 1943564, 1748127, 868135, 22047, -272132, -153463, 22896, 219817, 577977, 935824, 788355, -192481, -1666774, -2758928, -2812202, -2064960, -1446942, -1596561, -2212714, -2506002, -2100931, -1281516, -553916, -276977, -542250, -1031522, -1138107]
41562a138107M80792M76611p0180o6818R59159J800558J161625l44254j049822
41553B209564o53186k97699m04607j42217O68019Q75875j1920p35519k47613N53338
41543A814035L50096m39685n32059L4505K07587j20223j43990J29043j05100p02384
41533D91825n47797M10913P34878k71906j335600j096845n2697M11914M5690l19614
41523a529239k46010j5327K18925O04758R65519Q10424R4526n79359o62484k28969
41513e67236K38317M11340M02613N37747Q15958P35494m5065r87098j137477l62129
41503D2464M70969O77285M47163R9507n39014j439807j783204r15278N16537J236125
41493a187253R38149M41782L90056N97489O95669O41221M02488j70733q47029
$$ y = [-1138107, -657315, -180704, -250884, -317702, 641457, 2442015, 3603640, 3259386, 2209564, 1556378, 1258679, 854072, 711855, 1379874, 2255749, 2243829, 1508310, 1260697, 1814035, 2164131, 1724446, 1192387, 1226892, 1434479, 1314256, 1170266, 1299309, 1194209, 491825, -55972, 354941, 1089819, 817913, -517687, -1614532, -1667229, -1255315, -1209625, -1529239, -1775249, -1790576, -1571651, -966893, -1374, 809050, 903576, 324217, -338267, -567236, -328919, 82421, 485034, 1022781, 1838739, 2574233, 2529168, 1542070, 404593, 42464, 513433, 1190718, 1637881, 1737388, 1198374, -241433, -2024637, -2939915, -2423378, -1187253, -249104, 192678, 582734, 1180223, 1875892, 2517113, 2919601, 2748868, 1901839]
41484A901839r30850j18235Q75349R73471m7427j272894j586671p47584M89846
41475d63156J219372J207426Q31192M06711p9788n68231o86843k02973N18110
41466B181820P94643K91673p05739j505405j433084l78840Q95647J329157O85445
41457B155317k03704n39039m72965n73364q18465o96938o1208O85796J139572
41448F15002J159610P13548o1884p06086p72664l18808K11404M44695J76721o29435
41438H32103j496295j464118j46675J443542J841386Q51158l26862o58089k75388
41429F00762J33997K38845J28934n749j8726M2945j10772n70095q63741n49089
41419i72689K203R6599j21552J18138P93111R04151O1249p25022m72557L19372
$$ y = [1901839, 970989, 852754, 1728103, 2701574, 2654147, 1381253, -205418, -953002, -463156, 756216, 1963642, 2794834, 3201545, 3121757, 2553526, 1866683, 1663710, 2181820, 2976463, 3268136, 2562397, 1056992, -376092, -754932, 140715, 1469872, 2155317, 1951613, 1412574, 939609, 366245, -452220, -1149158, -1210366, -524570, 615002, 1774612, 2488160, 2426276, 1720190, 947526, 628718, 840122, 1284817, 1461538, 832103, -664192, -2128310, -2274985, -831443, 1009943, 1861101, 1534239, 876150, 600762, 734759, 973604, 1102538, 1096789, 1078063, 1121008, 1010236, 440141, -423600, -972689, -970486, -873887, -995439, -877301, -84190, 819961, 881210, 156188, -316369, 3003]
41409C003M35041l32417j016953q13491P4773Q34131Q20436J8786r34212j264065
41399b174968p88503J7551P19779J261035J478424R41584k67301j170361r53496
41390i36256p0222L84905J80199J02513O55798J317411J296253N23353m08018
41381C045936r84660j150857j065902p76223k66149K52907L67495l4331m68773
41372a080557l96235L9280K11892r0471m56043n49443m49208j86910L76915R58802
41362a621978Q49573l1452p11246l86946M37601O92862K04919k82655k40695J89879
41352i00138O53778Q24931L78910o04377j333628j052645j7797Q51788J145052
41343e4126J116798Q51784J32742q12607j295077j130752q76407q15397m71356
$$ y = [3003, 438044, 105627, -911326, -1724817, -1650044, -815913, 4523, 23309, -910903, -2174968, -2963471, -2945920, -2226141, -965106, 513318, 1454902, 1187601, 17240, -936256, -1006478, -621573, -441374, -338861, 316937, 1634348, 2930601, 3453954, 3045936, 2061276, 910419, -155483, -931706, -1197855, -944948, -577453, -611784, -1080557, -1476792, -1437512, -1225620, -1316091, -1772134, -2321577, -2770785, -2957695, -2580780, -1621978, -772405, -803857, -1515103, -1902049, -1464448, -771586, -566667, -849322, -1090017, -900138, -246360, 578571, 957481, 353104, -980524, -2033169, -2050966, -1199178, -54126, 1062672, 1914456, 2047198, 1234591, -60486, -1191238, -2067645, -2883042, -3354398]
41334c354398M04338J056581O56330l86097q13830j53816P34003R04471N50135
41325d02283N28556R71946J034371J84508q53010j015068m18696j47000n31961
41316f48637o15197K60841J220676J040426j7865n67696p0237N61471M09001k92927
41306A279856p74158q39065q65798j023161r65156l54655N11380Q50630L65872
41297a814255j42939L14043J402582J655455M83494r01586j202888p86775p67212
41288a760081j112797r13980o1743O62090R17869R62152O95961q2280o46361r3121
41278a432291Q99993P54335l85688n65347Q91848K098779J396216k64519j015349
41269B377977p06354l62146j84696K42438N66827J33667o47737q70005o72333
$$ y = [-3354398, -2950060, -1893479, -1237149, -1623246, -2437076, -2590892, -1856889, -952418, -402283, 126273, 1098219, 2132590, 2317098, 1464088, 449020, 30324, -116676, -648637, -1263834, -1002993, 217683, 1258109, 1240244, 672548, 602311, 1163782, 1572783, 1279856, 505698, -333367, -1199165, -2222326, -3187482, -3542137, -3030757, -2180127, -1814255, -1957194, -1643151, -240569, 1414886, 1898380, 996794, -206094, -992869, -1760081, -2872878, -3786858, -3848601, -3186511, -2268642, -1306490, -610529, -692809, -1339170, -1432291, -532298, 222037, -163651, -728998, 162850, 2261629, 3657845, 3393326, 2377977, 1671623, 1309477, 1124781, 1367219, 1934046, 2067713, 1419976, 549971, -122362]
41260a22362q45035j243836j011931j86767K86912R8185j29496o2117K7220J76063
41250c013164P39733J357630J125084P8059n98357k30345M41936M63164o1785
41241C01955l76644j28583M18609P85961O31807O1979l50860k42466l1517l11325
41231G58916q88250j090453p96500l78743J01342P00146Q82617J81028o08471
41222a138368k58397Q47560J028412q4799q94676l71705M11282K28788l39869
41213e71772k06633K20954j06231q69622q59675j1842N52968L43983L307J6028
41203a488535J33294J91985M47354Q82031J047925P85349L83582m8346o37355
41194A697284j129841j022524m52526j82720m70496o58429j82036O34867J105309
$$ y = [-122362, -967397, -2211233, -3223164, -3409931, -3123019, -3024834, -3154330, -3216447, -3189227, -3013164, -2273431, -915801, 209283, 287342, -311015, -541360, -99424, 363740, 301955, -74689, -203272, 215337, 1001298, 1633105, 1695084, 1344224, 1101758, 1070241, 758916, -129334, -1219787, -2016287, -2395030, -2293688, -1593542, -710925, -529897, -1138368, -1396765, -549205, 479207, 394408, -500268, -871973, -460691, -231903, -571772, -778405, -557451, -663682, -1533304, -2392979, -2404821, -1851853, -1507870, -1504563, -1488535, -1355241, -1163256, -715902, 166129, 1214054, 1999403, 2382985, 2334639, 1697284, 567443, -455081, -907607, -1090327, -1560823, -2219252, -2401288, -1766421, -661112]
41185f61112R66597L54734m85299j121839j033665k05386O60046Q61105M22993
41176b41826j21960m25503n36711o19230p09763o74436k92285M79204J248639
41167a893871J415141Q03032p6138n46691m58392k25922k38912l82215k43752
41158a847720K19806M52413J0071o29827n06796M28446R78965K40111j027385
41149a681916j279432j81784J069868J376059Q92547M13498L09456M11384M41843
41140A771523K14439k63262o72238o87854m96786n67004q08708n70680K61758
41131a818812Q18139L94115m65312o62268J1332P73666R83240P10504K68784j58953
41121H54435l51128j05591L26853L42843k18196p51456o45102o9091L03308J52903
$$ y = [-661112, 305485, 660219, 174920, -946919, -1980584, -2185970, -1525924, -664819, -241826, -363786, -789289, -1326000, -1945230, -2654993, -3329429, -3621714, -3142510, -1893871, -478730, 324302, 248164, -298527, -756919, -982841, -1221753, -1603968, -1847720, -1627914, -1175501, -1165430, -1795257, -2302053, -1873607, -894642, -654531, -1681916, -2961348, -3143132, -2073264, -697205, 195342, 608840, 918296, 1329680, 1771523, 1985962, 1722700, 1050462, 362608, -134178, -701182, -1509890, -2080570, -1818812, -1000673, -606558, -1071870, -1734138, -1722806, -949140, 34100, 744604, 1013388, 854435, 503307, 397716, 724569, 1067412, 849216, 97760, -547342, -616433, -313125, -160222]
41111a60222k27381m08732k48818J25150M87692O45627N87904N14045N61800N62847
41101B439912K80210j85815n37671p80163j132991j372022q60705L82197J200260
41092e66788N63416r77112j841569j313539j25932P90643J234880J239669O48328
41083c48004k86224o95800j82993N03337N60863L01142M39775P86699O11471o7765
41073A622501n64952o34079n06957j04842O46421R46341k6524j371707j187182
41064a180980N49604J490940K11723j548825j348684M19751J259731K74821p95368
41055f67287l90964P23980Q72330j40505j029690q74160n0141N68787O55969M67727
41045A36046K19951j52577n67633n09617L80852J513801J727482O82955o17466
$$ y = [-160222, -387603, -796335, -1045153, -920003, -432311, 213316, 801220, 1315265, 1877065, 2439912, 2720122, 2534307, 1996636, 1216473, 83482, -1288540, -2149245, -1767048, -566788, -3372, -980484, -2822053, -4135592, -4261524, -3470881, -2236001, -996332, -348004, -634228, -1330028, -1513021, -1009684, -448821, -147679, 292096, 1078795, 1690266, 1622501, 1057549, 423470, -83487, -188329, 458092, 1404433, 1377909, 6202, -1180980, -631376, 859564, 1071287, -477538, -1826222, -1406471, -146740, 128081, -667287, -1058251, -334271, 538059, 397554, -632136, -1506296, -1556437, -987650, -331681, 136046, 355997, 203420, -364213, -873830, -492978, 1020823, 2748305, 3431260, 2813794]
41036B813794j057899o98391l62865l42118j64566M85696J225733J408538P69965
41027D077887l12389r97335o71335K44872N35466l52418j482094j587085o46744
41018a191175L64204Q92457J099807J024078M93974j45400k62264l2299k88100
41009A955282j017890j078359P1269J292285J172733j46166j294972j349806m92227
41000h87851N96450J270359J090958J62203p37248q35509j73452N31355O57167
40991A674432R0103q12930j352043r38876J58384Q62748N41565j41185j72488
40982i0290L74392N89912J97463j05309J55947N26020M36466P1828o1492j776
40972B093161k11010p42651j034659o54461K6567J52412n99089j483035j402398
$$ y = [2813794, 1755895, 1057504, 694639, 352521, 187955, 673651, 1899384, 3307922, 4077887, 3765498, 2768163, 2096828, 2341700, 2877166, 2524748, 1042654, -544431, -1191175, -826971, 65486, 1165293, 2189371, 2683345, 2537945, 2275681, 2243382, 1955282, 937392, -140967, -69698, 1222587, 2395320, 2249154, 954182, -395624, -887851, -291401, 978958, 2069916, 2232119, 1494871, 659362, 485910, 1017265, 1674432, 1764535, 951605, -400438, -1339314, -1180930, -318182, 223383, 82198, -90290, 284102, 874014, 1071477, 966168, 1122115, 1648135, 2084601, 2156429, 2094937, 2093161, 1882151, 1139500, 104841, -549620, -523053, -370641, -969730, -2452765, -3855163]
40963c855163j85908J116867J399687P07717k8333k53864k90137n62212q55695
40954b807041o46032J22910R37328J287921J067959M47107l37370r51336r90661
40945a869215l43401N07133Q34413M49257o8945o8797M36462R16363R87684O42574
40935B423528J9493o37351r03470n42125N8301K88575J73849K82893P08073P85880
40925B657646J10500p71925j093950q15356m07582j10004J21931K52545K14905
40916A58710R8516m3480k92264n12733l34038K00108M73281J95540r4097R3986
40906e6471M33500M75578M20682M54918N9133j018575j772258j158855J83978
40897a978370P97949N94688O45367J017249O36281n26729j018237k48465M58122
$$ y = [-3855163, -4041071, -2924204, -1524517, -816800, -845133, -1098997, -1389134, -1951346, -2807041, -3453073, -3330163, -2392835, -1104914, -36955, 410152, 72782, -878554, -1869215, -2212616, -1705483, -871070, -421813, -490758, -559555, -123093, 793270, 1780954, 2423528, 2443021, 1805670, 902200, 360075, 418376, 706951, 880800, 1163693, 1871766, 2657646, 2768146, 1996221, 902271, 86915, -320667, -430671, -308740, -56195, 158710, 257226, 213746, -78518, -591251, -925289, -725181, -251900, -56360, -150457, -56471, 377029, 852607, 1273289, 1728207, 1787340, 768765, -1003493, -2162348, -1978370, -1180421, -585733, 59634, 1076883, 1713164, 1186435, 168198, -80267, 377855]
40888C77855L7161o65255n23776m490o4148l50138j5650N39701L30576l88606
40878g26770n11095N3008L68249J43950q048O5723j72691p09028q03157l24351
40868b624210q4532m82254q67042o57113j32992K97852P02802J026479Q10054
40859b010956J09655j33230O16891J476869J244687Q8442o75636l03476N81616
40850I94862R15517M07637k85034l62872K08312O18783J98306o47893r29786m67853
40840F49979j28039m52315q08930m32218L26611N42600J20422j75518M3920L16779
40830C291J62198k65454n42020n01267k10653J74079L60803J08396l51636m39439
40820a501702J6601N00955N46947L77299M08642M35406q1660r74045j281857m80913
$$ y = [377855, 415016, -250239, -774015, -778505, -842653, -1192791, -1208441, -668740, -338164, -726770, -1237865, -1184857, -816608, -672658, -680706, -614983, -787674, -1496702, -2299859, -2624210, -2708742, -3190996, -4058038, -4715151, -4848143, -4550291, -3847489, -2821010, -2010956, -1901301, -2034531, -1417640, 59229, 1303916, 1392358, 716722, 413246, 994862, 1910379, 2318016, 2032982, 1670110, 1878422, 2497205, 2695511, 2047618, 1117832, 649979, 521940, 69625, -739305, -1171523, -844912, -302312, -181890, -357408, -313488, 3291, 165489, -99965, -641985, -1143252, -1353905, -1179826, -819023, -710627, -1062263, -1501702, -1485101, -984146, -437199, -59900, 348742, 784148, 702488, -271557, -1553414, -2034327]
40810b034327O98327J117787O16433N1793N7080K82540K3886p70525j400534j198511
40800b556051k44249O90087R10845N52393M00919Q34962J252270R45178K28639
40791C014993k156L03111K81800l57078q05440n56103l03286o80789j026009m69692
40781f00649M47057N23612j58157m20921L1221K36402k97255q43747p93081m89801
40771b365319k51140K63521J046500J221606L95044m12247j88832M47460J72304
40762C28897r70244j565242p76045O63307J482505J213382L90980j12554J03809
40753G58795N67654M57706l08355q85729o64277q6533J45931J20607L21537O57000
40743A084336O43183K52772j47951m56112p37443p64538l96441j28166m18048
$$ y = [-2034327, -1336000, -218213, 398220, 450013, 507093, 789633, 813519, 42994, -1357540, -2556051, -2800300, -2110213, -1199368, -646975, -246056, 588906, 1841176, 2786354, 3014993, 3012837, 3315948, 3597748, 3240670, 2435230, 1879127, 1575841, 895052, -130957, -600649, -153592, 370020, 211863, -209058, -177837, 58565, -238690, -1082437, -1875518, -2365319, -2616459, -2352938, -1306438, -84832, 310212, -102035, -290867, 156593, 328897, -641347, -2206589, -2982634, -2319327, -836822, 376560, 767540, 654986, 758795, 1326449, 1784155, 1475800, 590071, -74206, -160739, -14808, 105799, 427336, 1084336, 1727519, 1980291, 1832340, 1376228, 638785, -125753, -522194, -650360, -1068408]
40734a068408p19373j68746Q63597J001615j86690j461881j512039m92960M58214
40725c286671O31835K30676j16460M3974O14987J018451Q83809N95171P33278
40716A349050J115166J016054K97232m09586o95268p85476q18247n21598Q3643
40707F30970M03460J05944l63391m78950k91579m6905K66925N94819N83500J01925
40697A506718m60904p60701q82665q82089n40021N9890L48663J23924l4702K85162
40687a236725N93362L29239j52851j48050L09703O39596O02769L13563k29730
40678A020876q88165j053196m05176L16322J92605m52721m73034L55383J020282
40669c66824Q23031K78791J40298L28367L16999J8991k30566k65161k30560k41360
$$ y = [-1068408, -1787781, -1956527, -1092930, -91315, -278005, -1739886, -3251925, -3744885, -3286671, -2654836, -2424160, -2540620, -2496646, -1881659, -863208, 20601, 615772, 1349050, 2464216, 3480270, 3777502, 3367916, 2672648, 1887172, 1068925, 547327, 630970, 1034430, 1140374, 776983, 298033, 6454, -40451, 226474, 821293, 1404793, 1506718, 1045814, 285113, -597552, -1479641, -2019662, -1959772, -1611109, -1487185, -1521887, -1236725, -643363, -314124, -466975, -615025, -305322, 334274, 937043, 1250606, 1020876, 132711, -920485, -1325661, -1009339, -816734, -1269455, -1742489, -1387106, -366824, 456207, 734998, 875296, 1203663, 1520662, 1539653, 1309087, 1043926, 813366, 572006]
40659E72006j55644K58286R16774J230971O30889n65466j244809q41183j28255
40650F73569r7233n05951l93123K64355M77880j44446p79874o87193j99039M3227
40640a347828P1544K31158M25647L39767M2746j66100k63957m25237o16880o00861
40630b310001k20249M67234J148608J324963P82385L9452j32182K80638N18629
40621A899477J51324m22518p45404q65284q45417m74113J04856K34720k23565
40612a185924m46321J01611P21703O13721K20864L91271Q02116M94229l75440
40603A337830o94855k25787J11362q1047r0154M38634P74516M66277K27706O27788
40593B892270R46435L53896o11382q81394n38958m36242n74606k11573N53018
$$ y = [572006, 416362, 674648, 1591422, 2822393, 3453282, 2887816, 1643007, 801824, 673569, 576336, 70385, -322738, -58383, 419497, 275051, -504823, -1192016, -1391055, -1347828, -1276284, -1045126, -619479, -279712, -236966, -403066, -667023, -1092260, -1709140, -2310001, -2530250, -2063016, -914408, 410555, 1192940, 1232392, 1100210, 1380848, 1899477, 2050801, 1628283, 882879, 17595, -827822, -1301935, -1197079, -962359, -1185924, -1632245, -1530634, -808931, -195210, 25654, 416925, 1219041, 1713270, 1337830, 642975, 417188, 528550, 447503, 357349, 795983, 1570499, 2036776, 2264482, 2892270, 3838705, 4192601, 3581219, 2699825, 2160867, 1724625, 1150019, 938446, 1491464]
40584A491464O78711r8858o88686k85840M29560M30767r5540j64148M85217J097679
40574C280326R85014K63067m67750p27268m60046o8545p6328m87221o46335p6324
40564A518590P40801Q72596J34786p00770r04379n36979j28919m4354l03222o61864
40554a3714p14698k38390M43052P64489O56352N31870M44373r7559j109854j592930
40544i27009p24437Q03327J469772Q26929q9586k94352J9752J75629J15130K59984
40534A635139O75871R41297P32257J62042m08967o71178n55729k95576j99727
40525B015429k75382k51847m8144P2146m8836j96740j90750k07236m04647n75471
40515a11478n31537m68069m93060k05159O03710J168979N75486p33868j267080
$$ y = [1491464, 2170175, 2071317, 1382631, 1096791, 1526351, 1957118, 1861578, 1697430, 2182647, 3280326, 4265340, 4528407, 4060657, 3333389, 2873343, 2804798, 2728470, 2241249, 1594914, 1518590, 2259391, 3131987, 3266773, 2566003, 1661624, 1124645, 995726, 951372, 648150, -13714, -728412, -966802, -523750, 240739, 897091, 1428961, 1873334, 1775775, 665921, -927009, -1651446, -848119, 621653, 1448582, 1358996, 1064644, 1084396, 1260025, 1375155, 1635139, 2311010, 3252307, 3984564, 4146606, 3737639, 3066461, 2510732, 2215156, 2015429, 1740047, 1488200, 1440056, 1512202, 1463366, 1266626, 1075876, 868640, 463993, -111478, -643015, -1111084, -1604144, -1809303, -1205593, -36614, 538872, -194996, -1462076]
40506a462076m78898N33418P33083N29096P15609R32640L51172o00376n67919
40497F85749O24437J471035Q60831l36038m99093N72298J561630J403271L54871
40488F698991o55063j077021r76770o96700n35762n43527m96001k28755k207k75207
40478A211978j029047j575182j237843j25314R27142J160788N94985l2537k5219
40469a30249N28988Q47358L84769m71920q96552p00280m87599o56875p43603j43487
40459b469450Q33088J200055N93416j77745j37065O05889R92097L66833o63429
40450A143689r64790l13631K91428n4375q41534o60062Q99585K414657K187723
40441D102690L83210j052701p36657M92834P36893n08490j784332j613651k98005
$$ y = [-1462076, -1940974, -1407556, -674473, -145377, 570232, 1502872, 1854044, 1253668, 685749, 1310186, 2781221, 3642052, 3306014, 2806921, 3379219, 4940849, 6344120, 6698991, 6043928, 4966907, 3990137, 3293437, 2757675, 2214148, 1718147, 1489392, 1487185, 1211978, 182931, -1392251, -2630094, -2755408, -1828266, -667478, -72493, -105030, -130249, 398739, 1246097, 1630866, 1158946, 262394, -437886, -925485, -1582360, -2325963, -2469450, -1636362, -436307, 157109, -20636, -157701, 448188, 1440285, 1807118, 1143689, 178899, -134732, 156696, 102321, -739213, -1399275, -499690, 1914967, 4102690, 4485900, 3433199, 2696542, 3189376, 3926269, 3417779, 1633447, 19796, -278209]
40432b78209P00089O81088K54219Q2059l4061m66199q75357o86509n4963L81834
40422b96009N28398Q04985J099809O62542n87366j448848q46772O04611J249732
40413A771082M69959o50111q64918k94423L2079k61863m71281M6O37979N23173
40403H91722k36289n33955J16902P86509N21494j50384p1990O09370O39223k14804
40393B357798o42080J25100J023189Q22717j0708k41265J88590M10517K47673
40384D281531K14186K32800k45584r27106q44989K8205O00067L37138o6965m1743
40374C567540P761l05373n59829l33201Q8261L72310O65692R13363N54485m49888
40364D521121j155366r37932m30569l54261k73394M52136J198677Q19135n16659
$$ y = [-278209, 421880, 1102968, 1357187, 1439246, 1405185, 938986, 63629, -622880, -677843, -296009, 232389, 1037374, 2137183, 2799725, 2212359, 763511, -83261, 521350, 1771082, 2241041, 1590930, 726012, 431589, 463668, 201805, -269476, -269430, 368549, 891722, 655433, 121478, 238380, 1024889, 1546383, 1395999, 1324009, 1933379, 2572602, 2357798, 1715718, 1840818, 2864007, 3686724, 3676016, 3434751, 3623341, 4033858, 4281531, 4495717, 4728517, 4482933, 3555827, 2710838, 2739043, 3339110, 3676248, 3609283, 3567540, 3575301, 3269928, 2710099, 2376898, 2465159, 2837469, 3503161, 4416524, 4971009, 4521121, 3365755, 2427823, 1997254, 1642993, 1369599, 1821735, 3020412, 3839547, 3322888]
40355C322888j428628j177916l92761N4987L801k51959m30059l46296n5351Q9013
40345f12281q0728k07607j6307J18227j45338k78420L83840J349808J440053M91584
40335B442831m34648o55859o55362r56731j150100o17350L83188R58611O45735
40326c9685j31040n30889j04680P28551J092028P33574L95193O99218J096353
40317C938623O58839m00464r68791o84406k83202k03835J4293N68883P23196k5835
40307C337301r38733r86079k59569L15895K97364M3202o8498j04657k71682n64764
40297G99780p90465p75497n46150k71813O9477P48707J675245K026825J140329
40288D076438l69081j170724r07872m59757m01547k14413N61580J336089J297314
$$ y = [3322888, 1894260, 716344, 323583, 378570, 382371, 130412, -299647, -645943, -701294, -612281, -693009, -900616, -916923, -798696, -944034, -1222454, -838614, 511194, 1951247, 2442831, 2008183, 1352324, 696962, -259769, -1409869, -2027219, -1644031, -685420, -39685, -170725, -701614, -806294, -77743, 1014285, 1747859, 2143052, 2842270, 3938623, 4597462, 4196998, 3228207, 2543801, 2260599, 2056764, 2071057, 2639940, 3363136, 3337301, 2398568, 1412489, 1152920, 1468815, 1766179, 1809381, 1740883, 1636226, 1364544, 799780, 9315, -766182, -1312332, -1584145, -1514668, -765961, 909284, 2936109, 4076438, 3707357, 2536633, 1628761, 1169004, 767457, 553044, 1114624, 2450713, 3748027]
40279C748027N63889j30080l83496k27004K11816O16295N21727p1901n54884n22959
40269C771430k14388J28704N89128R09086M32927o77847j125845k10832R87173
40260D589536J142445N91384N24413R45722Q46978O7656m63008l27073j50588
40251G767465l22227l06437L60452J227093J536514J162862O10377L92607O09292
40242A3037998J025672J561654K559668M128314N384125N314661M539744M964163
40234D2515999P269449J0284206J3528742J8381727K5379409L2597835L8750098
40227A88707465M5175747N1124108M9448330L2936012N337277j9560842l2116729
40220C21051368l5597855l8188286m1133324l9672624l2543690k4396301j9133075
$$ y = [3748027, 4311916, 4181836, 3798340, 3571336, 3783152, 4399447, 4921174, 4849273, 4294389, 3771430, 3557042, 3685746, 4274874, 5183960, 5616887, 4939040, 3813195, 3602363, 4589536, 5731981, 6323365, 6847778, 7793500, 8640478, 8708134, 8245126, 7918053, 7767465, 7445238, 7138801, 7499253, 8726346, 10262860, 11425722, 12036099, 12428706, 13037998, 14063670, 15625324, 18184992, 22313306, 27697431, 33012092, 37551836, 42515999, 49785448, 60069654, 73598396, 91980123, 117359532, 149957367, 188707465, 233883212, 285007320, 334455650, 367391662, 372728939, 353168097, 321051368, 285453513, 247265227, 206131903, 166459279, 133915589, 109519288, 90386213]
40213I0386213j5945191j2817403r902617p926588o346226m796019m099959m371171
40205B4181039m065232k373341q39347j080534k317798k694444j898780r65058
40197G946505l76455J25619M54140K95148l1126K3740K32955l8263p22492j169080
40187F740691j119948p97130l11195K59706M98161J17199m53649o42701n74129
40178C717005o23377n52882J8569O18747M21581l94467p98878m13765R2103J74310
40168B258946L4342o9940k18495l24678j15870J51723j27596p27044n89912N07084
40158G78560J299820P67528l46437o21107J19635R22025J201037J094620O81944
40149E897625o4664o56262m13109N15503J250293J329243J020884N47957j42255
$$ y = [90386213, 74441022, 61623619, 51721002, 43794414, 37448188, 32652169, 28552210, 24181039, 20115807, 17742466, 16903119, 15822585, 13504787, 10810343, 8911563, 7946505, 7570050, 7695669, 8149809, 8444957, 8413831, 8437571, 8670526, 8632263, 7909771, 6740691, 5620743, 4823613, 4512418, 4772124, 5270285, 5387484, 4933835, 4291134, 3717005, 3093628, 2540746, 2559315, 3178062, 3599643, 3205176, 2406298, 1992533, 2084636, 2258946, 2293288, 2223348, 2004853, 1680175, 1564305, 1716028, 1588432, 861388, 271476, 778560, 2078380, 2845908, 2499471, 1878364, 1997999, 2920024, 4121061, 5215681, 5897625, 5832961, 5176699, 4763590, 5279093, 6529386, 7858629, 8879513, 9427470, 9285215]
40140I285215p92853r25511o68244o26440p72942m50686K50735K58243p72266
40131D785251j602633j134951o2741K51794k00158m09736j87474k60959o94720
40122D83673o28146J78468P62512M02340l18815m58502J9700N10563P19745P68838
40112B440376P54165P04155O75274N13792j35141j203853j945666j747117r25759
40103h69774k84679j05166m5609J21729K00588M1430r7894J21081N97513Q10153
40093D89372M16599k59210n47752l05006j41673m93090q09302k61884R04794J479654
40083D72502Q53625k10116o21981j74014N73705J011734P60041j69674j101820
40074A394002j157625l75390K33267J15096j24245J7234o1777q63366j442809
$$ y = [9285215, 8492362, 7566851, 6898607, 6272167, 5499225, 5048539, 5299274, 5557517, 4785251, 3182618, 2047667, 1984926, 2236720, 2036562, 1626826, 1439352, 1178393, 483673, -144473, 33995, 796507, 1198847, 880032, 421530, 441230, 951793, 1671538, 2440376, 3194541, 3898696, 4573970, 5087762, 4952621, 3748768, 1803102, 55985, -869774, -1154453, -1259619, -1305228, -1183499, -982911, -941481, -1039375, -918294, -320781, 489372, 905971, 646761, 99009, -205997, -347670, -840760, -1650062, -1911946, -1007152, 472502, 1326127, 1116011, 494030, 320016, 893721, 1905455, 2665496, 2495822, 1394002, 236377, -139013, 94254, 209350, 85105, 102339, 40562, -822804, -2265613]
40065b265613n86624J135039J910809J137714k9768n93324p61358q24397m19031
40056a296553M38113P94266J16881p00113n98555R3802L21606n5003k93091r7482
40046a276129J05960J23449K71341N82128N18044k27691j148690j422413p26300
40037c200301N18638J461475J426567N60299j66500K897O21646N86440l15961
40028A495200j045992p32573J69482O25638M38146K39309L22140K68499j88580
40019A591269o52974p12790n17244l03707J12367P87723J045703K67652q87842
40010G30157j027969O5875J024037P90547K7429q0032L73200M27576j0051p4519
40000B246250M72800P41621J04895q51958j249384j050104p45803m95489j76311
$$ y = [-2265613, -2852237, -1717198, 193611, 1331325, 1301557, 708233, -53125, -877522, -1296553, -858440, -64174, 52707, -647406, -1245961, -1152159, -830553, -885556, -1178647, -1276129, -1170169, -1046720, -775379, -193251, 324793, 97102, -1051588, -2474001, -3200301, -2681663, -1220188, 206379, 766678, 600178, 603075, 1224721, 1811161, 1495200, 449208, -283365, -113883, 511755, 949901, 1189210, 1511350, 1779849, 1591269, 938295, 225505, -291739, -595446, -483079, 304644, 1350347, 1617999, 730157, -297812, -231937, 792100, 1582647, 1610076, 1530044, 1903244, 2330820, 2320769, 2246250, 2719050, 3460671, 3565566, 2713608, 1464224, 414120, -331683, -827172, -1003483]
39991a003483J05493J43481M7475N6606J04592k6578k62393l08398p2543K64791
39981i50957N02488N28953L24219L2937j43995k68018n96132j036233j065381
39972b672119m90937J20716K26026J61858O29355J510782J848371J045449m03672
39963A975829j467404j496167n95339M99983Q88087K77163n90571o80494O0905
39954a128008O08836K29235n31849o37838j305M47420P7389o36917q53400m64220
39944b890657k5276J79965M24398Q37746J031473P67102M93896O49891P88570
39935B257108J77753q68454j174252l86419M39000L62931j78158l15179j93438
39926A20892n05588j051685r18716l5785N34653J21510o07056o43068N5489P33556
$$ y = [-1003483, -897990, -754509, -707034, -650428, -545836, -572414, -834807, -1143205, -1215748, -950957, -448469, 80484, 404703, 437640, 293645, 25627, -570505, -1606738, -2672119, -3163056, -3042340, -2816314, -2654456, -2025101, -514319, 1334052, 2379501, 1975829, 508425, -987742, -1583081, -1083098, -195011, 82152, -508419, -1188913, -1128008, -519172, -289937, -821786, -1459624, -1460929, -1013509, -936120, -1573037, -2426437, -2890657, -2915933, -2735968, -2311570, -1473824, -442351, 324751, 818647, 1468538, 2257108, 2434861, 1566407, 392155, 5736, 444736, 807667, 629509, 314330, 120892, -384696, -1436381, -2355097, -2390882, -1856229, -1734719, -2341775, -2984843, -2929354, -2195798]
39916b195798Q65781N41250R2026k46468m02890m42122m17338k09545K87497Q10784
39906a316823Q96843N36696L14068O39776J105111R22943n4605j007303r38137
39897A098569K06001J283380J057048l63004j523965j359957m80759j55224m31703
39888f69614k78038M80754O33031m92253j664845j289344L53075J473768J101663
39879c51803K3546n58807l65753J63809O21313P80386N15574k3458m17017l96058
39869h268o8664L41827O91767P94193M80360p1145m13609l96337l04458k92107
39859G53559j16316K98196M95565J42531l12756k09490L01086M28251j09277p55306
39849I16043j030041j085223j043058m75651Q04297J887902J603256J71308q41159
$$ y = [-2195798, -1330017, -788767, -696741, -943209, -1346099, -1788221, -2205559, -2415104, -2127607, -1316823, -419980, 116716, 430784, 1070560, 2175671, 3098614, 3044009, 2036706, 1098569, 1304570, 2587950, 3644998, 3281994, 1758029, 398072, -82687, -237911, -669614, -947652, -466898, 166133, -326120, -1990965, -3280309, -2927234, -1453466, -351803, -328257, -887064, -1252817, -1089008, -467695, 312691, 828265, 804807, 387790, -8268, -76932, 264895, 956662, 1750855, 2231215, 2160070, 1746461, 1350124, 1045666, 753559, 637243, 935439, 1431004, 1573535, 1260779, 1051289, 1352375, 1780626, 1671349, 916043, -113998, -1199221, -2242279, -2717930, -1913633, -25731, 1577525, 1748833, 907674]
39840I07674n16642K27923L0988r36719j291154n22055K94840J71004l45271j42310
39830b121722O18792O78502l77933j365203j074917J46628J018304J023419P28686
39821g25444O42657O09564M40520L69741N12028M60945o4635o02008n61706j77837
39811I03825j75699o11540p76862l63753k380k70842p41059n69163K77208R70435
39801a359830R16010L75836o9626k44957l36534l90223j80030L97593R91367J044124
39791A143730M24798l16392m90353k4940N12910O33800M04337J44271o0903l39380
39781B031878p01355r38696q04012k37281M60570P09637J98014o06335q60115
39772g47695l99324J8459k37037p95695q20099p5307R12393J476699J245860L02319
$$ y = [907674, 391032, 618955, 649943, -286776, -1577930, -2099985, -1805145, -1634141, -1979412, -2121722, -1502930, -824428, -1202361, -2567564, -3642481, -3495853, -2477549, -1454130, -725444, -82787, 526777, 967297, 1337038, 1849066, 2310011, 2245376, 1643368, 1081662, 903825, 728126, 116586, -660276, -1024029, -1026409, -1297251, -2038310, -2607473, -2330265, -1359830, -443820, -67984, -137610, -382567, -719101, -1109324, -1289354, -891761, 99606, 1143730, 1568528, 1252136, 761783, 736843, 1249753, 1883553, 2287890, 2432161, 2371258, 2031878, 1330523, 391827, -412185, -649466, -188896, 520741, 718755, 112420, -747695, -1147019, -1128560, -1365597, -2161292, -2981391, -3056698, -2144305, -667606, 578254, 880573]
39762H80573o88312q69986j77668M44985K90022j41695o6067K43105K0522m68008
39752e32529k02115Q33772J420953Q90411q233m35907n84176q73460j000372n71195
39742a062851L1370K10631N9777R45Q61j61929k67288J4858M79975O83690N86721
39731E76760L87928P9384l06432m20460j35675P3555j10980k09819K34732P16623
39721H85616N11426p8164k17894M0706o6682n96726q07710n06304l30630m96033
39711a662395l80555K60353P00531M11491n6686j5054K66576J42777k51741k19602
39701h04305L86356R66996J035818P30075L96754P1151m02949q71492q05351j4633
39691F88420P00402K19932j296972k162637j181803O46870J414949Q65738L97117
$$ y = [880573, 192261, -677725, -855393, -410408, -120386, -262081, -328148, -85043, -64521, -532529, -734644, 99128, 1520081, 2410492, 2402259, 1966352, 1382176, 508716, -491656, -1062851, -1031481, -820850, -761073, -760128, -759267, -921196, -1188484, -1173626, -693651, -9961, 576760, 964688, 1044072, 737640, 317180, 181505, 255060, 144080, -65739, 168993, 885616, 1397042, 1318878, 1100984, 1141690, 1075008, 478282, -329428, -835732, -1166362, -1662395, -2042950, -1782597, -1082066, -670575, -727261, -742315, -475739, -332962, -584703, -804305, -417949, 549047, 1584865, 2314940, 2711694, 2782845, 2379896, 1508404, 703053, 688420, 1388822, 1608754, 311782, -1850855, -3032658, -2385788, -970839, -105101, 292016]
39682B92016O47740O43316k36516r41599l31946J016170J661397J206746L29682
39673D287006m87814j172003j395748q02101J99308P09645M05080k55508p06268
39664G81597o25610M1510P77585O26727n79141j534028r48144N86272J303151
39655D29919O67344j30323j24689K44483K44842l0187k37989n06406q72373p89996
39645a105375K5853Q62208Q89418L31954J8578J33810J88721r382j50641j16054
39635A069090j52416k89979k18439R0039J74165k32393p10133o69713j18177M00416
39625f57540N07394L37369J89371J05639m4423k20283k19612m3730K8472j13410
39615a30753j52400J84126N95113N42065J4089m83697o71325p14450o54506k27795
$$ y = [292016, 939756, 1583072, 1346556, 404957, 73011, 1089181, 2750578, 3957324, 4287006, 3799192, 2627189, 1231441, 429340, 628648, 1338293, 1743373, 1487865, 781597, 155987, 197497, 975082, 1601809, 1022668, -511360, -1459504, -873232, 429919, 1097263, 966940, 842251, 1086734, 1331576, 1301389, 1063400, 556994, -315379, -1105375, -1079522, -217314, 672104, 1004058, 1022636, 1156446, 1345167, 1335785, 1185144, 1069090, 916674, 626695, 408256, 498295, 672460, 440067, -270066, -939779, -1057956, -657540, -150146, 187223, 376594, 482233, 437810, 217527, -2085, -45815, -17343, -130753, -283153, -99027, 496086, 1038151, 1052240, 568543, -102782, -817232, -1471738, -1699533]
39605a699533M92494Q51595M47996k18515m08712r4390K50992M47887N69471M01907
39595A041192k55002q39067m59428P38920J463591R24655j07550m56953j61668
39586A888690j55880o76043r34347m57047J10028m1889p05808j017828o84070
39577b674194k13996Q972K39074P18304J051399P40922J00086J7259P27039J346082
39567B060947R57818j84697r80257q51494l12670j18829l04867l41220L4321N07951
39557D67003O65345M90966L08674L61769N42906N22782J36850l71685n82617m16948
39547B125045k98003o48971j292451j537699r14004K79609J190069J135921J77453
39538B16969r13782j277991p05700K08851P11573O15639K67894m1261k84183l46755
$$ y = [-1699533, -1207039, -355444, 92552, -125963, -534675, -629065, -378073, 69814, 639285, 1041192, 786190, -52877, -512305, 226615, 1690206, 2614861, 2507311, 2050358, 1888690, 1732810, 1056767, 122420, -334627, -224599, -266488, -972296, -1990124, -2674194, -2888190, -2879218, -2640144, -1921840, -870441, -129519, -29433, -12174, 714865, 2060947, 3018765, 2834068, 1853811, 1002317, 689647, 570818, 265951, -75269, -40948, 467003, 1132348, 1623314, 1931988, 2293757, 2836663, 3359445, 3496295, 3124610, 2541993, 2125045, 1827042, 1178071, -114380, -1652079, -2566083, -2286474, -1096405, 39516, 216969, -696813, -1974804, -2680504, -2471653, -1760080, -1144441, -876547, -917808, -1201991, -1548746]
39528a548746L0675P13552R81690L23437p72026j270141p84847Q4458N93414O02764
39518a045770M10221K57164K18226K80815L01361Q8249k94762n16467m32766l16776
39508a050505m29721n93498m54867n609M26229N84696M67965K41088J60889L85787
39498b67546O38004L51409m83851r54909k94549Q79570J163863K66298n29950
39489G68339j75894O27182M35402q67119j886764j558749l64310N32403P21208
39480a768302O41281O34116N42995K51337O8155K89167O83098P87701N72957L77799
39470C080304J97286m14777j461346k055055j451019k17785L87029J34426K9609
39461a771328N99869R67176K79639p64714q67919j46582L6576p68024j343289
$$ y = [-1548746, -1518071, -804519, 177171, 500608, -271418, -1541559, -2326406, -2241948, -1648534, -1045770, -635549, -378385, -160159, 120656, 422017, 510266, 215504, -300963, -733729, -1050505, -1480226, -2073724, -2528591, -2534200, -2107971, -1523275, -1055310, -814222, -653333, -267546, 370458, 721867, 238016, -716893, -1011442, -131872, 1031991, 1298289, 768339, 592445, 1219627, 1655029, 787910, -1098854, -2657603, -3021913, -2489510, -1768302, -1127021, -492905, 50090, 301427, 369582, 658749, 1341847, 2129548, 2702505, 3080304, 3277590, 2862813, 1401467, -653588, -2104607, -2322392, -1935363, -1800937, -1771328, -1171459, -204283, 75356, -689358, -1557277, -1703859, -1667283, -2435307, -3778596]
39452c778596o19219P86948J522345J245842O56563L17284K77321N21901R50009
39443A880398J057671M21853n50850j055892j005011r69670j068997q13082j86281
39434b289861P5203l31683o85796l64398K17184M06826L32465L85415L62065R598
39424a882982j36812N05227J377789J419445O28066j24181o05773j256729j782769
39415a858719j258932M6337N20372m02622j141339l07499J106553J252326K05286
39406a838237l75425J43515P43302O32348K10452o0054l75257p32783n30248L39393
39396a842994R09227L81118p01716j200514q04166p5966N15776R43230J200382
39387f75623J140487P39297J75735l29431n70749m09025K4723L42328L19994J42175
$$ y = [-3778596, -4397815, -3610867, -2088522, -842680, -186117, 131167, 408488, 930389, 1880398, 2938069, 3359922, 2809072, 1753180, 748169, -221501, -1290498, -2103580, -2289861, -2214658, -2546341, -3232137, -3596535, -3379351, -2972525, -2640060, -2254645, -1892580, -1882982, -2019794, -1514567, -136778, 1282667, 1910733, 1786552, 1180779, -75950, -1858719, -3117651, -3071314, -2550942, -2953564, -4094903, -4402402, -3295849, -2043523, -1838237, -2213662, -2070147, -1326845, -694497, -484045, -544099, -919356, -1652139, -2182387, -1842994, -933767, -552649, -1254365, -2454879, -3259045, -3335011, -2819235, -1876005, -675623, 464864, 1204161, 1379896, 1050465, 479716, 70691, 95414, 437742, 757736, 899911]
39377H99911N5986J1736j23629k27826j19737M1100r2338m84648n91775K7383
39367f03837J066112J623281J122587J2344o81061n53143k63464n65660j251118
39358i3959j501199j040498l42131K31058Q11657J421049J608285J035951K9874
39349B160087p56770r58329o09199K8525N60937O83870M84169K93305K12820J07300
39339B206715J9631R4181P9737m51801j238604j364488m77421O35633J061248
39330E64831P86061L36181j2221j83227o732M71585P97894O95864M30538K13210
39320D093984j83620p62189r42583n10767k31929p05700j254324r39209j41355
39311a577692L4134m25303m97756R2515M31057o7788q14750j040095p08236j21943
$$ y = [899911, 955897, 967633, 844004, 616178, 496441, 537541, 445203, -39445, -631220, -603837, 462275, 2085556, 3208143, 3220487, 2539426, 1986283, 1722819, 1157159, -93959, -1595158, -2635656, -2977787, -2746729, -1935072, -514023, 1094262, 2130213, 2160087, 1403317, 444988, -164211, -135686, 425251, 1109121, 1593290, 1886595, 2099415, 2206715, 2226346, 2320527, 2400264, 1948463, 709859, -654629, -1132050, -496417, 564831, 1350892, 1687073, 1674852, 1491625, 1484893, 1956478, 2754372, 3450236, 3880774, 4093984, 3910364, 3148175, 2205592, 1694825, 1462896, 757196, -497128, -1436337, -1577692, -1543558, -1968861, -2466617, -2374102, -1943045, -2010833, -2825583, -3865678, -4573914, -4695857]
39301d695857N41750R71748P87425K17120R107L53522N92381L06707m2864O7721
39291h91240M69516P65019Q91283Q22795L88866j81110k37235K51062L50830m92118
39281B137668j427687j307437l03151M32900L63713m8475l27151m53324l88145
39272a321089L3282N75517O57141J83063j98350N5828O64517R20989N34807j65967
39262A939738o85186p92823o08502m24735m30306n28383m45503p1078L31540L40290
39252a374948j25658n86271m70460J60268O14834M48299L4009k8838K33641L79475
39242g15649L67262N20673P39177M56044m51523j318286j505064j062518l80359
39233c350243K98381P68189Q11750N89212N92524Q77872Q33107R8882p41165q48206
$$ y = [-4695857, -4154107, -3182359, -2394934, -2177814, -2168707, -1815185, -1222804, -916097, -958961, -891240, -421724, 343295, 1234578, 2057373, 2446239, 2265129, 2027894, 2278956, 2629786, 2137668, 709981, -597456, -900607, -467707, -103994, -152469, -479620, -932944, -1321089, -1287807, -712290, -55149, 127914, -70436, -14608, 649909, 1570898, 2105705, 1939738, 1254552, 461729, -146773, -571508, -1001814, -1530197, -1975700, -2046778, -1715238, -1374948, -1500606, -2086877, -2557337, -2397069, -1782235, -1333936, -1299927, -1328765, -1095124, -715649, -348387, 172286, 911463, 1367507, 915984, -402302, -1907366, -2969884, -3350243, -3051862, -2283673, -1471923, -882711, -290187, 587685, 1420792, 1519674, 778509, -69697]
39223f9697j55441O88995J065661P12743k91345j428111j919502j422108l54429
39214c173234O49870J243656J202488M26085n29802o28072L52467J274713J036703
39205A854874k9945q30918j008991r30469o52350P8236R83793J344594R19365
39196A728189J11012o37829r81889n32575N80010J265194N62747r23400j637730
39187d66271j086292k65987n8973k48939l34038k79865p0661N64551J434912J630384
39177H18821O10159q89073j536404p70057P41184J724957J338362m5002j075759
39168I17188q59729p416K86449o6604j48435L25899N80861J52080m08301n53513
39158B18479m68810l50226O5469P32989J002681O84623N00165Q24648R16529J95954
$$ y = [-69697, -225138, 463857, 1529518, 2242261, 1950916, 522805, -1396697, -2818805, -3173234, -2523364, -1279708, -77220, 348865, -180937, -809009, -456542, 818171, 1854874, 1824929, 994011, -14980, -945449, -1597799, -1519563, -535770, 808824, 1728189, 1839201, 1201372, 219483, -313092, 266918, 1532112, 2094859, 1171459, -466271, -1552563, -1818550, -1877523, -2126462, -2460500, -2740365, -2811026, -2246475, -811563, 818821, 1428980, 539907, -996497, -1766554, -1025370, 699587, 2037949, 1992947, 917188, 57459, 50043, 336492, 269888, 121453, 447352, 1028213, 1180293, 771992, 218479, -250331, -600557, -535088, 197901, 1200582, 1885205, 2385370, 3210018, 4126547, 4322501]
39148D322501o09997n77886q5806j11352o18643q00784n34089m14137n27480l09839
39138b67512L50280Q27401P01945K21545k68233o62252p83054l91000L28574P98657
39128H56351P22696L72505J68569K56722M41312L25659k70677q57243o78979J34566
39118A471481M66773k23036r66488p08628N7603J73508k50641j55912N01473O28591
39108I94724q4306n98647k53318K73564K73474Q3448J76998K46832r724j13147
39098I89898L07390O24925J78881m85947l71861L81254O85863J17839n97694p33824
39088A096724m17333j80107k18313l04167j39338K79411N24867J61503n18379
39079B84868n77852L36941J247338R40882m10842j423829j235614l97373O0282
$$ y = [4322501, 3712504, 3134618, 3048812, 2937460, 2318817, 1518033, 983944, 569807, 42327, -267512, 82768, 910169, 1612114, 1833659, 1565426, 903174, 120120, -270880, 57694, 856351, 1579047, 1951552, 2120121, 2376843, 2818155, 3143814, 2873137, 2015894, 1336915, 1471481, 1938254, 1715218, 748730, 40102, 97705, 271213, 20572, -135340, 366133, 994724, 910418, 311771, 58453, 332017, 605491, 688939, 865937, 1112769, 1103045, 989898, 1297288, 1922213, 2101094, 1615147, 1243286, 1624540, 2310403, 2428242, 1830548, 1096724, 679391, 499284, 280971, -23196, -162534, 116877, 641744, 803247, 284868, -292984, 43957, 1291295, 2232177, 1821335, 397506, -838108, -1235481, -1175199]
39070a175199j46017m91804l87134K64576R99040J165882N92181j27453k90001
39061D04071K3525J26699k19547m86613k77181K3750j19095n36777o30912k48164
39051a940244K35525N80168R01886J202824J180093O89991L3222m52897p89846
39042A640722j082905j121015o31513J80638P29167P01279L29596p009j66942
39033E72018j81437r2682M0991J88889M21794O90183N92354j79976j131177j311377
39023c90420o11048l3681k37628n21340K543Q55195Q71908P7754l56014j3265
39013c55996J96455l03618p36734k51599P55465J365032J385567J072875L40335
39004C467782p81952j479770j042530q7200J60648m08758q43830p59554p24961
$$ y = [-1175199, -1321216, -1813020, -2200154, -1935578, -936538, 229344, 821525, 694072, 404071, 427596, 554295, 334748, -151865, -429046, -405296, -524391, -1061168, -1692080, -1940244, -1704719, -1124551, -222665, 980159, 2160252, 2850243, 2883465, 2430568, 1640722, 557817, -563198, -1194711, -1014073, -284906, 416373, 745969, 738960, 572018, 390581, 297899, 338890, 527779, 949573, 1639756, 2232110, 2052134, 920957, -390420, -1001468, -1035149, -1272777, -1794117, -1791574, -936379, -64471, 13283, -342731, -355996, -159541, -463159, -1199893, -1451492, -696027, 669005, 2054572, 3127447, 3467782, 2685830, 1206060, 163530, 76330, 236978, -171780, -1015610, -1775164, -2500125]
38995b500125r49519q09127n5370N99754O64786O78857J148154J496470R29916
38986A203796k37959r99595r92596o10584j26807M11458O46422K26614l65920
38977h45171k37995N21222P56577j26704j249899j444487o98264J24595M64766
38968b735360L55136k3422l68705j58546P03305J334430Q20237l17210n51989
38959i42124N08342J401013Q05046o04095j219390q20925o12255j094528j241365
38950c820281k18682J171061J561305Q25314p3208n42814o89366m52052M38220
38941a800503J512615J657944O14663m81788o36006k88003l19420m90208L0966
38932a99740R76816J133105K50214m42154o6624O23083M76049m12951j151688
$$ y = [-2500125, -3449644, -4258771, -4314141, -3714387, -3049601, -2370744, -1222590, 273880, 1203796, 965837, -33758, -1026354, -1636938, -1763745, -1352287, -705865, -479251, -845171, -1083166, -561944, 194633, 67929, -1181970, -2626457, -3324721, -3200126, -2735360, -2380224, -2403646, -2772351, -2930897, -2227592, -893162, -72925, -390135, -942124, -433782, 967231, 1772277, 1168182, -51208, -872133, -1484388, -2578916, -3820281, -4038963, -2867902, -1306597, -481283, -554491, -1097305, -1786671, -2238723, -1800503, -287888, 1370056, 1984719, 1502931, 866925, 578922, 259502, -230706, -199740, 777076, 1910181, 2160395, 1718241, 1651617, 2274700, 2750749, 2337798, 1186110]
38923A186110j466130j647716j515258n78726Q19904J571634J192595L46961j81692
38914b72318k79773j29135J11707L6475o69343j281263n03099J480744K530793
38905A024788J201195j022732j541529j70502P82362p6711j441632j471414k91579
38896c007754O68066Q49940Q72642J109329J112468M92187m24852j012790r85427
38887c26191n22375o0441K7673k12602l39452r6167J88554O6232l42341n13946
38877b131056k90616n2438r1468k04974n4530L50336O99082P46961N12819K20396
38867b95488J09216K06091K63875N0867k94014l75544p8773K06323Q6983k12667
38857c33131l2266Q03597J490815J037604m27321j544803j221582L7733P44349
$$ y = [1186110, -280020, -1927736, -3442994, -4021720, -3201816, -1630182, -437587, -90626, -272318, -552091, -681226, -569519, -533044, -1202387, -2483650, -2986749, -1506005, 1024788, 2225983, 1203251, -338278, -508780, 273582, 196871, -1244761, -2716175, -3007754, -2339688, -1489748, -617106, 492223, 1604691, 2096878, 1672026, 659236, -326191, -848566, -909007, -881334, -1093936, -1433388, -1529555, -1341001, -1274769, -1617110, -2131056, -2421672, -2474110, -2565578, -2770552, -2825082, -2474746, -1775664, -1028703, -515884, -295488, -186272, 19819, 283694, 334561, 40547, -334997, -413770, -207447, -120464, -333131, -365397, 438200, 1929015, 2966619, 2539298, 994495, -227087, -189354, 554995]
38848E54995K41574o58103r13106m90404k3853K07975L72397M70728L18218O9089
38838A49510J24745M15505L38188l57850j088797j156701n94347M7179M32600
38829a689968N45342L25976k26839o71643m47285K81469O31624J16419p04339
38820a839244j018953p59071l47329J00411O44041R11249M95183j27829l7781
38811a979323O55586Q20245J29593k57986M34857J152186N60405p55441j064929
38802c04807l2833R84901J041041N18158j00366q26674j208987l73328J272820
38793I69925J844155M86582j169552j247888k10351K26705j36598n7561P08683
38784A414100R13196k0749r34280o80272K25687N16780L114l54935R1305Q17875
$$ y = [554995, 796569, 138466, -774640, -1265044, -1288897, -1080922, -708525, -237797, 80421, 149510, 274255, 689760, 1027948, 670098, -418699, -1575400, -2169747, -2122568, -1689968, -1144626, -818650, -1045489, -1717132, -2164417, -1882948, -1251324, -1134905, -1839244, -2858197, -3617268, -3964597, -3864186, -3220145, -2308896, -1813713, -1941542, -1979323, -1323737, -503492, -373899, -631885, -197028, 955158, 1515563, 760122, -304807, -337640, 647261, 1688302, 2206460, 2106094, 1279420, 70433, -302895, 969925, 2814080, 3300662, 2131110, 883222, 672871, 899576, 762978, 705417, 1414100, 2327296, 2306547, 1372267, 691995, 917682, 1434462, 1437576, 1082641, 1173946, 1991821]
38774A991821Q03463k28015j421730j721010j066900l20367J7658L60825R89906
38765e94349J238646M99084n58476p89402k53052J4225k61478k78416L21838Q10763
38755A49383O06860J24617q9392j75472l71765m08821j23320K230l95304p92446
38745a473430m96290K54942O08175K70151k68498n27940m57249j11492N05422
38736a696209J131449J214336N01175m78876q11870j85344O89699Q79352L51363
38727A595075j09370j13493j41134n08934o43208p8635M99822K20404m49625l53521
38717h2619M35138P07512J43814k06847K18274N85966J99695l61321m03656k43468
38707I92488k83528p7823O18593Q64204j21657j368944j306032o0194P54300L55375
$$ y = [1991821, 2795284, 2567269, 1145539, -575471, -1642371, -1962738, -1945080, -1584255, -594349, 644297, 1143381, 584905, -204497, -457549, -443324, -704802, -983218, -661380, 149383, 756243, 880860, 791468, 615996, 244231, -164590, -287910, -285680, -680984, -1473430, -1969720, -1714778, -1106603, -836452, -1104950, -1632890, -2090139, -2201631, -1696209, -564760, 649576, 1150751, 671875, -139995, -325339, 364360, 1243712, 1595075, 1485705, 1372212, 1231078, 722144, 78936, 301, 500123, 720527, 270902, -82619, 352519, 1060031, 1203845, 996998, 1215272, 1801238, 2000933, 1639612, 1235956, 992488, 708960, 631137, 1249730, 2113934, 1992277, 623333, -682699, -742893, 11407, 366782]
38697C66782l91717n14427j20340K18578L39158L41378J79031k08864o29281p00749
38687a120451j60458P48860J195296N39227o43661j009407k68258K97960k27855
38678f48747r03034m20314P03979Q57308j54564q44021l13121O03413P83422K63202
38668g2477k17972k58854N4098M06077L71419j93619p51159o33595o664L59958
38658i42788K36840Q0869N9903j66443n66783n55441L5976O14612P46013O60375
38648B03133N62807K31368l22771n36743j08987M47323M89620K3371n05674p45047
38638b61600n67665j64117j07668p29350j358641r38107M50943J505677J396497
38629g74031O78008J61190j89860o68372r66159o51630M7010N92961Q54003R55703
$$ y = [366782, -24935, -539362, -659702, -441124, -101966, 239412, 418443, 209579, -419702, -1120451, -1280909, -532049, 663247, 1202474, 558813, -450594, -718852, -420892, -648747, -1551781, -1972095, -1268116, -410808, -565372, -1409393, -1722514, -1119101, -335679, -72477, -290449, -549303, -495205, -89128, 282291, 88672, -662487, -1296082, -1302746, -942788, -705948, -625079, -565176, -731619, -1298402, -1853843, -1817867, -1203255, -457242, 203133, 765940, 997308, 674537, 137794, 28807, 476130, 965750, 989121, 483447, -261600, -829265, -993382, -1101050, -1830400, -3189041, -4127148, -3676205, -2170528, -774031, -96023, 65167, -124693, -793065, -1759224, -2410854, -2363844, -1770883, -916880, 38823]
38619C8823Q66878O07259M46929M86077M57016K57973J61044J87112r2883p56100
38609B660128j190130r87420n11672j38100L18663Q82228R19729R1189q72400
38600A172215j097188p18162m11198l48222l28186l74363m61133k03070M46694
38591b322613P80137L85662l4119K32643O58795L69983l16474m24763M5790K49242
38581c75717j7705j54105O7500K81507L86356N78020O50605K88108j17534j2573
38571A574462J76611l32924j095518q91229K04000O98472o2463r42955q18428
38562a489972n5249M28484M62252L20717R3861j3830L49388Q57194N83569n11740
38552A024674j162631n44219N37732R76637Q83693Q32258N64639l06838j038420
$$ y = [38823, 905701, 1512960, 1959889, 2445966, 2902982, 3160955, 3321999, 3509111, 3416228, 2660128, 1469998, 482578, -29094, -167194, 151469, 1033697, 1953426, 2044615, 1172215, 75027, -643135, -1054333, -1402555, -1730741, -2105104, -2566237, -2769307, -2322613, -1542476, -1156814, -1190933, -958290, -299495, 70488, -245986, -670749, -624959, -375717, -393422, -547527, -480027, -198520, 187836, 765856, 1416461, 1704569, 1587035, 1574462, 1751073, 1418149, 322631, -568598, -364598, 333874, 271411, -671544, -1489972, -1545221, -1116737, -654485, -333768, -239907, -253737, 95651, 952845, 1536414, 1024674, -137957, -682176, -144444, 832193, 1715886, 2548144, 3112783, 2805945, 1767525]
38543A767525o20135M48882O47784l36473j151352p93172L2955Q8434o52152j107437
38533a675141n84418M36502J012802Q46292M30284J98418n4816o01492r96935
38524i88504n67662L82385P17705Q6139m75788q4351O46734O22028K8504L9037
38514D06227R63687J723845J335845J55706o83023o12586r4962M8271m38922r89247
38504A814841r00177k26657K76220J49024k26626k63820O0554L46059K92943j81657
38494A140704r14063j301126o95129O00882J331765Q17816j27162m44037l09448
38485A00202m74317p42681l12904O67810J164098Q56265M92478M92280L48703
38476B591934k49692p56869p14191m73784m52918m33892j61589L0233k25120o73313
$$ y = [1767525, 1147390, 1596272, 2244056, 1907583, 756231, -36941, -3986, 84448, -567704, -1675141, -2259559, -1823057, -810255, 36037, 466321, 664739, 609923, 8431, -988504, -1556166, -1173781, -456076, -369937, -845725, -930076, -283342, 338686, 367190, 406227, 1369914, 3093759, 4429604, 4585310, 3902287, 3289701, 3194739, 3243010, 2804088, 1814841, 914664, 688007, 964227, 1113251, 886625, 622805, 683359, 1029418, 1322361, 1140704, 226641, -1074485, -1769614, -1168732, 163033, 980849, 853687, 409650, 100202, -374115, -1116796, -1429700, -761890, 402208, 1258473, 1750951, 2243231, 2591934, 2342242, 1585373, 871182, 397398, -55520, -489412, -651001, -620768, -845888, -1519201]
38466a519201q51980o87330k75536L69482R13287O89320l16693j049371o44251
38457c372273L68075Q44390N91102L26321L96714M54729L29862L30843N42939
38448H12702N46964P3855n80678r71935r10607l81164M55349J075937R33825J83629
38438A237877l74193k82860N2713N9787k18744l52870j87223J01380L76744O05873
38428A018484O70871M27011q1226o22759r18426p19085k968P40965P51919j36427
38418A128359j090657j147681l68419L01358K57896j59610l54008k34331l7080
38409a704173J81047M48267N38432K34052j34137O3814Q05968J173275M48919
38400B055464p94559j241686m79232M61225M86142j44487l78228k6817M7006m89155
$$ y = [-1519201, -2371181, -3058511, -3334047, -2964565, -2051278, -1361958, -1678651, -2728022, -3372273, -3004198, -2159808, -1568706, -1242385, -845671, -390942, -61080, 269763, 812702, 1359666, 1433521, 852843, -119092, -1029699, -1410863, -955514, 120423, 1054248, 1237877, 863684, 580824, 633537, 693324, 474580, 121710, -65513, 35867, 412611, 1018484, 1689355, 2116366, 2035140, 1412381, 493955, -225130, -228098, 512867, 1264786, 1128359, 37702, -1109979, -1478398, -1177040, -919144, -1078754, -1432762, -1667093, -1704173, -1523126, -1074859, -536427, -302375, -436512, -372698, 433270, 1606545, 2055464, 1260905, 19219, -460013, 1212, 487354, 342867, -35361, -62178, -15172, -504327]
38390e04327o79199K43320J402293J351951K16195m66320m5426L76641j84195
38381A710933j061919j113158m71393m1210Q3816M28916P41997J92281j020643
38372e50380j604307j044488l35881l37602n24975j17970N31391O44337L74449
38363b965426L90354N88503L39586k32531l35163J44014M13102Q5937k07052J31500
38353a647176P51307R28052N10023j11428n53706o25811l45910q2024k88409p97954
38343b263036q09143J7189Q70705P79333J4580k03777N78043J335179R18476l63607
38333H73942j098968n77988L72158N80885N1427k53147J12813N52003M76994J44014
38323A234133L5968Q1671J37858O78073K041972L271675K834323O68626j481346
$$ y = [-504327, -1183526, -940206, 462087, 1814038, 2030233, 1563913, 1518487, 1895128, 1710933, 649014, -464144, -935537, -976747, -892931, -464015, 277982, 470263, -550380, -2154687, -3199175, -3535056, -3872658, -4397633, -4515603, -3984212, -3339875, -2965426, -2575072, -1986569, -1646983, -1879514, -2214677, -2070663, -1657561, -1571624, -1778676, -1647176, -895869, 32183, 542206, 430778, -122928, -748739, -1094649, -1176673, -1465082, -2263036, -3072179, -3054990, -2184285, -1404952, -1390372, -1594149, -1016106, 319073, 1237549, 873942, -225026, -803014, -430856, 150029, 201456, -51691, 61122, 613125, 1090119, 1234133, 1270101, 1351772, 1489630, 2167703, 4209675, 7481350, 10315673, 10984299, 9502953]
38314I502953k140966j650921j189107j141002j191139j315586j663108j777599
38306b566475r68240N12781J490518J266518L88858j96233k48807j94444l45031
38297h60555n17282l28583L10952R96494J143043N95481j60467n43992n06198
38288A28893l97199l69391k61115j7352J59267J61186J88581M67236Q95229J051443
38278B006778N40156n58256j521386j543484o73064J20775J41697j54330J7690
38269a623424M76825M27735j02140k20036L14166O15209J70222k08298L08090
38260A58349J127379J116852L77482N004L04182M01081k51332j014903j079917
38251A144177n34288M1274M22735O72752O83845L45537p9518k05959l3372J00996
$$ y = [9502953, 7361987, 5711066, 4521959, 3380957, 2189818, 874232, -788876, -2566475, -3534715, -3021934, -1531416, -264898, 123960, -72273, -321080, -515524, -860555, -1377837, -1706420, -1395468, -398974, 744069, 1339550, 1179083, 635091, 128893, -268306, -637697, -898812, -916164, -756897, -595711, -407130, 60106, 955335, 2006778, 2546934, 1988678, 467292, -1076192, -1749256, -1628481, -1486784, -1641114, -1623424, -1146599, -718864, -821004, -1041040, -726874, -111665, 58557, -149741, 158349, 1285728, 2402580, 2780062, 2785066, 3089248, 3490329, 3238997, 2224094, 1144177, 609889, 651163, 1073898, 1746650, 2430495, 2776032, 2696514, 2490555, 2457183, 2558179]
38241B558179m5720m43710q60153r27108l91201M82246J012572Q47729L31353
38232B564187r9309m83616r17774r84531k48822Q61592J363760R46749L02117
38223C304353J09282K35366J67913k15223o20018p84140o75885m25130k23377
38214H73141j46004l7340K09549L19173j9090m80231l52437L62412P13521O6403
38204A509097r28483j189418o38996j39386k01096m19750k04061M59842J061777
38195f90474J058059L27915n89020q66736l32422K21540J02456k63858p6230L95100
38185g13670J40304q03206j083876j5248J226878J170604L7908p58970n90476
38176a389752q1013J26987R0754O2996J18676L75519Q57854J056073L79479p79000
$$ y = [2558179, 2512459, 2068749, 1208596, 281488, -109713, 372533, 1385105, 2232834, 2564187, 2464878, 1981262, 1063488, 78957, -169865, 691727, 2055487, 3002236, 3304353, 3413635, 3649001, 3816914, 3601691, 2981673, 2197533, 1521648, 1096518, 873141, 727137, 689797, 899346, 1218519, 1199429, 719198, 366761, 729173, 1442694, 1509097, 580614, -608804, -1247800, -1387186, -1588282, -2008032, -2212093, -1752251, -690474, 367585, 695500, 106480, -760256, -1092678, -871138, -768682, -1032540, -1108770, -713670, -573366, -1376572, -2460448, -2475696, -1248818, -78214, -40306, -799276, -1389752, -1470765, -1343778, -1253024, -1190028, -1071352, -695833, 162021, 1218094, 1597573, 818573]
38166H18573j215926m92687L86028L44710l54379o94906l81731L9078K48045N10660
38156g92535R70490J303523J260853J012823P26044K53626m59743j017338r75281
38147B282462m31752Q1767K01629j425k72762m55407n15651m61447l16394j46578
38137c5558q4462k63114o32496q72303o39090O2442Q54502J317445J235615O32206
38127A575187j64137n62550k33077L61711M11148j47095n25628l31571k27356
38118A56632p86462j324027p73821O08944J448458J104841L41399J9189J06672
38109I01825K67483M57552M78763j31015j140848j430796n37176L98502J86736
38100e48974n88715m89129M99683R76385L33853l96504k11925M83451O90180J76102
$$ y = [818573, -397353, -890040, -504012, -159302, -513681, -1208587, -1590318, -1551240, -1303195, -792535, 177955, 1481478, 2742331, 3755154, 4481198, 4734824, 4275081, 3257743, 2282462, 1850710, 1932477, 2134106, 2132681, 1859919, 1404512, 888861, 427414, 111020, -35558, -120020, -383134, -1015630, -1887933, -2527023, -2464581, -1610079, -292634, 942981, 1575187, 1411050, 848500, 615423, 977134, 1388282, 1241187, 715559, 383988, 156632, -629830, -1953857, -2727678, -2118734, -670276, 434565, 775964, 795153, 901825, 1169308, 1626860, 2105623, 1974608, 833760, -597036, -1134212, -735710, -548974, -1137689, -1626818, -1127135, -150750, 183103, -213401, -425326, 58125, 748305, 924407]
38090I24407n17370q50936o30813l1833M19837L09016p4562j17490R3530j35670
38080f11884q38289j098959m14562N16617Q85681Q34058Q00420O20968Q0232l53090
38070D21192k61757j57455o28874j128489p29323K85862Q16599P07914P89000
38061A14669J146557Q00002n11059j536559j219476j54513M56319M49009M00506
38052e4545L78671L0815m57300m84880J6425N72657R82624J339811J335960M73831
38042D134069q80185j554777j061484k78681j74369n23492n32047j62256Q288
38033a024934r3695j4412K12951K2611n44308o39633K0475N14681J44865l20088
38023a721487J88088J243095J521958Q69910L78885M00472P38j141358j764779
$$ y = [924407, 407037, -443899, -1074712, -1106545, -686708, -377692, -452254, -569744, -476214, -611884, -1450173, -2549132, -2963694, -2447077, -1561396, -727338, 73082, 694050, 774282, 421192, 159435, 1980, -626894, -1755383, -2484706, -2198844, -1382245, -674331, 114669, 1261226, 2061228, 1550169, 13610, -1205866, -1360379, -904060, -455051, -54545, 324126, 354941, -102359, -587239, -570814, 1843, 984467, 2324278, 3660238, 4134069, 3253884, 1699107, 637623, 358942, 184573, -338919, -870966, -1033222, -1024934, -1118629, -1133041, -920090, -897479, -1441787, -2081420, -2060945, -1546264, -1401399, -1721487, -1533399, -290304, 1231654, 2101564, 2480449, 2880921, 2881659, 1740301, -24478]
38014b4478r01516M41262O90733k4609l61357L5156K87480M1324m9491K24141
38004C58645R4943p33983j285739p19043L26197O51655J73997k11122r1429L5056
37994a400823k32628n29695l27392K51295N79547L57140p932M4032M62996O80643
37984a22817M68297K69014M10488M55593r1446p59062n92526L80923J017614O07128
37974B043206j94638l72184J18482N22359L78796n3095k68429q7996J54851m9110
37964B192242o49212q04952P6669J225805J268578J37694q04355q09358o95340
37955A137771j138020j304841l26974R15078R67809J08248j48351M88410Q13328
37946A512458L12598j14664J9616o8810p42047r15345J68212J348704J074542
$$ y = [-24478, -925994, -484732, 206001, 181392, -179965, -144809, 142671, 183995, 134504, 358645, 453588, -280395, -1566134, -2285177, -1958980, -1307325, -1133328, -1344450, -1435879, -1400823, -1633451, -2163146, -2490538, -2239243, -1659696, -1302556, -1310488, -1266456, -803460, -122817, 345480, 614494, 1024982, 1480575, 1389129, 630067, 37541, 418464, 1436078, 2043206, 1848568, 1476384, 1594866, 2117225, 2496021, 2442926, 2174497, 2086501, 2241352, 2192242, 1543030, 738078, 814747, 2040552, 3309130, 3446824, 2642469, 1833111, 1137771, -249, -1305090, -1632064, -716986, 250823, 359071, 210720, 699130, 1512458, 1825056, 1710392, 1730008, 1661198, 919151, 3806, 172018, 1520722, 2595264]
37937B595264l02534j143938r08815m97662m46844k41635L80716P08568J49195
37928B92315q21139j306438r87343j32901P67406J083381M58168m42746l20062
37919a409359J032973K061083J293404o39769j758963j222456q4737L68548N5967
37910c03309l32213l54110k8933L71592M39256L4164k86375J18109Q10357O13077
37900A081615n58321j221195l70727R32328R84951k64250j420588j566935q21413
37891c224535N08939J950802K363976R93365r68487j445048l20985L95066l22794
37882f9701j027635l17292Q50989P89607k47783p00004k01807K41911J62525J02650
37872d16540L15967M27801M25341P05823J032512O44121l90452j020989o88130
$$ y = [2595264, 2292730, 1148792, 239977, -257685, -704529, -946164, -565448, 143120, 292315, -528824, -1835262, -2822605, -2955506, -2188100, -1104719, -646551, -1089297, -1409359, -376386, 1684697, 2978101, 2338332, 579369, -643087, -727824, -359276, -303309, -635522, -989632, -1018565, -646973, -207717, -173553, -459928, -341819, 468538, 1081615, 523294, -697901, -1068628, -136300, 848651, 584401, -836187, -2403122, -3224535, -2715596, -764794, 1599182, 2592547, 1624060, 179012, -141973, 253093, -69701, -1097336, -1414628, -563639, 225968, -21815, -721819, -923626, -681715, -519190, -416540, -100573, 327228, 752569, 1458392, 2490904, 3135025, 2744573, 1723584, 1035454]
37863A035454J2591L71195L40391N7585m50243q05939m72416K65937M31825j89105
37853E97275o73466m36997n4536n2931M9736O92261J193261P37875k28731o29960
37843A193787l14614j715k1116p6112l9955p5783q1722J65432M17243K76408j6941
37832A424912O7288L33854J07687n14831o58581j04227K63099j48295o85683n08095
37822d22872J27447L85032J60050N3180K72153L52315J206m08560l72509J29322
37812B76764P23218J058316R83536N44350j9816l92284m08591j21300L43818Q39652
37802C827663J107683Q89620K77919k28948k30966J18990L74871M10325M75765
37793G022922O64141P01547M30194J55938K07853L88745K42247k69158p61671
$$ y = [1035454, 1048045, 1419240, 1759631, 1817216, 1366973, 561034, 88618, 354555, 786380, 597275, -76191, -513188, -567724, -620655, -570919, 121342, 1314603, 2052478, 1823747, 1193787, 879173, 877458, 856342, 780230, 740275, 664492, 582770, 748202, 1165445, 1441853, 1424912, 1492200, 1826054, 1933741, 1418910, 760329, 656102, 919201, 770906, 85223, -422872, -295425, 89607, 249657, 302837, 574990, 927305, 928511, 519951, 147442, 276764, 999982, 2058298, 3041834, 3586184, 3566368, 3174084, 2765493, 2644193, 2988011, 3827663, 4935346, 5824966, 6102885, 5873937, 5642971, 5761961, 6136832, 6547157, 7022922, 7687063, 8388610, 8818804, 8974742, 9182595, 9571340, 9813587, 9544429, 8782758]
37784H782758j037492j238684j371962j179148o35527j03840K34527O05739R69159
37775E025530O79741n51488j757030j622680k50145Q06070M69128n93818j003648
37766A201660l83221M81796P91444M35374k52907q39497q99237l22223L57904
37757E71093L75715l22385q93357o14657J89770N79724K08007k90495j74499M54408
37747H3324Q16199M57819k00135m67753l33294m23163r54729j215121n30006N68825
37737b198034Q61136J13454n61605k98566L71669N26619K55753J81312J52713
37728e95549m03555j078160p66816M78361J200913O27060k13223j82739K78932
37719f54776J95673j78795L7050N99453M56693m13178r06147n75101j76994k16218
$$ y = [8782758, 7745266, 6506582, 5134620, 3955472, 3319945, 3216105, 3450632, 4056371, 5025530, 5705271, 5153783, 3396753, 1774073, 1523928, 2329998, 2799126, 2205308, 1201660, 818439, 1300235, 2091679, 2527053, 2274146, 1434649, 535412, 213189, 571093, 946808, 624423, -268934, -883591, -693821, -114097, 93910, -196585, -371084, 83324, 899523, 1357342, 1157207, 689454, 356160, -67003, -1021732, -2236853, -2766859, -2198034, -1336898, -1223444, -1785049, -2083615, -1711946, -1185327, -929574, -748262, -595549, -999104, -2077264, -2844080, -2365719, -1164806, -537746, -750969, -933708, -654776, -459103, -637898, -600848, -1395, 455298, 42120, -864027, -1439128, -1616122, -1832340]
37709a832340k24423Q3174J46964k98611n00312P1243O47290L11797m44420m22719
37699b462357M13186R05679M95308K061L30805J162851J417500O38028n04747
37690B398314r88422m67479M86090J037283Q52979J90374n49410j070311j130706
37681G58712p09386k45943k24278m29386j92199M51740N62555l21097j290444
37672a639726j219848k68418N51191Q60737J024832J034927M11775o62334j171900
37663a078764o57587N3025N6952l58590l41692J48639M26945K95453K74833N51774
37653f29012N45239j01523p85218q00093m29060l79367m24708L33908J739804
37644i30030K272988J115402m38150o60885J77424L58243o18508j407479j028666
$$ y = [-1832340, -2056763, -1973589, -1826625, -2125236, -2625548, -2554305, -1907015, -1595218, -2039638, -2462357, -2049171, -1143492, -648184, -646123, -315318, 847533, 2265033, 2903061, 2398314, 1409892, 942413, 1428503, 2465786, 3318765, 3509139, 2959729, 1889418, 758712, 49326, -196617, -420895, -850281, -1042480, -590740, -28185, -349282, -1639726, -2859574, -3127992, -2576801, -1716064, -691232, 343695, 755470, 93136, -1078764, -1736351, -1683326, -1626374, -1984964, -2326656, -2178017, -1751072, -1455619, -1180786, -629012, -83773, -185296, -970514, -1770607, -2199667, -2579034, -3003742, -2669834, -930030, 1342958, 2458360, 2020210, 1359325, 1536749, 1894992, 1276484, -130995, -1159661]
37635a159661k33092l5547j49022J59482O10231M59674r3362k27200P4760L0414
37625e63323n48210q53660k67792P58104J252471P41652l62241j096210p67511
37616a706720K65254Q66812M98403j00931p4582K71703J37478l05140j90644M86621
37606A48254P68994K92477j63503j3115K53141M2407l25415k49490J04199J05417
37596I63366l32728p00829p07518o09744o92488p74912m16060M40415J174201
37587a656297J074797K77958k55005K5030M62187J65453o08214q11186j57041
37578a482318N70073P77714P25633P07888M55470k09756q28145r20497o35960
37569h39898l33808M660M78239P90426N86869L2299l58757l16992J5756L29445
$$ y = [-1159661, -1392753, -1428300, -1577322, -1417840, -807609, -347935, -441297, -668497, -593737, -563323, -1111533, -1965193, -2232985, -1474881, -222410, 519242, 157001, -939209, -1706720, -1441466, -574654, -76251, -177182, -251764, 19939, 157417, -147723, -338367, 148254, 917248, 1209725, 1046222, 1033107, 1286248, 1328655, 1003240, 753750, 857949, 963366, 630638, -70191, -777709, -1387453, -2079941, -2854853, -3270913, -2830498, -1656297, -581500, -303542, -558547, -533517, -71330, 94123, -514091, -1325277, -1482318, -912245, -134531, 591102, 1298990, 1754460, 1544704, 716559, -203938, -839898, -1173706, -1169046, -690807, 99619, 686488, 718787, 360030, 43038, 58794, 388239]
37559C88239L51571K609n00032q48576r60499q66579m42062K95656P66746L90432
37549a422495m00675m70086M77763J385903J216096J81530p70563j083284p55497
37540a641308J7630Q11236J025203N23064q9610k43638j25661k20618m91865m81782
37530i17349j1971N83905P93908L43457m80615q90719l97722M31122N73582m6974
37520a9376m82377k16213J60130N1566k39815k17627j184J38096L38279O79066
37510A90545Q31336O86775N98436N27447j04176j114187j257187j34266P44686
37501I69409M2296j291521j489175o97150m52853r58306q60306K87780J259656
37492c190170J217860Q65864R38107R92485N14039M7041K77705P96107O94445
$$ y = [388239, 739810, 742419, 242387, -606189, -1566688, -2433267, -2875329, -2579673, -1812927, -1422495, -1823170, -2293256, -1815493, -429590, 786506, 968036, 197473, -885811, -1641308, -1623678, -812442, 212761, 735825, 646215, 402577, 276916, 56298, -435567, -917349, -929320, -345415, 448493, 791950, 311335, -579384, -977106, -545984, 27598, -19376, -501753, -717966, -557836, -506270, -746085, -963712, -964896, -826800, -488521, 190545, 1021881, 1708656, 2307092, 2834539, 2730363, 1616176, 358989, 224723, 969409, 1011705, -279816, -1768991, -2466141, -2918994, -3877300, -4737606, -4449826, -3190170, -1972310, -1106446, -168339, 824146, 1338185, 1385226, 1662931, 2459038, 3153483]
37483C153483p6727p13309o72511k26713J6755j51033l06540O3388P26211P78316
37473B591320j09133j016265r78631l82699k79740p00233p47594j65892L87652
37464a401215O19885R22914J273185J034625J78779m28574l51659j58706l02628
37455A386606m79237m87959o28282p96245l69777M48485M50917o32205j288354
37446b396051l79318J012668J200770M05354J14534N59947N32681m04562j122680
37437d76657p04766J84759L05144n03080j214974q63959M05308J415799J117586
37428c34840j96321j084378o27454M59407Q11516J37220o34262o69470m2774O52306
37418a529050Q92080M52412m05020r51006o45875J97906P72411P34962M29743
$$ y = [3153483, 3076756, 2363447, 1690936, 1464223, 1480978, 1329945, 1023405, 1086793, 1813004, 2591320, 2482187, 1465922, 487291, 104592, -175148, -875381, -1622975, -1788867, -1401215, -781330, 141584, 1414769, 2449394, 2628173, 2199599, 1847940, 1689234, 1386606, 907369, 419410, -208872, -1005117, -1374894, -926409, -475492, -1107697, -2396051, -2775369, -1762701, -561931, -156577, -42043, 517904, 1050585, 646023, -476657, -1181423, -996664, -691520, -1194600, -2409574, -3273533, -2868225, -1452426, -334840, -531161, -1615539, -2242993, -1783586, -972070, -834850, -1469112, -2138582, -2181356, -1529050, -636970, -184558, -589578, -1540584, -2186459, -1988553, -1216142, -481180, -51437]
$$ [...]
##END NTUPLES=NMR SPECTRUM
##END=
