##TITLE=31Pdec_LR-798-RM2-C1
 CDCl3, 24 sc
 12.3.2025
##JCAMPDX= 6.0         $$ Bruker NMR JCAMP-DX V2.0
##DATA TYPE= NMR SPECTRUM
##DATA CLASS= NTUPLES
##ORIGIN= UXNMR, Bruker Analytische Messtechnik GmbH
##OWNER= root
$$ XWIN-NMR		Version 3.5
$$ Wed Mar 12 14:09:29 2025 Russian Standard Time (UT+4h)  she@DPX200
##.OBSERVE FREQUENCY= 81.013821
##.OBSERVE NUCLEUS= ^31P
##.ACQUISITION MODE= SIMULTANEOUS
##.ACQUISITION SCHEME= undefined
##.AVERAGES= 24
##.DIGITISER RES= 17
##SPECTROMETER/DATA SYSTEM= spect
##.PULSE SEQUENCE= zgpg30
##.SOLVENT NAME= DMSO
##.SHIFT REFERENCE= (INTERNAL, DMSO, 0, 198.062)
##AUDIT TRAIL= $$ (NUMBER, WHEN, WHO, WHERE, WHAT)
$$ ##TITLE= Audit trail, XWIN-NMR		Version 3.5
$$ ##JCAMPDX= 5.01
$$ ##ORIGIN= Bruker BioSpin GmbH
$$ ##OWNER= she
$$ F:/spectra/data/she/nmr/P31/2/pdata/1/auditp.txt
$$ ##AUDIT TRAIL=  $$ (NUMBER, WHEN, WHO, WHERE, WHAT)
(   1,<2025-03-12 14:08:21.64 +0400>,<she>,<DPX200>,
      <created by zg, POWCHK disabled, PULCHK disabled
       configuration hash MD5:
       00 E9 B6 7A A2 85 ED C7 34 08 36 98 17 FE 4E 26
       data hash MD5: 32K
       80 A6 C2 CC AF E4 5B B5 5F B5 BC 17 EA A1 76 DB>)
(   2,<2025-03-12 14:08:30.46 +0400>,<she>,<DPX200>,
      <Start of raw data processing
       efp BC_mod = 2 LB = 1.5 FT_mod = 6 PKNL = 1 PHC0 = 1788.154 PHC1 = -10.1056 SI = 64K 
       data hash MD5: 64K
       00 AD BE 11 66 C8 49 5E 69 AC D8 B0 C5 0C C8 5B>)
(   3,<2025-03-12 14:08:48.50 +0400>,<she>,<DPX200>,
      <pk PHC0 = 20.74493 PHC1 = 0 
       data hash MD5: 64K
       ED 7D D1 44 5F 48 47 2A 55 E3 F9 B4 CF 0E D7 C9>)
(   4,<2025-03-12 14:08:52.64 +0400>,<she>,<DPX200>,
      <abs ABSG = 5 
       data hash MD5: 64K
       FC AD CB 2C 29 FF 7D 66 5B CC CE 40 E9 42 9E 9B>)
$$ ##END=
$$ 
$$ hash MD5
$$ C9 AA EE 34 69 A0 AC 47 C2 81 C8 E8 46 8F 83 A9
##$RELAX= 
##$RELAX= 
##$RELAX= 
##$RELAX= 
##$RELAX= 
##$RELAX= 
##$RELAX= 
##$RELAX= 
$$ Bruker specific parameters
$$ --------------------------
##$DU= <F:/spectra>
##$EXPNO= 2
##$NAME= <P31>
##$PROCNO= 1
##$TYPE= <nmr>
##$USER= <she>
##$AMP= (0..31)
100 100 100 100 100 100 100 100 100 100 100 100 100 100 100 100 100 100 
100 100 100 100 100 100 100 100 100 100 100 100 100 100 
##$AQSEQ= 0
##$AQ_mod= 1
##$AUNM= <au_zg>
##$AUTOPOS= <>
##$BF1= 81.014009
##$BF2= 200.13
##$BF3= 200.13
##$BF4= 200.13
##$BF5= 200.13
##$BF6= 200.13
##$BF7= 200.13
##$BF8= 200.13
##$BYTORDA= 1
##$CFDGTYP= 0
##$CFRGTYP= 5
##$CHEMSTR= <none>
##$CNST= (0..31)
1 1 145 1 1 1 1 1 1 1 1 1 1 1 1 1 1 1 1 1 1 1 1 1 1 1 1 1 1 1 1 1 
##$CPDPRG= <waltz16>
##$CPDPRG1= <>
##$CPDPRG2= <waltz16>
##$CPDPRG3= <>
##$CPDPRG4= <mlev>
##$CPDPRG5= <mlev>
##$CPDPRG6= <mlev>
##$CPDPRG7= <mlev>
##$CPDPRG8= <mlev>
##$CPDPRGB= <>
##$CPDPRGT= <>
##$D= (0..31)
0 1 0 0 0 0 0 0 0 0.06 0 0.03 2e-05 3e-06 0 0 0.0002 0 0 0 0 0 0 0 0 0 
0 0 0 0 0 0 
##$DATE= 1741774101
##$DBL= (0..7)
120 120 120 11 120 120 24 19 
##$DBP= (0..7)
150 150 150 150 150 150 150 150 
##$DBP07= 0
##$DBPNAM0= <>
##$DBPNAM1= <>
$$ [...]
##$SUBNAM3= <"">
##$SUBNAM4= <"">
##$SUBNAM5= <"">
##$SUBNAM6= <"">
##$SUBNAM7= <"">
##$SUBNAM8= <"">
##$SUBNAM9= <"">
##$SW= 400.765351723535
##$SWIBOX= (0..15)
0 1 3 0 0 0 0 0 0 0 0 0 0 0 0 0 
##$SW_h= 32467.5324675325
##$TD= 32768
##$TD0= 1
##$TE= 0
##$TE2= 300
##$TE3= 300
##$TEG= 300
##$TL= (0..7)
0 120 53 12 22 120 120 120 
##$TP= (0..7)
150 150 150 150 150 150 150 150 
##$TP07= 0
##$TPNAME0= <>
##$TPNAME1= <>
##$TPNAME2= <>
##$TPNAME3= <>
##$TPNAME4= <>
##$TPNAME5= <>
##$TPNAME6= <>
##$TPNAME7= <>
##$TPOAL= (0..7)
0.5 0.5 0.5 0.5 0.5 0.5 0.5 0.5 
##$TPOFFS= (0..7)
0 0 0 0 0 0 0 0 
##$TUNHIN= 0
##$TUNHOUT= 0
##$TUNXOUT= 0
##$USERA1= <user>
##$USERA2= <user>
##$USERA3= <user>
##$USERA4= <user>
##$USERA5= <user>
##$V9= 5
##$VALIST= <valist>
##$VCLIST= <CCCCCCCCCCCCCCC>
##$VD= 0
##$VDLIST= <DDDDDDDDDDDDDDD>
##$VPLIST= <PPPPPPPPPPPPPPP>
##$VTLIST= <TTTTTTTTTTTTTTT>
##$WBST= 1024
##$WBSW= 4
##$XGAIN= (0..3)
0 0 0 0 
##$XL= 0
##$YL= 0
##$YMAX_a= 3796
##$YMIN_a= -10405
##$ZGOPTNS= <>
##$ZL1= 120
##$ZL2= 120
##$ZL3= 120
##$ZL4= 120
##$ABSF1= 198.0616
##$ABSF2= -202.7028
##$ABSG= 5
##$ABSL= 3
##$ALPHA= 0
##$AQORDER= 0
##$ASSFAC= 0
##$ASSFACI= 0
##$ASSFACX= 0
##$ASSWID= 0
##$AUNMP= <proc_1d>
##$AZFE= 0.1
##$AZFW= 0.5
##$BCFW= 0
##$BC_mod= 2
##$BYTORDP= 0
##$COROFFS= 0
##$CY= -3
##$DATMOD= 1
##$DC= 0
##$DFILT= <>
##$DTYPP= 0
##$F1P= 0
##$F2P= 0
##$FCOR= 1
##$FTSIZE= 65536
##$FT_mod= 6
##$GAMMA= 0
##$GB= 0
##$INTBC= 1
##$INTSCL= 9.790993e-09
##$ISEN= 30
##$LB= 1.5
##$LEV0= 0
##$LPBIN= 0
##$MAXI= 10000
##$MC2= 0
##$MEAN= 0
##$ME_mod= 0
##$MI= 50
##$NCOEF= 0
##$NC_proc= -7
##$NLEV= 6
##$NOISF1= 182.463
##$NOISF2= 159.3651
##$NSP= 0
##$NTH_PI= 0
##$NZP= 0
##$OFFSET= 198.0616
##$PC= 4
##$PHC0= 1808.899
##$PHC1= -10.1056
##$PH_mod= 1
##$PKNL= yes
##$PPARMOD= 0
##$PSCAL= 0
##$PSIGN= 0
##$REVERSE= no
##$SF= 81.0140089999434
##$SI= 65536
##$SIGF1= 159.3651
##$SIGF2= -187.1042
##$SINO= 113.3802
##$SIOLD= 16384
##$SREGLST= <1H.CDCl3>
##$SSB= 0
##$STSI= 65536
##$STSR= 0
##$SW_p= 32467.5324675325
##$SYMM= 0
##$S_DEV= 0
##$TDeff= 32768
##$TDoff= 0
##$TI= <>
##$TILT= no
##$TM1= 0
##$TM2= 0
##$TOPLEV= 0
##$USERP1= <user>
##$USERP2= <user>
##$USERP3= <user>
##$USERP4= <user>
##$USERP5= <user>
##$WDW= 1
##$XDIM= 65536
##$YMAX_p= 369465539
##$YMIN_p= -10498760
$$ End of Bruker specific parameters
$$ ---------------------------------
##NTUPLES= NMR SPECTRUM
##VAR_NAME=  FREQUENCY,     SPECTRUM/REAL,   SPECTRUM/IMAG
##SYMBOL=    X,             R,               I
##VAR_TYPE=  INDEPENDENT,   DEPENDENT,       DEPENDENT
##VAR_FORM=  AFFN,          ASDF,            ASDF
##VAR_DIM=   65536,         65536,           65536
##UNITS=     HZ,            ARBITRARY UNITS, ARBITRARY UNITS
##FACTOR=    0.49542278885378, 1,            1
##FIRST=     16045.7642231865, 0,            0
##LAST=      -16421.768244346, 0,            0
##MIN=       -16421.768244346, -10498760,    0
##MAX=       16045.7642231865, 369465539,    0
$$ Real data points
##PAGE= N=1
##DATA TABLE= (X++(R..R)), XYDATA
$$ [...]
43022A378110j40721j100185q49371N29968J472411J115408K52149j57103k59757
43013B240909n64980r03054q25376l72177J30956M85938M58072j12764p00495
43004a62971m61667L52733L97141p10626j502547q23435K84570K61295m05570
42995b771077j22486R12712R15764l74810r86025K45049J821731J852163O40388
42986B133409k75637m78442n76600n58572J54410J271262J630213P29246o97474
42977C331815j664236j715868q41072N13358J351020R23325k52478r01045n96880
42968A47939j27743j63374l91948k68940J11341L21783K58807J02997l235K6208
42958A3835J88064K35751m5228l43623j24790M79723P04218K58450k42959k32032
$$ plain form
43022 1378110 1237389 137204 -712167 -182199 1290212 2405620 2657769 2500666 2240909
43013 2240909 1675929 772875 -52501 -424678 -293722 192216 650288 537524 -162971
43004 -162971 -624638 -271905 125236 -585390 -2087937 -2911372 -2626802 -2365507 -2771077
42995 -2771077 -2893563 -1980851 -1065087 -1439897 -2425922 -2180873 -359142 1493021 2133409
42986 2133409 1857772 1379330 802730 244158 398568 1669830 3300043 4029289 3331815
42977 3331815 1667579 -48289 -889361 -376003 975017 1898342 1645864 744819 147939
42968 147939 20196 -143178 -535126 -804066 -692725 -370942 -112135 -9138 -12373 13835
42958 13835 201899 437650 392422 48799 -75991 403732 1107950 1366400 1123441 891409
42948H91409Q1855K72037L36102L64649J91659j67117l30677k71289n45018j246420
42938d22810j466829n59350P04814J143903P93000N36238N56128K79020l56707
42929A207407p28061o24228m91363m97818k89863J95607N35565N63162N11347
42920C81755L80568K9425j15711N01686J305734R54919o62764j956960j708696
42911h90044n56888K33708M49389N48253N44127K80640J21715L48374M09591k31538
42901A257327r80702q85128j56963J75830p0989p9064M44371O95705P2780q11577
42891c38410r13204n5836R72712J350839R54119K75089k09325n08339q45929j052130
42881c70414p06603J6423L05941j07326l97797J32562Q95760Q76219J53161l66001
$$ plain form
42948 891409 973264 1245301 1581403 1946052 2137711 1970594 1639917 1368628 823610 -422810
42938 -422810 -1889639 -2448989 -1744175 -600272 192728 728966 1285094 1564114 1207407
42929 1207407 479346 -144882 -636245 -1134063 -1423926 -1228319 -692754 -129592 381755
42920 381755 762323 791748 676037 1177723 2483457 3438376 2775612 818652 -890044
42911 -890044 -1446932 -1213224 -763835 -215582 328545 609185 730900 1079274 1488865 1257327
42901 1257327 276625 -608503 -765466 -589636 -660625 -739689 -295318 400387 473167 -338410
42891 -338410 -1251614 -1307450 -334738 1016101 1970220 2245309 2035984 1527645 681716 -370414
42881 -370414 -1077017 -1060594 -754653 -861979 -1259776 -1127214 -231454 644765 797926 431925
42871D31925l90995m04805n30195k92012M02658R45038Q59383K57822n81764j367465
42861f70410j535853o80332O64346J446172J378891J019364N97342k02884j152382
42852H64254j325902m86558L92439N39701L88608N49431O98311L08563k59205
42843A669642l34808j06150k94742r43588j321934r18252M0930R17741J097810
42834a93351L82476o36917r39474k42424N77331O74866L57191L96746O86139M08225
42824A470808o22973j559699j519700m99123P20980J249088P89575k3945k12039
42815b07028L74318Q31017M84844j20488q3920M77993O61305J07658o34589r56513
42805I34597p55057k44684K35228L15365k1913k94532j49553J41530K22323K35661
$$ plain form
42871 431925 40930 -363875 -894070 -1186082 -783424 161614 1020997 1278819 697055 -670410
42861 -670410 -2206263 -2886595 -2222249 -776077 602814 1622178 2219520 2016636 864254
42852 864254 -461648 -948206 -555767 -16066 372542 921973 1620284 1928847 1669642
42843 1669642 1334834 1228684 933942 -9646 -1331580 -2249832 -2208902 -1291161 -193351
42834 -193351 189125 -447792 -1387266 -1629690 -1052359 -377493 -20302 376444 1062583 1470808
42824 1470808 847835 -711864 -2231564 -2730687 -2009707 -760619 28956 5011 -207028
42815 -207028 167290 998307 1483151 1362663 1278743 1756736 2418041 2525699 1891110 934597
42805 934597 179540 -65144 170084 485449 463536 169004 19451 160981 383304 618965
42795F18965L37395J98057k75387l39340M66492J146438M65667r82644j359988
42786B75655k10720R37485Q41702L6758l96649l08863r5156J33213L22979K50007
42776A786411N4642K07304N27890J93088q02279j271089n80040L15382M03747
42767H35056J09980K31478L98668j11299q09374o94406l4553J8990o20370q35381
42757a511211j43660O15193O56917K36434m0501j212K71660O45179P54037K98466
42747A781302l53118n35417k77507j47553j48207K27162P37080M01090p90820
42738H94012j378684m51785Q33147Q36707j69077m91294L83626J054259L26754
42729A837665j077537j618117j000204k55361o5629J8012N00020R45391O99934
$$ plain form
42795 618965 956360 1154417 879030 539690 1006182 2152620 2618287 1635643 275655
42786 275655 64935 1002420 1844122 1880880 1484231 1175368 1080212 1213425 1536404 1786411
42776 1786411 1841053 2048357 2576247 2769335 1967056 695967 115927 431309 835056
42767 835056 945036 1176514 1575182 1463883 654509 -39897 -74450 -55460 -675830 -1511211
42757 -1511211 -1654871 -1039678 -382761 -146327 -186828 -188040 83620 728799 1482836 1781302
42747 1781302 1428184 892767 615260 467707 319500 546662 1283742 1684832 894012
42738 894012 -484672 -936457 -103310 733397 564320 73026 456652 1510911 1837665
42729 1837665 760128 -857989 -1858193 -2113554 -2179183 -2161171 -1661151 -715760 -15826
42720a5826Q8289K1103N58503Q09764M11190J23297N00077R04991O11100O6369
42710D078857M6251J78050m41530j507489j751900r00107o0292K6523j37693j9410
42700d88740J00379K2687K23156Q63059J226312Q95088N32268O60206O01983l33698
42690D302700j417100j437454n29119J24286L3187k83894m31536m40098j51469
42681b30497N13603P75399k58704j949512k465467j131306O46417J293791R32834
42672a873442O69285Q24416P56510O8931p88896j111727o95385K7508M31183L01847
42662a389770L174o4129J4375q651N3274N09992J008952Q07062o5189o58568m03772
42651a93250J30526J82164j17348j51043J32941K11221j56172n86896o03961j87455
$$ plain form
42720 -15826 72463 93566 652069 1461833 1873023 1996320 2496397 3401388 4012488 4078857
42710 4078857 4125108 4303158 3861628 2354139 602239 -297868 -358160 -331637 -469330 -488740
42700 -488740 -388361 -365674 -142518 720541 1946853 2841941 3374209 4034415 4636398 4302700
42690 4302700 2885600 1448146 919027 1043313 1076500 792606 361070 -79028 -230497
42681 -230497 283106 1058505 799801 -1149711 -3615178 -4746484 -4100067 -2806276 -1873442
42672 -1873442 -1204157 -379741 376769 445700 -343196 -1454923 -2150308 -2122800 -1691617 -1389770
42662 -1389770 -1386596 -1450725 -1436350 -1445001 -1391727 -881735 127217 934279 869090 210522 -193250
42651 -193250 -62724 119440 2092 -148951 -16010 195211 39039 -547857 -1151818 -1339273
42641a339273K52347L40973J67325J70820M94051O87074M02434J01136M18965
42632A695852R60297N90504q81951k151989j974952o34386N92708Q79795L27695
42623e96427m48609p23585j36783P67893R43618J96374m25342q5257O38735O80150
42613H10767K8716m81461n07258m27310m65936m23608k03287O8838L61134O17754
42603f21651N20706n0017n64359m65949J2287K71160K43633J88405J5140l37381
42593g88026k93192N32261J243253O45456q41600j577553j018625k60985r8695
42584b457706k7471L46646L77130l19868q47106l11553P59642J231797Q80660
42575c67829K63020k50888n01260k39159L86701O35270K04849j98009n6253J1908
$$ plain form
42641 -1339273 -1086926 -745953 -578628 -407808 86243 773317 1175751 1276887 1695852
42632 1695852 2656149 3246653 2364702 212713 -1762239 -2396625 -1803917 -924122 -596427
42623 -596427 -1045036 -1768621 -1905404 -1137511 -193893 2481 -422861 -508118 130617 810767
42613 810767 839483 358022 -149236 -576546 -1042482 -1466090 -1669377 -1600539 -1239405 -621651
42603 -621651 -100945 -150962 -715321 -1181270 -1168983 -897823 -654190 -465785 -450645 -788026
42593 -788026 -1081218 -548957 694296 1339752 498152 -1079401 -2098026 -2359011 -2457706
42584 -2457706 -2485177 -2138531 -1761401 -2081269 -2928375 -3239928 -2480286 -1248489 -367829
42575 -367829 -104809 -355697 -856957 -1096116 -709415 -74145 130704 -67305 -123558 -111650
42565a11650n54087r81047l25639P77462R80731L79281K23321O79054N73526m43168
42555A197784j127107n98234L34423N94255M17339N37482O83864M8452j181746
42546I06512j837350j278520j23060O44065P48045O19242O39974O66354K94780
42537A280042n22032j292615j488399j059831l36837L35976O67747M76840L8198
42528a900911J2983N51996Q66971L39927l65054k08883N16301N64568k17975n55691
42518c95768K09900J028044P70925j47603o73664p24858q33759q32520r8502J126030
42508e71775J729175J111826j48683j066411j144116n46213J32657L00465p3389
42499b76464m43483m55813l65912l81541j59582M67975Q47894M12647k17879l6161
$$ plain form
42565 -111650 -665737 -1646784 -1972423 -1194961 -214230 165051 388372 1067426 1640952 1197784
42555 1197784 70677 -527557 -193134 401121 818460 1355942 2039806 2088258 906512
42546 906512 -930838 -2209358 -2332418 -1688353 -940308 -321066 318908 985262 1280042
42537 1280042 758010 -534605 -2023004 -3082835 -3419672 -3083696 -2415949 -1939109 -1900911
42528 -1900911 -1887928 -1335932 -468961 -129034 -494088 -702971 -186670 377898 159923 -395768
42518 -395768 -185868 842176 1613101 1465498 791834 66976 -766783 -1599303 -1697805 -571775
42508 -571775 1157400 2269226 2120543 1054132 -89984 -636197 -503540 -203075 -276464
42499 -276464 -719947 -1175760 -1541672 -1923213 -2082795 -1614820 -766926 -354279 -572158 -608319
42489f08319P21516Q45623J9299o99827m72893K48439O16817N10074L04290K05474
42479A690493K54514M52048N20536P2599o89749j041042q06808o87872j081233
42470a316514j293975n70219O76675J390361J217245O13199m0799o52761r73005
42461i49793p35803k10729O7441J11066L81582Q75374R96939M90724j20334k65786
42451F40681L667L03439M05589K13988k82026p51057o73503r5367K06927k53122
42441b80784q73808p27187J56212Q74511Q86011N14760K31483P8747l8107q3805
42431G38033j66033n20266r04248n99004M83924J248963P04781n71887j146422
42422g32159p18648l79831p84201j171600p03964J90135N93047N10834N84074
$$ plain form
42489 -608319 113197 958820 978119 278292 -194601 53838 670655 1180729 1485019 1690493
42479 1690493 1945007 2397055 2917591 2990190 2300441 1259399 452591 -235281 -1316514
42470 -1316514 -2610489 -3180708 -2504033 -1113672 103573 716772 675973 23212 -949793
42461 -949793 -1685596 -1896325 -1828884 -1717818 -1336236 -460862 536077 1026801 906467 640681
42451 640681 644348 947787 1353376 1567364 1285338 534281 -139222 -234589 -27662 -280784
42441 -280784 -1154592 -1881779 -1725567 -851056 34955 549715 781198 859945 821838 738033
42431 738033 572000 51734 -852514 -1451518 -967594 281369 986150 414263 -732159
42422 -732159 -1450807 -1830638 -2614839 -3786439 -4490403 -4300268 -3707221 -3196387 -2612313
42413b612313Q60037Q50864N69267M99736O01234L36950k05306k26087M47487
42404A121869Q67059L08985o59400j070817q84227p18728p28618n23021K121M50630
42394a834147N30534L71303K21234J89201K85527M55638N91223O37100N62119
42385B009732K02560n10352j085713q01901J97409P51860J51908p98171q68958
42376g51626r1319M75588L40095J1451m6013L1032O4594J42591K24647J27367
42366E28407p85J49281L81481K51613j574L05766J011273J091667K68379m39450
42356C546058l04461J4566k77718p52672o51970l35146o19281j205077j077735
42347a663436k48875K13188n8110j79796M46362J120411R18274J5035o62017o19634
$$ plain form
42413 -2612313 -1752276 -901412 -332145 167591 768825 1105775 900469 674382 1121869
42404 1121869 1988928 2297913 1638513 567696 -316531 -1035259 -1763877 -2286898 -2284777 -1834147
42394 -1834147 -1303613 -932310 -711076 -521875 -236348 219290 810513 1447613 2009732
42385 2009732 2212292 1701940 616227 -185674 11735 763595 915503 117332 -751626
42376 -751626 -842945 -367357 -27262 -15811 -61824 -30792 33802 176393 401040 528407
42366 528407 527622 676903 1058384 1309997 1308423 1614189 2625462 3717129 3985508 3546058
42356 3546058 3241597 3256163 2978445 2225773 1573803 1238657 619376 -585701 -1663436
42347 -1663436 -1912311 -1699123 -1757233 -1937029 -1490667 -370256 548018 563053 -98964 -718598
42337g18598j47439J95990R8520k59923l17707K03648P28158M41359m56897q33934
42327a066823k30483M15170K06303k93249M0522J043489J393372N42653m84667
42318A566287n35342J89893N77667O5510q27827j228473q05685l3205K64089k48786
42308a015872r51159q98556j9073P13834N48950n5313j80523K03432L46092M89
42298a307699k43364l2868J67386m4992k75814o6490K16332l3854n68397n84946
42288b774706O7147P74832J152636J321864J220059N56557l65441p11099l58311
42279H83538k03752p38891j190936p66031N4912L55973K66413N21637R66607P06367
42269H55837l30219j107796r24094j80145M95817R73629J150062O62215l63609
$$ plain form
42337 -718598 -866037 -670047 -571527 -831450 -1149157 -945509 -217351 224008 -232889 -1066823
42327 -1066823 -1297306 -882136 -675833 -969082 -928560 114929 1508301 2050954 1566287
42318 1566287 1030945 1220838 1798505 1864015 1036188 -192285 -997970 -1031175 -767086 -1015872
42308 -1015872 -1967031 -2865587 -2884660 -2170826 -1621876 -1677189 -1857712 -1654280 -1308188 -1307699
42298 -1307699 -1551063 -1583931 -1416545 -1461537 -1737351 -1803841 -1587509 -1621363 -2189760 -2774706
42288 -2774706 -2707559 -1932727 -780091 541773 1761832 2318389 1952948 1241849 883538
42279 883538 679786 -59105 -1250041 -2016072 -1961160 -1605187 -1338774 -817137 149470 855837
42269 855837 525618 -582178 -1506272 -1686417 -1190600 -216971 933091 1595306 1231697
42260A231697r68017m44324O25065J005178K58496q82358j411237r59379L5999
42251a508880P59929O92799M1883n53945p34645o04459k75055L11884R88641J276563
42241C94715R72219M40883M8833l32305r18249j417769j269442l88515N96884
42232a872746Q79362K38328o16549o05593N03164J590832J398090J28125q20790
42223H22223o94672j13958J76828K90476M70293L46833l22916r19019q15679m05910
42213a165501m03498o06205k91167M96842R98786Q91150N22614J54814k10914
42204C86921l77422j28827K30491K58032J33418K63405L73483p0554p40864q36489
42194e08406m90799n61689r63948o00793O74854J436270P52742l23105l10380
$$ plain form
42260 1231697 263680 -180644 444421 1449599 1708095 825737 -585500 -1544879 -1508880
42251 -1508880 -748951 -56152 -14269 -568214 -1302859 -1907318 -2182373 -1870489 -881848 394715
42241 394715 1366934 1807817 1856650 1524345 606096 -811673 -2081115 -2469630 -1872746
42232 -1872746 -993384 -755056 -1371605 -1977198 -1474034 116798 1514888 1643013 822223
42223 822223 127551 13593 190421 480897 951190 1298023 975107 56088 -759591 -1165501
42213 -1165501 -1568999 -2175204 -2466371 -1969529 -970743 -79593 443021 597835 386921
42204 386921 9499 -119328 111163 369195 502613 766018 1139501 1068947 328083 -508406
42194 -508406 -999205 -1560894 -2524842 -3125635 -2450781 -1014511 -261769 -584874 -895254
42185h95254N96223J076465O81964J39523N774Q0728Q1438L5477n8140l21043
42175A423155o59655p79481n73760k06228J17857K32657N2775k29351k39882M6316
42165h15597K01970L5738m0638K94118O47932M77055q5449m74875m66217k11882
42155d37845J71243N35153N51263J91731K5890M03779O86421P4505j027691j379233
42145b04784o16009K88756M50940J57816J67325N49488P12455K75480m65502q66271
42135D49694o01942m2870J53756o2277J660O78226J162966N50710o43991r58108
42125F87824q836R15797O25983m44570j021279o80828j12004o390k73817l20652
42115f38772J89013Q43700P62052l95806j748782j985570q91205M45161J057841
$$ plain form
42185 -895254 -299031 777434 1459398 1598921 1604695 1685423 1766861 1802338 1744198 1423155
42175 1423155 763500 -15981 -589741 -795969 -678112 -445455 -392680 -622031 -861913 -815597
42165 -815597 -613627 -577889 -618527 -324409 323523 800578 715129 240254 -225963 -437845
42155 -437845 -266602 268551 819814 1011545 1037435 1441214 2127635 2202140 1174449 -204784
42145 -204784 -820793 -532037 -81097 76719 244044 793532 1505987 1781467 1315965 449694
42135 449694 -152248 -195118 -41362 -103639 -101979 576247 1739213 2289923 1645932 687824
42125 687824 678988 1594785 2220768 1776198 754919 74091 -37913 -44303 -318120 -638772
42115 -638772 -449759 393941 1155993 760187 -988595 -2974165 -3865370 -3420209 -2362368
42106b362368J080485J018660P92256J17158o69056q98867m84344M9543K98310
42097a058223K47869l5940m65243p38520n56810l1589M74657Q41181J148651J242301
42087A068334Q05013p9413q24152r29076m43037J96817N69667N22577K45232R0173
42077A222135J39648L8425n06792j168089j256408n33427M93966J086180Q89098
42068D04736J41046m97773m50934J55159N20825J28524n48325p12035l51412n7424
42058a267613P1438M57347R22388N75835p08505j619821j010611M62055J207429
42049i10058Q04008K33027J96072K95788O8305j69662R95L05281K73616O9265
42039A166637J81891N43356N39775j34955j058599j533688j208970l09862N17393
$$ plain form
42106 -2362368 -1281883 -263223 529033 646191 -22865 -921732 -1406076 -1356533 -1058223
42097 -1058223 -810354 -846294 -1311537 -2050057 -2606867 -2638456 -2163799 -1322618 -173967 1068334
42087 1068334 1873347 1793934 969782 40706 -402331 -205514 364153 886730 1131962 1222135
42077 1222135 1361783 1400208 893416 -274673 -1531081 -2064508 -1570542 -484362 404736
42068 404736 545782 48009 -402925 -247766 273059 401583 -146742 -858777 -1210189 -1267613
42058 -1267613 -1196175 -738828 183560 759395 50890 -1568931 -2579542 -2117487 -910058
42049 -910058 -106050 126977 323049 618837 687142 517480 518475 823756 1097372 1166637
42039 1166637 1348528 1891884 2431659 2296704 1238105 -295583 -1504553 -1814415 -1297022
42030a297022O73264J37122n41858r11813j043411j083203p57307J81605J226222
42021c416401J468079P27687j99892n60561m31897l14791l77987m01986j74495
42012c682244L26709R29746J263207J000344K95867k58406k88602j5675J50852
42003b78202Q4727j51896m91866o87470l37137N31316J203471J025892K12286
41994A111121m58839n40995j69811L03668M91779N7867q18127j246179n26215
41985a795731Q03650J427028Q05407k87376q65287p74364m42928j54890N5624
41976a228867J46078Q3536l9354j36878k51761m11976n00655l51027J27496Q63480
41966a699928J486339J429740N35144n24168q59681m21261M697j12933m59017
$$ plain form
42030 -1297022 -623758 -486636 -1028494 -1940307 -2983718 -4066921 -4824228 -4642623 -3416401
42021 -3416401 -1948322 -1220635 -1420527 -1981088 -2412985 -2727776 -3105763 -3507749 -3682244
42012 -3682244 -3355535 -2425789 -1162582 -162238 133629 -124777 -413379 -429054 -278202
42003 -278202 -193475 -345371 -837237 -1524707 -1861844 -1330528 -127057 898835 1111121
41994 1111121 652282 111287 -58524 245144 736923 794790 -23337 -1269516 -1795731
41985 -1795731 -992081 434947 1240354 952978 87691 -686673 -1129601 -1284491 -1228867
41976 -1228867 -1082789 -999253 -1038607 -1175485 -1427246 -1839222 -2339877 -2690904 -2563408 -1699928
41966 -1699928 -213589 1216151 1751295 1227127 367446 -53815 -49118 -162051 -621068
41957f21068n04889k24931P4375K26151K08778N132k55039k58143J37792O79714
41947e32128R87981Q69136L44654l32101o77618l96822J38065K60069p1690k35086
41937C54460N2056K98341P5160l02826l23620r600L06646M92882M98518J75754
41927A617771l39556n19315k15625j00731p33994j553996j498827m42193O58338
41918c128128R94636P05359M01837L83728M67593L13855j90330p84319j088445
41909a924214r80907n47026K18918J216218J819428J366343K16084m55620k21553
41900G07671O3014k86832p37572o04440k28614j84516j58849K91381O02007Q4939
41890d51811o30891m24508M46631P40282K48614p0637J06914R0657k94800l29712
$$ plain form
41957 -621068 -1125957 -1350888 -1276513 -1050362 -841584 -836452 -1091491 -1349634 -1211842 -532128
41947 -532128 455853 1324989 1669643 1337542 659924 263102 401167 661236 589546 354460
41937 354460 406516 704857 780017 477191 153571 143971 450617 943499 1442017 1617771
41927 1617771 1278215 758900 543275 442544 -291450 -1845446 -3344273 -3786466 -3128128
41918 -3128128 -2133492 -1428133 -1026296 -642568 -174975 138880 -51450 -835769 -1924214
41909 -1924214 -2905121 -3452147 -3233229 -2017011 -197583 1168760 1384844 929224 707671
41900 707671 770685 483853 -253719 -858159 -1086773 -1271289 -1430138 -1138757 -536750 -451811
41890 -451811 -1082702 -1507210 -1060579 -320297 -71683 -142320 -35406 55251 -239549 -569261
41880e69261J48315L52397P334j66729J31465K59827N889L3661L55550o9004j322078
41869h32634j698879j58680J745922J891067M81936o35307o98673l84447o6791
41860c56486M70195Q45834L52978n50688n99537K45333O02842j47105r18284p26759
41850g81677j55106j84544n86151m72193K13556P65881R29826J096243J338788
41841B164623J080051j2938j313488j819580j274890l55770K47104N46549Q36082
41832I7743R39004M67771k84080m70963O8724M39394o328o57611n78630R1970
41822A06994M49161J54922l41867o55816p12248l32996N40369J258504R87595
41813A454618p2538p88294n71303j6980J31888p6699k12771j71006p9439K9310
$$ plain form
41880 -569261 -420946 -68549 -61215 -227944 -96479 163348 169237 202898 558448 489444 -832634
41869 -832634 -2531513 -2690193 -944271 946796 1428732 793425 94752 -289695 -356486
41860 -356486 113709 959543 1312521 761833 162296 407629 1010471 863366 -54918 -781677
41850 -781677 -936783 -1121327 -1707478 -2179671 -1966115 -1200234 -270408 825835 2164623
41841 2164623 3244674 3231736 1918248 98668 -1176222 -1531992 -1284888 -738339 97743
41832 97743 1036747 1504518 1220438 749475 818199 1257593 1251265 593654 15024 106994
41822 106994 556155 711077 369210 -286606 -998854 -1331850 -791481 467023 1454618
41813 1454618 1382080 593786 22483 5503 137391 60692 -152079 -323085 -402524 -373214
41803c73214J15342N0883j31096k22651j78296j11211M8451M15091O81953M04198
41793F99450j88126l40836R5738L90097M0826n25793p08293n19343k24452J74864
41783a105868O36742Q34830O87934N73614N58534P5565j032996j830116j454762
41774b056523m34512R7558P1977K99572Q52010Q41385l4718q44472p72803k50954
41764b231480j34640l92890l22018K78959Q20994P38321J09129n48521p70310
41755b452456m18901K72757Q69643J080051R34163N65787o032o63753r43181m27946
41745a189868N57920J084141O89930j0320j48673K59862N19651M09535M04589
41736B576767O41102M74900m46227j334670j222452l44353K64741K91353L23895
$$ plain form
41803 -373214 -257872 -206989 -338085 -560736 -739032 -850243 -801792 -386701 295252 699450
41793 699450 511324 170488 266226 656323 697149 171356 -536937 -1056280 -1280732 -1105868
41783 -1105868 -469126 365704 1053638 1627252 2185786 2261351 1228355 -601761 -2056523
41774 -2056523 -2491035 -2393477 -2321500 -2021928 -1169918 -328533 -363251 -1207723 -1980526 -2231480
41764 -2231480 -2366120 -2759010 -3081028 -2802069 -1981075 -1242754 -1133625 -1682146 -2452456
41755 -2452456 -2871357 -2598600 -1728957 -648906 285257 851044 845012 181259 -761922 -1189868
41745 -1189868 -631948 452193 1142123 1131803 983130 1242992 1762643 2172178 2576767
41736 2576767 3217869 3692769 3246542 1911872 689420 345067 609808 901161 1225056
41727A225056N84175N34582p347l75986j85974o1153n24564r24201m15140N04608
41717C54056N64004l35168q80899k65203O71647P23442k3185n39104m00421j42587
41707b73418j70646j47459K58598O63864N50832J86080K69319P50178P45641j29087
41697B703902j030428r88020k28175K49443P0962k72574l78032l05365n0540M86810
41687B57983Q84661M29634p15706j387857r23408q0996P0768m27666p09634k78145
41677b880366O49793J528811J687199O89623q66153j466745l87804J160079J440377
41668A554814L71544o43038p79378n83369p03256r16532p31579j62027M45842
41659b146979P98839O78961J30685k52488J60690J074125J415652O78299m31556
$$ plain form
41727 1225056 1809231 2343813 2336466 1960480 1774506 1713353 1188789 264588 -150552 354056
41717 354056 918060 582892 -298007 -563210 108437 831879 808694 269590 -130831 -273418
41707 -273418 -444064 -591523 -332925 330939 881771 1067851 1337170 2087348 2832989 2703902
41697 2703902 1673474 685454 457279 706722 777684 505110 127078 -178287 -228827 257983
41687 257983 1142644 1572278 856572 -531285 -1454693 -1535689 -1464921 -1892587 -2602221 -2880366
41677 -2880366 -2230573 -701762 985437 1675060 808907 -657838 -1045642 114437 1554814
41668 1554814 1926358 1283320 503942 -79427 -782683 -1699215 -2430794 -2592821 -2146979
41659 -2146979 -1348140 -669179 -538494 -790982 -630292 443833 1859485 2537784 2106228
41650B106228r17387n76602M6401L34753L6672n63915p95064l13503L22017K86987
41640c3413l61383q28667q32682q52399j009088o91907K90006J106260J074812
41631b138461O65659O25144P52798L85540l48426o29066j09730P12708J181782
41622A097948R99071K29373o75981r99413m16774N17564R22321N22042k61111
41613A935040r10177j142812q80116l11225J53808L14342L82880N25613N20493
41604E87846J74437k72850m95962m70775k27798K79592P16398M32143m86579r37526
41594g01074k97707N08957L56939l43315m24038N8464M1811n80036p39423m9173
41584b168595N81697N44280M09849O79525Q51032M20784j76993l53734k66696
$$ plain form
41650 2106228 1188841 612239 658640 993393 1030065 466150 -328914 -642417 -320400 -33413
41640 -33413 -394796 -1223463 -2056145 -2908544 -3917632 -4609539 -4319533 -3213273 -2138461
41631 -2138461 -1472802 -847658 -94860 290680 -57746 -686812 -796542 -83834 1097948
41622 1097948 2097019 2326392 1650411 650998 234224 751788 1674109 2196151 1935040
41613 1935040 1024863 -117949 -998065 -1309290 -1155482 -841140 -458260 67353 587846
41604 587846 762283 489433 -6529 -477304 -705102 -425510 290888 723031 236452 -701074
41594 -701074 -998781 -489824 -132885 -476200 -900238 -841774 -799963 -1379999 -2119422 -2168595
41584 -2168595 -1586898 -1042618 -632769 46756 897788 1318572 1141579 787845 521149
41575E21149k82168l05261k47141l76208o09067l09593N30896Q46921R1217o44052
41565g83307j79588Q72899J060785L24985j41650L9816n058p31368j405655j312258
41555b260399o57594N9194O57863R45424O40077o817k71099J5940K11739m8046
41545g13718k62864J4254L94484L17335r7262m00114n02050m72771j29705N65010
41535a287401J069037Q62141K54129j6721J32091L8206o62096j383056j212306
41526b205976o762J306923J588541O76590l85208m88749L07467R96960R19252
41517B709038L34160k36518n96186o88193m84193k87563n06729q61861n29922
41508a147967N56087J335802J074985L99124J89449K45803l5341l71330j49942
$$ plain form
41575 521149 238981 -66280 -313421 -689629 -1298696 -1608289 -1077393 -230472 -139255 -783307
41565 -783307 -962895 -89996 970789 1295774 1154124 1193940 1188882 457514 -948141 -2260399
41555 -2260399 -2917993 -2858799 -2200936 -1255512 -615435 -622252 -893351 -877411 -665672 -713718
41545 -713718 -976582 -962328 -567844 -250509 -347771 -747885 -1249935 -1722706 -1852411 -1287401
41535 -1287401 -218364 643777 897906 881185 1013276 1051482 389386 -993670 -2205976
41526 -2205976 -2212738 -905815 682726 1359316 974108 485359 792826 1789786 2709038
41517 2709038 3043198 2806680 2210494 1522301 1038108 750545 243816 -618045 -1147967
41508 -1147967 -591880 743922 1818907 2218031 2407480 2653283 2617942 2246612 2096670
41499B096670K23903j48393j015387j192043m24670K59909K45155R0710K57614
41490C93468L04265q3706l64469j35017J01338q4635j69864L78371J043323J054837
41480B437911O00770K98050M2617n51074j032163o44281K32262L82762m43853
41471A323001j139057q59538q1124L11599J63336j40725l27949k61506J59074
41462h52889P08881Q68002M76723j5252k06033k21703k81706k56809n813K64228
41452D77629L42202L46500L68401J87837k45179m55846r5756L80756K96949j98748
41442A404745l13904K16039P62866P04624J66077l03805l79954j16161K03204
41433B343731K14507k05482o45315n36931J6127K02423m15883j175709j115820
$$ plain form
41499 2096670 2320573 2172180 1156793 -35250 -459920 -200011 45144 135854 393468
41490 393468 697733 614027 249558 114541 215879 131244 -38620 339751 1383074 2437911
41480 2437911 3038681 3336731 3379348 2828274 1796111 1151830 1384092 1766854 1323001
41471 1323001 183944 -675594 -756718 -445119 -281783 -422508 -750457 -1011963 -852889
41462 -852889 -144008 723994 1200717 1185465 979432 757729 476023 219214 213401 477629
41452 477629 819831 1166331 1534732 1722569 1477390 1021544 925788 1306544 1603493 1404745
41442 1404745 1090841 1306880 2069746 2774370 2940447 2636642 2256688 2140527 2343731
41433 2343731 2558238 2352756 1707441 1170510 1186637 1389060 973177 -202532 -1318352
41424a318352k44128N42705O97564N61957N62744M98354J6634o45905r53178q69437
41414a151042p85033p30008l28500L39747N46793O841m50702J4805Q76037Q52816
41404h08246j73068q26386j25738J134806J476280O09455m89763r82168q42991
41395a027819l16084M57540J146299J270263Q14279L06426P7185o7419k37409
41386B423261j27335L32385N74433K07659k31156l0843N06658M32927m07220j128587
41376B552182j086699o35357l75416l59698l95929m92003n36390j06488Q32473
41367f03325J491710J154054J74805n32206p01156p12727o51565k27054L97886
41358b09578N71536J48666k12370m1932K74518J69822k83564n94251m92807n0921
$$ plain form
41424 -1318352 -1562480 -1019775 -322211 239746 802490 1300844 1317478 671573 -281605 -1151042
41414 -1151042 -1936075 -2666083 -2994583 -2654836 -2108043 -2101202 -2551904 -2537099 -1661062 -808246
41404 -808246 -981314 -1807700 -1933438 -798632 677648 1287103 797340 -184828 -1027819
41395 -1027819 -1343903 -886363 259936 1530199 2344478 2650904 2728089 2660670 2423261
41386 2423261 2295926 2628311 3202744 3410403 3179247 3148404 3655062 4087989 3680769 2552182
41376 2552182 1465483 830126 454710 95012 -300917 -792920 -1329310 -1435798 -603325
41367 -603325 888385 2042439 2217244 1685038 983882 271155 -380410 -607464 -209578
41358 -209578 361958 510624 298254 256322 530840 700662 417098 -177153 -669960 -720881
41348g20881M72368O76976L23739k15411k85521R5420K18819j30149k47705K52938
41338D40593O08755R2214o63591n43891K90908O60221J96809k27653r044L27424
41328A172745J28174l76046n39974k05692K93585O11266N39115L8747n96493q77086
41318A88341n95630K2056O19111Q72684N22254k71207p40697l43349K98646Q1327
41308F53536r08073j326874m75332O55338P64837p8788p81924o60362J23658J088092
41298i45892J719942J565418O62208k98937o89257n89903l92081j52789J88924
41289A067633L50627M3663m72426o84196m79946j10740K28571L78748J24287m03996
41279D2225n76718m1005O60323P73480L23868j30361l92044o20563p15288m31493
$$ plain form
41348 -720881 -248513 428463 752202 536791 251270 346690 565509 435360 187655 440593
41338 440593 1049348 1141562 477971 -65920 224988 885209 1082018 854365 845321 1172745
41328 1172745 1300919 924873 384899 179207 472792 1084058 1623173 1661920 1065427 188341
41318 188341 -407289 -385233 233878 1106562 1628816 1357609 616912 273563 572209 653536
41308 653536 -254537 -1581411 -2056743 -1401405 -636568 -715356 -1497280 -2157642 -2033984 -945892
41298 -945892 774050 2339468 3001676 2702739 2013482 1423579 1031498 878709 1067633
41289 1067633 1418260 1461923 989497 305301 -174645 -285385 -56814 321934 446221 42225
41279 42225 -534493 -575498 84825 858305 1182173 1051812 659768 39205 -676083 -1107576
41269a107576J7059J27926j75586n24631o75045o17467l25857J14121L95787M84477
41259b286792P92165J299190J139538n7507j061812n23334Q86709J305599M72801
41250A966557J1475P17322J323657O56932n38554r59948o85974n71406o56438
41241A263623m52019j49020k76641n65133l32535K44386L61764l6093j93684J25504
41231i848K87711k8954k45200J30275O72184P10054L07225L3377P5215R3044j49974
41220A875109m54289n31199l82311j92366j8180K21419M93713N99111M39744J75714
41210B226465k815j14513k70357m86212p54792j075729j232203q75604j43863
41201b729623K22226j12033l79302K34660J195774J274929M37484r8598J90927
$$ plain form
41269 -1107576 -1090517 -962591 -1138177 -1662808 -2337853 -2955320 -3281177 -3167056 -2771269 -2286792
41259 -2286792 -1494627 -195437 944101 886594 -175218 -698552 188157 1493756 1966557
41250 1966557 1978032 2695354 4019011 4675943 4137389 3177441 2491467 1920061 1263623
41241 1263623 811604 662584 385943 -179190 -511725 -267339 94425 58332 -135352 -9848
41231 -9848 277863 248909 3709 133984 806168 1516222 1823447 1856824 1932039 2025083 1875109
41220 1875109 1420820 889621 507310 314944 296764 518183 1011896 1611007 2050751 2226465
41210 2226465 2223650 2109137 1838780 1352568 597776 -477953 -1710156 -2585760 -2729623
41201 -2729623 -2507397 -2619430 -2998732 -2764072 -1568298 -293369 144115 45517 236444
41192B36444M11679p6166n16976j06080N68940M80067k05294n49949l66603j74593
41182b98531m972N50802J200385J020805j32196j210840j293492o35115r8048
41173i01202q4822l54851n00472k96602K00256O93416Q79926O94908K74339k15868
41163C89028o07012p44468o03723k39880L73100J135251J509217R95745J826m84190
41153A724894k84661k35237o48986o47907K73299J098103P59861j51264m23258
41144A464844j98231m32283r50588p32617J08262L75090j40480l47607J22032
41135g31578K84583k84645n47590J83726R81005Q50742L21249L37348N72176J17120
41125B084136q10060j108307m34154M29320P00110L19671l14584p21358n76409
$$ plain form
41192 236444 648123 571957 54981 -51099 517841 997908 792614 242665 -123938 -298531
41182 -298531 -303503 247299 1447684 2468489 2336293 1125453 -168039 -803154 -901202
41173 -901202 -986024 -1340875 -1841347 -2137949 -1937693 -1244277 -364351 330557 604896 389028
41163 389028 -217984 -962452 -1566175 -1806055 -1432955 -297704 1211513 2207258 2209084 1724894
41153 1724894 1440233 1204996 556010 -91897 181402 1279505 2039366 1888102 1464844
41144 1464844 1266613 834330 -116258 -848875 -740613 -365523 -506003 -853610 -731578
41135 -731578 -446995 -731640 -1279230 -1095504 -114499 736243 1057492 1394840 1967016 2084136
41125 2084136 1274076 165769 -268385 160935 861045 1180716 866132 144774 -431635
41116d31635m1172L32452L17307K72168M26806M45088P5211l42124m54318l96380
41106B03403k65543K13757R44173J117842L53018n07369n48684r8017K1470q6188
41096A347862J67976M73102o732j010121j230381j97087R58874R88394k4808j061519
41086D05560j388057j011690l57959J66129M62170O84947Q21758N75938p6277
41077B82519n98772o06616m52032n32981m88270J24398P51038M53919n79192j187906
41067b833895q83587l03583M8912M19706R03273J007456N76855K24502L34021
41058e06340M83275L89633N32446J135493J389700O28062l89518m60663K01526
41049C403614K79686n88403j262269q59262K139K79111L316q3525J24871O0647
$$ plain form
41116 -431635 -472807 -140355 176952 449120 875926 1321014 1396225 1054101 599783 203403
41106 203403 -62140 151617 1095790 2213632 2566650 2059281 1510597 1412580 1434050 1347862
41096 1347862 1515838 1988940 1982208 972087 -258294 -455381 503493 1491887 1467079 405560
41086 405560 -982497 -1994187 -2352146 -2186017 -1723847 -1038900 -217142 358796 282519
41077 282519 -316253 -922869 -1374901 -1907882 -2396152 -2271754 -1520716 -1066797 -1645989 -2833895
41067 -2833895 -3717482 -4021065 -3972153 -3552447 -2649174 -1641718 -1064863 -840361 -506340
41058 -506340 -23065 366568 899014 2034507 3424207 4052269 3662751 3202088 3403614
41049 3403614 3683300 3094897 1832628 973366 975505 1254616 1257932 1174407 1299278 1359925
41039A359925l46149m14905J09097M49046n9305q19431p71595p415L58863r7899
41029b39768n31837k34448L27650M34714K53551L06304M54000K85055K5600J07497
41019A188318J87522l49230j084869q92984L38024J331784J059263p8318r91905
41010G07605j102159n26594K28675M76068r8290q14773n90477N88868J489998
41001C58921J237198L51540k27227l93061n53446p07225n81961k93324j76730
40992i85315j81400J0618M03819O52402M94402l1695o06065p05931k6758R50563
40982b5360J230887M57169n72845q49491k72495M42242O33822K31884k48590j06948
40972I20275P49189J391768Q75757l12597o94062J01002P33381J63851q60275
$$ plain form
41039 1359925 1013776 598871 707968 1157014 1097709 278278 -493317 -500732 -141869 -239768
41029 -239768 -771605 -1006053 -678403 -243689 9862 316166 770166 1055221 1080821 1188318
41019 1188318 1375840 1026610 -58259 -951243 -613219 718565 1777828 1699510 707605
41010 707605 -394554 -921148 -692473 -216405 -314695 -1129468 -1719945 -1131077 358921
41001 358921 1596119 1947659 1720432 1327371 773925 66700 -515261 -808585 -985315
40992 -985315 -1166715 -1156097 -752278 -99876 394526 362831 -243234 -949165 -975923 -25360
40982 -25360 1205527 1662696 1089851 240360 -32135 410107 1043929 1275813 1027223 920275
40972 920275 1669464 3061232 3936989 3624392 2930330 3031332 3764713 3928564 3068289
40963C068289j165976r65195j136915j471668j006030K64053J297248J504066
40955C87872J220670P91861K62327o0114J81842N46958J91516p47777j173131
40946A602024o52774l9178j00257m52432l76569N9065L11246K67945K21782K32500
40936A073352M7000m18458q37160p60557j17375N63071O06719K6255l96851j44358
40926c58362L15911L03499k906M7767M43515N80459K99236K0841o2178j14499
40916A473283o6930K43788M37243N4616l97157J6532J001280J166917J35188p58291
40906C306469m59285K70548J33385q22480j515566j359709o32684J77550O61996
40897b39776N51883R4603m8055K69469M03428J0270l24077j23693J07486j62272
$$ plain form
40963 3068289 1902313 937118 -199797 -1671465 -2677495 -2413442 -1116194 387872
40955 387872 1608542 2400403 2662730 2602616 2784458 3331416 3522932 2775155 1602024
40946 1602024 949250 910072 809815 357383 -19186 39879 351125 619070 840852 1073352
40936 1073352 1120352 701894 -135266 -895823 -1013198 -450127 156592 182847 -214004 -358362
40926 -358362 -42451 261048 258142 305909 749424 1329883 1629119 1649960 1587782 1473283
40916 1473283 1406353 1650141 2087384 2142000 1744843 1761375 2762655 3929572 4064760 3306469
40906 3306469 2847184 3117732 3251117 2428637 913071 -446638 -1079322 -901772 -239776
40897 -239776 312107 406710 358655 628124 1031552 1041822 717745 594052 701538 539266
40887E39266m05905J33600J072094J352286P43323m0800m61170n59147m59755
40878A913792k27589m8840K1834J95182L53241q4173j052244j367745l23185R60518
40868C40791R67158k2392n29747k03570l78k82918l82860q9452L3108q615M18110
40857B39235R95004N27852q74425j449227m50883N24630N2980q45980m89647O62659
40847a107802Q17857k84832j158190r04737r7588O07211J195432J482661R69806
40838A519818j27080q12295o36468j61340J31056L93561N99657K71618m71790
40829G06737o27052K23710J023195O56288m45487j040073q61697o35880o53090
40820a653349m59080O0637L55490K00445J06636L73421N10508Q9736m85373o31065
$$ plain form
40887 539266 133361 266961 1339055 2691341 3434664 3393864 2932694 2373547 1913792
40878 1913792 1686203 1637363 1659197 1854379 2207620 2123447 1071203 -296542 -619727 340791
40868 340791 1307949 1285557 755810 552240 551862 268944 -113916 -203368 -170260 -178875 239235
40857 239235 1234239 1762091 887666 -561561 -1012444 -487814 -434834 -1280814 -1770461 -1107802
40847 -1107802 -289945 -574777 -1732967 -2637704 -2735292 -2128081 -932649 550012 1519818
40838 1519818 1392738 580443 -56025 -217365 -86309 307252 906909 1178527 706737
40829 706737 79685 303395 1326590 1982878 1537391 497318 -364379 -1000259 -1653349
40820 -1653349 -2112429 -2051792 -1696302 -1495857 -1389221 -1015800 -505292 -415556 -900929 -1531994
40810a531994m47405k90678J331O29334R53917J54935j253207j655123m29999
40801c868889J108585J425187O53712N6538J91890N22801N48378L88366K40350
40792A266918L9839j91182k65587k46030m06965o65114n95667j74555N8890j70935
40782a350388m09584j59427M14094Q21701R06618P72638L97162k25613p62280
40773D04921q04333l84906Q8865L58280N00945O40553O99972M77631r5364p45386
40763A141178r75435o04806j23226j44313n06011m15609L59605J023958Q50114
40754F05455K43250J55697P51383J258710J044693L08244l13812m43607k23358
40745C386655j29766m96075j043535j054952k48777P47311J119568Q41396N23013
$$ plain form
40810 -1531994 -1979399 -2270077 -2268746 -1639412 -685495 -530560 -1783767 -3438890 -3868889
40801 -3868889 -2760304 -1335117 -681405 -624867 -432977 89824 638202 1026568 1266918
40792 1266918 1306757 1115575 849988 603958 196993 -468121 -1063788 -1238343 -1179453 -1350388
40782 -1350388 -1759972 -1919399 -1505305 -683604 223014 995652 1392814 1167201 404921
40773 404921 -399412 -784318 -695453 -337173 163772 804325 1504297 1981928 1886564 1141178
40763 1141178 165743 -439063 -562289 -706602 -1212613 -1628222 -1268617 -244659 605455
40754 605455 848705 1004402 1755785 3014495 4059188 4367432 4053620 3610013 3386655
40745 3386655 3256889 2760814 1717279 662327 413550 1160861 2280429 3121825 3644838
40736C644838M81986M62281K12041j68409n28043q95597j262315j424230j192357
40727f69805o19383J9279L76756K62885j23655l14845r3244K63972M14289L67913
40717a15838K62791N5234k32163k87349M3564L88495L87481K72072L75230M25554
40707A575071J8150n11129m88420J5921L50333L57235L45095J48497o04954j273586
40697f7787o57935R34827J544434K81482j138157p60824P94858J395015N37643
40688B863556k89910j98802p2552p43697j469599j099082J43214R68039O88407
40679G89574j64447o90683n10878J32468P19425Q28451M15269j73610n07659m17703
40669D20207r5533P5985j30570n01018n62409k02446R8396o1824l16764K1436
$$ plain form
40736 3644838 4126824 4589105 4801146 4632737 4104694 3209097 1946782 522552 -669805
40727 -669805 -1289188 -1269909 -893153 -630268 -753923 -1068768 -1162012 -898040 -483751 -115838
40717 -115838 146953 202187 -29976 -317325 -273761 114734 502215 774287 1149517 1575071
40707 1575071 1593221 1082092 593672 609593 959926 1317161 1662256 1810753 1205799 -67787
40697 -67787 -725722 209105 1753539 2035021 896864 136040 930898 2325913 2863556
40688 2863556 2573646 2374844 2302292 1558595 88996 -1010086 -866872 101167 789574
40679 789574 625127 -65556 -576434 -443966 275459 1103910 1519179 1345569 837910 420207
40669 420207 324674 400659 270089 -230929 -793338 -995784 -897388 -959212 -1275976 -1254540
40659a254540R00353J455319J107651K45970l87054n31456l45595N9025N57185
40650A806858P42264K51570o50796j227794j100759o35769l80152l58907j47652
40641a701137M58399J090594J203140P03999N2828k43871p6624L56066Q42174
40632B685568J157551R71030J40506q87178j374629j161094q82541j059590j301214
40623a711591q66298J77539R39086Q83973M47908K43152K19825Q1244O7088N95614
40613A077540J312624J330055N37797j12213J3136K90637j29199r57531j240230
40604B122616q13453l58893j69373J26237N29803M39347j64505l06690N17125
40595A922214J292797Q29151m35745j051805o77947l86966p82243j014416k23844
$$ plain form
40659 -1254540 -354187 1101132 2208783 2454753 2067699 1536243 1190648 1249673 1806858
40650 1806858 2549122 2800692 2149896 922102 -178657 -814426 -1194578 -1553485 -1701137
40641 -1701137 -1242738 -152144 1050996 1754995 1807823 1563952 1487328 1843394 2685568
40632 2685568 3843119 4814149 4954655 4067477 2692848 1531754 649213 -410377 -1711591
40623 -1711591 -2577889 -2400350 -1461264 -577291 -129383 113769 333594 414838 481926 1077540
40613 1077540 2390164 3720219 4258016 4145803 4158939 4449576 4320377 3362846 2122616
40604 2122616 1309163 950270 780897 907134 1436937 1876284 1711779 1405089 1922214
40595 1922214 3215011 4044162 3608417 2556612 1878665 1491699 709456 -304960 -528804
40586e28804R48500J154942K06747p23115o97603o8617K72816J11798p9858m0396
40576E56410m0495k66560m02165j39247K35280K10633j57750l18296l8877L57274
40566c793O07407P98796Q97684O00156m1511m25136k51823l1619k35654m97563
40556A416944l23689r2323m74188j176156j242392n22321J29355K06878J70470
40547a907422M45781O71484M09212n0960j28486K18363N48192N54372L18109J42525
40537A221170K76005N85984N48443o8375o34339l60171M89364Q33693L03946k92451
40527B903269k41684J98187N03417N86929L86244l15925j118354j031166M855
40518A875772O29875J4057p23317k66878O53857L89087q64723j293534l35012
$$ plain form
40586 -528804 419696 1574638 1781385 1058270 360667 292050 564866 676664 596806 556410
40576 556410 515915 249355 -152810 -292057 -56777 153856 -3894 -322190 -361067 -3793
40566 -3793 603614 1402410 2300094 2900250 2858739 2433603 2181780 2150161 1914507 1416944
40556 1416944 1093255 1000932 526744 -649412 -1891804 -2414125 -2284770 -2077892 -1907422
40547 -1907422 -1461641 -790157 -380945 -431905 -560391 -342028 206164 760536 1078645 1221170
40537 1221170 1497175 2083159 2631602 2563227 1928888 1568717 2058081 2891774 3195720 2903269
40527 2903269 2661585 2859772 3363189 3950118 4336362 4020437 2902083 1870917 1875772
40518 1875772 2505647 2519704 1796387 1529509 2183366 2572453 1707730 414196 79184
40509G9184N87945N13875K86418P07782R87116K01747r04813r53043j7937O25485
40499B113759M30324L4472k4943P3624J44071L31642N35975L03453l88353q62414
40489B691610o12292K5069M04978L99725L13504K52874J9163m36755q04342p45218
40479A508316k69619K79747N28783L39201j15894m78666m81456j89834M7068l1628
40469A136018k97030m11470k98200k36137l89056m40830N8797J040891J832330
40460A995313J766626P83291n37717j407206j353000n22679M63398J010096R05340
40451C103462K59344o46310j336887j308981n67383J82250K52449k04222m24735
40442f91013J7860Q42721J496652J548883Q11681l88774j151815q54440p8503
$$ plain form
40509 79184 667129 1181004 1467422 2175204 3162320 3364067 2459254 1506211 1488274 2113759
40499 2113759 2544083 2578555 2553612 2627236 2771307 3102949 3638924 3942377 3554024 2691610
40489 2691610 2079318 2104387 2509365 2909090 3222594 3475468 3494631 3057876 2253534 1508316
40479 1508316 1238697 1518444 2047227 2386428 2270534 1791868 1310412 1120578 1167646 1136018
40469 1136018 838988 427518 129318 -106819 -495875 -936705 -877908 162983 1995313
40460 1995313 3761939 4545230 4007513 2600307 1247307 724628 1188026 2198122 3103462
40451 3103462 3362806 2716496 1379609 70628 -496755 -314505 -62056 -266278 -691013
40442 -691013 -673153 169568 1666220 3215103 4026784 3638010 2486195 1631755 1553252
40433A553252J3629o75651r88806k80643N08003J98398q87848j388884p11670
40424b660220M60413J256247J379760Q39407k32996j269881j443709n59460N69042
40415a661397R45801M29010k14446j54160O74362J475967J355646K85056q18416
40406B317423j140364q53403o41626o31891l68102K42726O25467L60061k08363
40397b98072m57709k20764K18242N47599O09162M11185J61162N6360p4798n82893
40387C69474j282174j364756m01138R03914J421317Q93665R9265j54725K30172
40378G15014Q41058J208678R99433J87432p77217j268925j128698p72893n51582
40369e47700l22370J18360N22408N23806L00570L86291P91522Q34081J03135q27947
$$ plain form
40433 1553252 1566881 891230 -97576 -378219 129784 328182 -559666 -1948550 -2660220
40424 -2660220 -2199807 -943560 436200 1275607 1042611 -227270 -1670979 -2230439 -1661397
40415 -1661397 -715596 -286586 -501032 -655192 19170 1495137 2850783 3135839 2317423
40406 2317423 1177059 323656 -317970 -949861 -1317963 -1075237 -449770 -89709 -298072
40397 -298072 -755781 -976545 -758303 -210704 398458 809643 970805 1027165 952367 369474
40387 369474 -912700 -2277456 -2678594 -1774680 -353363 540302 639567 484842 715014
40378 715014 1556072 2764750 3764183 3951615 3174398 1905473 776775 3882 -547700
40369 -547700 -870070 -751710 -229302 294504 595074 981365 1772887 2606968 2710103 1882156
40359A882156j090245o66998k95893k86372j00472O30782J277598R69224j46637
40350B173143j061707j208286r12297n11940J69170J103685J550102R52049r5690
40341B158229n52505l47823k54842m65507l00043M43793Q83369M11191j66739
40332A809123K45393J286471J548132N55285o64058j063404p16729k22217J92097
40323B970093N12099N35314J69059k70446m62521m20395j62119M11668R62473
40314D245225P24291l39597j059034n63840K90078N7554j070486j413555k06688
40305F63948J330818J685593Q31892j75994o14899n14548k08983j1011l5966o2012
40295B888838J35439K77309m8140n08838l29074L90514O23549L5423m15259p6404
$$ plain form
40359 1882156 791911 124913 -170980 -457352 -557824 72958 1350556 2319780 2173143
40350 2173143 1111436 -96850 -1009147 -1521087 -1351917 -248232 1301870 2253919 2158229
40341 2158229 1605724 1257901 1003059 537552 237509 681302 1564671 1975862 1809123
40332 1809123 2054516 3340987 4889119 5444404 4780346 3716942 3000213 2777996 2970093
40323 2970093 3482192 4017506 4186565 3916119 3453598 3033203 2871084 3282752 4245225
40314 4245225 4969516 4629919 3570885 3007045 3297123 3354677 2284191 870636 663948
40305 663948 1994766 3680359 4512251 4336257 3721358 3206810 2997827 2986816 2950850 2888838
40295 2888838 3024277 3301586 3253446 2744608 2415534 2806048 3429597 3465020 3049761 2973357
40285B973357L11491J5249k71216L55575J208472R32597k45824p86325k22678
40276D270698K85524l5662n07878m18771j74258k99847l69369J52333P44055M83530
40266D130355m96634j046828m23477Q66085J636885J154065k29631j365231j333369
40257B892220k84151Q29691J270684J039344N54859K47646L97531R11028J275877
40248I134729J153130R20766J179678J909495K681075L471065M546669N738916
40240C0735523O641588P396514Q528510J0319416J3182274J7967187K4556279
40233A19327291L0986617L5917747M0899199M6779359M8134866L6373660J1046800
40226C69465539j5981099l1881669l5953669l6986732l9701536l9969323l3779483
$$ plain form
40285 2973357 3284848 3300097 3028881 3384456 4592928 5525525 5279701 4493376 4270698
40276 4270698 4556222 4520560 4012682 3593911 3419653 3119806 2750437 2902770 3646825 4130355
40266 4130355 3633721 2586893 2163416 3029501 4666386 5820451 5590820 4225589 2892220
40257 2892220 2608069 3437760 4708444 5747788 6302647 6550293 6947824 7858852 9134729
40248 9134729 10287859 11208625 12388303 14297798 16978873 20449938 24996607 30735523
40240 30735523 37377111 44773625 53302135 63621551 76803825 94771012 119327291
40233 119327291 150313908 186231655 227130854 273910213 322045079 358418739 369465539
40226 369465539 353484440 321602771 285649102 248662370 208960834 168991511 135212028
40219A35212028k4540160j8231899j5594645j3214932r851095p447358o849632
40212C9482307o352213m785346l209103k809498l119451l107973k596536j912069
40204A1590118j201835o34069m60250n19193l76946j15926k19842n79062n04003
40195F978992N9545K47373m14240j248426j472986j276842j225044j164003n07648
40186b3279O23148J305384R87425K82650K83294J197548J952311J363586l67477
40177G604590j703572j514155l83969K45522q9591n69355m87743j28584l1428
40168B941715j24035o0919P9733r273k58151l21050j43396L126j1360l4061N8096
40157B120425J97557K86981L02137K44507J69404K13129M15944O03288O54185
$$ plain form
40219 135212028 110671868 92439969 76845324 63630392 53779297 46331939 39482307
40212 39482307 33130094 28344748 25135645 22326147 19206696 16098723 13502187 11590118
40204 11590118 10388283 9754214 9293964 8774771 8397825 8281899 8062057 7482995 6978992
40195 6978992 7038537 7285910 6871670 5623244 4150258 2873416 1648372 484369 -23279
40186 -23279 599869 1905253 2892678 3175328 3458622 4656170 6608481 7972067 7604590
40177 7604590 5901018 4386863 4002894 4248416 4158825 3589470 3101727 2973143 2941715
40168 2941715 2817680 2756761 2836494 2827221 2569070 2248020 2104624 2107750 2096390 2062329 2120425
40157 2120425 2317982 2604963 2907100 3151607 3321011 3534140 3950084 4553372 5207557
40148E207557P68637J143311J436200J003867j63477j152462j141346m66548k02968
40139F432771p30079j261702j021395l74733k47562o80390p27598N1350P49661
40130B190323L39748p30670j007749l7782R51577O97264m64399j182348q42624
40121h6660j0318O42988J004123J034598M83200m76937r89370n54742Q9282j15494
40111A020670r83147j302106o31338O0695r6028n82011l78605M55284R52128O93802
40101g90656K41937J41052K46934J78411j58973o46155j050990r86843l01874
40092c127157M53395N74089K72227M27470J104721J270218M34111l97656j77348
40083H34070O14900Q44630M98484L91461N34012J67510o43182q47834j34728M26025
$$ plain form
40148 5207557 5976194 7119505 8555705 9559572 9396095 8243633 7102287 6635739 6432771
40139 6432771 5702692 4440990 3419595 3044862 2797300 2116910 1389312 1440662 2190323
40130 2190323 2530071 1799401 791652 753870 1705447 2402711 1938312 755964 -86660
40121 -86660 -96978 546010 1550133 2584731 3067931 2590994 1601624 1046882 1136164 1020670
40111 1020670 37523 -1264583 -1895921 -1835226 -1931254 -2513265 -2891870 -2436586 -1484458 -790656
40101 -790656 -548719 -407667 -160733 17678 -141295 -787450 -1838440 -2825283 -3127157
40092 -3127157 -2673762 -2099673 -1827446 -1399976 -295255 974963 1409074 1011418 834070
40083 834070 1448970 2293600 2792084 3183545 3717557 3885067 3241885 2394051 2259323 2685348
40073B685348M759p62157q56754l42316L9046P2299M3640j1440j99839k36572
40063D36014J65178N73269L18698l65332m89525K78371J051057Q73199p6671q09491
40053A954767p38943j92548J78012J72221J09162K28473K49487k47203j052741
40044F60687j322908n47475P49689J555548J402051N94623l13633q74531p93694
40035A110357j54453M50920M92690K16369L10377Q15467R23313J14071r80951
40026C298160j288001o24114J23173J28231m18904o54737j66261M95308N28482
40017A421337q7641o07900n64383l38519m22912n50211j12091P66051J225938
40008G29669P96870m5627n80981o06393l10517J32613N41325O59961M33329J12715
$$ plain form
40073 2685348 2690107 1927950 1071196 728880 767926 840225 883865 872425 672586 436014
40063 436014 601192 1174461 1493159 1127827 638302 916673 1967730 2840929 2764258 1954767
40053 1954767 1215824 1023276 1201288 1373509 1482671 1711144 1960631 1713428 660687
40044 660687 -662221 -1209696 -460007 1095541 2497592 3092215 2778582 1904051 1110357
40035 1110357 955904 1406824 1899514 2115883 2426260 3241727 4165040 4279111 3298160
40026 3298160 2010159 1386045 1509218 1637449 1218545 563808 397547 892855 1421337
40017 1421337 1333696 725796 161413 -177106 -600018 -1150229 -1262320 -496269 729669
40008 729669 1526539 1480912 899931 293538 -16979 115634 656959 1316920 1750249 1862964
39998A862964j15785l30223n19674l94619J51400O81035O48880K4705p45946j203117
39988E9620j127271o18964j17097k0913j19273J82154Q60737J103491N41480j4118
39978G29846K39165P67469N24486k90445m75015K32992O90633J45140o11564m96169
39968A456538L02967P61521M45342k34387q03202j065893r17511m45499p7487
39959e77611r8563j67156J75568O68025N96761j22635p36889o71790k48963j13462
39949a296715l07152k86221K55116R09549J022338N03275k5029L2742N22037P68115
39939B098055M18187k49974p95095r89323p45193j83244J48387k46287q89858
39930a434345o28759O99481J668564J067093l67795r83282m66656J01222J63767
$$ plain form
39998 1862964 1747179 1416956 897282 502663 654063 1335098 1983978 2008683 1262737 59620
39988 59620 -1067651 -1686615 -1803712 -1824625 -1943898 -1761744 -901007 202484 743964 729846
39978 729846 969011 1736480 2260966 1970521 1495506 1728498 2419131 2564271 1952707 1456538
39968 1456538 1759505 2521026 2966368 2731981 1928779 862886 -54625 -500124 -577611
39959 -577611 -676174 -843330 -667762 263 597024 474389 -262500 -934290 -1183253 -1296715
39949 -1296715 -1603867 -1890088 -1634972 -725423 296915 800190 775161 807903 1329940 2098055
39939 2098055 2516242 2266268 1471173 481850 -263343 -446587 -298200 -544487 -1434345
39930 -1434345 -2063104 -1363623 304941 1372034 1004239 20957 -445699 -344477 -180710
39921a80710L01399Q21644J062910N73096r3269l25932k94763k59279N1033O59932
39911B316061P99205K0624q30197p05488J19872N98623N10699M02632K69843m05336
39901C096538j306802j287214j05272R15244N76173o14316j207993o34125L83600
39892a84167Q86768N70728k21471q94639r83685m48860L29875R11533J104486
39883A070568R58916O38582L14990K1177l48522p24043p33072k27508K74594J94154
39873A439836k08041k07774J47894K4233p90008j348593q99044J0488M21488L25184
39863a084337L74712P19349R39066Q20513M26124l16624j275746j643611p93065
39854a833619M92785P16998k80408j042399n89659K92785M74759J86811L54320
$$ plain form
39921 -180710 120689 942333 2005243 2578339 2485070 2159138 1864375 1605096 1656129 2316061
39911 2316061 3115266 3135890 2305693 1600205 1720077 2318700 2829399 3232031 3501874 3096538
39901 3096538 1789736 502522 397250 1312494 1888667 1274351 66358 -567767 -184167
39892 -184167 702601 1273329 1051858 157219 -826466 -1275326 -945451 -33918 1070568
39883 1070568 2029484 2668066 2983056 3004233 2655711 1931668 1198596 971088 1245682 1439836
39873 1439836 1231795 1024021 1171915 1196148 406140 -942453 -1841497 -1831009 -1409521 -1084337
39863 -1084337 -709625 9724 948790 1769303 2195427 1878803 603057 -1040554 -1833619
39854 -1833619 -1340834 -623836 -904244 -1946643 -2536302 -2243517 -1768758 -1581947 -1227627
39845a227627R21494R95930L98171m6351J62962N10082L65011j51663n48269o27319
39835G52421m06898J22699P33875Q46070J58112q33772j353445j184318o52092
39826a817348o0546L84146L49751k86331r64415r49804l26223J62331K85641N34325
39816b688473R72904Q79107Q0272l29226M38581J344168Q46513o92960j418231
39807e67345p47363j46533p09688j480234j091739J29815Q90026Q91396P72897
39798b058768O56208J44756m70041l77138L29120O40322K55769K3138L93844O11364
39788A48574P4290n13750k27394N91504Q89118M69414M8352j9690j51008o64992
39778F44418j256805j474457j196634n44463K38526P62440P69196N02633M36689
$$ plain form
39845 -1227627 -306133 689797 1087968 1041617 1204579 1714661 2079672 1928009 1379740 752421
39835 752421 345523 468222 1202097 2048167 2206279 1372507 19062 -1165256 -1817348
39826 -1817348 -1877894 -1493748 -1143997 -1430328 -2394743 -3344547 -3670770 -3508439 -3222798 -2688473
39816 -2688473 -1715569 -836462 -756190 -1085416 -646835 697333 1543846 850886 -567345
39807 -567345 -1314708 -1461241 -2170929 -3651163 -4742902 -4613087 -3723061 -2831665 -2058768
39798 -2058768 -1402560 -1257804 -1727845 -2104983 -1775863 -1135541 -879772 -856634 -462790 148574
39788 148574 222864 -290886 -518280 73224 962342 1431756 1480108 1460418 1309410 644418
39778 644418 -612387 -2086844 -3283478 -3827941 -3589415 -2826975 -2057779 -1555146 -1118457
39769a118457O14203O38589L26790p1191l51989n74385o74488l86361J99617M88640
39759i09032J76111k06051l876O07625R39262Q44902P93629Q95463N95356l61520
39749C371869j276436j337734p33286l28107m42046n93045m08615r9587J30258
39740a716729M67614R16457R39482K35365n63413o52961k43253k02207o06692
39731a426337n33085M71052J503270J428611L80562m71256m12863J23177L20711
39722A383842l7346m99174o01026l74067j76906j35756K0633M34559O98258L49766
39712A062783l54604o80993m16998n5251Q8353K61104N61402N88676K32633R1854
39702A378959M94986P59111K06250o26073p25032j64210J25254n5442L9579O44552
$$ plain form
39769 -1118457 -504254 134335 461125 389934 37945 -536440 -1210928 -1597289 -1397672 -909032
39759 -909032 -732921 -938972 -942848 -335223 604039 1448941 2242570 3138033 3733389 3371869
39749 3371869 2095433 757699 24413 -303694 -745740 -1338785 -1747400 -1846987 -1716729
39740 -1716729 -1249115 -332658 606824 842189 278776 -374185 -617438 -819645 -1426337
39731 -1426337 -1959422 -1488370 14900 1443511 1824073 1352817 939954 1063131 1383842
39722 1383842 1346496 847322 246296 -127771 -304677 -440433 -419800 14759 713017 1062783
39712 1062783 708179 27186 -389812 -445063 -356710 -95606 465796 1054472 1287105 1378959
39702 1378959 1873945 2633056 2839306 2213233 1488201 1323991 1449245 1393803 1433382 2077934
39692B077934R35395L19599o23820r94048p03632l02639j81222l39338n43725
39683c55496m65802p4128M9221n83334j284351p41574J029107K292394J780893
39674A646930L39390m53198m33955n05915q03135o04670J35336N44641K67704
39665A33128k9668R7836J66093k47493o98319o50273l52631k94012l22102q220
39655b205661M58342M47580j51579p17622o62236l2883O39684Q00704K49088o07558
39645a782141r01665p8303J365844K179281J568629k646j332065j664215j208618
39636a855899n88936r7641L33300O50701N74265N8158m66004n52298k68304j5747
39626b228405L7547O4560J93169L16197L15646K51388K67116M23456O06623N36684
$$ plain form
39692 2077934 3013329 3332928 2709108 1715060 1011428 708789 527567 188229 -355496
39683 -355496 -821298 -895426 -846205 -1429539 -2713890 -3455464 -2426357 -133963 1646930
39674 1646930 1986320 1533122 1099167 593252 -209883 -814553 -679217 -134576 133128
39665 133128 103460 201296 367389 119896 -578423 -1228696 -1581327 -1875339 -2197441 -2205661
39655 -2205661 -1747319 -1299739 -1451318 -2168940 -2831176 -2864059 -2224375 -1423671 -1174583 -1782141
39645 -1782141 -2683806 -2762109 -1396265 783016 2351645 2348999 1016934 -647281 -1855899
39636 -1855899 -2444835 -2542476 -2209176 -1558475 -984210 -926052 -1392056 -1944354 -2212658 -2228405
39626 -2228405 -2190858 -2126298 -1933129 -1616932 -1301286 -1049898 -782782 -359326 247297 783981
39616G83981K1160o67213r12417n09021k0282j761j47781K19072R79613J263676
39606A009027P14889k0594l05628l33275n45717q20346p71607m56277k11869m7539
39596a788936K63761O28283O69039L01257j08966j74158J77013P21563J049939
39587A738795P55452j75765j174408j517799r73506O0380R20897J081058M35030
39578A150134n55192j145702r88849m40040o2575k8999j60109k60657j68838K33492
39568b427335P58950R45312O59485L47006L27145K54674k03600n87020k79871
39559b05254L49363L43221l56687p39602k25738N22476O59880K97315P9157J93594
39549I17725L77907N17819O59198O42097K50787l39243o61963n12071j47928L8262
$$ plain form
39616 783981 805141 137928 -774489 -1283510 -1303792 -1305553 -1453334 -1234262 -254649 1009027
39606 1009027 1723916 1703322 1397694 1064419 518702 -301644 -1073251 -1529528 -1741397 -1788936
39596 -1788936 -1525175 -896892 -227853 73404 -35562 -209720 -32707 688856 1738795
39587 1738795 2494247 2318482 1144074 -373725 -1347231 -1286851 -365954 715104 1150134
39578 1150134 594942 -550760 -1539609 -1979649 -2042224 -2071223 -2231332 -2491989 -2660827 -2427335
39568 -2427335 -1668385 -723073 -63588 283418 610563 865237 661637 74617 -205254
39559 -205254 144109 487330 130643 -608959 -834697 -312221 347659 644974 724131 917725
39549 917725 1295632 1813451 2472649 3114746 3365533 3026290 2364327 1852256 1704328 1742590
39539A742590j07075m09762n56093m34177k83484l56681n08901m19278j63209
39530a496070j27617l18666k79868J25895M04151K13557n6883O2849L43561K78903
39520h50188l0742l4195L71557O79457N22058J24687p5991M2549K24604J40095
39510A113891k29670m59616j41441M51394N53489j8650m78963j83824L64756K75166
39500A246532l52391o12960j91245K95699L76735L07267L67330L31233j9218m47173
39490A301809o88186q37465r80620r01841n08822j19043M4685K40702O90295J048382
39480g10104Q65090L07414o1500o4299l2058k21574m82017n10635k22253J17846
39470a014090P3292m54239q60821l93839P54598J429462R64626J18056k1060M35054
$$ plain form
39539 1742590 1635515 1225753 669660 235483 -48001 -404682 -913583 -1332861 -1496070
39530 -1496070 -1623687 -1942353 -2222221 -2096326 -1692175 -1478618 -1535501 -1472652 -1129091 -850188
39520 -850188 -880930 -915125 -543568 135889 657947 782634 706643 749192 973796 1113891
39510 1113891 884221 424605 283164 734558 1288047 1269397 790434 606610 971366 1246532
39500 1246532 894141 281181 89936 385635 762370 1069637 1436967 1768200 1748982 1301809
39490 1301809 613623 -223842 -1204462 -2106303 -2615125 -2734168 -2689483 -2448781 -1758486 -710104
39480 -710104 154986 462400 400900 336601 304543 82969 -399048 -909683 -1131936 -1014090
39470 -1014090 -940798 -1395037 -2255858 -2649697 -1895099 -465637 498989 617045 595985 1031039
39460A031039N42243P9366k86448l10848n16707r74974q66973J23406R44768N98893
39450C63765k94706m35640J33957K20250m34007o54172K07179J100350Q65473
39441A072449k191k46673J50567J29656n59341r50162m92856J09035J51358P333
39431f30825K92268P63564Q50212O70573O67340O85017L17261j55291j48385Q7298
39421C399032k46021j055309j283151n28732K65419K16117k81955l60098J2492
39412A37794K56248K21602K36878L95396M74380M21920L68831K62341k9865l36226
39402B409299l32650l3830J94313N4460m57980j063110j230906n31894P36330
39393b55968J602455J458519P16244R2286k96880o46333p91656n28861k01458
$$ plain form
39460 1031039 1573282 1652648 1366200 1055352 538645 -436329 -1303302 -1179896 -235128 363765
39450 363765 69059 -366581 -232624 -12374 -446381 -1100553 -893374 206976 1072449
39441 1072449 1070258 823585 974152 1103808 544467 -405695 -898551 -789516 -638158 -630825
39431 -630825 -338557 425007 1275219 1945792 2613132 3298149 3615410 3460119 3311734 3399032
39421 3399032 3153011 2097702 814551 285819 551238 767355 485400 125302 137794
39412 137794 394042 615644 852522 1247918 1722298 2144218 2513049 2775390 2745525 2409299
39402 2409299 2076649 2042819 2237132 2291592 1833612 770502 -460404 -992298 -255968
39393 -255968 1346487 2805006 3521250 3613536 3316656 2670323 1878667 1349806 1148348
39384A148348j82583j10337M79442J050355O61584m29252r19833l73775J69690
39375A493639j20374o53412n17268R2179L28598j5202m42638o00108n28040l12276
39365a274902j9824J76772J72751O2905p6649k32414j89641K72882P96077P09750
39355C97707J11245j17793K68606L68722l59567j039160p09087J35150M43241
39346e00936L35825O12135J045703O84029l29483p81794l66058j38513o20542
39337e9634q80946k06113N62155L23400n56800q74618l65688J57363J44274j03820
39327a860427r1880L13187R78407J638284J909430J547380P38577l8391l96083
39318D738484k57373O8991J6801o40266j269429r98269N594N57514Q2172n32520
$$ plain form
39384 1148348 965765 855428 1334870 2385225 3046809 2617557 1697724 1323949 1493639
39375 1493639 1373265 719853 202585 294764 623362 608160 165522 -434586 -962626 -1274902
39365 -1274902 -1294726 -1117954 -945203 -882298 -958947 -1191361 -1381002 -1108120 -312043 397707
39355 397707 508952 391159 659765 1028487 668920 -370240 -1079327 -944177 -500936
39346 -500936 -165111 447024 1492727 2176756 1847273 1065479 699421 560908 -59634
39337 -59634 -940580 -1146693 -584538 -261138 -817938 -1692556 -2058244 -1900881 -1756607 -1860427
39327 -1860427 -1952307 -1639120 -660713 977571 2887001 4434381 5172958 5134567 4738484
39318 4738484 4481111 4550102 4566903 3926637 2657208 1658939 1664533 2222047 2304219 1771699
39308A771699k67518N47197Q72728N21324J19047j30458n58698r86417o79059
39299A209845L71446J041528M71893p36912j276052p22044J26161L54618m9193
39290G91290l66677j16720L76370N04181K89243L36552P83104Q98984J77990p25210
39280B949107q71908m58059m24896q41136p93651l7946M21952l8479m86158J88566
39270c92608J386344J433346q0195j649898j758716o34642L24652L66409K9516
39261i75792J05012N18935N59547m059m93983j93720O70434J188789Q74658R8960
39251B348781n46241q49286q40664n23481j7904L34833K91124m2710m01716n77770
39241h25034l98263J38164O02476M71514q9882l04981O8906K71427k89781r72715
$$ plain form
39308 1771699 1504181 2051378 2924106 3445430 3564477 3434019 2875321 1888904 1209845
39299 1209845 1581291 2622819 3094712 2357800 1081748 359704 485865 840483 791290
39290 791290 424613 307893 684263 1188444 1477687 1814239 2597343 3496327 3674317 2949107
39280 2949107 2077199 1619140 1194244 353108 -440543 -478489 -56537 -95016 -581174 -392608
39270 -392608 993736 2427082 2346887 696989 -1061727 -1696369 -1371717 -1005308 -975792
39261 -975792 -870780 -351845 207702 203643 -290340 -484060 186374 1375163 2249821 2348781
39251 2348781 1802540 953254 112590 -410891 -428795 -93962 197162 154452 -247264 -825034
39241 -825034 -1223297 -1085133 -482657 -11143 -101025 -406006 -337100 -65673 -355454 -1328169
39231a328169p45644K67961R33637O70192N4155j93512q0802J529j01135l02431
39221h24219m50892l14164K09021P21491O33985L1182k55511K47703Q94967O74917
39211A568480n12119j703383j895238r76225K59155Q56412N49702m9523k06724
39202b109463P1275K17321O3070P6702M96252Q13629N25024m6599j86647K30288
39192A50852O91005P93407N75209K17157j29631k89350k41972k87558o32569r10651
39182f4101n92864J57377N64704K62563k53869l55320k5090L25920M09841K01789
39172F30950j41758k95289j8375M08632L80171j58816m69610l5289N97577N38965
39162A437158j76293o81588n00181k676L43483M74746L39513k66773j106309j367694
$$ plain form
39231 -1328169 -2073813 -1805852 -872215 -202023 -147868 -341380 -422182 -420653 -521788 -824219
39221 -824219 -1275111 -1589275 -1380254 -658763 -24778 6404 -249107 -1404 893563 1568480
39211 1568480 1056361 -647022 -2542260 -3518485 -3259330 -2402918 -1853216 -1902739 -2109463
39202 -2109463 -2038188 -1820867 -1757797 -1681095 -1184843 -371214 153810 107211 -79436 150852
39192 150852 841857 1635264 2210473 2427630 2297999 2008649 1766677 1479119 846550 -64101
39182 -64101 -656965 -499588 65116 327679 73810 -281510 -306600 19320 429161 630950
39172 630950 489192 193903 175528 584160 964331 805515 335905 300616 898193 1437158
39162 1437158 1260865 579277 79096 76420 419903 894649 1234162 967389 -138920 -1506614
39152a506614o79147K02524L47336l0687M4052P46630J123241N23349l90897n51737
39142a71950Q5613O11594M24153j75253o32459q31852r14058p95060k67941N13076
39132b154137J021962R69890O99898P25798R68034P97036m5055r17405j021108
39123A044913m51679l6358j82932m54399m07295k30646j89715j9010N03094P90275
39113C66248J05029j126514j558089p02731L31386L48973l36065m92319K41140
39104b822942R78263R50665M80379L14449N40895O40656L70808Q9629J43660L03772
39094A990234Q9840m56601o49642K8318J158758J706832J129301o9565r71841
39085C955634j186592r65816o18478j86908L18231P31112R22294R27109P26256
$$ plain form
39152 -1506614 -2185761 -1983237 -1635901 -1666588 -1622536 -875906 247335 770684 379787 -171950
39142 -171950 -86337 525257 949410 774157 141698 -690154 -1604212 -2399272 -2667213 -2154137
39132 -2154137 -1132175 -162285 537613 1263411 2231445 3028481 2983426 2066021 1044913
39123 1044913 593234 556876 373944 -80455 -487750 -718396 -908111 -927121 -424027 366248
39113 366248 471277 -655237 -2213326 -2916057 -2584671 -2235698 -2571763 -3064082 -2822942
39104 -2822942 -1844679 -894014 -413635 -99186 441709 1082365 1453173 1542802 1686462 1990234
39094 1990234 2080074 1623473 973831 1002149 2160907 3867739 4997040 4927475 3955634
39085 3955634 2769042 1803226 1184748 997840 1316071 2047183 2969477 3896586 4622842
39076D622842J44856p72938j473285j350382m96263L28285N36997K24763k55574
39067A509301q00464j330888j437258p98478J74824O85431N64170L92529N13262
39058e27571N36426J12704m02973n28748m04317l96626l68411q487M17970M07518
39048a162515J22827J48636M14353K38321m53183q29736l43650N76427J314586
39039B6066J731894J672927P44272p59842j558305r09904J77372K37046o18925
39030G42601j010633l46881N66183R32681Q76173P49873N22942K09881J00756
39021C343576J50127j91398j106963j926670j908833j053472J39908J188250J615614
39012B50139J085730J4503n25085n6284O38009O48271J83169j7457K0299k48386
$$ plain form
39076 4622842 4767698 3994760 2521475 1171093 674830 1003115 1540112 1764875 1509301
39067 1509301 708837 -622051 -2059309 -2857787 -2682963 -1997532 -1433362 -1040833 -527571
39058 -527571 8855 121559 -281414 -810162 -1214479 -1611105 -1979516 -1988003 -1570033 -1162515
39048 -1162515 -1039688 -891052 -476699 -238378 -691561 -1521297 -1864947 -1288520 26066
39039 26066 1757960 3430887 4175159 3415317 1857012 947108 1124480 1361526 742601
39030 742601 -268032 -614913 -48730 883951 1760124 2509997 3032939 3242820 3343576
39021 3343576 3493703 3302305 2195342 268672 -1640161 -2693633 -2553725 -1365475 250139
39012 250139 1335869 1350372 825287 769003 1407012 2055283 2238452 2220995 2241294 1992908
39002A992908o54186m48523K98481N45105j17225o76779j53875Q88339J106499
38993B780744K41986o42690p01133k89643k34885p03734j147124j058454m80249
38984b235182J21541L30681K19011L16802R28227J510557J165811j07930j173327
38975A076191j136085m84313k57988n01121m15421J28920L32487q0720k66685
38966a604735L06387Q39521N10247m6337K32568R05460O15040n41818q69156L09326
38956F56503J422607R39481l49534o13268K49016O24881k42714j178508r12334
38947E96130J46850O53404J47714o09580q00622l74951K20492N74216M44511k10603
38937G87561j032046j305901o06008N71379J151051O57238k01478m24724R716
$$ plain form
39002 1992908 1338722 890199 1188680 1733785 1616560 939781 785906 1674245 2780744
38993 2780744 3022730 2380040 1678907 1389264 1154379 450645 -696479 -1754933 -2235182
38984 -2235182 -2113641 -1782960 -1563949 -1247147 -318920 1191637 2357448 2249518 1076191
38975 1076191 -59894 -544207 -802195 -1303316 -1718737 -1589817 -1257330 -1338050 -1604735
38966 -1604735 -1298348 -458827 51420 5083 237651 1143111 1758151 1216333 347177 656503
38956 656503 2079110 3018591 2669057 2055789 2304805 2929686 2686972 1508464 596130
38947 596130 742980 1396384 1544098 934518 133896 -241055 -20563 553653 998164 787561
38937 787561 -244485 -1550386 -2156394 -1585015 -433964 223274 21796 -402928 -393212
38928c93212K40229j62873n86673l42486K90674N16524K21591P8609M45764P79544
38918A087691M52053k67525n63474k89013k29833q74120j414287o73471J058615
38909a713364J979521R79252q25463j506492p61203O9436J60950J17455N11615
38900i88293P88645L38520l16387l52625O248J100k42327Q0323R59845J373121
38890A648170P62370j52424l93200N0914L95023Q2051o62968j117969q01335n4988
38880b44356K40512k16832n99607j3177J136578J564814Q60865J0679m6309L71372
38870C064539L52436l03753r98911j219726r92598n98026k38589K5128K41169
38861f68331M58421N74027M13708L8993k06110q3242K31676L30510q786o01221
$$ plain form
38928 -393212 -152983 -315856 -902529 -1245015 -954341 -437817 -216226 -137617 308147 1087691
38918 1087691 1539744 1272219 708745 419732 189899 -684221 -2098508 -2771979 -1713364
38909 -1713364 266157 1245409 419946 -1086546 -1847749 -1778313 -1617363 -1499908 -988293
38900 -988293 -199648 138872 -177515 -530140 -523892 -522792 -765119 -684796 275049 1648170
38890 1648170 2410540 2258116 1864916 1915830 2310853 2392904 1729936 611967 -189368 -244356
38880 -244356 -3844 -220676 -820283 -833460 303118 1867932 2728797 2739476 2693167 3064539
38870 3064539 3416975 3113222 2114311 894585 -98013 -696039 -934628 -909500 -668331
38861 -668331 -209910 364117 777825 816818 610708 527466 759142 1089652 1080866 479645
38851D79645r73857p71473j55074L38029M70691N83320R30590J097392N90888
38842B590151k53217o39139m69785l74621n57649m64066J54313O42421L61653
38833I90061m15664j009267j199863j105904o81882Q2162P88131R89038P14648
38824h48540K76194j55119m34201l15670J08226K47911j67200m93000l8163P75885
38814a043677Q85928R1291o97587p69718m21439k05117k9361M89612J125652J078838
38804E04422M122j325835j689604p62561M82522R33548O23737M04652N54108M98856
38794B27967J9017k17364J79943M93769M5702n25490j79610P85306J109970N16478
38784B455688M4N5224q8207r38743j590805r96700L19343Q24299J42j041887j014988
$$ plain form
38851 479645 -494212 -1265685 -1420759 -1082730 -612039 -28719 901871 1999263 2590151
38842 2590151 2336934 1697795 1228010 853389 295740 -168326 -14013 628408 990061
38833 990061 574397 -434870 -1634733 -2740637 -3422519 -3340357 -2552226 -1563188 -848540
38824 -848540 -572346 -727465 -1161666 -1477336 -1369110 -1121199 -1288399 -1781399 -1819562 -1043677
38814 -1043677 -157749 -66458 -764045 -1533763 -1955202 -2160319 -2189680 -1700068 -574416 504422
38804 504422 508544 -817291 -2506895 -3269456 -2786934 -1853386 -1229649 -824997 -270889 227967
38794 227967 246984 29620 209563 703332 749034 223544 43934 829240 1939210 2455688
38784 2455688 2455732 2510956 2422749 1484006 -106799 -1103499 -784156 40143 40285 -1001602 -2016590
38773b016590N8831J000117Q13136k89319j145293q89845J39962Q75258P54496
38764f99247J77627j89438j00504L15926P63562P89434J34100o77345o65804K88507
38754A36818J015946M94533p42901j327495q57988j81465J2568J3839L22470P88574
38744c25101R20105N90720N1772m59332p93230q11045n41413k41618m9542K34165
38734a424519P35579J069629P04667k61699j043400r83454k23179N11416O21356
38725b93604R9501n15022n71117J11571R62610J110718K82082q22350j206118
38716h41729o27400J55461K42147l75051p74935k19781P98466R77040j52735j385440
38706b203957j161671M44328J735539J469743J97080p90192j086720j115666j038738
$$ plain form
38773 -2016590 -1957759 -957642 -144506 -433825 -1579118 -2468963 -2329001 -1453743 -699247
38764 -699247 -521620 -711058 -811562 -495636 267926 1057360 1191460 514115 -151689 136818
38754 136818 1152764 1647297 904396 -423099 -1281087 -1462552 -1449984 -1436145 -1113675 -325101
38744 -325101 595004 1185724 1237496 778164 -15066 -826111 -1367524 -1609142 -1658684 -1424519
38734 -1424519 -688940 380689 1085356 823657 -219743 -1203197 -1426376 -914960 -293604
38725 -293604 -194103 -709125 -1280242 -1168671 -206061 904657 1186739 364389 -841729
38716 -841729 -1469129 -1313668 -1071521 -1446572 -2221507 -2441288 -1642822 -665782 -818517 -2203957
38706 -2203957 -3365628 -2921300 -1185761 283982 481062 -309130 -1395850 -2511516 -3550254
38697c550254o25853K6029N05599P81495J139604J434932J155254L01951n07641
38688F61116r10749j065263r90533m80885J68104K72688j05312r9590M77548O50262
38678a422614q2002o99645k15623O50260N56906l61623q21391m24307R849L6035
38668b774155J53080N96978P75944L47155o7654K33225J035296J502855J068960
38659B871684j46822j399249j742952q65281M73727J243222J248040R53072N35183
38650C170624r7679n86503m24276M4839o9284q20280j339419j231677r82758p98512
38640c134925k41231O05949Q58711L23395R3230Q55254J665560J379873M04946
38631B810762o2045J59434L19836J31212n3936j51207l80621n46771k25713L68757
$$ plain form
38697 -3550254 -4176107 -4150078 -3644479 -2862984 -1723380 -288448 866806 1168757 661116
38688 661116 -249633 -1314896 -2305429 -2786314 -2618210 -2345522 -2450834 -2550424 -2072876 -1422614
38678 -1422614 -1504616 -2204261 -2419884 -1769624 -1212718 -1574341 -2395732 -2820039 -2810190 -2774155
38668 -2774155 -2621075 -2024097 -1248153 -900998 -968652 -735427 299869 1802724 2871684
38659 2871684 2724862 1325613 -417339 -1282620 -808893 434329 1682369 2635441 3170624
38650 3170624 3072945 2486442 2062166 2107005 2037721 1217441 -121978 -1353655 -2336413 -3134925
38640 -3134925 -3376156 -2770207 -1911496 -1588101 -1494871 -639617 1025943 2405816 2810762
38631 2810762 2748717 2908151 3227987 3359199 3305263 3154056 2773435 2226664 2000951 2369708
38621B369708N15812J5083n63328o79197l64309J349M4587l64442r07126j059020
38611i90883p87349o11619o99815n17944J70177O74196M36937M3045K98518Q76752
38601a107985Q67810K32958l11464m99341n59816l86524K18525P21910M54539
38592c69388j48905j35935K82322L2781q12730q92476K11047J107488O64885l75387
38582d36298p30483m06410j76547j35880P7610K34494j39501o73037m77348M75467
38572b387933J173352Q89339N8595l57741M508O03417O50762J0299o07373m93485
38562d56260J32618M34527J37800j87670j20048L8780j5856l06L14581M78888
38552G57054N8742m73224k93718N33362J079071P80459P2125k87876r8057K01931
$$ plain form
38621 2369708 2885520 2900603 2337275 1658078 1293769 1295118 1339705 975263 68137 -990883
38611 -990883 -1778232 -2389851 -3089666 -3607610 -3437433 -2763237 -2326300 -2283255 -1984737 -1107985
38601 -1107985 -240175 -7217 -318681 -818022 -1377838 -1764362 -1545837 -823927 -369388
38592 -369388 -518293 -654228 -371906 -339125 -1151855 -2044331 -1833284 -725796 -60911 -436298
38582 -436298 -1166781 -1573191 -1749738 -1885618 -1808008 -1573514 -1713015 -2386052 -2863400 -2387933
38572 -2387933 -1214581 -325242 -266647 -624388 -619880 -16463 634299 644598 37225 -456260
38562 -456260 -323642 110885 248685 61015 -59033 -20253 -36109 -36415 278166 757054
38552 757054 815796 342572 48854 582216 1661287 2441746 2513871 2225995 2127938 2329869
38542B329869Q0091n31865j134978j157037n73881J19940N23556N81256K52195
38533D89146n00564j212010j067923r250Q64127N91824l46646o86010n2283P16730
38523a212859Q18690L80717L4113J14573M41966N93618L16745j71604l82682j94779
38513G38498m4811k59316n47168n15317l08177k43515j73040J80498N52696N22423
38503i7229L37525N25776P96043K89115r43201j665106j053357K11077R31642
38494f67715Q34296M82474K92323K40687K08717Q0125k57720o10627m95486J35855
38484B42929N80342K88348l02413m25831j04312J09350J76455M62496P58192M49123
38474B234679k73258m57098N8043K38881m34453r38784k76181Q30542R80248K20712
$$ plain form
38542 2329869 2409960 1878095 743117 -413920 -987801 -867861 -344305 236951 489146
38533 489146 -11418 -1223428 -2291351 -2300601 -1436474 -844650 -1191296 -1877306 -1929589 -1212859
38523 -1212859 -394169 -13452 20661 135234 577200 1170818 1487563 1315959 933277 738498
38513 738498 693687 434371 -112797 -628114 -936291 -1179806 -1352846 -1172348 -619652 -97229
38503 -97229 240296 766072 1562115 1851230 908029 -757077 -1810434 -1599357 -667715
38494 -667715 166581 649055 941378 1182065 1390782 1470907 1213187 602560 107074 242929
38484 242929 823271 1111619 809206 383375 279063 388413 564868 1027364 1785556 2234679
38474 2234679 1961421 1504323 1562366 1801247 1366794 428010 151829 982371 1962619 2183331
38464B183331j90744J50278L70034k5581m35974m22026m31702p49261q18432k74338
38454f44415K95525L32633J85473K63857J95018k91627m93247J61217Q61705N37320
38444A403459l13685l10591N89438J010314K80223p36045j106101q91297m71394
38435e45679M7316M22015L22060R9302M71422J149652R36908l82021j442745j201908
38425a23678l10302J44311J94067L96068O14547M23092M1602q7591j08102k83713
38415I00301k79580K35593P70926O43693J7260m28052m39928j82931J75814K63577
38405A676673m15305j502141j722121o54320L52540J05096n51022j56733Q99092
38396a968241J055455J88382l17941M8766L14488o3519l77803j62254K659l08656
$$ plain form
38464 2183331 1992587 2142865 2512899 2487318 2051344 1629318 1197616 448355 -370077 -644415
38454 -644415 -348890 -16257 169216 433073 628091 336464 -156783 4434 866139 1403459
38444 1403459 1089774 779183 1368621 2378935 2659158 1923113 817012 -74285 -545679
38435 -545679 -498363 -76348 245712 345014 816436 1966088 2902996 2520975 1078230 -123678
38425 -123678 -433980 -289669 -95602 300466 915013 1338105 1379707 1292116 1184014 900301
38415 900301 620721 856314 1627240 2270933 2288193 1860141 1420213 1237282 1413096 1676673
38405 1676673 1261368 -240773 -1962894 -2617214 -2264674 -2159578 -2710600 -2867333 -1968241
38396 -1968241 -912786 -724404 -1042345 -993579 -679091 -742610 -1120413 -1282667 -1280008 -1588664
38386a588664o33603n80946m00361k08184K39006O78010M43019k15257j82480
38377b449460P18685J298597Q98919L47074L31822K36427m77616j031699o13803
38368g41054J84339L87863J50067P7142k9468m74879n73569K97460J220473Q77577
38358A375951k69838n64182K67405P52293L6001r07310q77039l6812O69988P63843
38348A210300L29444l98735j027433j112237o68569j56356K26174O87241J121528
38339B11357R56769J03228n71308k66136O56045J137628P44416J5950l78212l51747
38329B257990k01702n1448K45846P08404R95917Q30907N90189J038086K185958
38320H600147K799683J647888q19916k680564k639873j408314n98122o84292p16584
$$ plain form
38386 -1588664 -2222267 -2803213 -3203574 -3411758 -3172752 -2494742 -2051723 -2266980 -2449460
38377 -2449460 -1730775 -432178 466741 813815 1145637 1382064 904448 -127251 -741054
38368 -741054 -556715 -168852 -18785 58357 28889 -445990 -1019559 -722099 498374 1375951
38358 1375951 1106113 541931 809336 1561629 1597630 690320 -186719 -223531 446457 1210300
38348 1210300 1539744 1141009 113576 -998661 -1667230 -1823586 -1597412 -910171 211357
38339 211357 1168126 1271354 700046 433910 1089955 2227583 2971999 2987949 2609737 2257990
38329 2257990 2056288 2004840 2250686 2959090 3955007 4785914 5376103 6414189 8600147
38320 8600147 11399830 13047718 12227802 9547238 6907365 5499051 4900929 4216637 3500053
38311C500053M7088J001807J086355K84414m60991o61965p92388j188113j285570
38302A530690n72202L41439M78940l7317k68815m9763j80595r11409j369865r31179
38292a970076j60383J98932L00531N74400Q08244O31704K80559J06176p7503l79226
38282C13358k21900P06407J481084J022548k64621j065287j043625r53173j067723
38273a092932q33464j47203K96144K02338J01479K48486J55155l83781p87420
38264b241198o73606m37524l68103q4582N92512J070330R22556O08734N71513
38255c9368L93287l27800r56430o65510J61159M02814j41794n39412j47896N78597
38245a282353Q53970N09426p160j85710R0953M13127K54542k84809m64361K4690
$$ plain form
38311 3500053 3547141 4548948 5635303 5919717 5458726 4796761 4004373 2816260 1530690
38302 1530690 958488 1299927 1778867 1741550 1472735 1422972 1242377 330968 -1038897 -1970076
38292 -1970076 -2130459 -1931527 -1630996 -1056596 -248352 383352 663911 770087 692584 313358
38282 313358 91458 797865 2278949 3301497 3036876 1971589 927964 -25209 -1092932
38273 -1092932 -1926396 -2073599 -1777455 -1575117 -1473638 -1225152 -1069997 -1453778 -2241198
38264 -2241198 -2914804 -3352328 -3720431 -3805013 -3212501 -2142171 -1219615 -610881 -39368
38255 -39368 353919 26119 -930311 -1595821 -1434662 -1031848 -1173642 -1713054 -1860950 -1282353
38245 -1282353 -428383 81043 73883 -111827 -20874 392253 646795 361986 -102375 -77685
38235g7685M33653K6469o42197m39053N18006Q23585j95028j423012j473740m97806
38225b946808K45653J34402k86090l01352J72734P87013J156833R63451J62438
38216H8274p22269r10260k15222O75979R67276N65883l1113l85562m04373k03354
38206e74741J3637O8975M0254K05075N22564M52622l02491j136522j193518n36186
38196b440331J9742J85421M61863R58431R35756Q6061o06298j67168Q05024R16131
38186A154632p023p80938p03318m13078o21312r44084n90011L88060J151726J118564
38176b46782N06577k1835l643M06171N41316n5626r70164j266384n86056M14627
38166a281799Q34256M26489l65683r39786r54378n12159o2330R1016J69676N01845
$$ plain form
38235 -77685 355968 382437 -259760 -698813 -180807 642778 447750 -975262 -2449002 -2946808
38225 -2946808 -2701155 -2566753 -2852843 -3154195 -2981461 -2194448 -1037615 -74164 88274
38216 88274 -633995 -1544255 -1759477 -1083498 -116222 449661 418548 32986 -371387 -574741
38206 -574741 -561104 -492129 -451875 -246800 275764 728386 425895 -710627 -1904145 -2440331
38196 -2440331 -2420589 -2235168 -1773305 -814874 120882 206943 -399355 -566523 238501 1154632
38186 1154632 1147609 366671 -336647 -749725 -1371037 -2315121 -2905132 -2517072 -1365346 -246782
38176 -246782 259795 237960 234317 640488 1181804 1126178 156014 -1110370 -1696426 -1281799
38166 -1281799 -447543 -21054 -386737 -1326523 -2280901 -2793060 -2855390 -2764374 -2594698 -2092853
38156b092853Q30265N85329j23849m52614J2699O54143P43195L87372R3474r6562
38146E40599m28525p47481o40077j14435M17905P57227J013790J137144Q57405
38137B793552J92755l82638m58855j62331J9989k24016p17890r46632n51162K43565
38127a93663P56432N13419k50349q19160o89994j4500N88304O52800L34816J68848
38117A046953L04417K51088l59371j066232j137407o38332k77746k19897J53600
38108a942927J063404J691279J235367P3435o99589n74862J7711M19037L61977
38099A644832J9149k58321l33448m83448r36728j251885p47737L33550Q73352
38090a140684M51730L8096M76416J094834P78268j81530n01340Q3330M67219m8022
$$ plain form
38156 -2092853 -1262588 -677259 -801108 -1253722 -1241023 -586880 156315 543687 637161 540599
38146 540599 112074 -635407 -1275484 -1389919 -972014 -214787 799003 1936147 2793552
38137 2793552 2986307 2603669 2144814 1982483 2002472 1778456 1060566 113934 -437228 -193663
38127 -193663 562769 1076188 825839 6679 -683315 -697815 -109511 543289 878105 1046953
38117 1046953 1351370 1602458 1243087 176855 -960552 -1598884 -1876630 -2096527 -1942927
38108 -1942927 -879523 811756 2047123 2120558 1420969 846107 863818 1282855 1644832
38099 1644832 1663981 1405660 1072212 588764 -347964 -1599849 -2347586 -2014036 -1140684
38090 -1140684 -688954 -650858 -174442 920392 1698660 1517130 1015790 1099120 1566339 1518317
38080A518317p44681o80826l9018L13012R3937j62508L9271N24167P05546K87065
38070A854282l98880q00337q10589p67266p82635n33218O7221N21850N19138N29478
38060f00956R84895J297442N73141q71250j640946j030500J18579N68827Q2818
38051e17950o05547p42740k04928N08434P81498N57679L98601O07181O32064q2859
38041A331433r71330r25940O8905Q20036N81443q6638m03079m02039l93452k03659
38031e84320L48014P89774N63175q7174m51007l63290k82931m84679p16552o64725
38021a933715l39452O5922M11125O18392O03677K89596k77351p76825p25974j0158
38011b074763P57299P77371K6605o80224o83639j75237K21712J86529j69885n58319
$$ plain form
38080 1518317 773636 92810 53792 366804 460741 298233 337504 861671 1567217 1854282
38070 1854282 1455402 655065 -155524 -922790 -1705425 -2238643 -2171422 -1649572 -1130434 -600956
38060 -600956 383939 1681381 2254522 1383272 -257674 -1288174 -1169595 -600768 -517950
38051 -517950 -1123497 -1866237 -2071165 -1562731 -781233 -223554 175047 782228 1414292 1331433
38041 1331433 360103 -565837 -496932 323104 904547 817909 414830 12791 -380661 -584320
38031 -584320 -236306 553468 1116643 1029469 578462 215172 -67759 -552438 -1268990 -1933715
38021 -1933715 -2273167 -2207245 -1796120 -1177728 -574051 -284455 -561806 -1338631 -2064605 -2074763
38011 -2074763 -1317464 -540093 -513488 -1193712 -1877351 -2052588 -1830876 -1644347 -1814232 -2372551
38001b372551o58026k84729L68473Q57169R68874Q51469O21459J90998m14132
37992A29004r17847j099647r22422l35036N96033J306866J103484J60185m37096
37983d16476l1699P24521P85776N8858p09168j046093j110769j052217o48637
37974c445904K15726J060802J122585K26897p71918p29939M36196J485930J340595
37965I40970M48347k0705J0899l87459j291693j511907n44395L55306j1272r12778
37955b924687q22773K74472J035924Q44314L88060K01475q4036p21930j121157
37946b930338o68102L54734J121475J145806N56862j43948m14167q4729M11979
37937f50428M82560O8302l70295n00830m01443k64366k04470k98906m19320j31146
$$ plain form
38001 -2372551 -3030577 -3315306 -2946833 -2089664 -1120790 -269321 352138 543136 129004
37992 129004 -788843 -1888490 -2810912 -3145948 -2549915 -1243049 -139565 20620 -416476
37983 -416476 -448175 276346 1062122 1120980 411812 -634281 -1745050 -2797267 -3445904
37974 -3445904 -3230178 -2169376 -1046791 -819894 -1591812 -2321751 -1885555 -399625 940970
37965 940970 1389317 1368612 1379511 992052 -299641 -1811548 -2355943 -2000637 -2011909 -2924687
37955 -2924687 -3747460 -3472988 -2437064 -1592750 -1204690 -1003215 -1087251 -1809181 -2930338
37946 -2930338 -3598440 -3243706 -2122231 -976425 -419563 -563511 -977678 -1062407 -650428
37937 -650428 -167868 -99566 -469861 -970691 -1372134 -1636500 -1840970 -2139876 -2559196 -2690342
37927b690342P55333J611336J533076M91118n99432j016858q91585o32422l14984
37918a754760P5448L06888K11008K8330R5891L72424N39916M61721L40803M52096
37908A129765P78226R05784M07757n51889j206776j035837m01556J0468J38882
37899A74824M05922P91676P28087q316r06771j400181j409278j034181k64907
37890b923125O86106J236704J040393M75075K04973M40604Q37791R16276M22393
37881C337190m66527j148141j091483m80586m1875o4522k969O25547J320385J090057
37871C077076k23423j557536j703262n80252O84883R35660J73353n51796m48423
37862a93720J19218L06913K5091r2918J70676K80542o3585l45238q8028L07115
$$ plain form
37927 -2690342 -1935009 -323673 1209403 1700521 1101089 84231 -807354 -1439776 -1754760
37918 -1754760 -1679312 -1372424 -1161416 -1133086 -1037195 -664771 -124855 336866 677669 1129765
37908 1129765 1907991 2813775 3221532 2669643 1462867 427030 25474 35942 174824
37899 174824 580746 1372422 2100509 2092193 1185422 -214759 -1624037 -2658218 -2923125
37890 -2923125 -2237019 -1000315 40078 515153 720126 1160730 1998521 2914797 3337190
37881 3337190 2870663 1722522 631039 150453 108578 44056 41087 666634 1987019 3077076
37871 3077076 2853653 1296117 -407145 -987397 -302514 633146 806499 254703 -193720
37862 -193720 -74502 232411 257502 164584 335260 615802 552217 206979 118951 426066
37852D26066K05784j84496j04076N58532J053711P94494M318p87144j350996j598205
37842i82012j290646l91365N13854O70526Q9752l81002j12625N18762P28188M33794
37832b02774K36780L58094K80845k87701p57096n20820M982k8049n45005o68396
37822b129140j55339K45624J17362J02518P38875J356352J000333L758l38457
37813I41886M07865J214292J034313J31846m65922l47626K5234K20448L66311
37804C528647O71239R18320P96725M71791L96897O32833P73215N78028K50066
37795I017761m2278m42845r34751j049389m88459L06123O97758O88470O58884
37786H411274N32434j02156j101991j709188j495157q12429k10319O9280o0478
$$ plain form
37852 426066 631850 447354 343278 901810 1955521 2750015 2754333 1967189 616193 -982012
37842 -982012 -2272658 -2664023 -2150169 -1479643 -1389891 -1770893 -1883518 -1364756 -636568 -202774
37832 -202774 34006 392100 672945 385244 -371852 -892672 -887690 -915739 -1460744 -2129140
37822 -2129140 -2284479 -2038855 -1921493 -1818975 -1080100 276252 1276585 1280343 941886
37813 941886 1349751 2564043 3598356 3730202 3264280 2916654 2941888 3162336 3528647
37804 3528647 4199886 5118206 5914931 6386722 6783619 7416452 8189667 8767695 9017761
37795 9017761 8975483 8532638 7597887 6548498 6060039 6366162 7063920 7752390 8411274
37786 8411274 8943708 8841552 7739561 6030373 4535216 3722787 3512468 3581748 3521270
37777C521270n83308j087379r80491k84551K22559m9782p41395r59325k59018
37768a201420Q67435J318774L74782j308881k018884q95303P92845J115330k9384
37759i84706r65182o68844J68159O79299R65147J162101Q02186m6364l04971L88721
37749A195546O99485l59900j516132j006706N50859R59423k39124j197618o53723
37740a567890M15989N96123K3666k42389J65758P54883R88413O71813k7903n74593
37730A203870n08393j06182r8867o10705r81132p60952k10329L35745Q38882J075808
37720A77745O08004l83196r69148o37467M3412L27906K11157K3903j74879k64154
37710a036717J59607R77681J183100J82879j037044j039847M9819P00769J00507
$$ plain form
37777 3521270 2937962 1850583 870092 585541 808100 758318 16923 -942402 -1201420
37768 -1201420 -333985 984789 1359571 50690 -1968194 -2863497 -2070652 -955322 -984706
37759 -984706 -1949888 -2618732 -2450573 -1771274 -806127 355974 1158160 1111796 806825 1195546
37749 1195546 1895031 1535131 18999 -987707 -436848 522575 283451 -914167 -1567890
37740 -1567890 -1151901 -555778 -532112 -774501 -608743 146140 1134553 1806366 1778463 1203870
37730 1203870 695477 589295 490428 -120277 -1101409 -1862361 -2072690 -1736945 -898063 177745
37720 177745 785749 402553 -566595 -1204062 -1160650 -832744 -621587 -597684 -772563 -1036717
37710 -1036717 -877110 100571 1283671 1466550 429506 -610341 -560522 140247 240754
37701B40754r07822j237208r51100p20712o11047j78248N38977R03604O19357
37692b303445K07506K83379P14560Q37614L43717l80958p52037n45573K2547M98587
37682a074103M77596j04l31037m86O31812P05083J13978k85640m3271Q8236o26571
37671c44507j558506j521734n14113L80490O12241N92716N40747R2605o59506
37662b379567q52955j29409O57278O46701J68129L3833K33024J63218j68130m8366
37652a676244P82298J526686J212292m9393j017057p06876L09328M64315p43009
37643A02340j865328j327085L97299J426294J012756K09865k4454l876j67579
37634b39768r2570N32873R97789N95838j96008m80845k48667n8113k2033Q050
$$ plain form
37701 240754 -667068 -1904276 -2855376 -3576088 -4187135 -4365383 -3826406 -2922802 -2303445
37692 -2303445 -2095939 -1812560 -1098000 -260386 83331 -297627 -1049664 -1595237 -1572690 -1074103
37682 -1074103 -596507 -596611 -927648 -928134 -296322 408761 522739 237099 193828 282064 -344507
37671 -344507 -1903013 -3424747 -3938860 -3558370 -2946129 -2353413 -1812666 -1720061 -2379567
37662 -2379567 -3232522 -3361931 -2704653 -2057952 -1889823 -1855990 -1622966 -1459748 -1627878 -1676244
37652 -1676244 -893946 632740 1845032 1795639 778582 71706 381034 845349 102340
37643 102340 -1762988 -3090073 -2692774 -1266480 -253724 -43859 -68313 -72189 -239768
37634 -239768 -332338 200535 1198324 1794162 1598154 1117309 868642 810529 788496 796546
37624G96546j67646n87670n74569K74280J033258N52174p04657j146954k81719
37615h06957P40823Q88166M45151J72906J85067P5874m16046j151683j622188
37606a488887j252552j24840P83056O81133O0461k9507M64767P12859N08049N25739
37596H40278R63504J061537L48479n95988j048117r67957n38726K34950R94250
37587A292210R79583J37936n11156l02148L0885m45807j273224j222104j45531
37578a459356Q19236Q28877K29699k07777j99906J02403M68645O07230K71779
37569A460830l46856o42248k95432K74694M71801L49610M43623P82049O27463
37560C125534m22308j525531j507523n37538O183m54958q28531j07184R42853
$$ plain form
37624 796546 628900 41230 -533339 -259059 774199 1326373 621716 -525238 -806957
37615 -806957 -66134 822032 1267183 1440089 1625156 1701030 1284984 133301 -1488887
37606 -1488887 -2741439 -2866279 -2083223 -1402090 -1341629 -1371136 -906369 -193510 314539 840278
37596 840278 1803782 2865319 3213798 2617810 1569693 601736 63010 297960 1292210
37587 1292210 2271793 2409729 1898573 1596425 1627310 1181503 -91721 -1313825 -1459356
37578 -1459356 -640120 188757 418456 210679 10773 113176 581821 1189051 1460830
37569 1460830 1113974 471726 176294 450988 922789 1272399 1716022 2498071 3125534
37560 3125534 2703226 1177695 -329828 -867366 -861183 -1316141 -2144672 -2251856 -1309003
37551a309003R11857o4295n63205q2300L89979J12440m02394m78806k21384J08223
37541a598888N97989J009483O20681n55408j326920q97684m4966J49710o0782
37532b106785K19655Q44030Q58595J19443m95455m46901j31950n6262k01332l12557
37522a709519k06356K26866Q08942R66906L73580m60538p76639n27514j74720
37513a478992J51399N58774P65925M48336J4158Q0216K96679k21748j240383j372768
37503a998404r9852J220746J015172n46054j885601j844350o42013O45613J146607
37494b988136R14582P43464J048697J113339N4322j594163k197163j100529N36854
37485c468733J334299J180991O80480J12550l21682j28352O56727R81965J48507
$$ plain form
37551 -1309003 -397146 -461441 -1024646 -1106946 -716967 -604527 -1006921 -1485727 -1707111 -1598888
37541 -1598888 -1000899 8584 629265 73857 -1253063 -2150747 -2195713 -2046003 -2106785
37532 -2106785 -1887130 -1043100 -184505 -65062 -560517 -1007418 -1139368 -1195630 -1396962 -1709519
37522 -1709519 -1915875 -1689009 -880067 86839 460419 -119 -776758 -1304272 -1478992
37513 -1478992 -1327593 -768819 -2894 445442 459600 539816 836495 614747 -625636 -1998404
37503 -1998404 -2098256 -877510 137662 -408392 -2293993 -4138343 -4780356 -4134743 -2988136
37494 -2988136 -2073554 -1330090 -281393 831946 886268 -707895 -2905058 -4005587 -3468733
37485 -3468733 -2134434 -953443 -272963 -160413 -482095 -610447 46280 1028245 1176752
37476A176752q97019p53830L64980R73208N09544r6797j25315m5723l90757p39618
37466b4575n08346j5024j0847n36401q68892m67840M19649J044848Q92038K17563
37456A42173j80523O3115L32834r8725q77338r76188k35965M18052M49763L65698
37446e97104M86739K04971p21253j173124j91224J234610J341632J91690m63171
37437C13766J14331P04039K77104m80145n95633m15106o45459q38757j89479Q17968
37427i37371R78154K57519k28974n759L11617L64021M81353N44348j51868j327779
37417B85261j389508L45787K159161J898714k03546j908300j803022n78789L96742
$$ plain form
37476 1176752 279733 -474097 -109117 864091 1373635 1276838 1151523 1105800 715043 -24575
37466 -24575 -532921 -547945 -558792 -1095193 -1964085 -2431925 -2012276 -967428 -75390 142173
37456 142173 -38350 24765 357599 258874 -618464 -1594652 -1830617 -1412565 -962802 -597104
37446 -597104 -110365 94606 -626647 -1799771 -1990995 -756385 585247 776937 313766
37437 313766 428097 1132136 1409240 929095 333462 -81644 -727103 -1565860 -1755339 -937371
37427 -937371 40783 298302 69328 63569 375186 739207 1220560 1764908 1613040 285261
37417 285261 -1104247 -758460 1400701 3299415 3095869 1187569 -615453 -1194242 -797500
$$ [...]
##END NTUPLES=NMR SPECTRUM
##END=
