##TITLE=31Pdec_LR-798-RM1
 CDCl3, 64 sc
 6.3.2025
##JCAMPDX= 6.0         $$ Bruker NMR JCAMP-DX V2.0
##DATA TYPE= NMR SPECTRUM
##DATA CLASS= NTUPLES
##ORIGIN= UXNMR, Bruker Analytische Messtechnik GmbH
##OWNER= root
$$ XWIN-NMR		Version 3.5
$$ Thu Mar  6 16:51:44 2025 Russian Standard Time (UT+4h)  she@DPX200
##.OBSERVE FREQUENCY= 81.013821
##.OBSERVE NUCLEUS= ^31P
##.ACQUISITION MODE= SIMULTANEOUS
##.ACQUISITION SCHEME= undefined
##.AVERAGES= 24
##.DIGITISER RES= 17
##SPECTROMETER/DATA SYSTEM= spect
##.PULSE SEQUENCE= zgpg30
##.SOLVENT NAME= CDCl3
##.SHIFT REFERENCE= (INTERNAL, CDCl3, 0, 198.062)
##AUDIT TRAIL= $$ (NUMBER, WHEN, WHO, WHERE, WHAT)
$$ ##TITLE= Audit trail, XWIN-NMR		Version 3.5
$$ ##JCAMPDX= 5.01
$$ ##ORIGIN= Bruker BioSpin GmbH
$$ ##OWNER= she
$$ F:/spectra/data/she/nmr/P31/2/pdata/1/auditp.txt
$$ ##AUDIT TRAIL=  $$ (NUMBER, WHEN, WHO, WHERE, WHAT)
(   1,<2025-03-06 16:50:52.04 +0400>,<she>,<DPX200>,
      <created by zg, POWCHK disabled, PULCHK disabled
       configuration hash MD5:
       00 E9 B6 7A A2 85 ED C7 34 08 36 98 17 FE 4E 26
       data hash MD5: 32K
       DA B5 67 EC FD A1 B4 E2 28 E4 A6 5F F5 B9 33 E9>)
(   2,<2025-03-06 16:50:56.07 +0400>,<she>,<DPX200>,
      <Start of raw data processing
       efp BC_mod = 2 LB = 1.5 FT_mod = 6 PKNL = 1 PHC0 = 1856.038 PHC1 = -137.9056 SI = 64K 
       data hash MD5: 64K
       31 30 21 FB FE FD AA B9 7B 3A 61 8F 5E 42 E2 08>)
(   3,<2025-03-06 16:51:13.00 +0400>,<she>,<DPX200>,
      <pk PHC0 = 4.666216 PHC1 = -7.4 
       data hash MD5: 64K
       70 4E F1 AD F3 AF B2 A9 2E D9 29 A5 7F 23 D3 79>)
(   4,<2025-03-06 16:51:19.40 +0400>,<she>,<DPX200>,
      <abs ABSG = 5 
       data hash MD5: 64K
       D9 98 A5 EF 40 3B 04 DF 7B 7A 3A 00 6F C1 7A 61>)
$$ ##END=
$$ 
$$ hash MD5
$$ 23 4B A8 BE D6 37 CC CF 58 C2 F8 1E A5 B9 A5 3E
##$RELAX= 
##$RELAX= 
##$RELAX= 
##$RELAX= 
##$RELAX= 
##$RELAX= 
##$RELAX= 
##$RELAX= 
$$ Bruker specific parameters
$$ --------------------------
##$DU= <F:/spectra>
##$EXPNO= 2
##$NAME= <P31>
##$PROCNO= 1
##$TYPE= <nmr>
##$USER= <she>
##$AMP= (0..31)
100 100 100 100 100 100 100 100 100 100 100 100 100 100 100 100 100 100 
100 100 100 100 100 100 100 100 100 100 100 100 100 100 
##$AQSEQ= 0
##$AQ_mod= 1
##$AUNM= <au_zg>
##$AUTOPOS= <>
##$BF1= 81.014009
##$BF2= 200.13
##$BF3= 200.13
##$BF4= 200.13
##$BF5= 200.13
##$BF6= 200.13
##$BF7= 200.13
##$BF8= 200.13
##$BYTORDA= 1
##$CFDGTYP= 0
##$CFRGTYP= 5
##$CHEMSTR= <none>
##$CNST= (0..31)
1 1 145 1 1 1 1 1 1 1 1 1 1 1 1 1 1 1 1 1 1 1 1 1 1 1 1 1 1 1 1 1 
##$CPDPRG= <waltz16>
##$CPDPRG1= <>
##$CPDPRG2= <waltz16>
##$CPDPRG3= <>
##$CPDPRG4= <mlev>
##$CPDPRG5= <mlev>
##$CPDPRG6= <mlev>
##$CPDPRG7= <mlev>
##$CPDPRG8= <mlev>
##$CPDPRGB= <>
##$CPDPRGT= <>
##$D= (0..31)
0 1 0 0 0 0 0 0 0 0.06 0 0.03 2e-05 3e-06 0 0 0.0002 0 0 0 0 0 0 0 0 0 
0 0 0 0 0 0 
##$DATE= 1741265451
##$DBL= (0..7)
120 120 120 11 120 120 24 19 
##$DBP= (0..7)
150 150 150 150 150 150 150 150 
##$DBP07= 0
##$DBPNAM0= <>
##$DBPNAM1= <>
$$ [...]
##$SUBNAM3= <"">
##$SUBNAM4= <"">
##$SUBNAM5= <"">
##$SUBNAM6= <"">
##$SUBNAM7= <"">
##$SUBNAM8= <"">
##$SUBNAM9= <"">
##$SW= 400.765351723535
##$SWIBOX= (0..15)
0 1 3 0 0 0 0 0 0 0 0 0 0 0 0 0 
##$SW_h= 32467.5324675325
##$TD= 32768
##$TD0= 1
##$TE= 0
##$TE2= 300
##$TE3= 300
##$TEG= 300
##$TL= (0..7)
0 120 53 12 22 120 120 120 
##$TP= (0..7)
150 150 150 150 150 150 150 150 
##$TP07= 0
##$TPNAME0= <>
##$TPNAME1= <>
##$TPNAME2= <>
##$TPNAME3= <>
##$TPNAME4= <>
##$TPNAME5= <>
##$TPNAME6= <>
##$TPNAME7= <>
##$TPOAL= (0..7)
0.5 0.5 0.5 0.5 0.5 0.5 0.5 0.5 
##$TPOFFS= (0..7)
0 0 0 0 0 0 0 0 
##$TUNHIN= 0
##$TUNHOUT= 0
##$TUNXOUT= 0
##$USERA1= <user>
##$USERA2= <user>
##$USERA3= <user>
##$USERA4= <user>
##$USERA5= <user>
##$V9= 5
##$VALIST= <valist>
##$VCLIST= <CCCCCCCCCCCCCCC>
##$VD= 0
##$VDLIST= <DDDDDDDDDDDDDDD>
##$VPLIST= <PPPPPPPPPPPPPPP>
##$VTLIST= <TTTTTTTTTTTTTTT>
##$WBST= 1024
##$WBSW= 4
##$XGAIN= (0..3)
0 0 0 0 
##$XL= 0
##$YL= 0
##$YMAX_a= 4933
##$YMIN_a= -17168
##$ZGOPTNS= <>
##$ZL1= 120
##$ZL2= 120
##$ZL3= 120
##$ZL4= 120
##$ABSF1= 198.0616
##$ABSF2= -202.7028
##$ABSG= 5
##$ABSL= 3
##$ALPHA= 0
##$AQORDER= 0
##$ASSFAC= 0
##$ASSFACI= 0
##$ASSFACX= 0
##$ASSWID= 0
##$AUNMP= <proc_1d>
##$AZFE= 0.1
##$AZFW= 0.5
##$BCFW= 0
##$BC_mod= 2
##$BYTORDP= 0
##$COROFFS= 0
##$CY= -3
##$DATMOD= 1
##$DC= 0
##$DFILT= <>
##$DTYPP= 0
##$F1P= 0
##$F2P= 0
##$FCOR= 1
##$FTSIZE= 65536
##$FT_mod= 6
##$GAMMA= 0
##$GB= 0
##$INTBC= 1
##$INTSCL= 9.790993e-09
##$ISEN= 30
##$LB= 1.5
##$LEV0= 0
##$LPBIN= 0
##$MAXI= 10000
##$MC2= 0
##$MEAN= 0
##$ME_mod= 0
##$MI= 50
##$NCOEF= 0
##$NC_proc= -7
##$NLEV= 6
##$NOISF1= 182.463
##$NOISF2= 159.3651
##$NSP= 0
##$NTH_PI= 0
##$NZP= 0
##$OFFSET= 198.0616
##$PC= 4
##$PHC0= 1860.704
##$PHC1= -145.3056
##$PH_mod= 1
##$PKNL= yes
##$PPARMOD= 0
##$PSCAL= 0
##$PSIGN= 0
##$REVERSE= no
##$SF= 81.0140089999434
##$SI= 65536
##$SIGF1= 159.3651
##$SIGF2= -187.1042
##$SINO= 113.3802
##$SIOLD= 16384
##$SREGLST= <1H.CDCl3>
##$SSB= 0
##$STSI= 65536
##$STSR= 0
##$SW_p= 32467.5324675325
##$SYMM= 0
##$S_DEV= 0
##$TDeff= 32768
##$TDoff= 0
##$TI= <>
##$TILT= no
##$TM1= 0
##$TM2= 0
##$TOPLEV= 0
##$USERP1= <user>
##$USERP2= <user>
##$USERP3= <user>
##$USERP4= <user>
##$USERP5= <user>
##$WDW= 1
##$XDIM= 65536
##$YMAX_p= 472351707
##$YMIN_p= -33003188
$$ End of Bruker specific parameters
$$ ---------------------------------
##NTUPLES= NMR SPECTRUM
##VAR_NAME=  FREQUENCY,     SPECTRUM/REAL,   SPECTRUM/IMAG
##SYMBOL=    X,             R,               I
##VAR_TYPE=  INDEPENDENT,   DEPENDENT,       DEPENDENT
##VAR_FORM=  AFFN,          ASDF,            ASDF
##VAR_DIM=   65536,         65536,           65536
##UNITS=     HZ,            ARBITRARY UNITS, ARBITRARY UNITS
##FACTOR=    0.49542278885378, 1,            1
##FIRST=     16045.7642231865, 0,            0
##LAST=      -16421.768244346, 0,            0
##MIN=       -16421.768244346, -33003188,    0
##MAX=       16045.7642231865, 472351707,    0
$$ Real data points
##PAGE= N=1
##DATA TABLE= (X++(R..R)), XYDATA
$$ [...]
43026b80612M38880L16403Q25801J243660N50319q72605j411272m17429Q11620
43017A204765Q49111J318n02379m35858n51927r83353r17119j1401R10017J016239
43007E79413N33121J03820k48457p74723j081691n19633N87508J053073M23074
42998F55505l65843l78433K6761P005k89144p6135N27615M86914m81449j307448
42988a194652j078051k51243K38125L14592M40689N65670L13355j13737j30640
42979h95892K45856M20606K03448J1366M5858J7616j54300p9467L84107P46381
42969I45579N82856J60715J0428K23402N04658O38412N88209L43328n8577m73468
42959C465542p69185q84149p41184l35704O1915R9661j85332m05137m00194m02822
$$ y = [-280612, 158268, 474671, 1300472, 2544132, 3094451, 2221846, 810574, 393145, 1204765, 2053876, 2055194, 1552815, 1116957, 565030, -418323, -1335442, -1346843, -436826, 579413, 1112534, 1216354, 967897, 193174, -888517, -1408150, -820642, 232431, 655505, 289662, -88771, -62010, -55005, -344149, -420284, 107331, 594245, 112796, -1194652, -2272703, -2523946, -2285821, -1971229, -1530540, -964870, -651515, -765252, -895892, -650036, -229430, -25982, -14616, 31242, 48858, -105442, -184909, 199198, 945579, 1528435, 1689150, 1699578, 1922980, 2427638, 3066050, 3654259, 3997587, 3939010, 3465542, 2696357, 1812208, 1071024, 735320, 797235, 896896, 711564, 306427, -93767, -496589]
42949d96589n03885l92078J22091O84955Q08630M47263p5490m49303m61512p197
42939c23115O81999J061166Q24392K52794k02424m29124n17821m46092k40031
42930F61744j57988l07028l13791J73704Q30753R81183M91833j14141m02500m39483
42920A404286m30513l71800j84762J02174M04500N98660M89217J6318n19717p27864
42910G80499o11830m87231m40416k47915J15454K97771P5940k79027l57538j08127
42900a262420K03309L40164K35355m7611l28776m03001k38851L730K02895L78281
42890i16925N12413M48164Q5476m13496o97815m82898K11338R80286J293816R95726
42880B016085M40005j5257m07433p89671q01522j79372N27885M88201k01424o16831
$$ y = [-496589, -1000474, -1392552, -1270461, -585506, 223124, 670387, 594897, 145594, -315918, -323115, 358884, 1420050, 2244442, 2497236, 2294812, 1865688, 1347867, 901775, 661744, 503756, 196728, -117063, 56641, 887394, 1868577, 2360410, 2246269, 1843769, 1404286, 973773, 601973, 417211, 519385, 923885, 1522545, 2011762, 2028080, 1508363, 780499, 168669, -318562, -758978, -1006893, -891439, -593668, -517728, -796755, -1154293, -1262420, -1059111, -718947, -483592, -531203, -859979, -1262980, -1501831, -1498101, -1295206, -916925, -404512, 43652, 129128, -284368, -982183, -1465081, -1253743, -273457, 1020359, 2016085, 2456090, 2440833, 2033400, 1243729, 442207, 262835, 790720, 1278921, 1077497, 460666]
42870D60666m04117j93813l63339l67245J45599M84243M4349m44172J35380J492841
42860I90392K145769J301484l46282j608081j812653r80274K00052O76423J15594
42851F82424m66542J5309J059522J255469M15135k81922k85570l37181q21176
42842A235468r87314m66191j17207m67827o30645J24937R20366O77555n9315j62047
42832F7780J02166k31846p92780l40084R99609J718238J169647K31883l79933
42823B544680q67329j152158n59475P14131J253656L47545q79401j047613k75524
42814G8512M11109N60264L99535J61164K3355J71406L82059J30725m94230p31519
42804A092380l98166k79269p20029q44481J4159J025432J002237J20347n35977
$$ y = [460666, 56549, -137264, -500603, -867848, -722249, -238006, -193657, -637829, -502449, 990392, 3136161, 4437645, 4091363, 2483282, 670629, -309645, -109593, 566830, 682424, 215882, 231191, 1290713, 2546182, 2961317, 2679395, 2393825, 2056644, 1235468, 248154, -218037, -335244, -803071, -1433716, -1308779, -388413, 289142, 229827, 67780, 169946, -61900, -854680, -1194764, -195155, 1523083, 2692730, 2924613, 2544680, 1677351, 525193, -34282, 679849, 1933505, 2281050, 1401649, 354036, 78512, 489621, 1049885, 1449420, 1610584, 1633939, 1805345, 2187404, 2318129, 1823899, 1092380, 694214, 414945, -305084, -1149565, -1135406, -109974, 892263, 1012610, 476633]
42795D76633o08025o15220q31182r38188o21182J32015J040574J420730O72316
42786A28471o33505j008353r1122N70941k07667j260264p75801Q44525J570872
42777h61903P34418l47746o02463l24456L1980N25180Q57881L49551p25279j075764
42767a438601k06968Q45916J071573O60995J62025l93702r07051q16086k7722
42758a049621N87259L21151m14739p92682n75454L14O47970R51231N73280j22912
42748A25797l93053k52750l97323q02953n68712M64541J186555Q97528K99694
42739E59324J15850m0156n56232q06952k82768L59487M55577M76251Q63374Q44338
42729A988093k10720j264866j026474o4109J53373l51086m07092P3332J04087
$$ y = [476633, -131392, -746612, -1577794, -2515982, -3137164, -3005149, -1964575, -543845, 128471, -505034, -1513387, -1604509, -1033568, -1241235, -2501499, -3277300, -2432775, -861903, -127485, -475231, -1077694, -1402150, -1370170, -844990, 12891, 362442, -362837, -1438601, -1645569, -799653, 271920, 932915, 1094940, 701238, -205813, -1021899, -1049621, -462362, -141211, -555950, -1348632, -1924086, -1923772, -1275802, -324571, 248709, 125797, -267256, -520006, -917329, -1720282, -2288994, -1824453, -637898, 259630, 559324, 675174, 635018, 78786, -728166, -1010934, -651447, -195870, 280381, 1143755, 1988093, 1777373, 512507, -513967, -578076, -424703, -775789, -1182881, -1109549, -1005462]
42720a005462l72444l77705K12450M80685K99917N45653J180075R48839m26745
42711A485263j448346j040027p5323K02954l2352k3275R0786k07995o27160n21446
42701b196921l137L40057L92675L84980K60496p2926k43106J21809P19202R44202
42691F47331O42336L4147o92534j222891j031295p1384Q33933R00681L64891J1121
42681D16336P9693K37715K99240L01442Q9881m95436j114872j201955p21410j84320
42671b293686N9373J28602K45182M29859N66731N24703K67974l427P07K32016
42661A58034K98970N3904k00677l22185o44671j275289j562540q71326M18361
42652c947419J297642J321462Q67541M02197R1355L5893K78337N37484M22852
$$ y = [-1005462, -1377906, -1755611, -1543161, -1062476, -762559, -216906, 963169, 1912008, 1485263, 36917, -1003110, -1078433, -875479, -907831, -931106, -840320, -1048315, -1675475, -2196921, -2200058, -1860001, -1467326, -1082346, -821850, -894776, -1137882, -1016073, -296871, 647331, 1289667, 1323814, 631280, -591611, -1622906, -1694290, -860357, 40324, 405215, 416336, 496029, 733744, 1032984, 1334426, 1424307, 928871, -186001, -1387956, -2109366, -2293686, -2234313, -2105711, -1860529, -1430670, -863939, -339236, -71262, -74689, -73982, 158034, 457004, 510908, 310231, -11954, -656625, -1931914, -3494454, -4365780, -3947419, -2649777, -1328315, -460774, -58577, 32778, 68671, 347008, 884492, 1307344]
42643A307344l3342m27090n27116l98591q6847L64121O28025L29038l77589q70856
42633i2903p99794m26663j84359j93874k62321j01053M51673J178425J499595
42624A068726J010499k9982r48163j275916r47272j66322N81226O95058J30584
42615A18438l26988Q739P36961R16392M02019r5803j79068j49110j90339p1529
42605A169712J15136j82544r61099j331324p66383K8541J57147j58692p1027N53393
42595a447140J102623J216765R87069L75094o67558j538350j367500k67449N89977
42586a016469M51765j57563m13171l06434k24286n4622M71037R30857O71203L3174
42576C85491J15889J060223J531642N46976r31893j165047n51R95734P44103j12132
$$ y = [1307344, 1274002, 846912, 319796, -78795, -165642, 198479, 826504, 1155542, 777953, -92903, -892697, -1319360, -1503719, -1697593, -1959914, -2060967, -1609294, -430869, 1068726, 2079225, 2049243, 1101080, -174836, -1122108, -1288430, -707204, -12146, 118438, -208550, -199811, 537150, 1453542, 1855561, 1759758, 1580690, 1431580, 1241241, 1169712, 1284848, 1102304, 141205, -1190119, -1956502, -1927961, -1770814, -1929506, -2000533, -1447140, -344517, 872248, 1859317, 2234411, 1566853, 28503, -1338997, -1606446, -1016469, -564704, -722267, -1135438, -1441872, -1666158, -1720780, -1249743, -318886, 352317, 385491, 501380, 1561603, 3093245, 3640221, 2708328, 1543281, 1542730, 2538464, 3282567, 3170435]
42566C170435m97424l89368l09648j63138L92569Q82078M61986o39962j197618
42557A709910o63986J62085M16412J97982r2262n09026j002647r24446K4264R45135
42547B63421Q13425k3306m28569k38693k79116p19833p01804J15586Q05671N32084
42537A38866k66703o78928n41564k15492J70370N48220N82455K25597N4775L55936
42527C73532M97632L0216l02258K55737R16511L90007r04259j292731m57958J52126
42517c41445j80628l49340M53519J234288R52093K94632K97281M39971k20305
42508B580066j011729o59127K93095J57098r89320j225039P7646J102455L77587
42499G02732j051684j395712o91786k36132l78601l21323L14414R59780J045555
$$ y = [3170435, 2673011, 2283643, 1973995, 1810857, 2203426, 3085504, 3547490, 2907528, 1709910, 1045924, 1208009, 1624421, 1822403, 1730141, 1221115, 218468, -705978, -681714, 263421, 1076846, 1053540, 624971, 386278, 107162, -612671, -1314475, -1198889, -393218, 138866, -127837, -806765, -1348329, -1563821, -1393451, -845231, -262776, -37179, 17596, 373532, 871164, 901380, 599122, 854859, 1771370, 2161377, 1257118, -35613, -493571, -341445, -522073, -871413, -417894, 816394, 1768487, 2063119, 2360400, 2800371, 2580066, 1568337, 909210, 1202305, 1359403, 370083, -854956, -777310, 325145, 702732, -348952, -1744664, -2436450, -2672582, -3051183, -3372506, -3058092, -2098312, -1052757]
42490a052757O05118k1340m61130l96093J29017O31503P67031O87857N44847J46866
42480A580919m65890p16755l57611o0701m33329r82150q81280k74137J45287M23328
42470b022319J080439J772979J476482J33596r96279r57024j62209M80160O60111
42461A465936M92271L8562m78411n73238r2481N22858Q80761J031412R45164K79174
42451D512008q44577j461595q70297K72715O72441L294q51253j057815o91164
42442c16243k79904o0909O9572J95503K44106J08973k16839n85964p49792n38217
42432b129714j7051N58202R28220R49798N99009l4888p08870j038046p15127J34252
42422a474215R03639J061202P52465N58831O39631N50719O5569l70300l74408
$$ y = [-1052757, -447639, -468979, -930109, -1326202, -1197185, -565682, 201349, 889206, 1434053, 1580919, 1115029, 398274, 40663, -20038, -453367, -1435517, -2316797, -2590934, -2445647, -2022319, -941880, 831099, 2307581, 2441177, 1444898, 487874, 325665, 805825, 1465936, 1958207, 1996769, 1518358, 945120, 852639, 1375497, 2256258, 3287670, 4232834, 4512008, 3667431, 2205836, 1335539, 1608254, 2280695, 2283989, 1432736, 374921, -316243, -596147, -657056, -587484, -391981, -147875, -38902, -255741, -841705, -1591497, -2129714, -2146765, -1588563, -660343, 289455, 888464, 853576, 144706, -893340, -1608467, -1474215, -570576, 490626, 1243091, 1801922, 2441553, 2992272, 3057841, 2687541, 2313133]
42413B313133k82278n14039p67631n63422j88614k12726l59126P1140P67493O40890
42403I04820l46414q98362m31924r3991q24818j551044o72409J298550K121160
42394d94432Q18055j038643j399654j27199J238153J457671O88795j49185n11631
42385D81930n70871o62102o94173l07992M63520J027248Q71801J49033n42727
42376B15667p47036l93784K69911Q05573Q95215P03596O58244P42382M30468m16901
42366C163335j068454p79663J99203R34112Q72516J81588o81463j228500j002294
42357E90380K4229J129210J370485M89001r15244j955416k007371j027548K89220
42348b013054R40063O09592K004j41742L8514J6049k06623l11228l55258m88285
$$ y = [2313133, 2030855, 1516816, 749185, 185763, -2851, -215577, -574703, -503563, 263930, 904820, 558406, -339956, -771880, -865871, -1690689, -3241733, -3914142, -2615592, -494432, 323623, -715020, -2114674, -2241873, -1003720, 453951, 1142746, 993561, 481930, -88941, -751043, -1445216, -1753208, -1289688, -262440, 609361, 758394, 215667, -531369, -925153, -655242, 150331, 1045546, 1749142, 2407386, 3149768, 3580236, 3163335, 2094881, 1315218, 1514421, 2448533, 3321049, 3502637, 2821174, 1592674, 590380, 614609, 1743819, 3114304, 3603305, 2688061, 732645, -1274726, -2302274, -2013054, -1072991, -463399, -461395, -603137, -564623, -548574, -755197, -1066425, -1421683, -1909968]
42338a909968l56102L27635R17417N73373k87955m16860L40713P31411M0546p77689
42328h17479n25908N62336J298591J077820K57584n60364r94297q92820l91227
42319i85764J44031M47756M63103J32709m87948r28561p36418k64386k81502o87795
42309c184775n50882K91492P52808K13916l53041J25035J114016J356584P75157
42300E40310K84046J83718J0170k80947k40712M1529J1019k50698j56555J10836
42290B52716k90488j262129j589508q35997j37498l63260o48058J83035J596338
42281c094849K020396J099276O3589n2255M80822Q68945Q12293M58410k0291m40936
42271B195400n68243l40541L1639K86200K91052O7474j56845m2253M22756P08007
$$ y = [-1909968, -2266070, -1938435, -1021018, -447645, -735600, -1152460, -811747, -80336, -39790, -817479, -1343387, -781051, 517540, 1595360, 1852944, 1292580, 298283, -594537, -985764, -841733, -393977, 69126, 201835, -286113, -1214674, -1951092, -2215478, -2496980, -3184775, -3735657, -3444165, -2691357, -2477441, -2830482, -2705447, -1591431, -234847, 540310, 824356, 1008074, 1018244, 737297, 496585, 538114, 549133, 298435, 141880, 252716, -37772, -1299901, -2889409, -3725406, -3862904, -4226164, -4874222, -4691187, -3094849, -1074453, 24823, 88412, 36157, 516979, 1385924, 2198217, 2656627, 2636336, 2195400, 1627157, 1286616, 1318255, 1604455, 1895507, 1962981, 1806136, 1763883, 2186639, 2894646]
42261B894646L31284m45788r17528q34643n39630k84723j072K16824M9172m26117
42251D2425o58073m48549k47093k77844o7048N96497R27145K46949o67510m49575
42241a002676Q10962J559489R66352k2568k68428o544p7947m53612n32760l89602
42231E82666o24513j149570j158473m07726L42371M22355R5317k3270J56726K82179
42221a481938J64206k7486q89L73633Q55495R41119M48594j13733j60978J26414
42211A124437J21951k15793l66050k63148l65190n51721m1957J104695J511009
42202B058233L59465j155304j326029k20154P04550P70345N48692M15315M5335
42193B200448n66550q74033q21907r39560j096617m31411R60643J564896N50055
$$ y = [2894646, 3225930, 2780142, 1862614, 1027971, 488341, 203618, 202546, 419370, 468542, 42425, -615648, -1064197, -1311290, -1589134, -1656182, -1059685, -132540, 114409, -553101, -1002676, -191714, 1367775, 2334127, 2311559, 2043131, 2036587, 1958640, 1505028, 972268, 582666, -41847, -1191417, -2349890, -2757616, -2415245, -1992890, -1897573, -1920843, -1764117, -1481938, -1317732, -1345218, -1346107, -972474, -116979, 824140, 1272734, 1159001, 998023, 1124437, 1246388, 1030595, 664545, 401397, 36207, -515514, -557471, 547224, 2058233, 2417698, 1262394, -63635, -283789, 420761, 1191106, 1739798, 2155113, 2200448, 1633898, 759865, -62042, -1001602, -2098219, -2529630, -1568987, -4091, 545964]
42184E45964p63125o59056N61769J183070N48396l93012p86467p88859o86872
42175a238192l09712K76588M34472j37456q02040p92638j63885M80487Q02694
42166a449682Q63287P62180N51717L18426P9603k11592l98143j76215L63463O27936
42156A330980K79521k46753l69697j67570p0114n0132K24529N67902L58046m26649
42146A430063r32334n22807L63345Q45799O92015L23158L7868k35335n33333p04133
42136G64306o72891m91676j30364M20553Q56403P92967L55742R7444J95798J92968
42126B381250k27104o65160o12853k69874k22004m81060m22477K64946J033026
42117G78690J089745L18468o08108r54438o71674l93305o23740j022677q10703
$$ y = [545964, -217161, -876217, -314448, 868622, 1417018, 1024006, 237539, -551320, -1238192, -1547904, -1271316, -836844, -974300, -1776340, -2568978, -2732863, -2252376, -1449682, -586395, 175785, 727502, 1045928, 1125531, 913939, 515796, 339581, 703044, 1330980, 1610501, 1363748, 994051, 826481, 756367, 706235, 930764, 1498666, 1856712, 1430063, 497729, -25078, 338267, 1184066, 1876081, 2199239, 2237107, 2001772, 1468439, 764306, 91415, -400261, -530625, -110072, 746331, 1539298, 1895040, 1992484, 2188282, 2381250, 2154146, 1488986, 876133, 606259, 384255, -96805, -519282, -254336, 778690, 1868435, 2186903, 1578795, 624357, -47317, -440622, -1064362, -2087039, -2897742]
42108b897742Q3048P90457P06805L54684M76625P85238N02351j58354j71403N68747
42098A040456Q52891n6312j224673j315746l26541O82973J024945P88698K63417
42089A730108k52400l61975j7601J71817k73808q85099q83422l50143O412M345
42079a111766O1528K69825K83937R2262M4034J25192O3637J02014O74607J309038
42069A914308J013803m2164m97901J16222N60383j17147r96982p65158K21886
42060A407250O31926K46529q260K14787K56682k55987q03868q38887m38482L9901
42050D51591L06941J16795m91329r58798q03538l39202j84356k55568k035N29186
42040a630313P34027M97583L10626L29498K18075j5292M4347L26896K80565p3988
$$ y = [-2897742, -2814694, -2024237, -1317432, -962748, -486123, 299115, 801466, 643112, 471709, 1040456, 1893347, 1837035, 612362, -703384, -1029925, -346952, 677993, 1466691, 1730108, 1477708, 1115733, 1098132, 1269949, 996141, 111042, -772380, -1122523, -1116111, -1111766, -1050238, -780413, -496476, -404214, -360180, -234988, -171351, -69337, 605270, 1914308, 2928111, 2885947, 2388046, 2504268, 3064651, 2947504, 1950522, 1185364, 1407250, 2039176, 2285705, 2277445, 2492232, 2748914, 2492927, 1689059, 850172, 411690, 451591, 758532, 875327, 383998, -574800, -1378338, -1717540, -1901896, -2157464, -2159499, -1630313, -896286, -398703, -88077, 241421, 459496, 444204, 488551, 815447, 1096012, 1022024]
42030A022024j16318J20562j78924j060744j325135l20602Q72252R75540L14214
42021C02869O332R7619k38674j046973j405142q58463J875N14937O77501P15873
42011a232246O06003K95123j5265m6489K42461N37495L49727m26893j080387o93392
42001a463863N90057J500232J208190L17130j88082k53785l29970l41922q388
41992A029599L47160K66990P556j7576j46828p63044j204100o77770J50038o473
41982a014448q42519p78751M36640J218654O71541r1456Q8700O75643O64387K64838
41972A293229K22701M50672M44902K82388K19946L2515l53991l56261K32103N46551
41962C014755j2377o34545m32359j8745l83192r94379o48795L41489N73776r7167
$$ y = [1022024, 905706, 1026268, 847344, -213400, -1538535, -1859137, -986885, -11345, 302869, 309201, 406820, 168146, -878827, -2283969, -3142432, -3140557, -2625620, -1948119, -1232246, -626243, -331120, -346385, -392874, -150413, 387082, 736809, 309916, -770471, -1463863, -873806, 626426, 1834616, 2151746, 1963664, 1709879, 1379909, 1037987, 1029599, 1376759, 1643749, 1651305, 1633729, 1486901, 723857, -480243, -1158013, -1007975, -1014448, -1856967, -2635718, -2199078, -980424, -308883, -400339, -311639, 364004, 1028391, 1293229, 1515930, 1966602, 2411504, 2693892, 2913838, 2946353, 2592362, 2236101, 2468204, 3014755, 3002378, 2367833, 1935474, 1916729, 1533537, 539158, -109637, 231852, 805628, 708461]
41952G08461m24985K6217L21146J5630j58278Q2348n9727p80408r41916L4945
41942a176567R37889N68205l75545n01204R9631K74591j96906m68082k19164o0256
41932a117408l18385n38548l77529j01864L6195J87217M22603M79204K63825J29065
41922i35625L51480O62814N61846o7301p79433r50660l91092L56139N38565J38303
41912e14964q1366K68492N23644r656q46073r73003m09308r1593k55925p8011
41902b467763P83916J412608J044286L36598L35102Q11964O55820l89059j361372
41893A162100j427614p73674r0371J38049k40739r49830j175523k39417J370511
41884b226508K256588J723437N85458N942Q5734J17874k03640m90018l95414p4314
$$ y = [708461, 283476, 309693, 630839, 646469, 488191, 570539, 510812, -269596, -1211512, -1176567, -238678, 329527, -46018, -547222, -447591, -173000, -369906, -837988, -1057152, -1117408, -1435793, -1974341, -2351870, -2453734, -2417539, -2230322, -1807719, -1328515, -1064690, -935625, -584145, 78669, 640515, 573214, -206219, -1156879, -1547971, -1191832, -653267, -514964, -596330, -327838, 195806, 186150, -659923, -1632926, -2042234, -2133827, -2389752, -2467763, -1683847, -271239, 773047, 1109645, 1444747, 2256711, 2912531, 2523472, 1162100, -265514, -1039188, -1129559, -991510, -1232249, -2182079, -3357602, -3597019, -2226508, 30080, 1753517, 2338975, 2344917, 2430651, 2548525, 2344885, 1854867, 1459453, 1385139]
41874A385139J06367m5770m36610p42467o92301m47476m43972o78689n69382J44734
41864b420427Q44501Q86609N62887N32280O91137M54027r3881k84228l4323M9437
41854A188019j98034k57187K358J2773l96727n87205k56473l9818l72799o66019
41844a571112l41290J40164J23573r4656J10603N42142O23624M81781N83636P13373
41834A311838L39920l14854n83969m56562l82641k82916J67437N52904K40310
41825E91467k86169M2614J006483J164869L7747j143615j271020o68541q3602
41816f09767L61735N96673K31193m61791l79363O78068J242067K50417j157049
41807G52183j249745k55709K48125q5970j44093M58835P24561J53805k73204K54149
$$ y = [1385139, 1491506, 1445736, 1009126, 266659, -425642, -873118, -1317090, -1995779, -2565161, -2420427, -1575926, -689317, -126430, 405850, 1096987, 1551014, 1457133, 1172905, 1138582, 1188019, 989985, 732798, 735156, 747929, 351202, -236003, -492476, -532294, -905093, -1571112, -1912402, -1772238, -1648665, -1743321, -1632718, -1090576, -466952, 14829, 598465, 1311838, 1651758, 1336904, 752935, 296373, -86268, -369184, -201747, 351157, 591467, 305298, 347912, 1354395, 2519264, 2557011, 1413396, 142376, -526165, -609767, -248032, 348641, 579834, 118043, -261320, 416748, 1658815, 1909232, 752183, -497562, -753271, -505146, -591116, -735209, -276374, 448187, 601992, 328788, 582937]
41797E82937R34783N52300o27499j204521n97523K71816L08722m11189r03809
41788a093983n21843L82405R49300P33387O9028l78175l14808n6406q7691m20363
41778g39149n10986K0876P02732O43465k26523q46029l37028P99601J353412R30616
41768A790987J57728l43408l91222J16174J038619J545900Q78535l80438q93119
41759C519756n53614o11412j490008j942596j087152J45978O30877P87879J372448
41750G72156J682235O75217q70780j166129q9606O89444K81559l74407l25847
41741A273842J9111p1430l86319k81808K43172O04980M20342q4465k70287K42966
41731A710104Q78979N08906r66231k062852j562298k57777K69621L600J36689
$$ y = [582937, 1517720, 2070020, 1442521, 238000, -359523, -87707, 221015, -190174, -1093983, -1615826, -1233421, -284121, 449266, 518294, 140119, -174689, -231095, -318786, -739149, -1250135, -1229259, -526527, 116938, -109585, -955614, -1292642, -493041, 860371, 1790987, 1948715, 1605307, 1214085, 1330259, 2368878, 3914778, 4793313, 4412875, 3519756, 2966142, 2354730, 864722, -1077874, -2165026, -2019048, -1388171, -600292, 772156, 2454391, 3129608, 2258828, 1092699, 1003093, 1692537, 1974096, 1599689, 1273842, 1292953, 1221523, 835204, 553396, 796568, 1401548, 1821890, 1737425, 1467138, 1710104, 2589083, 3097989, 2131758, 68906, -1493392, -1751169, -1481548, -1477948, -1341259]
41722a341259P74015Q03375P4728j74252M95478Q67063J11251q76626j055984
41713c22211p63707o87070n67509J0939O15523P78815Q16396Q68270K64714j005843
41703H317j414754j5421J561652J102090q12464j473696j8566J324866N26988
41694G89012j414216k006273n78524J143722J430881N13429o3112M72020J201261
41685A488200Q38796m52140j224735p23248J44796J90584m96090j014964j014637
41676b263438p72943m26693M089J92527k9676r4466N43291J358909J405658P77891
41666F95149M12804N52434M84269j22041o72170o80510m27383k70375r8366J83520
41656E7331L19330K00926J09368J61463O8230k93126o08376o74415o79799o91271
$$ y = [-1341259, -567244, 236131, 310859, 136607, 632085, 1499148, 1610399, 733773, -322211, -1085918, -1772988, -2340497, -2329558, -1714035, -935220, -118824, 749446, 1014160, 8317, -1406437, -1421858, 139794, 1241884, 429420, -1044276, -1062842, 262024, 789012, -625204, -2631477, -3210001, -2066279, -635398, -121969, -185081, 286939, 1488200, 2326996, 1874856, 650121, -73127, 71669, 262253, -233837, -1248801, -2263438, -3036381, -3463074, -3458985, -3266458, -3296134, -3390600, -2847309, -1488400, -82742, 695149, 1107953, 1660387, 2144656, 2022615, 1350445, 669935, 242552, -27823, -126189, 57331, 376661, 577587, 686955, 848418, 916648, 623522, 15146, -659269, -1339068, -2030339]
41646b030339m15565K18486P46942P96444O20976O77693R76451J128048Q08927
41637C528063K0629q82148j364479j176245o26412j21296L72758R49303J134735
41628A834908M17972p01581j117917o67196l07555n03919n01546K33829Q68324
41619d44681M01651o88356j052924l66174M00738N06285L10319M46160Q46367
41610C59385R66090N91180P3172j36010l019O4485k65160p51747p96041k00124
41600i7789N33814P96169N04212k9789n61760r40079r07014l17141M62337P49044
41590A92004K96615l56715m75625J5418M70861L71015j0818o2176K06556J62952
41580H10087l98464q14096n34511k208M8177k59039k39542J67373L52362R3948
$$ y = [-2030339, -2445904, -2227418, -1480476, -684032, -63056, 614637, 1591088, 2719136, 3528063, 3548692, 2666544, 1302065, 125820, -500592, -621888, -249130, 700173, 1834908, 2252880, 1551299, 433382, -233814, -541369, -1045288, -1546834, -1313005, -444681, -43030, -731386, -1784310, -2150484, -1749746, -1243461, -933142, -486982, 359385, 1325475, 1916655, 1989827, 1853817, 1850798, 1915283, 1650123, 898376, 102335, -97789, 436025, 1232194, 1736406, 1706617, 1144857, 204778, -702236, -1019377, -557040, 192004, 488619, 131904, -343721, -328303, 142558, 513573, 502755, 440579, 647135, 810087, 411623, -402473, -936984, -939192, -891015, -1150054, -1389596, -1222223, -869861, -775913]
41570g75913j49641l8503K99168P26358J128980R99144p6945j384362j543118
41561h14832l25703R41400J170405P18422L29700l6026n56913p17512j29128N29495
41551A109308M12173j90834m27572k85911l88778p41970p55751l53777p1990r4121
41541a789223o3616J39734K20883R0216k9020r9817k23705j60481M01833J115811
41531c97385J211780N26982k85809n98006l49276J46759M07724j1142q98216j227753
41521a474342l62570Q55512J109725M56727P5737K88395J54172p29273j366480
41512i92397r09845M8324N02400M57319M72169N04313J81421k07929L5886Q80193
41502I71854J409139R09054l12013j252452j191320m04106O7802m09159j194617
$$ y = [-775913, -925554, -964057, -664889, 61469, 1190449, 2189593, 2112648, 728286, -814832, -1140535, -199135, 971270, 1689692, 2019392, 1983366, 1426453, 708941, 579813, 1109308, 1521481, 1330647, 903075, 617164, 228386, -513584, -1269335, -1623112, -1695102, -1789223, -1852839, -1713105, -1492222, -1402006, -1431026, -1530843, -1754548, -1915029, -1513196, -397385, 814395, 1341377, 1055568, 457562, 108286, 255045, 662769, 651627, -246589, -1474342, -1836912, -981400, 128325, 585052, 660789, 949184, 1103356, 374083, -992397, -1902242, -1853918, -1351518, -894199, -422030, 82283, 263704, 55775, 91661, 971854, 2380993, 3290047, 2978034, 1725582, 534262, 130156, 197958, -211201, -1405818]
41493a405818j141398j58409P06563Q20069O82274P56198N92689j66169p88118
41484a02119m45268L81393N55927p196l54113m3123L53538L26734P2585r3532
41474F44826j64423j07653J78138M27192K52555l8978K81122J023705R73165l35523
41464C134126j624049j486120l01775M90363N45999P60132J355177J262010o0285
41455D075578j379702j254094j10546L82197l13347j061216r25698m01221l14286
41446a302335m79258k15036M28811P92687O07508J49860l33654o67610m85150
41437a504177K98386R43502O69897j19744l24138J59657K94280l27597p26319
41428f36253j22086P41570P21914j4703l97737j23255R4343j77530m29574l5271
$$ y = [-1405818, -2547216, -2705625, -1999062, -1178993, -496719, 259479, 852168, 685999, -102119, -547387, -165994, 389933, 382737, 28624, -14499, 339039, 665773, 738358, 644826, 480403, 372750, 550888, 978080, 1230635, 1191657, 1472779, 2496484, 3469649, 3134126, 1510077, 23957, -277818, 212545, 758544, 1518676, 2873853, 4135863, 4075578, 2695876, 1441782, 1331236, 1713433, 1400086, 338870, -586828, -988049, -1302335, -1781593, -1996629, -1567818, -775131, -167623, -17763, -351417, -1019027, -1504177, -1205791, -262289, 407608, 287864, -36274, 123383, 417663, 90066, -636253, -758339, -16769, 705145, 690442, 292705, 169450, 263793, 86263, -343311, -378582]
41418c78582Q08921J220946N70706p35471j466947q79937K40060M58651l37386
41409d99039p76047j38025N04498J10887n03396r572J082103J096043j26183r83471
41399b42202o33997m0984o7428j31924M42546J084851J003051N44287M64452O07226
41389C029878L67723j23442l37364m13972q05175j134065n55018P22197J314727
41380B065489M26288r91030j315811j70670J139650J090398l37827j592914j356048
41371a042475j39657M63162j8065m17283J16367P62757M39463l55926l31890M93348
41361c0199Q42195K10079m75378m20217j4439Q4312p1024j67159k51604l56363
41351f49797j66776L82309P30752M47501q8242k29475J19150O07302R05929P03026
$$ y = [-378582, 430339, 1651285, 2221991, 1486520, 19573, -860364, -620304, -161653, -499039, -1275086, -1413111, -908613, -797726, -1301122, -1310694, -228591, 867452, 741269, -242202, -876199, -917183, -984611, -1116535, -673989, 410862, 1413913, 1958200, 2422652, 3029878, 3397601, 3274159, 2936795, 2522823, 1717648, 583583, 28565, 750762, 2065489, 2491777, 1500747, 184936, 14266, 1153916, 2244314, 1906487, 313573, -1042475, -1182132, -718970, -737035, -1154318, -1037951, -275194, 164269, -191657, -523547, -30199, 811996, 1022075, 546697, 126480, 112041, 196353, 125329, -41830, -293434, -649797, -816573, -434264, 296488, 743989, 655747, 426272, 545422, 1152724, 2058653, 2761679]
41341B761679k00662j302982j486701l41922J060752J401404O96404q3557n44267
41332A960148j034303j486058j220117j27778Q74330J001385N58473L05035L84077
41323A215192L82217J21497j12448l5566K79058N11779M13210M2564k62104k34631
41313B320768l643N3819k35223o49310p76574l21434O04204J337604J121337L2281
41303C483829q62588p45575j23737l3164m69910n17284M4703L36566j44690o79956
41293B88194n19740n9518q1519m71013n21331j06572K53400K71074J43928O5602
41283g37495L9965N2298K481k92285o45910m67970L26003Q92785O43484K93258
41273A06614P59363J449715R31158p54130j792400r99618O01546J215422M49564
$$ y = [2761679, 2561017, 1258035, -228666, -570588, 490164, 1891568, 2587972, 2504415, 1960148, 925845, -560213, -1780330, -1908108, -1033778, -32393, 526080, 831115, 1215192, 1597409, 1718906, 1606458, 1570892, 1849950, 2361729, 2774939, 2817503, 2555399, 2320768, 2317125, 2370944, 2135721, 1486411, 709837, 388403, 992607, 2330211, 3451548, 3483829, 2621241, 1875666, 1751929, 1718765, 1248855, 731571, 776274, 1112840, 968150, 288194, -231546, -291064, -372583, -843596, -1364927, -1471499, -1218099, -947025, -803097, -737495, -697530, -645232, -642751, -935036, -1580946, -2048916, -1722913, -830128, -186644, 106614, 865977, 2315692, 3246850, 2492720, 700320, -299298, 302248, 1517670, 1967234]
41264A967234o08756q93308k84971N82732R07104L35923o50283j179431r52456
41255g76212m38460p5533J66298K97064O9899m46177o87163l85030K9859J98982
41245b046473L84275P81580R41405N01795n9313j11576J39024Q7627k07716j79627
41235B31001K62500O35704O46346M24071J28462j10812m8109L04194L79675k28280
41225B624752r78995j018359m18968j4978j11957j98492M8599L27001M26531N82221
41215A267355Q42120P84897K18858l94889n62788l65230j69566j39127k72233
41206A209397n66974r17201j118487j102177r18940n21319Q6028N66337N85263
41197b698073L58365L56962N58539N70424L81151K93425K32229l3963q3504O63916
$$ y = [1967234, 1358478, 465170, 180199, 762931, 1670035, 2005958, 1355675, 176244, -776212, -1214672, -1290205, -1123907, -826843, -756944, -1203121, -1890284, -2275314, -2245455, -2046473, -1662198, -880618, 60787, 562582, 503269, 391693, 530717, 618344, 410628, 231001, 493501, 1129205, 1775551, 2199622, 2328084, 2217272, 2169163, 2473357, 2853032, 2624752, 1645757, 627398, 208430, 193452, 81495, -116997, -68398, 258603, 685134, 1267355, 2109475, 2894372, 3113230, 2718341, 2155553, 1790323, 1620757, 1481630, 1209397, 642423, -274778, -1393265, -2495442, -3414382, -3935701, -3849673, -3283336, -2698073, -2339708, -1982746, -1424207, -853783, -472632, -179207, 53022, 19059, -64445, 599471]
41187E99471J569251J174678n99523j930317j470759r4941O23800N68528N40950
41178I81138N08161j21964r66165r19584J19493J029353J041246M95493l2367
41169B134804l72416m35369j80356k3975m05625q78165n75608L27854O94604J74137
41159D59885k83682r0038J2586o27181j275763r76487j71857M4341k36406M0442
41149c104160J008837J513765Q42134k42757o39477k87584J16153K01124J36530
41140d55435Q6766j3623k35501n22913p03542m84797L07573J267298J519444P02178
41130A467448m02616p33617l23129j97009q50195j505527j239133k73845M18891
41121c638732M51662K92178L55563N25431O36968P78961Q90082O25534l9545n50141
$$ y = [599471, 2168722, 3343400, 2743877, 813560, -657199, -752140, -128340, 440188, 981138, 1489299, 1367335, 401170, -518414, -398921, 630432, 1671678, 2167171, 2134804, 1762388, 1327019, 1146663, 1122688, 717063, -161102, -736710, -408856, 285748, 459885, 176203, 86165, 98751, -528430, -1804193, -2780680, -2952537, -2908196, -3144602, -3104160, -2095323, -581558, 260576, 17819, -621658, -909242, -793089, -591965, -455435, -368669, -382292, -617793, -1140706, -1844248, -2329045, -2021472, -754174, 765270, 1467448, 1064832, 331215, 8086, -188923, -1039118, -2544645, -3783778, -4057623, -3638732, -3187070, -2894892, -2539329, -2013898, -1376930, -597969, 292113, 917647, 878102, 327961]
41111C27961n06731k45730k37424k94603L0964N27083M97332j67171p37347o11759
41101a417425k1009M28662M85962K88916K1658j73234j60528N5053K80346L64007
41091A52408L55078L55719L80846M25563M81322M41923K26292K2741R0035K43928
41081C175855l3188p53060j139137n92601L94892Q13051M16144j41099l69019
41072A771838m82651p30730q20142m08003K64187P04046Q60823R85361R80580
41063C125309M89167l40445p63590l75731K83548M07695p4217n29882m77418m6702
41053A697734L21607L12655q2345n31499n44502J6233O20012N66339j66304q46011
41043A363919q24081k16023L08743K31879l27453o73922j84075Q85661J435183
$$ y = [327961, -178770, -424500, -661924, -956527, -925563, -398480, 98852, -68319, -805666, -1417425, -1438434, -1009772, -523810, -234894, -213236, -386470, -546998, -491945, -211599, 152408, 507486, 863205, 1244051, 1669614, 2150936, 2592859, 2819151, 2841892, 2931927, 3175855, 3142667, 2389607, 1250470, 657869, 1052761, 1865812, 2281956, 2140857, 1771838, 1289187, 558457, -261685, -669688, -405501, 298545, 1159368, 2144729, 3125309, 3614476, 3274031, 2510441, 2134710, 2418258, 2825953, 2751736, 2221854, 1744436, 1697734, 2019341, 2331996, 2249651, 1718152, 1173650, 1189883, 1809895, 2376234, 2209930, 1363919, 539838, 323815, 632558, 864437, 536984, -136938, -321013, 564648, 1999831]
41034A999831P47229n05984j011171m47309K93195M92797L92428L73584K23263
41025B557863k74292p03775o21303l11319l26186o39613q16803o96510l96071
41016b228009J8211L82457L46892p2974k99991n8796J18243j34930k03850M82325
41006a650422J234080J004231N0421n11185m82053n85265q79838o36088J35681
40997b320438N06901K56483K26722O28268M86810n13161j068654j65736J229601
40988g33204J558948Q32983J94508M6562j08914m27295n50627m79794n86499q57884
40978a111216r54538q65829p71692m89634J85726Q46921R55702P11623O52609
40969h40328O73172L25461j51470j15297K78400K29580k87471l34106M82297J272947
$$ y = [1999831, 2747060, 2241076, 1229905, 782596, 1075791, 1568588, 1961016, 2334600, 2557863, 2283571, 1579796, 958493, 647174, 320988, -318625, -1135428, -1831938, -2228009, -2209798, -1827341, -1480449, -1553423, -1853414, -1912210, -1793967, -1928897, -2132747, -1650422, -416342, 587889, 638310, 127125, -354928, -940193, -1820031, -2456119, -2320438, -1813537, -1557054, -1330332, -702064, -215254, -728415, -1797069, -1962805, -733204, 825744, 1658727, 1853235, 1899797, 1790883, 1363588, 812961, 333167, -253332, -1111216, -2065754, -2931583, -3703275, -4192909, -4007183, -3160262, -2204560, -1492937, -840328, -167156, 158305, 6835, -108462, 169938, 399518, 112047, -222059, 260238, 1533185]
40959A533185J094637J48122p35283j169146j248116j022528n43996j63408k26852
40950b333385n21179m20262L28124J184673J373293Q45807M53821Q77546J547457
40941C335895J222296k42537j438679j191028j34669K47075l31764q28071n58053
40932H0465j113J70733j1599j69946j92134j91146k69111m86222p36413o62476
40922b468962q3314N74292P26181M17135J73910K02651K66301K25611J41963p336
40912A68432j63611P011N16394O46503m1164p17614l80551M38013M00213m10890
40902D62736n83581K17397O72825R4277m37197k4619N49063L55325p4204L7273
40892A269295J34172n45890j267039q53786K32931N41624o5891l88197L4028M07765
$$ y = [1533185, 2627822, 2775944, 2040661, 871515, -376601, -1399129, -1943125, -2106533, -2333385, -2854564, -3274826, -2946702, -1762029, -388736, 457071, 910892, 1788438, 3335895, 4558191, 4315654, 2876975, 1685947, 1551278, 1798353, 1466589, 638518, 80465, 79352, 250085, 238486, 68540, -123594, -314740, -583851, -1070073, -1806486, -2468962, -2552276, -1977984, -1251803, -834668, -660758, -458107, -191806, 33805, 175768, 168432, 4821, 11832, 528226, 1174729, 1133565, 415951, 35400, 473413, 873626, 462736, -120845, 96552, 769377, 863654, 426457, 401838, 950901, 1306226, 1232022, 1269295, 1403467, 857577, -409462, -1263248, -1030317, -488693, -554584, -942781, -908753, -500988]
40882e00988L02371K62944N30034M95180j01604n65388l98706j29298l63175p36299
40872a204929m84104L87831J090801J016458L45269k17831j58830L32815O07076
40863A714556L82862N6160m3614k39081q26430j262928q38272Q5210M17616j02433
40853f56354o10025n06721k42832l46661m50943J23136J231108J898212J365303
40844A804223q1186j288656j290515l07121N03084M84484K33480M53258O53191
40835A164242p4338j328286j667721o74778M35073O12953K97431L56822O51322
40826b27280M69476j90332n88427k40965N98922J269653J196458L56498n05719
40817B138284n16810K41026P43192L46137m61074r09896r04194p04485l39017
$$ y = [-500988, -198617, 64327, 594361, 1089541, 987937, 422549, 23843, -105455, -468630, -1204929, -1689033, -1301202, -210401, 806057, 1151326, 933495, 774665, 1107480, 1714556, 2097418, 2153578, 2109964, 1870883, 1044453, -218475, -1056747, -971537, -553921, -656354, -1266379, -1773100, -2015932, -2362593, -2813536, -2690400, -1459292, 438920, 1804223, 1723037, 434381, -856134, -1163255, -660171, -175687, 57793, 511051, 1164242, 1089904, -238382, -1906103, -2580881, -2145808, -1532855, -1235424, -878602, -227280, 242196, 51864, -536563, -777528, -178606, 1091047, 2287505, 2644003, 2138284, 1621474, 1862500, 2605692, 2951829, 2490755, 1580859, 676665, -27820, -366837]
40808c66837Q1991N5539o03109j170473q38765J90431J060832J363112J231627
40799A004348P13536j65820r34238j071509p71125n80621m33991J14754P59757
40790a364909N57381n66041j341287p31168O69846J418666R72690M7649m91140
40781h28313m49051p2480L98264P48673P50598M01033M1525k322J74122K29854
40771A391903J07674Q7294K44901K28602j53625m42353r5345O11721Q27579K97712
40761C106063k86593k94207L6067J06280j77926m48620m44141j70107K21065L96528
40751B044409J3116p54112j213162j023106o13745l27418K51036J382691K141980
40742A901689J386743m05200j428997q76650P8805M3872p91283j272495r70678
$$ y = [-366837, -284846, -229307, -832416, -2002889, -2841654, -2651223, -1590391, -227279, 1004348, 1717884, 1552064, 617826, -453683, -1224808, -1805429, -2239420, -2124666, -1364909, -807528, -1373569, -2714856, -3446024, -2776178, -1357512, -384822, -337173, -828313, -1277364, -1349844, -951580, -202907, 547691, 948724, 990249, 987927, 1162049, 1391903, 1499577, 1586871, 1831772, 2060374, 1906749, 1464396, 1369051, 1980772, 2808351, 3106063, 2819470, 2525263, 2561330, 2667610, 2489684, 2041064, 1596923, 1426816, 1647881, 2044409, 2057525, 1303413, 90251, -932855, -1546600, -1874018, -1622982, -240291, 1901689, 3288432, 2883232, 1454235, 577585, 656390, 700262, -91021, -1363516, -2334194]
40733b334194m04191o105K44720L07742J8298l68289k46518M86438J152149J145427
40723d523O59248K37597j9198l38983o09834m32766J19799L63264j06211p73470
40713i05077q19295j18625P34702J185235J086721M92094m00752j100592j122568
40704i68157n55703L7133L23615L97462K87654j33000o03506m86103L20304J001274
40694c79027P88132r0693p74419o94512J52476J322448J930826J179097n28244
40685B906084j572719r63279L16893O41731n9010m82873l2842N10360M17621n9802
40675A622164m46325o78584o19761O5955J030241J139233l5771j321183j311785
40666e55816j58501P64113O41881n9233m82317l21037J23994L46841O0063m83445
$$ y = [-2334194, -2738385, -2744490, -2499770, -2192028, -2173730, -2542019, -2788537, -2302099, -1149950, -4523, 654725, 892322, 873124, 534141, -75693, -508459, -388660, -25396, -131607, -905077, -1724372, -1842997, -1108295, 76940, 1163661, 1655755, 1255003, 154411, -968157, -1523860, -1486727, -1163112, -765650, -477996, -610996, -1214502, -1700605, -1380301, -379027, 409105, 318412, -456007, -1150519, -998043, 324405, 2255231, 3434328, 2906084, 1333365, 370086, 686979, 1328710, 1269700, 786827, 753985, 1264345, 1681966, 1622164, 1175839, 497255, -122506, -56551, 973690, 2112923, 2077152, 755969, -555816, -714317, 49796, 691677, 632444, 150127, -170910, -46916, 299925, 359988, -123457]
40656a23457o60025k19288L02356K16061m31093r36966p90424j14912O08388R12385
40646a236975N46037k80169q39622m79342N93677J402678J260593N33190J22260
40637A622327L31019N81174L12730k12654l55944j22353j58993o69714r92232
40628C35360o27627p6988j2017j10345L82018J192966J207869J78595q16425r35182
40618G18224n84848l71294m5018O87442J134135N00455o65448j053650m50941
40609a30943Q3660m4089j50572M20516J124721J044354K93315k15264j51448r8425
40599B175825m18674n43859J27427J076795J123212L384j186656j392872q42092
40590A22490l82189j21410M38959J155060J157991K27878o62436o60394j74099
$$ y = [-123457, -783482, -1002770, -700414, -484353, -915446, -1852412, -2642836, -2757748, -2149360, -1236975, -690938, -971107, -1810729, -2290071, -1696394, -293716, 966877, 1500067, 1622327, 1953346, 2534520, 2847250, 2634596, 2278652, 2156299, 1997306, 1327592, 335360, -292267, -369255, -381272, -491617, -109599, 1083367, 2291236, 2469831, 1653406, 718224, 133376, -237918, -282936, 404506, 1538641, 2039096, 1373648, 319998, -130943, -47283, -91372, -241944, 178572, 1303293, 2347647, 2640962, 2425698, 2274250, 2175825, 1757151, 1213292, 1340719, 2417514, 3540726, 3544110, 2357454, 964582, 122490, -259699, -381109, 57850, 1212910, 2370901, 2598779, 1936343, 1275949, 1101850]
40581A101850p7656l30240j64787O04525J220076R56470n8836j076460j420265
40572G54677r11448Q7066R33438J160392P59757P4088m71055n74002k52627J23797
40562A684083K18534J13977N1645n3615l70552n84308k60810K79047L00960n9877
40552A319084J21185R24792J184121K77597q14872j053467q40583r48796r89964
40543h20903k87754N55852N09722k7854J54455R26473R64073l879p58298n80992
40533F30895j18689O1264K60217N28301K39852n47091o78502L13620J219204Q78140
40523B787211j27613n03950j04070K68308K38282M7604j41427k72279j47118J54235
40513B199183J07403l76932n48496q998M22376m5233p33875m21837P49303J470161
$$ y = [1101850, 1024194, 693954, 529167, 1133692, 2353768, 3310238, 3251402, 2174942, 754677, -156771, -69705, 863733, 2024125, 2783882, 2857970, 2386915, 1812913, 1560286, 1684083, 1902617, 2016594, 2068239, 2014624, 1644072, 1059764, 798954, 1078001, 1378961, 1319084, 1440269, 2365061, 3549182, 3826779, 3011907, 1958440, 1117857, 169061, -820903, -1108657, -552805, -43083, -70937, 83518, 1009991, 1974064, 1970185, 1211887, 630895, 512206, 573470, 833687, 1361988, 1601840, 1054749, 376247, 689867, 1909071, 2787211, 2659598, 2155648, 2051578, 2319886, 2558168, 2605772, 2464345, 2192066, 2044948, 2199183, 2306586, 1929654, 1381158, 1372160, 1794536, 1749303, 1015428, 593591, 1342894, 2813055]
40503B813055J124985L34472k50015o00750p23599m36382O0773K24822j1527j65461
40493B370373r1050k09424o35030p75083j70311P59699J173364P18703k18860
40484B922381r37734r80205m80575J8835K29058L91253O56542N86242j68799r84580
40474A252418q40666K38677J070921Q06888j00641o68078n88624l45172m68462
40465C57261r64530j299855q69609L09891J404014J555166Q37931R2729j06107
40456A316891R4132L04287L03032l0559o36118j029925o78595K22228Q21015O45305
40446A331693J32920l6787K90262Q16408J181972J061283L01561p57473j453000
40437B868839j527154j348044j214839q92073j70309N30761O26474K21779j0981
$$ y = [2813055, 3938040, 4272512, 4022497, 3421747, 2698148, 2261766, 2322539, 2547361, 2535834, 2370373, 2279323, 2069899, 1434869, 659786, 489475, 1249174, 2422538, 3141241, 2922381, 1984647, 1004442, 523867, 542702, 771760, 1163013, 1819555, 2405797, 2236998, 1252418, 411752, 650429, 1721350, 2528238, 2427597, 1759519, 1170895, 825723, 357261, -607269, -1907124, -2776733, -2466842, -1062828, 492338, 1330269, 1422998, 1316891, 1411023, 1715310, 2018342, 1987783, 1351665, 321740, -356855, -134627, 686388, 1331693, 1464613, 1427826, 1718088, 2534496, 3716468, 4777751, 5079312, 4321839, 2868839, 1341685, -6359, -1221198, -2113271, -2283580, -1752819, -1126345, -904566, -915547]
40428i15547K15329M23202J05511m69505n30640J38302P87460O57498R4193R1199
40418E97002O98949P39937m08873j589548j369435j94897K37580m37698p69522
40409b496505J39267J227343J210649N24742M09628Q64706Q24808J9755o34201
40400B090192n59792l27510n71236r29182o50926J98956P64804N38241p665r3709
40390D52173L26691N50603J50033l89403l51155J96393N60889M49059K33675K17965
40380B396923K90531M09774P15358R36798M74200n30655r94222l54151N02933
40371C847489N32272O3578N9887L87239O9941r11523j389928p89822J9478J09321
40361A997932k37422k71506j7120J9470j26993J0253M18872N73893L01953K5274
$$ y = [-915547, -700218, -277016, -171505, -641010, -1171650, -1033348, -245888, 411610, 505803, 597002, 1295951, 2035888, 1627015, 37467, -1331968, -1526865, -1289285, -1726983, -2496505, -2357238, -1129895, 80754, 605496, 1015124, 1879830, 2704638, 2724393, 2090192, 1530400, 1202890, 631654, -297528, -948454, -749498, 15306, 553547, 545882, 452173, 778864, 1329467, 1479500, 1090097, 738942, 935335, 1496224, 1945283, 2178958, 2396923, 2687454, 3097228, 3812586, 4749384, 5223584, 4692929, 3698707, 3344556, 3847489, 4379761, 4443339, 4503226, 4890465, 4960406, 4048883, 2658955, 1869133, 1888611, 1997932, 1760510, 1489004, 1471884, 1491354, 1364361, 1374614, 1793486, 2367379, 2669332, 2694606]
40351B694606L1020P2653o8096j44178K4513J930o42458j335296r43698N39415
40341B30411J543349Q15182p76013j275176k66205O58512K45584p52825r19003
40332d96184k34829K17691P5326M5824N46581J057681J052469P41282N23042L06742
40322C835625j95365q78961j319677j235335o93475o3061J76321j08703l55500
40313h38131J92336J440346K288199J839260M88967n61917p02330l99681l32653
40304C414396n10312n05857k53675j44967l24697l72272K8201M69830L75409l3164
40294B142892L2766P03646J159470Q10003J04350k60244l33129n14392o48387
40285C196975k83490L85094O05294J40146l49273j60985N72066J024844N76362
$$ y = [2694606, 2725626, 2798279, 2730183, 2586005, 2610518, 2612448, 1969990, 634694, -309004, 230411, 1773760, 2588942, 1812929, 537753, 271548, 930060, 1175644, 422819, -496184, -731013, -513322, -437996, -392172, 154409, 1212090, 2264559, 3005841, 3528883, 3835625, 3640260, 2761299, 1441622, 206287, -487188, -550249, -373928, -482631, -838131, -645795, 794551, 3082750, 4922010, 5410977, 4849060, 4146730, 3747049, 3414396, 2904084, 2398227, 2144552, 1999585, 1674888, 1302616, 1330817, 1800647, 2176056, 2142892, 2175658, 2879304, 4038774, 4848777, 4953127, 4692883, 4359754, 3845362, 3196975, 2913485, 3298579, 3903873, 4044019, 3694746, 3533761, 4105827, 5130671, 5707033]
40276E707033m45382r62240l47501O56920P85247J1524m10016P8188M61019n0645
40266E484147n32521J43187J265081J283335K45044m31630k88499j97949m73054
40257F497141l84305K10859M50754J04723L6520N02125N45112k14589o81091l8071
40247G029178R30379J215003J085779J259945J638949J830866J998245K358926
40239A9347270K746487L296259M496958O034084O929708P393512Q913813J1896579
40231G1054670J5257269J9188953K5730950L5134134M4545722N2218704N9237430
40224C22367832O3484432N6044016L0455427n499955l4328085m6595371m8490351
40217C37437945m9918753n1524130m7885082l8477135k8884209k2814621j8677015
$$ y = [5707033, 5261651, 4299411, 3951910, 4608830, 5394077, 5405601, 4995585, 5073773, 5534792, 5484147, 4951626, 5094813, 6359894, 7643229, 7888273, 7456643, 7168144, 6970195, 6497141, 6112836, 6323695, 6774449, 6879172, 6915692, 7417817, 7962929, 7748340, 7067249, 7029178, 7959557, 9174560, 10260339, 11520284, 13159233, 14990099, 16988344, 19347270, 22093757, 25390016, 29886974, 35921058, 42850766, 50244278, 59158091, 71054670, 86311939, 105500892, 131231842, 166365976, 210911698, 263130402, 322367832, 385852264, 441896280, 472351707, 466851752, 432523667, 385928296, 337437945, 287519192, 235995062, 188109980, 149632845, 120748636, 97934015, 79257000]
40210G9257000j4252349j0252125q095118p323348o641629n592367m260989k764390
40202B0074685j617364j415092j842829k015585j750200j416128q47710K25405
40194I395182J000444M81709o28666o58248M22287R31338J81062o73261q92798
40185I559049j254590k103099k235072r47844M03145L36907n08353n69482J81120
40176B861781N50329K19459q0794j35327m41129q81240o02610N24649J438089
40167C453207J262721L48513m18043o60039n11300j51152K14601K61303j43294
40158C656517o58895p66153l20942K76193M47470Q90o15428p03480m7715Q55547
40148B124004J389506J446726J304621J102725P64891L56650J82400M23528Q26650
$$ y = [79257000, 65004651, 54752526, 46657408, 39334060, 32692431, 27100064, 22839075, 20074685, 18457321, 17042229, 15199400, 13183815, 11433615, 10017487, 9169777, 9395182, 10395626, 10877335, 10248669, 9590421, 10012708, 10944046, 11125108, 10451847, 9559049, 8304459, 6201360, 3966288, 3018444, 3421589, 3758496, 3250143, 2680661, 2861781, 3412110, 3631569, 3550775, 3415448, 2974319, 2093079, 1490469, 2015118, 3453207, 4715928, 5064441, 4646398, 3986359, 3475059, 3323907, 3538508, 3799811, 3656517, 2997622, 2231469, 1910527, 2186720, 2634190, 2635080, 2019652, 1316172, 1268457, 2124004, 3513510, 4960236, 6264857, 7367582, 8132473, 8489123, 8671523, 9095051, 9921701]
40139I921701Q55071J86966q85343j622301j584523j169119j118332j501695j601606
40130A480819r47868j1446M32779K41628j87345n93199r27940r82224n27958J73202
40120a849552M96327J85070l77547o65626m71070J05957P40677R31703M05139
40111d98922l77413n15216K68403J155204J118703P9315j109113j644137j388006
40102b911182n98746M58209J419222J704403R60307l45542j124996p11084M15292
40093g34117J143070R13754J75412l05328k72382Q909K74744M56524M37431J5436
40083B113453o99752j097078o20375M67540J185146Q92664M8400l79853j16461
40074A793684K25131J31497j62064k28581j28126j02346j8743L12023N70317L29214
$$ y = [9921701, 10776772, 10963738, 10078395, 8456094, 6871571, 5702452, 4584120, 3082425, 1480819, 532951, 521505, 954284, 1195912, 1008567, 415368, -512572, -1494796, -2022754, -1849552, -1353225, -1168155, -1545702, -2211328, -2682398, -2576441, -1835764, -904061, -498922, -876335, -1391551, -1123148, 32056, 1150759, 1230074, 120961, -1523176, -2911182, -3509928, -3051719, -1632497, 71906, 1032213, 686671, -438325, -1149409, -734117, 408953, 1322707, 1498119, 1192791, 920409, 929318, 1204062, 1660586, 2098017, 2113453, 1413701, 316623, -303752, 163788, 1348934, 2241598, 2289998, 1910145, 1793684, 2018815, 2150312, 1988248, 1759667, 1631541, 1529195, 1510452, 1822475, 2392792, 2722006]
40064B722006j75894l74706l16476n01342q17122n97737J04007L31286k71043
40055A02979p59259l61824K47959N3865o24048o33799K18435R68708R42622M18930
40045E74568j36787n86948p72127m71163R8770M15377M15976M75501N47894J15989
40035F77050p77044j237828o79627L56442R70727R55293O32293J56095m66878
40026E86523r94617j119579q61553m32407R1281O42284R49227Q21026M81565K77464
40016D41214J77365r9228n08783n72467L7522R32344J215282M21587p84991j206382
40006E3463n74257O0601j58864n83310j44397O99019M64750q89373j583060o77427
39996c332855L97965Q0613q44512n52534Q69020J589935Q87246K6209P7793M78546
$$ y = [2722006, 2546112, 2171406, 1854930, 1353588, 536466, -61271, 42736, 374022, 102979, -656280, -1018104, -770145, -716280, -1340328, -1974127, -1755692, -786984, 155638, 574568, 437781, -149167, -921294, -1392457, -1293687, -878310, -462334, 13167, 561061, 677050, -99994, -1337822, -2017449, -1661007, -690280, 265013, 897306, 1053401, 586523, -408094, -1527673, -2389226, -2821633, -2730352, -2088068, -1138841, -317815, 163750, 441214, 618579, 519351, 10568, -561899, -524377, 407967, 1623249, 2044836, 1259845, 53463, -520794, -460193, -619057, -1202367, -1346764, -647745, -182995, -1072368, -2655428, -3332855, -2934890, -2854277, -3698789, -4251323, -3382303, -1792368, -905122, -878913, -801120, -322574]
39986c22574L71884N6517K21568O57037O45902R5594m73612o91473n24196q5502
39976d8855K39613r1566j005830j558936j034704N8276O99447P20947P28351Q93857
39966c99400P08295O910n60310m10945J71839M98683L53593M6818j49714k41029
39956B4740k94225l05803k88941k80247k18151M5183N37847J025424J139108O86365
39946B071300j43590r01290j233759j105970o70620m7207O20141R72875O23448
39937A85328k95704r87134p29606K40478R16747P24835K25201L26449J046809
39928A653403J530419J229187N02927j10785o40347j277015j684567j335922l63119
39919d95819N05097P97600N92585N9961o58819j115134q26985p9301K55765m741
$$ y = [-322574, 49310, 105827, 327395, 984432, 1630334, 1725928, 1252316, 560843, 36647, -48855, 190758, 99192, -906638, -2465574, -3500278, -3442002, -2742555, -2021608, -1293257, -399400, 308895, 315805, -244505, -655450, -483611, 15072, 368665, 415483, 265769, 24740, -269485, -575288, -864229, -1144476, -1362627, -1317444, -779597, 245827, 1384935, 2071300, 1927710, 1026420, -207339, -1313309, -1983929, -2031136, -1410995, -438120, 185328, -110376, -1097510, -1827116, -1586638, -669891, 54944, 280145, 606594, 1653403, 3183822, 4413009, 4915936, 4805151, 4164804, 2887789, 1203222, -132700, -495819, 9278, 806878, 1399463, 1459424, 800605, -314529, -1141514, -1220815, -965050, -969791]
39909i69791r642P18008J314942Q16237k62733o37445k11583j12460p41460j034179
39899a130106j43613J142577J410957L99311r62200j793095j805933j012202K59068
39890c635236J213310J253864P55929M87181L70433k93077j330710j513729l22219
39881c014254J061252J274467N73033K02365M83556N76427m5557r08249j365250
39872a162210j226845m76571P36795J631132J256548j72311j237492j063660k96894
39863b011508J44657L45237O51527O06059k32821j065814p68999L12303Q09415
39854a209944L98033M8067K06633K03018k44435l89179J04168M33669J42089N3771
39844b54110P46233J260031N91380m76773m94580L59032O50567q037o13869o29693
$$ y = [-969791, -979433, -261425, 1053517, 1869754, 1607021, 969576, 757993, 645533, -95927, -1130106, -1273719, -131142, 1279815, 1679126, 716926, -1076169, -2882102, -3894304, -3635236, -2421926, -1168062, -412133, 75048, 445481, 152404, -1178306, -2692035, -3014254, -1953002, -678535, -105502, 96863, 580419, 1156846, 1111289, 203040, -1162210, -2389055, -2865626, -2128831, -497699, 758849, 586538, -650954, -1714614, -2011508, -1866851, -1521614, -870087, -264028, -496849, -1562663, -2331662, -2019359, -1209944, -811911, -763844, -557211, -354193, -598628, -987807, -883639, -449970, -307881, -254110, 492123, 1752154, 2343534, 1866761, 1372181, 1731213, 2381780, 2373743, 1759874, 1130181]
39834A130181o17654q32411o62733P2693N61929L22130k0031J00165K56161j5308
39824B95122k76909m3627K36959k8912m81696m49301j34459j58640l55751r1589
39814a488803M84426O07553K31502J22040N34949Q11468N28937J38361R7115J65939
39804B233487J0368j73596j11672L8858R8916K57280N54627N01820j68783p98435
39794B442870n81905J91240M38126k28270j036405j185624p62344k53062K64899
39785g10475R35767J446373J144258p4296j363067j668949q08531L62730Q77978
39776A41788O07219J64604L1876J03356J22999J45959K79849K99380l2091m34431
39766A430508m15409n9443K6498l61602o92123m97406l322L38443M74968N24206
$$ y = [1130181, 512527, -319884, -982617, -909924, -347995, -25865, -45896, 54269, 310430, 295122, 18213, -25414, 211545, 182633, -299063, -748364, -882823, -1041463, -1397214, -1488803, -1004377, -396824, -165322, -43282, 491667, 1303135, 1832072, 1970433, 2067548, 2233487, 2243855, 2070259, 1958587, 1997445, 2096361, 2353641, 2908268, 3410088, 3241305, 2442870, 1860965, 2052205, 2490331, 2262061, 1225656, 40032, -722312, -975374, -710475, 225292, 1671665, 2815923, 2741627, 1378560, -290389, -1098920, -736190, 141788, 749007, 913611, 945487, 1048843, 1171842, 1317801, 1597650, 1897030, 1864939, 1430508, 1015099, 955656, 982154, 620552, -71571, -568977, -572299, -233856, 241112, 765318]
39756G65318L73573L782j84344L2418J22502m44334j126839r07769J16727P72975
39746d75991N84985L88340P25314Q09744k0195q31015l71413Q04271R95112n6259
39736B552893p98885l35154K72338j58195j068830j184358m73973J13697L09562
39727g70905O43277J118708J030284K67769k58602Q6139P21373O97474o9821q87547
39717B578149j195869r27335k68079M44306P26854L14891m34298p99932m77760
39708c9073M8422O2515m67256p16135J1794J201397J514602M87145p17824q16987
39698E68600j78242j65601r61047j261968l62195P32803R23445O07557O30764
39689E34116N81358m46651j870796k008020n40252Q44103P40137k12735n15159
$$ y = [765318, 1138891, 1142673, 958329, 990747, 1113249, 668915, -457924, -1365693, -1248966, -475991, 108994, 497334, 1222648, 2032392, 2012197, 1181182, 809769, 1614040, 2609152, 2552893, 1754008, 1418854, 1691192, 1532997, 464167, -720191, -1194164, -1080467, -770905, -127628, 991080, 2021364, 2289133, 2030531, 2116670, 2838043, 3535517, 3465696, 2578149, 1382280, 454945, 186866, 631172, 1358026, 1672917, 1238619, 438687, -39073, 9349, 71864, -395392, -1111527, -1099733, 101664, 1616266, 2103411, 1385587, 568600, 390358, 224757, -736290, -1998258, -2360453, -1627650, -704205, -96648, 534116, 1115474, 668823, -1201973, -3209993, -3750245, -2906142, -2166005, -2378740, -2893899]
39680b893899J87821J071630J404749J042383J55794p28210p92125J67846J158586
39671G74575J088498K49066j37110K54582M47881k15922j006842r01754p0015
39662D82959M62916K75006q9318j45295j33644m10947p02324m54419K50181O44918
39652A80033K62969m12620n65466p4783M46036N30988L41345K13472J56813m147
39642A074640l05055o42041q18959n07012M08409J292182J181716J22913n66464
39633A240329J404R20757P23860m69655j174241p57412j72439k58972n38658k77304
39623g62331K58356L83535J21920l3032L3964J54806L57409N69626L07970n84633
39613H07590j295580r72825j6957M10332q698m91527m14324M0711N14892Q96629
$$ y = [-2893899, -2706078, -1634448, -229699, 812684, 968478, 240268, -551857, -384011, 774575, 1863073, 2112139, 1975029, 2229611, 2677492, 2461570, 1454728, 552974, 482959, 945875, 1220881, 1131563, 986268, 852624, 441677, -260647, -715066, -464885, 180033, 443002, 30382, -535084, -609867, -163831, 367157, 708502, 921974, 1078787, 1074640, 769585, 127544, -691415, -1198427, -790018, 502164, 1683880, 1806793, 1240329, 1241733, 2162490, 2886350, 2416695, 1242454, 485042, 312603, 53631, -485027, -762331, -503975, -120440, 1480, -31552, 2412, 157218, 514627, 1084253, 1392223, 807590, -487990, -1460815, -1477772, -1067440, -1076138, -1567665, -1981989, -1941278, -1426386, -529757]
39603e29757R92003N85184L7896O1661O14537P66867M1207q08273q47266k11572
39593G02487K63669K26114P399r0756j23360j87983k19900j22589J20398M07322
39583I82801M76434R1482n88789j065198j090146r38294q97178q03719l73119
39574d205726K78557P71760R36575Q50827N80943J96864q0032n1232J78649L07883
39564b34932J84217q0471k51420j40721K24016N37550N07127K38641Q9514J35601
39554A209122J37035M4072M6399L0482l87022j025021j020695l3063J029382J103526
39544A134217L17939m15401p07798q07505p51409l12956L13835O21295N80482
39535b7301N79937N90262J90439n04354p71174l50281J55157K16616L0483o3570
$$ y = [-529757, 462246, 1047430, 1085326, 1146987, 1761524, 2528391, 2569598, 1761325, 914059, 702487, 966156, 1192270, 1199669, 1108913, 985553, 797570, 577670, 455081, 575479, 982801, 1459235, 1550717, 961928, -103270, -1193416, -2131710, -3028888, -3832607, -4205726, -3927169, -3155409, -2218834, -1368007, -787064, -590200, -670232, -721464, -542815, -234932, -50715, -131186, -382606, -523327, -299311, 238239, 745366, 984007, 1073521, 1209122, 1346157, 1390229, 1436628, 1467110, 1080088, 55067, -965628, -998691, 30691, 1134217, 1452156, 1036755, 328957, -478548, -1229957, -1542913, -1229078, -607783, -27301, 552636, 1142898, 1333337, 828983, 57809, -292472, -137315, 79301, 109784, 46214]
39525D6214j39620k86847k63070K7667K31349J32037O0517L05343N89493N67364
39515A270447L80458K53014L938m86581p52740l43088L54801N68707K25827j02224
39505A372559k20907n22476j080338j248516n28149O01681J134609O70582j71345
39496G700m50513J06602Q26321P91169j75684j296099j624053r37872J52926P92204
39486a807299N37329k83131p60016k47468Q39615J400319R77490K76592Q9898
39477A023329K40413J09289k59346l22891n8120l896l13384n25425l99696k80139
39467g89866l94472m20629r4300K61052K16854j06591k50402l2674L58130O75688
39457e77210P55367N25618J08808k40812m40121o09912p04926m34851K48089Q98752
$$ y = [46214, -93406, -380253, -643323, -615656, -384307, -252270, -191753, 113590, 703083, 1270447, 1650905, 1903919, 1907857, 1421276, 668536, 325448, 680249, 1248956, 1474783, 1372559, 1151652, 629176, -451162, -1699678, -2227827, -1626146, -491537, 179045, 7700, -442813, -336211, 490110, 1281279, 1105595, -190504, -1814557, -2752429, -2599503, -1807299, -1269970, -1553101, -2313117, -2560585, -1720970, -320651, 656839, 933431, 1023329, 1263742, 1373031, 1113685, 790794, 732674, 728778, 415394, -110031, -509727, -789866, -1184338, -1604967, -1699267, -1438215, -1221361, -1327952, -1578354, -1611028, -1252898, -577210, 178157, 703775, 812583, 571771, 131650, -478262, -1183188, -1618039, -1369950, -471198]
39447d71198J060778P14903M4237q33719j555460j402181j30997J325913J688123
39438D40399Q27135j77748m98767l79208l15747j85046K91384P60307O28014k504
39428A388219m72559n66537o67445q29888m70117N91856J401786R01256n75334
39419G01237j579260j328619n23605j90861l62336l44408J58600P71882J098842
39410a598528J099113Q57275M36264K4079j20437M9262L59876O47707P34690L32243
39400B821544n60249j216801p67313N90888J540276J164683N7101n49117l62663
39391B718349j37499l88646p06365n04024N9199K53891k83905j043318j111864
39382a144182j36506J218676J866435J348835J54403r50974j535569j389362m19224
$$ y = [-471198, 589580, 1304483, 1348720, 515001, -1040459, -2442640, -2573637, -1247724, 440399, 1267534, 1089786, 591019, 211811, -103936, -288982, 2402, 762709, 1390723, 1388219, 915660, 349123, -318322, -1148210, -1618327, -1026471, 375315, 1276571, 701237, -878023, -2206642, -2730247, -2921108, -3283444, -3627852, -3469252, -2697370, -1598528, -499415, 357860, 794124, 818203, 697766, 747028, 1106904, 1754611, 2489301, 2821544, 2261295, 1044494, 277181, 868069, 2408345, 3573028, 3630129, 3081012, 2718349, 2580850, 2192204, 1485839, 981815, 1041014, 1294905, 1011000, -32318, -1144182, -1280688, -62012, 1804423, 3153258, 3307661, 2356687, 821118, -568244, -987468]
39373i87468Q79290J362942M28312r62807j271036l39721N25925N31324L69257
39364E36018P56004J078309M69146n31221o60454L6817K13805o35871j327047
39355f4494p75910M30400J021766P81986L78029N4982m13027p65703m14642L74507
39345F07894N22007l11246j108378r24492j60545K19041R1478r899l5090l97840
39335a507070r21776p60721L79472J639143J983830J310300K73332n29965q12646
39326A053899m42176L91525R78453O16608n11063j339117j060724j24963J94910
39317b42648o96874j879671j865073l44812J377279J851231J003574j11445o84749
39308a593188p13417m43221r998L20711K55358j5101j8003J65868K3099k50756
$$ y = [-987468, -108178, 1254764, 1683076, 720269, -550767, -890488, -364563, 166761, 536018, 1292022, 2370331, 2839477, 2308256, 1647802, 1684619, 1898424, 1262553, -64494, -840404, -410004, 611762, 1393748, 1771777, 1826759, 1413732, 648029, 233387, 607894, 1129901, 818655, -289723, -1214215, -1374760, -1155719, -1064241, -1074140, -1109230, -1507070, -2428846, -3189567, -2810095, -1170952, 812878, 2123178, 2396510, 1866545, 1053899, 611723, 1003248, 1981701, 2598309, 2087246, 748129, -312595, -437558, -242648, -939522, -2819193, -4684266, -5029078, -3651799, -1800568, -796994, -908439, -1593188, -2306605, -2749826, -2759824, -2439113, -2183755, -2198856, -2216859, -2050991, -2027892, -2278648]
39298b278648K58655J506551J874075K65724j977956k587827j342941j04556k3615
39289d410538k83723P9985O36802O07092K68892L23286O55415P13450N53271N62424
39279b93644N68853J52213m41641n77744k39657N5022J88229M58555P64318O50285
39269A284789K05770M9554K57643J37240o27639j338450j204294l49026M82043
39260a102370P55926L80378m06424j015581q36371J7876O76936N73660J25020
39251h30950m33J92083L23481M09287O72170Q72378N35579k25679p31145o03313
39241F13458j41480J80754J53205k20833p47470r76807n58309K46663P76514P49425
39231G5120M68842K40123M3476j16669m3400K18929K06879l49840j009607j065001
$$ y = [-2278648, -2019993, -513442, 1360633, 1626357, -351599, -2939426, -4282367, -4386923, -4410538, -4694261, -4614276, -3977474, -3370382, -3101490, -2778204, -2122789, -1409339, -856068, -293644, 275209, 427422, -14219, -591963, -831620, -776598, -588369, -129814, 634504, 1284789, 1490559, 1540113, 1797756, 1934996, 1307357, -31093, -1235387, -1584413, -1102370, -346444, 33934, -372490, -1388071, -2224442, -2206566, -1529630, -955970, -830950, -831383, -639300, -315819, 93468, 765638, 1638016, 2173595, 1947916, 1216771, 613458, 471978, 652732, 805937, 585104, -162366, -1139173, -1697482, -1450819, -674305, 75120, 543962, 784085, 827561, 710892, 667492, 886421, 1093300, 743460, -266147, -1331148]
39221a331148l65046N74410J154263J139063O34644q1846o69710q56313n91910
39212c93593q6485L28244M38870L14854J82558R0824j49667n69376q07308n63569
39202a214648r9800J19054J56713M41899Q76714P72674o7124q21173o87883J320
39192e22254L10299O3856j7069M60102Q77823M67475n58311j179063p95156Q1763
39182h10535N16301L05997J19123M54820Q68001N68289m51567j363867j506745
39173a300183r33857K3438J116004J918152J857102R17497j47653p08002r07053
39164A835445j030030q17670p9707N06227J28033q25182j090585k35064Q10462
39155g98071J090434P13853K96663K2051k60738m90022m64118k06306J15278M28196
$$ y = [-1331148, -1696194, -1121784, 32479, 1171542, 1806186, 1724340, 1054630, 198317, -393593, -480078, -151834, 287036, 601890, 784448, 875272, 725605, 156229, -651079, -1214648, -1314448, -1195394, -1038681, -596782, 279932, 1052606, 985482, 164309, -523574, -522254, -211955, -148099, -165168, 294934, 1172757, 1640232, 1081921, -97142, -892298, -810535, -294234, 11763, 130886, 585706, 1453707, 2021996, 1570429, 206562, -1300183, -2234040, -2210602, -1094598, 823554, 2680656, 3598153, 3450500, 2742498, 1835445, 805415, -12255, -91962, 414265, 542298, -282884, -1373469, -1608533, -798071, 292363, 1006216, 1302879, 1324930, 1064192, 574170, 110052, -96254, 19024, 447220]
39145D47220O41636N34171N7605m31455n28553k51122N6261J49659K2665k48000
39135D50087n69731p98328p99098n54263j75408J49754K49983J15735p0121j39943
39125b141333j01366K879J99787L65733J85184l24641n42530j9764O93539O61619
39115a020893r6601o33245m72458j64573k25085l39248m2210M89018Q06077P98464
39105i00754N00723j44760q75420j034223m28895K61609M38717L56795M05010
39096a421198L17376j59380m86799j55590K86523Q8799l02695O7893Q90644Q96474
39086B2047p4449p20337k69528M76656N62133J56771j94934n34485r29174q55109
39076b360409j6068R05082J151503R56035Q80841P03401m5305q82312q47739l3099
$$ y = [447220, 1088856, 1623027, 1680632, 1249177, 720624, 469502, 525763, 675422, 698087, 450087, -119644, -917972, -1717070, -2271333, -2446741, -2296987, -2047004, -1931269, -2001390, -2141333, -2242699, -2239820, -2040033, -1674300, -1489116, -1813757, -2356287, -2376051, -1682512, -1020893, -1117494, -1750739, -2223197, -2387770, -2612855, -2952103, -2994313, -2505295, -1699218, -900754, -400031, -544791, -1420211, -2454434, -2883329, -2621720, -2183003, -1826208, -1421198, -1103822, -1263202, -1750001, -1905591, -1619068, -1530269, -1832964, -1765071, -874427, 22047, -52402, -772739, -1042267, -565611, -3478, 153293, -41641, -576126, -1505300, -2360409, -2376477, -1471395, -319892, 636143, 1516984, 2220385, 2175080, 1292768, 445029, 411930]
39066D11930M39277M1572n10692m57547R682L21129L90446M18011L49882O6800
39056A480490k15802k46883k31601n14602q58998n95060L62758J123516Q32657
39047A136475j77193p48886l86076J86222J72098j61070o9988L43750K70668l78911
39037A87089o49748l2162N70987J09437r43060j135268q9264R52560Q43639J6549
39027a69241k50255M08222J044145P10671l18221r09585m87516K54984K29416
39018E12620o66711j417010j172217k60445L45977K52684p5945j01844J78497
39009b404394M49711N29937M48705K90983J32530M4831M8631N9726o9398l63701
38999h32439n23111q7212R09440J574317R76481n63037j590214j241375k52277
$$ y = [411930, 851207, 892779, 382087, -75460, -65778, 255351, 645797, 1063808, 1413690, 1480490, 1264688, 1017805, 786204, 271602, -587396, -1182456, -819698, 303818, 1136475, 959282, 210396, -175680, 10542, 182640, 21570, -48418, 295332, 566000, 187089, -462659, -494821, 76166, 185603, -757457, -1892725, -1981989, -1029429, -185790, -169241, -419496, -11274, 1032871, 1743542, 1425321, 515736, 28220, 283204, 512620, -154091, -1571101, -2743318, -3003763, -2657786, -2405102, -2481047, -2582891, -2404394, -1954683, -1424746, -976041, -685058, -552528, -507697, -459066, -399340, -468738, -832439, -1355550, -1442762, -533322, 1040995, 2017476, 1454439, -135775, -1377150, -1629427]
38990a629427K44941K83804N81001R79688N78217n92208j237693n84907M87109
38981h89475P41888K38387j07344n4980j93732p76051j278596j199575o25806
38972d145284J43076R84456J745767K078701J767319R92461J04918o47863j069260
38963A954291r97641n69801k64045l82231o02173l43481M24975J003876O92745
38954I16515m34988j563629j846000j053511L03859J357758J507960Q95378K47990
38945C31332J06836K62774J65779k12877l31131N8944M88856M84060K31926J00210
38935A686709q5530o17702j030391n17155P23097J422172Q53960k17915o73941
38926A543304m82448l75532n77936o69041n12065n12402q56926j115599q31992
$$ y = [-1629427, -1384486, -1100682, -519681, 460007, 1038224, 446016, -791677, -1376584, -889475, -147587, 90800, -16544, -71524, -265256, -1041307, -2319903, -3519478, -4145284, -4002208, -3017752, -1271985, 806716, 2574035, 3566496, 3671414, 3023551, 1954291, 956650, 386849, 122804, -259427, -861600, -1205081, -780106, 223770, 916515, 481527, -1082102, -2928102, -3981613, -3677754, -2319996, -812036, 83342, 331332, 438168, 700942, 866721, 653844, 322713, 381657, 870513, 1354573, 1586499, 1686709, 1601179, 983477, -46914, -564069, 159028, 1581200, 2435160, 2217245, 1543304, 1060856, 685324, 107388, -561653, -1073718, -1586120, -2443046, -3558645, -4390637]
38917d390637j29410M66689N83823K95959L9990K23869P43003J003654O56393
38908e06667J01126q8212j382j30776m47918m32718l3043J63893o3503j29483
38898a568683L78677R04096O79752j40273p06648n76435o8520K83318J69453l99736
38888a044999r79414q94395n8135O43103L74998m36415o38732l669N00904K18584
38878b318170k82494j92878L85334Q26860R42535Q99737O27340M4673l78854r1059
38868D63024N65623O13795j80923q92464p11045m3054J58171k47872n25464k31361
38858a031570J84767J29194k47777l00997J54331N61601L80305j96846n37847
38849i04839m13223j95344k07808k52209m045L96877N19971L14337K13336M90997
$$ y = [-4390637, -4520047, -4053358, -3469535, -3173576, -3133586, -2909717, -2166714, -1163060, -506667, -405541, -493753, -495135, -625911, -1073829, -1506547, -1539590, -1375697, -1439200, -1568683, -1190006, -285910, 393842, 253569, -453079, -1029514, -1098034, -814716, -645263, -1044999, -2024413, -2918808, -2976943, -2333840, -1958842, -2395257, -3033989, -3037658, -2536754, -2318170, -2600664, -2793542, -2408208, -1581348, -638813, 260924, 888264, 932937, 554083, 463024, 1028647, 1642442, 1461519, 569055, -141990, -185044, -26873, -274745, -800209, -1031570, -846803, -717609, -965386, -1266383, -1112052, -550451, -170146, -366992, -904839, -1318062, -1513406, -1721214, -1973423, -1977468, -1580591, -1060620, -746283, -532947, -41950]
38839d1950Q47291Q42245N23094L38359M95775O75770M59970j29216o68023q60106
38829B483209q61417r86765j186329j025836k90161N53193P49721J46405n48298
38820i66278n54088P9622N94641M86001L4804k17944k07285k37330l29556j58990
38810a476403K96488N21199J57867m23973o37721m68902k78307n8215M55948R83767
38800i28252P81465k29934j090886r75479k07471L59197M84453M91837M84456
38791h30614L13900J09106J41269K56892Q3095k64038l13981n3239O7179m0859
38781e31290J4139K70178K10177l33112p59310n71366q7049J22709m933k14064
38771a883921l68105k88612K97444J139589J317452L44267r91551j536669j160761
$$ y = [-41950, 805341, 1647586, 2170680, 2509039, 3004814, 3680584, 4140554, 4011338, 3343315, 2483209, 1621792, 635027, -551302, -1577138, -1867299, -1314106, -564385, -417980, -966278, -1520366, -1440744, -846103, -360102, -325298, -543242, -750527, -987857, -1317413, -1476403, -1179915, -658716, -500849, -924822, -1562543, -2031445, -2309752, -2367967, -1912019, -928252, -146787, -376721, -1467607, -2443086, -2650557, -2291360, -1806907, -1315070, -830614, -516714, -407608, -266339, -9447, 73648, -190390, -504371, -557610, -490431, -531290, -517151, -246973, -36796, -369908, -1129218, -1700584, -1787633, -1664924, -1669857, -1883921, -2252026, -2540638, -2243194, -1103605, 213847, 558114, -433437, -1970106, -3130867]
38762c130867n48456J6667P57795J446947J332037K38350r89326j434937r88171
38753c299961j15023O83659R78499N69546j01854j64379O47136J500254J410170
38744B108047M27654n07642p17898l80746m5051L7880o627J518Q6065J48808R2260
38733A244268q3382k32578j25864L08892P30016N43564m14380j431436j540866
38724a001766o83463J51657J58204l42762n65209m51955n74750j016124j086237
38715e412405l25527P65837J327008J147011P64156P09888R07049Q15436Q0667
38706G79120r74727j546894j113616J3498R43157R79607J88236o55992p27283
38697b114894r919N53471J61828o65109o53177L90479J178792P89236k8726j36890
$$ y = [-3130867, -3679323, -3662656, -2904861, -1457914, -125877, 112473, -876853, -2311790, -3299961, -3414984, -2731325, -1752826, -1183280, -1285134, -1449513, -802377, 697877, 2108047, 2535701, 2028059, 1310161, 929415, 884364, 922244, 915617, 917135, 1003200, 1152008, 1244268, 1160886, 928308, 802444, 1111336, 1841352, 2384916, 1970536, 539100, -1001766, -1685229, -1533572, -1375368, -1718130, -2283339, -2735294, -3310044, -4326168, -5412405, -5737932, -4972095, -3645087, -2498076, -1733920, -1024032, -116983, 698453, 779120, -195607, -1742501, -2856117, -2842619, -1899462, -919855, -731619, -1387611, -2114894, -2124813, -1571342, -1409514, -2074623, -2727800, -2337321, -1158529, -369293, -398019, -534909]
38687e34909K73477L07954J4491R3302M12263K69010o7354L56488J276799J222700
38677C624221j67675j370063j154630j52631N16833Q16376J004943N79239p06272
38668B990341j750672j437357l64918P8758k22830l55841j87292m04560r32121
38659b586492q30263R2173Q88336R64411P92334P94431O08482m1826o56612p19344
38649f94370m62842l41716k84537K9059N53441R62546J058554Q16156L11225j90252
38639A757264l75191k83704k83155n42172q32985r10132p50566l97085O0156L37788
38629b219782K08450r2363j21861J55925M88066R30594J624056K003884J167315
38620D144284o56463j886955j450903j98317K71282k75786o32432j9825Q60812
$$ y = [-534909, -261432, 46522, 61013, 154315, 566578, 835588, 768234, 1124722, 2401521, 3624221, 3456546, 2086483, 931853, 779222, 1296055, 2112431, 3117374, 3696613, 2990341, 1239669, -197688, -562606, -483848, -706678, -1062519, -1249811, -1654371, -2586492, -3416755, -3324582, -2436246, -1471835, -679501, 114930, 723412, 681586, 24974, -694370, -1157212, -1498928, -1783465, -1754406, -1200965, -238419, 820135, 1636291, 1947516, 1757264, 1382073, 1098369, 815214, 273042, -559943, -1470075, -2220641, -2617726, -2557570, -2219782, -2011332, -2103695, -2225556, -2069631, -1581565, -650971, 973085, 2976969, 4144284, 3487821, 1600866, 149963, -48354, 222928, -52858, -685290, -705115, 155697]
38611A55697Q85511n081q27826p97007r4889N72330P72104M88074j92674j048346
38601i2107j472789q76108M49081J392235J294252O64960K46657l0340n04353
38592A071488p72263k15792P20780Q60144l5981q81881p66361L244O22648P68551
38582A374577N04878p7134o86221q44231m64640J4574L15074O11724R05290P22664
38572B376555j51520j125849j399489q01991J80768Q69604P90906Q1501m47721
38563C72764j93712L30744J98523m05344m16845K43011L72000m52574r27735q1540
38553i60708R91519P81365k07783k76604P35993J218210K71523j055098j364831
38544A33586o08018K98173P09138O01988K26991j45952l78470n37496o52902n06908
$$ y = [155697, 1041208, 1036127, 208301, -588706, -683595, -111265, 660839, 1148913, 956239, -92107, -1564896, -2441004, -1991923, -599688, 694564, 1359524, 1606181, 1575841, 1071488, 299225, 83433, 804213, 1664357, 1628376, 746495, -19866, -16622, 606026, 1374577, 1879455, 1802321, 1116100, 271869, -192771, -178197, 136877, 748601, 1653891, 2376555, 2225035, 1099186, -300303, -1102294, -921526, -51922, 738984, 820485, 372764, 179052, 509796, 708319, 302975, -113870, 129141, 501141, 48567, -879168, -960708, 30811, 812176, 604393, 327789, 1063782, 2281992, 2553515, 1498417, 133586, -474432, -176259, 532879, 1134867, 1361858, 1215906, 837436, 299940, -352962, -859870]
38534h59870K1806N75921O99264M45451J78070l7924l41608n63468l95275J3406
38524b64227J81176j4522k38485k17244O9947N69849J055671J026618K43055p56494
38514A655344j174059q70611l30006O7983K39411J31835j51093k07163R6980K13628
38504c27751k82960q27295n74697L18300R72117J060783Q82549M40236m33175
38495A228107j162498q66261J90615P21322J99896n39071o90643l91921R930M94984
38485h05540Q37000O27028K07866M53289J178664J005897n53005k093930k210040
38476a352771j252402l07356M28042J114390J188392K60012o42268k49269R43073
38467A29843J310250N08686k10870q0807K43170R9364j34898J9203J85772j61513
$$ y = [-859870, -838064, -262143, 437121, 882572, 1060642, 1022718, 681110, 117642, -277633, -264227, -83051, -97573, -336058, -553302, -483355, 86494, 1142165, 2168783, 2411838, 1655344, 481285, -389326, -719332, -651349, -411938, -280103, -431196, -638359, -541379, -327751, -610711, -1438006, -2012703, -1694403, -722286, 338497, 1221046, 1661282, 1228107, 65609, -800652, -610037, 111285, 311181, -227890, -918533, -1310454, -1300524, -805540, 31460, 658488, 866354, 1319643, 2498307, 3504204, 2951199, 857269, -1352771, -2605173, -2912529, -2484487, -1370097, -181705, 78307, -563961, -813230, 129843, 1440093, 1948779, 1737909, 1657102, 1900272, 1999636, 1864738, 1883941, 2069713, 1908200]
38457A908200p11774p35897j15352O02870R41764Q34273L79856l09734r79524
38448A814682j239116r04909k83413R6294J33739L01145Q55216J177256M93830
38439B444724q26230j478240r13831j8705K78497K16817L82310M99548K0776o19543
38429a3877m69775M08984R32066N49898r5636k45958J1239J22068j62591o61538
38419C74880j029819j002764o45956l48277l08906k16232K09423O36992N89685
38410a740974K21810N3835J84797L88762O91124J092463J020792J4870j193174
38401G34305j319321k76307P33968R47944P64014N58281P813r12048j385652r32517
38391a079520k27481k0228n1518J90095M28714K32880K4411M29959J078327J078157
$$ y = [1908200, 1196426, 460529, 345177, 948047, 1889811, 2724084, 3103940, 2794206, 1814682, 575566, -329343, -612756, -516462, -382723, -81578, 773638, 1950894, 2444724, 1618494, 140254, -773577, -792282, -513785, -296968, 85342, 584890, 605666, -13877, -483652, -74668, 857398, 1407296, 1311660, 1065702, 1076941, 1199009, 1036418, 374880, -654939, -1657703, -2303659, -2651936, -2960842, -3177074, -2967651, -2330659, -1740974, -1519164, -1465329, -1280532, -891770, -200646, 891817, 1912609, 1927479, 734305, -585016, -861323, -127355, 820589, 1584603, 2142884, 2150697, 1238649, -147003, -1079520, -1307001, -1327229, -1378747, -1188652, -759938, -527058, -502647, -72688, 1005639, 2083796]
38381B083796M19974q8957j42200k28023o06124q72245o96858k99960j9723M9015
38371d01305r0140l24274k72515K87955Q33519N84476l25513q54206m41891K49261
38361g54633L19203k03621n94934m16769J36950N64036M00059m26665j263500
38352b239874j126391J63746J547867J872751J187453M20548O4483j66184n14024
38343A210375p68577p66017o30266l34802L23722J043932J016199R3441o69119
38334E18888l45828M90224O25977J16758K01341J230633J868841R47205p81284
38325D872755j591863r66667P6242N95883P78887J297671K309990L319343L574633
38316A4266874K470949M5934k646438m051092l439801j669451l68498l52989r75390
$$ y = [2083796, 2503770, 2414813, 2272613, 2044590, 1438466, 566221, -130637, -430597, -450320, -401305, -491445, -815719, -1088234, -800279, 33240, 617716, 292203, -562003, -1003894, -754633, -435430, -639051, -1233985, -1650754, -1513804, -949768, -549709, -976374, -2239874, -3366265, -3202519, -1654652, 218099, 1405552, 1826100, 1890583, 1724399, 1210375, 441798, -324219, -954485, -1289287, -965565, 78367, 1094566, 1188007, 518888, 173060, 663284, 1289261, 1406019, 1607360, 2837993, 4706834, 5654039, 4872755, 3280892, 2314225, 2390467, 2986350, 3765237, 5062908, 7372898, 10692241, 14266874, 16737823, 16783757, 14137319, 10086227, 6646426, 4976975, 4608477, 4255488, 3280098]
38307C280098j051033k78371M73102L52623l05972m54498J33020M92554o6833
38298B574690q22971o43317L08147P42096L0151j018904j327256p95287q7706
38289a040357K87536L15580K17437J72281J58423k2721m11708o70992n04477j60552
38279a659550p1734j21662J40379O12783O85893K62518k1229J68963L46933Q1313
38269D24607k86409k43493J49867N46567P90764P17485J12844o58532o97897J34220
38259I90023O83808N7502r55989j003447j48989M46336M62177O50570J143404
38250B325395R85279j82712j212118j014080j65607l2731q08040j343766p65144
38241b213524N21287J469986J468837O41353m52944j140008r29594J04227J181034
$$ y = [3280098, 2229065, 1950694, 2423796, 2776419, 2470447, 2015949, 2148969, 2641523, 2574690, 1751719, 1108402, 1416549, 2158645, 2188796, 1169892, -157364, -952651, -1040357, -752821, -437241, -219804, -47523, 110900, 88179, -323529, -994521, -1498998, -1659550, -1731284, -1852946, -1712567, -1099784, -413891, -151373, -172602, -3639, 343294, 424607, 138198, -105295, 44572, 591139, 1381903, 2099388, 2212232, 1553700, 855803, 990023, 1673831, 1731333, 775344, -228103, -377092, 69244, 531421, 1181991, 2325395, 3310674, 3127962, 1915844, 901764, 736157, 703426, -104614, -1448380, -2213524, -1692237, -222251, 1246586, 1887939, 1434995, 294987, -634607, -530380, 650654]
38232F50654J339029L81086p67881r52479q7091P53210O54334j24994p15985p67186
38222C62697n47664k93188p1177p6720l78860m83255J07398Q96689P86243l36240
38212c4077j217804q44950K98074J093304J230467J073411O50587k44734j143273
38203H61005j104256m1184R34184Q67337Q7183m57926n13881n70280q45299r22800
38193a705917n00440P1148L05226K52022K63713L36676J67168k10445l39242J140
38183a358951M70077O85022O91808O67387N05672O5018m16096n63969m11812l19276
38173A4880m03032l97611j04045K95430M24289P4153n63802r13965m51569O44814
38163a380458J457488J247253K85806m97278n44833o5092M04791M68659P4808
$$ y = [650654, 1989683, 2370769, 1602888, 650409, 563318, 1316528, 1970862, 1845868, 1129883, 362697, -184967, -478155, -549332, -626052, -1004912, -1488167, -1380769, -484080, 302163, -34077, -1251881, -2096831, -1798757, -705453, 525014, 1598425, 2249012, 2004278, 861005, -243251, -284435, 649749, 1517086, 1604269, 1146343, 632462, 62182, -783117, -1705917, -2206357, -2135209, -1829983, -1577961, -1314248, -977572, -810404, -1020849, -1360091, -1358951, -888874, -203852, 487956, 1155343, 1661015, 1726033, 1309937, 745968, 334156, 14880, -388152, -785763, -889808, -594378, -170089, -95936, -659738, -1573703, -2025272, -1380458, 77030, 1324283, 1610089, 1112811, 567978, 502886, 907677, 1376336, 1451144]
38154A451144l84680l63392Q9455J71189n73097j337083r94475K46952J031420
38145f62567O95389l2851l69473n18080q92325j156840p76211J7393N18116M89081
38135b688368K33022l843j54357p3051L15645P20841P72108N43503M51013O61909
38125G78422Q45313N00049n22183j687556k049113j208289L3764N12357J90646
38116b606590Q8392N89650P98213Q7462o96253m79448L56865O70231M23810N72131
38106a95537J254767J440266O07119l66538m96126k4407J31031l10987q23798
38097A215790q99966n85539l02351l63034n87930m23946L47201J154682J274067
38088H28974P78751L28791J07024l34817j087743j504593j126561l68133J12907
$$ y = [1451144, 1066464, 703072, 792527, 963716, 390619, -946464, -1940939, -1693987, -662567, 32822, -29, -369502, -887582, -1779907, -2936747, -3712958, -3695565, -3177449, -2688368, -2455346, -2459189, -2613546, -2686597, -2370952, -1650111, -878003, -334500, 116513, 778422, 1623735, 2123784, 1601601, -85955, -2135068, -3343357, -3309593, -2797236, -2606590, -2518198, -1928548, -1130335, -1042873, -1739126, -2218574, -1861709, -1191478, -767668, -195537, 1059230, 2499496, 3106615, 2740077, 2243951, 2219544, 2350575, 2039588, 1215790, 315824, -269715, -572066, -935100, -1523030, -1946976, -1599775, -445093, 828974, 1607725, 1936516, 2043540, 1708723, 620980, -883613, -2010174, -2378307, -2265400]
38079b265400K12453J55095k7458l14267l92267n7090L43067L27144m6916l21270
38069b386909k63923J940L04244N03039M39949J49185m1384O9165K25991J32132
38059h66571m3791K6063K22453J53199j86214m08851l45587j96627q6554P1120
38049a661360K38131K46156J93700L60105N97944L54883m12564q59812k70284
38040a213101Q80929J436019R81699K10530j46179j69724l03361n22872m24809
38031G29131L4050L64950J95421k49960n03247m60557l78553l76616k62028P7453
38021h29956L74247K98261m0643j72464J13524M57218L89288m2442l38585k04042
38011D406J14471K11053o435l73105p43634r41752o48746K32540J162372J383774
$$ y = [-2265400, -2052947, -1897852, -1925310, -2239577, -2631844, -2688934, -2345867, -2018723, -2065639, -2386909, -2650832, -2648892, -2344648, -1841609, -1401660, -1252475, -1293859, -1224694, -998703, -866571, -910362, -884299, -661846, -508647, -694861, -1103712, -1449299, -1645926, -1732480, -1661360, -1423229, -1177073, -983373, -623268, -25324, 329559, -83005, -942817, -1213101, -332172, 1103847, 2085546, 2296076, 2149897, 1980173, 1676812, 1153940, 729131, 763181, 1128131, 1323552, 1073592, 570345, 109788, -268765, -645381, -907409, -829956, -455709, -157448, -198091, -370555, -257031, 200187, 589475, 547033, 208448, 4406, 118877, 329930, 323495, -49610, -793244, -1734996, -2383742, -2151202, -988830, 394944]
38001C94944Q42333K45200P3150N1038j35312j94489J54032M08940q4463r72421
37991G82952j222117o05795K0404J15614K35576R23260J584404J250707M9557
37982C134562q92554q81569l06437J29017J97649M2511k00405m14324m42196k29933
37972A36321J23968N04033P59701O03133j04850r18567j100565n54569m8205j79029
37962g78629n13163k69044M08963N80029m6346n47439q7402P91391Q69451n076
37952D02735o75943l05625M90470N84289r8705o01997l28693K71171N03126L42422
37942E83250K14882K28915Q5527l15232n82391l29217K30243M52576P2856m01581
37932B39828l30017J88531M71943K74497J22226L95159O34489K90130k79824l07918
$$ y = [394944, 1237277, 1482477, 1555627, 1606665, 1471353, 1276864, 1430896, 1839836, 1755373, 782952, -439165, -1044960, -1024556, -908942, -673366, 249894, 1834298, 3085005, 3134562, 2242008, 1360439, 1054002, 1183019, 1380668, 1423179, 1222774, 808450, 366254, 136321, 260289, 764322, 1524023, 2127156, 2022306, 1103739, 3174, -551395, -599600, -778629, -1291792, -1560836, -1151873, -571844, -618190, -1165629, -1253031, -461640, 407811, 402735, -273208, -578833, -88363, 495926, 397221, -204776, -533469, -262298, 240828, 583250, 798132, 1027047, 1112574, 797342, 214951, -114266, 115977, 568553, 641409, 239828, -90189, 98342, 570285, 844782, 967008, 1362167, 1996656, 2286786, 2006962, 1699044]
37922A699044J09679J23406m52226p55351k32709M49853M02299k20320n93414
37913E30261m10286j6471L22721N95611O62074L61737l8897o8233K80935N67073
37903B786525N40812L10423n5725n60161r28910q04583l70681k44734n99529q88159
37893h14722o39481p1950L14000L47162J56479p2664o1844M31142J119260J204128
37883A911510L17787q19710j147074n13125K70351N45673M75512M84633M94710
37874B020267R1306o95065j181657p92056J64529P73995N91151J06339k6836J35442
37864A187415J19833r5337j30009l0796k83462q00862o77860N18176J806626J872975
37854C486699P69249k28971l53676j46932l89253r33932j041756m72170K57910
$$ y = [1699044, 1808723, 1932129, 1479903, 724552, 491843, 941696, 1343995, 1123675, 530261, 119975, 103504, 426225, 1021836, 1683910, 2045647, 2006750, 1938517, 2219452, 2786525, 3327337, 3637760, 3582035, 3021874, 2092964, 1288381, 917700, 672966, 73437, -814722, -1454203, -1526153, -1212153, -864991, -708512, -781176, -843020, -411878, 707382, 1911510, 2229297, 1409587, 262513, -250612, 19739, 565412, 1040924, 1525557, 2020267, 2111573, 1416508, 234851, -557205, -392676, 381319, 972470, 1078809, 1051973, 1187415, 1307248, 1211911, 1081902, 1051106, 767644, -33218, -711078, -192902, 1613724, 3486699, 4255948, 4026977, 3673301, 3526369, 3137116, 2203184, 1161428, 689258, 947168]
37845I47168O00970N66511M74944L60571q6469q94631j398867q78867L82353J202099
37835A275782R32147K82452K29678N86652M34370l06272p27985m09536k3526j41501
37825B132261l72554k42432p3791k29102k12156M95240J220618Q58181l86167
37816C190098j135190p20613J39696O42195P77563O46741K8038q44989j074035
37807A649504l39298N03220P49809Q70123J360710J540768O98880l16330j31956
37798F585430R42843J319972O06739L3408K38511L17138l51399q98881n18045
37789H275716R2417k8687m60311k78246J94506r4534j079851j577324j015815
37780D027871o7699M24317K23404n31526j426604j681024q37873M33093J008918
$$ y = [947168, 1548138, 2114649, 2589593, 2950164, 2863695, 1969064, 570197, -308670, 73683, 1275782, 2207929, 2490381, 2720059, 3306711, 3741081, 3434809, 2706824, 2297288, 2273762, 2132261, 1759707, 1517275, 1443484, 1214382, 1002226, 1497466, 2718084, 3576265, 3190098, 2054908, 1334295, 1473991, 2116186, 2893749, 3540490, 3568528, 2723539, 1649504, 1310206, 1813426, 2563235, 3433358, 4794068, 6334836, 7033716, 6717386, 6585430, 7528273, 8848245, 9454984, 9488392, 9726903, 10044041, 9692642, 8793761, 8275716, 8368133, 8339446, 7879135, 7600889, 7795395, 7700861, 6621010, 5043686, 4027871, 3960172, 4384489, 4607893, 4076367, 2649763, 968739, 130866, 563959, 1572877]
37771A572877P27807L17508P4055l48540q56045q04165k00339J20160r8370n0127
37761D54821O67971J173111O48495k85439m47862K50581Q78126P77791O0183q18046
37751C359732j288870q51971K90800J067989O51571m94468j233179j138532o91544
37742c28472l89140k89520k62501j45078J94303N45155M29654r7170k22810M50851
37732a14728J058408O03212n27652j131336r06461n34999l07113J15038N94824
37723a150807M57501k47691o02457k85942n2384k90105k71773M61339J054237
37714i28082O39101j65045j59653N91401R63129N00851j49977m53117n92018p51121
37704e04531o72368k17059K83271N27577N91339N45297K29956k99910n47081j64348
$$ y = [1572877, 2300684, 2618192, 2692247, 2343707, 1487662, 683497, 483158, 603318, 504948, 454821, 1122792, 2295903, 2944398, 2658959, 2211097, 2461678, 3339804, 4117595, 4177778, 3359732, 2070862, 1218891, 1509691, 2577680, 3229251, 2734783, 1501604, 363072, -328472, -717612, -1007132, -1269633, -1414711, -1220408, -675253, -245599, -342769, -565579, -114728, 943680, 1546892, 1019240, -112096, -1018557, -1553556, -1860669, -1745631, -1150807, -693306, -940997, -1543454, -1829396, -1881780, -2171885, -2443658, -1982319, -928082, -288981, -454026, -613679, -22278, 940851, 1441702, 1291725, 838608, 246590, -504531, -1176899, -1393958, -1110687, -583110, 8229, 553526, 783482, 483572, -63509, -227857]
37694b27857N09579Q50841O84291L01937p7705m91255r01388j038090p06909q3501
37684a180057M18277M97299J59962l00200m70166j46129L78722N31168J48170
37675C7046k48030j60637J10673p6657n68259m56034N00021J235578P46321m51552
37665F68470r72266l72162M53612N61638n9460p67108r04191k15195P88184J034854
37655B16376J58568o91158k39621R21533J008533k31492j007347k20511Q48085
37646G62966O24666l27394m07125M38225Q73728M28392m8139m1632K6838n0559
37636B279966R3780L63945Q4702o77994q73338r9273N86388K08351o38215o78628
37626F49684K38275J029297P69855l84635j456188j464954k91497J019251J214927
$$ y = [-227857, 281722, 1132563, 1816854, 2118791, 2041086, 1549831, 648443, -389647, -1096556, -1180057, -761780, -264481, -104519, -404719, -874885, -1021014, -642292, -111124, 37046, -210984, -371621, -260948, -337605, -905864, -1361898, -861877, 373701, 1120022, 668470, -303796, -675958, -222346, 339292, 279832, -487276, -1391467, -1606662, -818478, 216376, 374944, -316214, -555835, 365698, 1374231, 1142739, 135392, -85119, 762966, 1387632, 1060238, 653113, 1091338, 1965066, 2393458, 2345319, 2303687, 2330525, 2279966, 2373746, 2737691, 2822393, 2144399, 1271061, 1171788, 1758176, 1966527, 1328312, 649684, 887959, 1917256, 2687111, 2302476, 846288, -618666, -910163, 109088, 1324015]
37617A324015L15677l94836j00110N43727N71377Q9401k29840l60428o73133r06177
37607A79673m55543M29935P49865J55173n95303p70403n04078k30793K3333L83880
37597f34261O87493P34343O24715M83348J73068l55184p28928o00472k30976j75727
37587b2581m59647n16530k9863N42145N03243k17693r69407j080350m87357L17214
37577b420826P98675P79190M48416J17239l0377k3687j0044r7884k86584m88155
37567a214037n50376l24272J40824N06093M82487K84066M14534Q69472R71486
37558A580277L41116l76149l24288K92790M91543p316m02338j05132L90355L53113
37548B233971j34878n29927p14231q95968r64021n93689J43959P80185R57867
$$ y = [1324015, 1639692, 1244856, 1144746, 1688473, 2259850, 2349251, 2119411, 1758983, 1085850, 179673, -275870, 154065, 903930, 1059103, 463800, -306603, -810681, -1041474, -1018141, -634261, 53232, 787575, 1412290, 1895638, 2068706, 1713522, 984594, 384122, 153146, -22581, -482228, -998758, -1028621, -486476, 16767, -200926, -1170333, -2250683, -2738040, -2420826, -1622151, -842961, -394545, -277306, -307683, -331370, -341414, -439298, -725882, -1214037, -1764413, -2088685, -1947861, -1441768, -959281, -675215, -260681, 608791, 1580277, 1921393, 1545244, 1220956, 1513746, 2005289, 1997973, 1595635, 1490503, 1880858, 2233971, 2099093, 1569166, 854935, -41033, -1005054, -1598743, -1454784, -674599, 283268]
37539B83268O11744j04121o97918n13860M46791J195823Q59797j47226p03257
37530A231041m74866o7400J30934L36756N84447M85590Q451l06053j95193j0452
37520A723255P0588L66790Q30387O98543l49980j366001j239879j98244N76764
37511A112223N26174J51083J9759P6531Q280k50930n35114o52575n13251k38815
37501b96635q2375q9703k5020K00538L20134J65484k8925r2219k77168p19262
37491i25151r55464n61565P9851L16116K46466M48311Q73293Q82063L76073K5158
37481H05151J89937M02559K11869j37138k28413j17595q1232j73438l38581n53504
37471b0385o22835k87538K42267L78565L8271j23602L06383Q53590Q90544M69447
$$ y = [283268, 895012, 790891, 92973, -420887, 25904, 1221727, 2081524, 1934298, 1231041, 756175, 688775, 819709, 1156465, 1740912, 2226502, 2234953, 1928900, 1733707, 1723255, 1793843, 2160633, 2991020, 3689563, 3339583, 1973582, 733703, 535459, 1112223, 1638397, 1789480, 1809239, 1885770, 1894050, 1643120, 1108006, 455431, -57820, -296635, -379010, -468713, -493733, -293195, 26939, 192423, 163498, 71279, -205889, -925151, -1880615, -2442180, -2362329, -2046213, -1799747, -1351436, -478143, 403920, 779993, 805151, 995088, 1397647, 1609516, 1472378, 1243965, 1126370, 1045138, 871700, 533119, -20385, -643220, -930758, -688491, -309926, -271655, -395257, -88874, 764716, 1655260, 2124707]
37461B124707k5569m92324q46567p09638j2706N72203M99979J88712K36030L08257
37451A843084k14861q92793p28022J20962M33903j10034l87866K71997Q97196
37442A233566M16546n74708o79419K42934R82444P19357j08994o74147o78674
37433H78905k79005K69954O63545O66358L77388J19214J2072r2556k82697m74705
37423A858473n84484n32341k00481K61251K73551m77294j261052r35038M63135
37414a134280J459721R26465m34491j008572l32665M98369M52878j34551k05566
37405H7308N27040J228392J025059M7360p99572r23708n99842l83245l06545k0812
$$ y = [2124707, 2099138, 1606814, 760247, 50609, 37903, 610106, 1110085, 1298797, 1534827, 1843084, 1628223, 735430, 7408, 128370, 562273, 452239, 64373, 336370, 1233566, 1650112, 1075404, 395985, 638919, 1621363, 2340720, 2231726, 1557579, 878905, 599900, 869854, 1533399, 2199757, 2577145, 2696359, 2708431, 2615875, 2333178, 1858473, 1273989, 741648, 541167, 802418, 1075969, 598675, -662377, -1597415, -1134280, 325441, 1251906, 817415, -191157, -523822, -25453, 427425, 292874, 87308, 614348, 1842740, 2867799, 2915159, 2115587, 1191879, 592037, 208792, -97753, -118565]
$$ [...]
##END NTUPLES=NMR SPECTRUM
##END=
